##TITLE=19F_CG-1101-0
 DMSO. 124 sc
 4.4.2019
##JCAMPDX= 6.0         $$ Bruker NMR JCAMP-DX V2.0
##DATA TYPE= NMR SPECTRUM
##DATA CLASS= NTUPLES
##ORIGIN= UXNMR, Bruker Analytische Messtechnik GmbH
##OWNER= root
$$ XWIN-NMR		Version 3.5
$$ Thu Apr  4 14:44:52 2019 Russian Standard Time (UT+4h)  she@DPX200
##.OBSERVE FREQUENCY= 188.290927
##.OBSERVE NUCLEUS= ^19F
##.ACQUISITION MODE= SIMULTANEOUS
##.ACQUISITION SCHEME= undefined
##.AVERAGES= 124
##.DIGITISER RES= 16
##SPECTROMETER/DATA SYSTEM= spect
##.PULSE SEQUENCE= zg
##.SOLVENT NAME= D2O
##.SHIFT REFERENCE= (INTERNAL, D2O, 0, 101.251)
##AUDIT TRAIL= $$ (NUMBER, WHEN, WHO, WHERE, WHAT)
$$ ##TITLE= Audit trail, XWIN-NMR		Version 3.5
$$ ##JCAMPDX= 5.01
$$ ##ORIGIN= Bruker BioSpin GmbH
$$ ##OWNER= she
$$ F:/spectra/data/she/nmr/f19/1/pdata/1/auditp.txt
$$ ##AUDIT TRAIL=  $$ (NUMBER, WHEN, WHO, WHERE, WHAT)
(   1,<2019-04-04 14:42:47.09 +0400>,<she>,<DPX200>,
      <continue with go, POWCHK disabled, PULCHK disabled
       configuration hash MD5:
       00 E9 B6 7A A2 85 ED C7 34 08 36 98 17 FE 4E 26
       data hash MD5: 64K
       01 C0 0F E3 0B 9A B3 C6 C9 8E 2C B3 B3 24 D9 AD>)
(   2,<2019-04-04 14:43:03.03 +0400>,<she>,<DPX200>,
      <Start of raw data processing
       efp BC_mod = 2 LB = 1 FT_mod = 6 PKNL = 1 PHC0 = 1405.583 PHC1 = 184.5559 SI = 64K 
       data hash MD5: 64K
       1B AD 4D DA B0 E0 D3 EE C8 76 B2 2E 03 D3 69 0A>)
(   3,<2019-04-04 14:43:07.01 +0400>,<she>,<DPX200>,
      <abs ABSG = 5 
       data hash MD5: 64K
       BF AD CB 47 83 00 6D C5 99 3E A0 76 35 18 71 77>)
(   4,<2019-04-04 14:44:21.50 +0400>,<she>,<DPX200>,
      <pk PHC0 = -503.2426 PHC1 = 437.5998 
       data hash MD5: 64K
       F0 AA A0 3A 94 AC D3 AB E7 49 CA E0 C5 64 92 19>)
(   5,<2019-04-04 14:44:24.95 +0400>,<she>,<DPX200>,
      <abs ABSG = 5 
       data hash MD5: 64K
       C2 0F F4 D4 A3 FC 9A FA 26 1D 70 F9 DD A3 E8 E7>)
$$ ##END=
$$ 
$$ hash MD5
$$ 7B 42 64 4D 9D 44 F9 1D 5F 51 C8 82 1E A7 2E 91
##$RELAX= 
##$RELAX= 
##$RELAX= 
##$RELAX= 
##$RELAX= 
##$RELAX= 
##$RELAX= 
##$RELAX= 
$$ Bruker specific parameters
$$ --------------------------
##$DU= <F:/spectra>
##$EXPNO= 1
##$NAME= <f19>
##$PROCNO= 1
##$TYPE= <nmr>
##$USER= <she>
##$AMP= (0..31)
100 100 100 100 100 100 100 100 100 100 100 100 100 100 100 100 100 100 
100 100 100 100 100 100 100 100 100 100 100 100 100 100 
##$AQSEQ= 0
##$AQ_mod= 1
##$AUNM= <au_zg>
##$AUTOPOS= <>
##$BF1= 188.310428
##$BF2= 200.13
##$BF3= 200.13
##$BF4= 200.13
##$BF5= 200.13
##$BF6= 200.13
##$BF7= 200.13
##$BF8= 200.13
##$BYTORDA= 1
##$CFDGTYP= 0
##$CFRGTYP= 5
##$CHEMSTR= <none>
##$CNST= (0..31)
1 1 145 1 1 1 1 1 1 1 1 1 1 1 1 1 1 1 1 1 1 1 1 1 1 1 1 1 1 1 1 1 
##$CPDPRG= <>
##$CPDPRG1= <>
##$CPDPRG2= <>
##$CPDPRG3= <>
##$CPDPRG4= <mlev>
##$CPDPRG5= <mlev>
##$CPDPRG6= <mlev>
##$CPDPRG7= <mlev>
##$CPDPRG8= <mlev>
##$CPDPRGB= <>
##$CPDPRGT= <>
##$D= (0..31)
0 1.3 0 0 0 0 0 0 0 0 0 0 0.25 0 0 0 0 0 0 0 0 0 0 0 0 0 0 0 0 0 0 0 
##$DATE= 1554374333
##$DBL= (0..7)
$$ [...]
##$SUBNAM3= <"">
##$SUBNAM4= <"">
##$SUBNAM5= <"">
##$SUBNAM6= <"">
##$SUBNAM7= <"">
##$SUBNAM8= <"">
##$SUBNAM9= <"">
##$SW= 251.107818259711
##$SWIBOX= (0..15)
0 1 0 0 0 0 0 0 0 0 0 0 0 0 0 0 
##$SW_h= 47281.3238770686
##$TD= 65536
##$TD0= 1
##$TE= 0
##$TE2= 300
##$TE3= 300
##$TEG= 300
##$TL= (0..7)
0 120 53 12 22 120 120 120 
##$TP= (0..7)
150 150 150 150 150 150 150 150 
##$TP07= 0
##$TPNAME0= <>
##$TPNAME1= <>
##$TPNAME2= <>
##$TPNAME3= <>
##$TPNAME4= <>
##$TPNAME5= <>
##$TPNAME6= <>
##$TPNAME7= <>
##$TPOAL= (0..7)
0.5 0.5 0.5 0.5 0.5 0.5 0.5 0.5 
##$TPOFFS= (0..7)
0 0 0 0 0 0 0 0 
##$TUNHIN= 0
##$TUNHOUT= 0
##$TUNXOUT= 0
##$USERA1= <user>
##$USERA2= <user>
##$USERA3= <user>
##$USERA4= <user>
##$USERA5= <user>
##$V9= 5
##$VALIST= <valist>
##$VCLIST= <CCCCCCCCCCCCCCC>
##$VD= 0
##$VDLIST= <DDDDDDDDDDDDDDD>
##$VPLIST= <PPPPPPPPPPPPPPP>
##$VTLIST= <TTTTTTTTTTTTTTT>
##$WBST= 1024
##$WBSW= 4
##$XGAIN= (0..3)
0 0 0 0 
##$XL= 0
##$YL= 0
##$YMAX_a= 51605
##$YMIN_a= -124263
##$ZGOPTNS= <>
##$ZL1= 120
##$ZL2= 120
##$ZL3= 120
##$ZL4= 120
##$ABSF1= 101.2514
##$ABSF2= -149.8503
##$ABSG= 5
##$ABSL= 3
##$ALPHA= 0
##$AQORDER= 0
##$ASSFAC= 0
##$ASSFACI= 0
##$ASSFACX= 0
##$ASSWID= 0
##$AUNMP= <proc_1d>
##$AZFE= 0.1
##$AZFW= 5
##$BCFW= 0
##$BC_mod= 2
##$BYTORDP= 0
##$COROFFS= 0
##$CY= -3
##$DATMOD= 1
##$DC= 0
##$DFILT= <>
##$DTYPP= 0
##$F1P= 0
##$F2P= 0
##$FCOR= 0.5
##$FTSIZE= 65536
##$FT_mod= 6
##$GAMMA= 0
##$GB= 0
##$INTBC= 1
##$INTSCL= 8.653935e-10
##$ISEN= 128
##$LB= 1
##$LEV0= 0
##$LPBIN= 0
##$MAXI= 10000
##$MC2= 0
##$MEAN= 0
##$ME_mod= 0
##$MI= 0.4277144
##$NCOEF= 0
##$NC_proc= -10
##$NLEV= 6
##$NOISF1= -61.99997
##$NOISF2= -62.99997
##$NSP= 0
##$NTH_PI= 0
##$NZP= 0
##$OFFSET= 101.2514
##$PC= 1
##$PHC0= 902.3404
##$PHC1= 622.1557
##$PH_mod= 1
##$PKNL= yes
##$PPARMOD= 0
##$PSCAL= 0
##$PSIGN= 0
##$REVERSE= no
##$SF= 188.29550247311
##$SI= 65536
##$SIGF1= -61
##$SIGF2= -65
##$SINO= 3.502647
##$SIOLD= 65536
##$SREGLST= <1H.CDCl3>
##$SSB= 0
##$STSI= 65536
##$STSR= 0
##$SW_p= 47281.3238770685
##$SYMM= 0
##$S_DEV= 0
##$TDeff= 65536
##$TDoff= 0
##$TI= <>
##$TILT= no
##$TM1= 0
##$TM2= 0
##$TOPLEV= 0
##$USERP1= <user>
##$USERP2= <user>
##$USERP3= <user>
##$USERP4= <user>
##$USERP5= <user>
##$WDW= 1
##$XDIM= 65536
##$YMAX_p= 322688316
##$YMIN_p= -202207021
$$ End of Bruker specific parameters
$$ ---------------------------------
##NTUPLES= NMR SPECTRUM
##VAR_NAME=  FREQUENCY,     SPECTRUM/REAL,   SPECTRUM/IMAG
##SYMBOL=    X,             R,               I
##VAR_TYPE=  INDEPENDENT,   DEPENDENT,       DEPENDENT
##VAR_FORM=  AFFN,          ASDF,            ASDF
##VAR_DIM=   65536,         65536,           65536
##UNITS=     HZ,            ARBITRARY UNITS, ARBITRARY UNITS
##FACTOR=    0.721466756344984, 1,           1
##FIRST=     19065.1839562469, 0,            0
##LAST=      -28216.1399208216, 0,           0
##MIN=       -28216.1399208216, -202207021,  0
##MAX=       19065.1839562469, 322688316,    0
$$ Real data points
##PAGE= N=1
##DATA TABLE= (X++(R..R)), XYDATA
$$ [...]
##PAGE= N=2
##DATA TABLE= (X++(I..I)), XYDATA
21032 -220481624 -210207596 -237187943 -245465616 -237299491 -213529191 -184826416 -220515905
21025 -220515905 -191820222 -175069728 -168254849 -180235567 -194872592 -243469468 -254893698
21018 -254893698 -290051726 -252578091 -174106211 -199466849 -264313367 -254736747 -233136994
21011 -233136994 -276677850 -268868773 -258584642 -249437849 -200092420 -185690563 -228630443
21004 -228630443 -208570320 -198110463 -216754010 -207386353 -193167852 -208988468 -212319859
20997 -212319859 -238701847 -221066452 -189524889 -246422146 -215595593 -181613205 -196182367
20990 -196182367 -229392372 -254572104 -255911437 -196652641 -163306386 -188352027 -234938111
20983 -234938111 -293686717 -224940526 -187338909 -176360132 -161229723 -207893706 -227487666
20976 -227487666 -207988435 -214060021 -164500261 -165492304 -174892269 -153353438 -202717359
20969 -202717359 -222376180 -169502828 -174411186 -130574804 -110738875 -148020326 -180450502
20962 -180450502 -200286657 -169003684 -165667264 -172698221 -200025073 -207633910 -169503613
20955 -169503613 -139232656 -184606232 -204859724 -185989038 -108612803 -161778778 -163984307
20948 -163984307 -154556633 -209230238 -164652270 -203523535 -242770679 -272733807 -264959108
20941 -264959108 -218679513 -206151976 -178934597 -216871372 -217239522 -184438361 -226806844
20934 -226806844 -262829061 -255117187 -229479350 -220567824 -187590356 -161934775 -175681175
20927 -175681175 -207401199 -274322221 -206768108 -141315546 -189434222 -224143877 -256454770
20920 -256454770 -299766602 -267218443 -236008197 -217036320 -174095800 -206715302 -261420836
20913 -261420836 -263911756 -222448446 -203080411 -216482612 -235916413 -240305371 -200854579
20906 -200854579 -201815953 -182263966 -171757385 -204445185 -181205412 -219531161 -224002687
20899 -224002687 -245856278 -230038193 -197576495 -273100400 -249789816 -191386555 -203551529
20892 -203551529 -219040632 -243309105 -258397339 -242947209 -174849447 -144361853 -159711711
20885 -159711711 -135896819 -190344864 -236161907 -195276441 -189475502 -208014525 -174220843
20878 -174220843 -152042907 -151330800 -167599436 -159678698 -204528330 -200560568 -172895519
20871 -172895519 -208749631 -198670497 -161259070 -156467821 -199902505 -234902398 -193279592
20864 -193279592 -147473468 -129050802 -158334623 -152833476 -174379171 -222979074 -215805644
20857 -215805644 -205960738 -188806795 -200390226 -249345494 -267506541 -248884803 -216656396
20850 -216656396 -196413593 -200344433 -225587852 -211971681 -206484019 -178639734 -156694494
20843 -156694494 -178983431 -256981287 -253853268 -221590910 -226243076 -218163319 -224303737
20836 -224303737 -216336846 -219745080 -213729706 -238068929 -209239522 -143694365 -183207802
20829 -183207802 -239478552 -223795064 -235665703 -174370726 -171558977 -202259831 -190597471
20822 -190597471 -155005477 -148037245 -169318690 -215539965 -178478224 -189365864 -171465585
20815 -171465585 -201650876 -153189885 -139087013 -182749939 -196346394 -199524100 -192008998
20808 -192008998 -230736586 -238540616 -251795099 -277169478 -255889553 -247766643 -243552837
20801 -243552837 -221261396 -230736691 -267352972 -217081843 -187925128 -188218104 -228635832
20794 -228635832 -255313579 -239518593 -234651280 -187670474 -161146297 -155347620 -151547237
20787 -151547237 -165153425 -229059204 -168952885 -184352785 -191540088 -180532028 -191911996
20780 -191911996 -206152882 -211923528 -237916661 -242951895 -252318721 -237431641 -250219963
20773 -250219963 -229571705 -220202533 -231289214 -197562976 -180866025 -247684805 -244467180
20766 -244467180 -214260836 -136925759 -125707974 -184502978 -210184177 -182563902 -219112288
20759 -219112288 -145053958 -124176984 -173790186 -187622919 -199802112 -222792351 -264775254
20752 -264775254 -291099750 -281674516 -258171976 -231900601 -213054902 -212430410 -197963078
20745 -197963078 -153834230 -198887908 -227597862 -224926156 -217890732 -205144777 -190955270
20738 -190955270 -235105918 -225346753 -207491563 -215756898 -226540567 -214879056 -221201087
20731 -221201087 -220049228 -234108362 -213642409 -250471814 -222130271 -253126161 -207427225
20724 -207427225 -201489661 -261204600 -212061366 -243288494 -251938596 -242252680 -210346245
20717 -210346245 -142888650 -181827434 -205451635 -240414480 -209902625 -145737300 -144932034
20710 -144932034 -241161763 -242382772 -183741961 -195668813 -173158330 -126642598 -154651075
20703 -154651075 -240443982 -248274912 -206465145 -205494180 -198344923 -188004660 -173895385
20696 -173895385 -220305299 -266232269 -302777700 -335748565 -295308487 -272937439 -236136502
20689 -236136502 -190855908 -187627214 -245744959 -254493159 -215126605 -182135694 -176284453
20682 -176284453 -204972773 -212649241 -182314793 -176628668 -183579631 -203027713 -231300848
20675 -231300848 -213967502 -176009958 -238339056 -221967125 -165426169 -218314400 -244251754
20668 -244251754 -208381983 -225477868 -196227447 -173676904 -205824579 -195069611 -183922718
20661 -183922718 -150046117 -126166144 -182412514 -236591629 -204467489 -194227020 -181015266
20654 -181015266 -201726967 -181065414 -218485306 -239548957 -213634521 -190605891 -68552448
20647 -68552448 -92244359 -165621980 -243336902 -239705707 -220300927 -210139097 -224203043
20640 -224203043 -224903416 -232264015 -230069664 -223469199 -213449003 -240292293 -238149796 -183449409
20632 -183449409 -194614200 -200308388 -138947400 -118931522 -159889184 -136847916 -140093984
20625 -140093984 -151034324 -183149017 -204654668 -164489225 -200961147 -202046909 -247544032
20618 -247544032 -281138543 -287627017 -251959586 -190536696 -196618203 -218642204 -224940416
20611 -224940416 -215032334 -207264317 -212078685 -263953587 -231216304 -214528384 -239246063
20604 -239246063 -265614597 -230946028 -182237244 -203525846 -180433966 -173049368 -148996000
20597 -148996000 -147536860 -198111966 -249327463 -229104209 -186560988 -201004048 -193215827
20590 -193215827 -183352724 -179977925 -199106112 -257417472 -248863311 -268600683 -241301389
20583 -241301389 -219102771 -208847258 -165887017 -219264284 -291623382 -295409992 -298649528
20576 -298649528 -293965689 -335411566 -374620716 -293165755 -239061364 -293543032 -282687194
20569 -282687194 -251542646 -221390779 -161193691 -189201526 -293271281 -244729755 -210308127
20562 -210308127 -231441999 -236838173 -215615078 -194065605 -178844343 -231329427 -204332992
20555 -204332992 -215961871 -234617131 -208528893 -174023083 -208857603 -202830767 -244956576
20548 -244956576 -219873248 -128027077 -151691421 -161543154 -192991012 -193101991 -191037626
20541 -191037626 -185776488 -202148389 -146109340 -163378937 -217351790 -209822938 -179609295
20534 -179609295 -243443874 -293530738 -266359622 -308032469 -303019282 -253107576 -201258039
20527 -201258039 -204670131 -157332412 -142304627 -147241069 -166747083 -206650078 -195020343
20520 -195020343 -197979841 -158059551 -258096470 -203249182 -130251283 -114947590 -150608867
20513 -150608867 -205486538 -280488731 -269830129 -204776521 -181865659 -234799297 -254972398
20506 -254972398 -277682917 -258243303 -217340856 -211173594 -182568795 -159276929 -198093155
20499 -198093155 -251849360 -236496456 -202327259 -201233428 -314928368 -303406478 -191542530
20492 -191542530 -166312084 -223751822 -174220323 -132290492 -148564200 -232027261 -245469220
20485 -245469220 -262010325 -267518055 -242990073 -269264682 -194720716 -156162375 -161587916
20478 -161587916 -156443777 -218160808 -258795647 -229116878 -207182187 -190683959 -250027688
20471 -250027688 -293305557 -325160071 -287199249 -198055453 -181414745 -210237423 -170824533
20464 -170824533 -132396489 -134392481 -184514073 -161418560 -161606992 -217699681 -170984430
20457 -170984430 -153725953 -148091797 -201670458 -212905302 -231565030 -239532152 -235665178
20450 -235665178 -201508437 -187996602 -242815231 -221989894 -203643950 -188027301 -212804085
20443 -212804085 -235525352 -187785902 -159809130 -154243907 -168223075 -174978981 -190591354
20436 -190591354 -235907853 -223178895 -183256863 -172082624 -144410189 -172039120 -217007023
20429 -217007023 -212619956 -252565652 -252278408 -215153218 -272802416 -259167429 -195056688
20422 -195056688 -197008751 -156735090 -190714275 -252633521 -267800712 -272757706 -278001868
20415 -278001868 -284340290 -296552784 -235009360 -197697149 -203805957 -153952449 -189596368
20408 -189596368 -258294229 -252638659 -245400926 -248501493 -283601042 -311791179 -290721031
20401 -290721031 -241441869 -206827280 -227873876 -248787952 -211172319 -177501190 -195710508
20394 -195710508 -209818934 -254638101 -247335531 -219304277 -211750573 -252417058 -267914546
20387 -267914546 -199375515 -155443610 -170457050 -184269410 -207670443 -172467065 -183201588
20380 -183201588 -220918924 -241506299 -184558283 -182531256 -206536669 -208667353 -191469881
20373 -191469881 -224665981 -224615182 -270632770 -235774443 -208013854 -185943927 -246980803
20366 -246980803 -254045190 -199860752 -202569908 -223745351 -255846148 -188588471 -177423885
20359 -177423885 -219236419 -187578550 -186035085 -226040219 -257195668 -239957218 -263945533
20352 -263945533 -283181005 -277361575 -283333555 -257207776 -233364533 -265707665 -255593450
20345 -255593450 -224658848 -266496299 -230920040 -210927541 -197926155 -160359801 -192051417
20338 -192051417 -196735879 -177280010 -132285383 -121986401 -120615111 -211169087 -266469555
20331 -266469555 -241711244 -188383013 -156271572 -186810695 -182130288 -170749909 -180002068
20324 -180002068 -184373801 -241817659 -299789035 -287618644 -231071979 -209271571 -261835892
20317 -261835892 -261315801 -225706613 -208292455 -256124386 -250639638 -264274755 -236337560
20310 -236337560 -209266280 -289226980 -269753716 -210136676 -244724817 -272538735 -210595880
20303 -210595880 -191289541 -173207372 -150208985 -174595309 -212998527 -206390089 -191621930
20296 -191621930 -215901548 -193130388 -205211370 -236268661 -248491828 -225457845 -148446245
20289 -148446245 -195679807 -226801635 -224680475 -229122262 -240893109 -240642385 -213722809
20282 -213722809 -183833418 -191788384 -200283457 -196025797 -215213653 -183231917 -223671582
20275 -223671582 -251452319 -283034864 -258243284 -273916502 -239537998 -180052970 -176131068
20268 -176131068 -237952007 -219256585 -164803539 -126732027 -118413433 -145210716 -192873479
20261 -192873479 -194204032 -192307422 -230031447 -230401316 -231041357 -172257293 -223919054 -224118923
20253 -224118923 -244925003 -210674106 -164784634 -156897739 -167760412 -224103324 -238451771
20246 -238451771 -231397114 -168668048 -178206766 -230108832 -221281280 -210454828 -207062335
20239 -207062335 -148807214 -167986550 -222848312 -230762794 -225868175 -206568510 -253402887
20232 -253402887 -267441775 -199569238 -194411296 -215297453 -210590470 -162187301 -212840889
20225 -212840889 -220902460 -230200425 -276531310 -238592099 -176775436 -196349453 -175422273
20218 -175422273 -224637093 -220686493 -220595814 -242372133 -266300968 -269162499 -261505285 -250894966
20210 -250894966 -302526994 -297540281 -236654845 -243387545 -276211295 -258055304 -259861363
20203 -259861363 -262512786 -265757794 -270579101 -291468872 -248783869 -244946139 -276017648
20196 -276017648 -272482032 -218436928 -220548405 -232701411 -316071824 -259831701 -260730270
20189 -260730270 -259596809 -237837973 -215892823 -208716190 -215170058 -173511028 -224231294
20182 -224231294 -253487044 -200385289 -207011443 -227774577 -209989127 -202329650 -215574590
20175 -215574590 -222838617 -224559073 -308886191 -243211025 -190309586 -179821911 -204599386
20168 -204599386 -203203846 -200606365 -238903612 -200700548 -197834011 -217164880 -213283039
20161 -213283039 -203191866 -196769324 -226505220 -247757980 -230462919 -206912576 -213775106
20154 -213775106 -203237492 -236501798 -218840390 -212213857 -232667429 -263163939 -251231607
20147 -251231607 -250440913 -285882749 -286376580 -288776752 -280959470 -251674290 -209949461 -201839368
20139 -201839368 -217137792 -200014468 -195738218 -176839793 -171241813 -213290636 -238156365
20132 -238156365 -216067953 -229661402 -233952859 -210693552 -188397820 -252423440 -315469169
20125 -315469169 -302108448 -247092796 -215271007 -224368738 -207549511 -227843038 -248738866
20118 -248738866 -247595257 -249428614 -247619778 -257297741 -235664782 -250850670 -248883691 -204827493
20110 -204827493 -178218788 -177221407 -214775378 -229311629 -230064492 -215086109 -226799649
20103 -226799649 -212018278 -194018098 -241308549 -206062963 -190558597 -241134797 -290691845
20096 -290691845 -260693987 -243324305 -250558650 -276050532 -220279469 -148753491 -172381329
20089 -172381329 -244528444 -254075897 -250734397 -237347760 -220226480 -228924918 -222628655
20082 -222628655 -233338638 -300722629 -264306690 -297934337 -330973770 -279137906 -206486797
20075 -206486797 -224825356 -225226866 -200617305 -151441055 -150137764 -171529116 -179104694
20068 -179104694 -182092581 -191660348 -221065478 -237037580 -235498983 -209344543 -192004470
20061 -192004470 -187106650 -195416683 -178697535 -217003013 -224172597 -217007677 -206543955
20054 -206543955 -202383455 -214804289 -247014766 -213961284 -201646372 -252688880 -256026060
20047 -256026060 -245224363 -257501355 -285302900 -276856436 -230617295 -239063475 -189845426
20040 -189845426 -127983851 -141199621 -162373647 -207049697 -205048437 -210093739 -250607090
20033 -250607090 -250909418 -258304020 -201541996 -221937815 -289522071 -217429657 -162305305
20026 -162305305 -211881143 -250492332 -247360089 -279651570 -252220527 -267403042 -253323972
20019 -253323972 -205681168 -235193207 -231913059 -261575833 -234180303 -231606830 -212622615
20012 -212622615 -219929190 -228572220 -246752100 -272762845 -210648378 -163650004 -168774363
20005 -168774363 -179272242 -171526473 -150091259 -197263029 -225905166 -203370536 -171264922
19998 -171264922 -183244767 -222383211 -242421001 -224557039 -233218424 -186036164 -149617658
19991 -149617658 -156505371 -224061727 -213900001 -190110637 -211472336 -210000248 -201963774
19984 -201963774 -171993644 -126507397 -190173767 -189910543 -186670868 -204154777 -229607096
19977 -229607096 -232248370 -237692149 -245556356 -247424852 -249265107 -204317861 -206137257 -165118403
19969 -165118403 -196418000 -223854189 -258078740 -263029056 -256417374 -252945605 -229240634
19962 -229240634 -264333408 -309743180 -297282305 -296639799 -280291251 -222774971 -137272275
19955 -137272275 -196041533 -201866585 -198587575 -221003553 -247139294 -233676432 -204840876
19948 -204840876 -230197442 -275390195 -294123555 -283527372 -238046202 -202901757 -191277320
19941 -191277320 -250392359 -251095172 -207105682 -226193441 -221183329 -236648308 -201747590
19934 -201747590 -164812952 -195341198 -228253013 -245555737 -250356883 -212276537 -202865106
19927 -202865106 -244369954 -285580862 -258847523 -229987506 -254533333 -250149257 -212837909
19920 -212837909 -178785127 -203003244 -218974196 -197213622 -209929974 -191400844 -217000722
19913 -217000722 -204881594 -229923823 -188881723 -192804688 -196701152 -182703065 -205716250
19906 -205716250 -278245506 -202938840 -127406906 -171737175 -178458807 -198638277 -229095752
19899 -229095752 -188456609 -150719639 -192174687 -253870628 -228864235 -178515547 -207296643
19892 -207296643 -202068931 -184798959 -154634875 -164015758 -164400688 -187070260 -215534662
19885 -215534662 -175133492 -123356407 -128313558 -213174289 -239034935 -200535957 -182990442
19878 -182990442 -198427018 -180789725 -248593399 -271171979 -288964259 -295543166 -222718513
19871 -222718513 -215221738 -249057090 -251537529 -237819761 -263565832 -230027386 -207531894
19864 -207531894 -217944299 -244329094 -273653346 -249197141 -187365945 -195198358 -195277272
19857 -195277272 -157514233 -170284532 -199958873 -220898249 -244033980 -230765204 -233693857
19850 -233693857 -208817601 -254829658 -282900120 -279291996 -259530797 -204911261 -176596808
19843 -176596808 -166684598 -197333615 -221882812 -228415980 -199450284 -189758804 -177814606
19836 -177814606 -147104418 -172800216 -176540293 -167245588 -246488548 -246112495 -205118207
19829 -205118207 -188752132 -193248093 -221460296 -229634067 -217104561 -228539185 -201061161
19822 -201061161 -225296144 -279653085 -230256892 -167875991 -184313588 -242518076 -238510467
19815 -238510467 -254434739 -235110350 -240281730 -231188825 -216745577 -236359013 -225269151
19808 -225269151 -169387461 -170592550 -154265990 -149639354 -169417816 -221033840 -266165532
19801 -266165532 -264780809 -289155323 -237855955 -269011970 -261016387 -235368563 -287898633
19794 -287898633 -263199225 -256150722 -236620243 -254629817 -203868508 -196323928 -202230724
19787 -202230724 -220695527 -215372219 -188148782 -225945672 -209405757 -186788319 -193676619
19780 -193676619 -225989933 -240174705 -253301218 -223990598 -239205832 -272142635 -206136027
19773 -206136027 -150351835 -151904224 -157717857 -185031323 -227181274 -196275134 -172807301
19766 -172807301 -224086524 -244753445 -209238532 -243138826 -241978193 -238400156 -246013269
19759 -246013269 -242950862 -210512202 -224889322 -251724208 -242703027 -193679429 -213721570
19752 -213721570 -216730197 -227971576 -253443910 -253655961 -225887025 -234067402 -148334209
19745 -148334209 -170487046 -221116799 -277419477 -282622755 -279685410 -265948190 -284791654
19738 -284791654 -312256192 -324778989 -274241778 -209975566 -203364489 -209732119 -228885693
19731 -228885693 -226723784 -211551051 -171603482 -238693005 -232031312 -238509737 -297934448
19724 -297934448 -289155203 -252477601 -257746866 -221539349 -187738536 -215156535 -198098912
19717 -198098912 -197595169 -191361880 -194735889 -315287194 -299273255 -239625932 -260979438
19710 -260979438 -249092346 -269066565 -240107178 -194364251 -198550413 -244855623 -221074836
19703 -221074836 -225593897 -219722960 -206669685 -219201361 -191121273 -169158319 -178694646
19696 -178694646 -213707385 -210358619 -224313873 -235616236 -259798052 -246460576 -253300353
19689 -253300353 -305955456 -290016420 -259475558 -200490094 -198917989 -202337736 -192588877
19682 -192588877 -203688771 -234187970 -231829047 -248232719 -231868673 -204449531 -190033951
19675 -190033951 -198556042 -223185673 -195934137 -248630721 -298236404 -268000007 -260226180
19668 -260226180 -245930485 -263009507 -213930636 -163857379 -213915204 -180396245 -160505687
19661 -160505687 -223871629 -243153116 -210721031 -215589750 -179525677 -169590197 -223721074
19654 -223721074 -221460439 -164690030 -174111880 -188048286 -181598524 -154109714 -208333071
19647 -208333071 -273128896 -277802555 -239308306 -252823288 -305877926 -331130107 -267542504
19640 -267542504 -214734506 -244337821 -227962790 -213786972 -207772246 -246565747 -306982580
19633 -306982580 -307874221 -198561397 -146303748 -161322303 -207468760 -199165313 -209798371
19626 -209798371 -234368509 -245655512 -254098000 -200822595 -204411425 -203282057 -259744543
19619 -259744543 -260579045 -206773127 -216043329 -185446563 -149029894 -141760377 -213572729
19612 -213572729 -211921623 -172563298 -209495735 -200985970 -195965995 -168111284 -187687309
19605 -187687309 -205395275 -260795812 -260560774 -216775268 -229616842 -204226690 -204345767
19598 -204345767 -145437618 -156425060 -185590700 -192623916 -210166732 -198333076 -170869885
19591 -170869885 -205283018 -233685167 -242424114 -288436575 -226898633 -219965875 -182049801
19584 -182049801 -153040858 -192660324 -196711643 -197222769 -189541191 -167035561 -179149954
19577 -179149954 -225048769 -221270500 -181346256 -214373124 -191006930 -223457881 -268412235
19570 -268412235 -237958663 -224025017 -185625471 -156119031 -202185160 -201345354 -179551115
19563 -179551115 -200355411 -233082427 -202619154 -192041454 -227743953 -244759890 -146425589
19556 -146425589 -145682606 -183750734 -236751052 -265224180 -255278846 -232632061 -203168803
19549 -203168803 -216102932 -214875187 -229794549 -269746886 -263476143 -205953825 -197881371
19542 -197881371 -144930071 -116263265 -181192078 -225935055 -235200080 -252163603 -305517058
19535 -305517058 -274662876 -248185818 -275517761 -248973670 -257724761 -241700909 -264165670
19528 -264165670 -269764328 -237342794 -228252390 -216681597 -206652090 -243823549 -280898181
19521 -280898181 -239850679 -235904053 -209056023 -234054854 -202765273 -244000485 -228556554
19514 -228556554 -160104288 -226544797 -234125315 -210333007 -248596172 -289663598 -246925111
19507 -246925111 -204051698 -162352260 -155612098 -211241359 -227744791 -225619566 -278883769
19500 -278883769 -250680906 -158799625 -120624878 -197559282 -197347232 -227431929 -198372616
19493 -198372616 -174708813 -184330885 -202579976 -215984344 -227837788 -243167480 -234049117
19486 -234049117 -239881752 -181861091 -190121691 -160658594 -159619370 -139657197 -213906844
19479 -213906844 -285435920 -226655960 -211545752 -282123495 -233861494 -144598213 -117650791
19472 -117650791 -178466206 -245381062 -246391134 -216755464 -228745628 -139806482 -224611830
19465 -224611830 -187823929 -139077327 -187827597 -185794805 -175624487 -216853389 -214297527
19458 -214297527 -198435334 -200502675 -233100024 -244749900 -220650174 -225057587 -255354916
19451 -255354916 -234127259 -259040424 -244734558 -232041359 -257118132 -252428961 -284464307
19444 -284464307 -307095751 -313156799 -235079086 -218351705 -213958912 -211062995 -261734938
19437 -261734938 -225124743 -178037827 -207929272 -200230514 -222875271 -229505748 -242794468
19430 -242794468 -188056703 -206039287 -191855199 -203684018 -215541246 -210521634 -223136783
19423 -223136783 -261608574 -298869866 -252565292 -226014936 -216020038 -192087286 -178943316
19416 -178943316 -209790440 -233822549 -208986840 -202198626 -211833332 -210191978 -194615521
19409 -194615521 -187890108 -187072203 -185368342 -214067708 -197564102 -191972772 -214642746 -271529629
19401 -271529629 -235727847 -192137394 -190883586 -184605447 -156907034 -200913698 -233894647
19394 -233894647 -241851616 -232840909 -210700578 -186077567 -158551253 -187718096 -191144749
19387 -191144749 -239475474 -233203104 -252463603 -210156704 -193046146 -187264367 -238901321
19380 -238901321 -230349847 -190952723 -180952917 -183410979 -199358360 -237856970 -269734757
19373 -269734757 -265354894 -242621186 -228919685 -218929104 -220138797 -247526737 -210378152
19366 -210378152 -178916333 -198745442 -265319896 -267414357 -238835439 -228010287 -184853066
19359 -184853066 -228868804 -240197075 -254468109 -302524968 -277725011 -251388969 -203846033
19352 -203846033 -217367238 -249372014 -224102227 -221383367 -259143164 -270380725 -258421440
19345 -258421440 -264119217 -250026664 -185515057 -232069253 -189724943 -145283071 -201870477
19338 -201870477 -263772571 -244856602 -252736954 -290065557 -279256678 -237321122 -159535463
19331 -159535463 -180436541 -241985073 -245375224 -247793361 -201456859 -220099199 -211257390
19324 -211257390 -192351721 -203852511 -205724392 -191399789 -179030913 -167779911 -193207810
19317 -193207810 -266745808 -280131319 -242285113 -242662533 -259961822 -273603453 -291117874
19310 -291117874 -274516455 -223015665 -237714525 -248373689 -236900058 -261884671 -174825375
19303 -174825375 -159836997 -143408420 -161116170 -194215293 -196054042 -191929706 -267847164
19296 -267847164 -277928329 -270530367 -293582277 -278958725 -267684343 -221490249 -169610509
19289 -169610509 -214259832 -226725034 -225074319 -187958298 -267124206 -299477187 -236739290
19282 -236739290 -191741444 -177800566 -202800027 -230671434 -155559186 -118132572 -171519443
19275 -171519443 -223595337 -196191597 -207226037 -227712305 -180939465 -200699914 -168714574
19268 -168714574 -152444328 -160263096 -214357563 -204101975 -222448896 -233337046 -208593228
19261 -208593228 -204824749 -166036452 -187573101 -136966601 -143425461 -158177821 -168454346
19254 -168454346 -255970203 -251777001 -198717885 -198981029 -226207011 -215038513 -194689869
19247 -194689869 -222779103 -209557210 -183493992 -150213924 -153691896 -243495769 -296554021
19240 -296554021 -255217933 -232356086 -272946432 -310010704 -303384544 -324413041 -318178697
19233 -318178697 -263979482 -269893856 -236181699 -250829305 -233830240 -177031426 -151119005
19226 -151119005 -180141368 -166637715 -182898614 -222480364 -223444721 -242934906 -240838346
19219 -240838346 -211826018 -214260368 -197922253 -204475466 -194141304 -222157055 -218379039
19212 -218379039 -261708935 -268189268 -242724433 -264162458 -269302460 -254941348 -227292441
19205 -227292441 -189224674 -193644180 -221411945 -299907720 -277901700 -246081633 -219799142
19198 -219799142 -269115681 -304116398 -255880841 -241816906 -255115592 -285058568 -280145030
19191 -280145030 -225578306 -177143474 -177777906 -215230675 -211272726 -140720333 -210298744
19184 -210298744 -246257334 -238874117 -217741178 -163868437 -192710887 -235166992 -215005048
19177 -215005048 -258385978 -260150183 -247860832 -251497983 -239740729 -241575256 -218231969
19170 -218231969 -258903479 -312618259 -302530047 -280722386 -296907457 -257491240 -256877892
19163 -256877892 -253618604 -260148825 -196436927 -218141887 -253837371 -281779228 -266755814
19156 -266755814 -255115958 -254991379 -259955123 -209420120 -216539959 -185103953 -136615508
19149 -136615508 -142166719 -164690690 -194479384 -186077646 -188915664 -191301528 -186011277 -207242367
19141 -207242367 -234193774 -238282725 -265096472 -211840118 -217444654 -237398795 -229874224
19134 -229874224 -175523593 -194276734 -161190158 -145501229 -136418262 -129719724 -156386030
19127 -156386030 -224144178 -276474310 -233934920 -231271648 -184056690 -181129879 -240904135
19120 -240904135 -260602763 -209222364 -182701734 -172528110 -182186961 -220521624 -164323248
19113 -164323248 -74828521 -113234214 -118061113 -117374636 -182083320 -181887647 -136947159 -150051646
19105 -150051646 -152596662 -194042636 -191771660 -166895967 -161867926 -168182577 -204516156
19098 -204516156 -247499652 -264664240 -213192004 -118518612 -176370376 -217460653 -199281236
19091 -199281236 -234210076 -245353255 -206620814 -171176733 -211048965 -189147430 -203463168
19084 -203463168 -233665726 -290365145 -260775015 -231995266 -216147177 -146680995 -139181173
19077 -139181173 -179887116 -206827577 -194650632 -190848951 -155203592 -124637520 -152344510
19070 -152344510 -162822840 -166818069 -177190441 -262710378 -309101010 -295885104 -273155107
19063 -273155107 -230238165 -238587374 -261521946 -209783334 -170068130 -180889111 -202723923
19056 -202723923 -196640066 -197671156 -198151342 -239082259 -230594395 -263012331 -255588806 -228032767
19048 -228032767 -230194009 -222863949 -156390861 -165767523 -175170499 -188788322 -200518252
19041 -200518252 -194085148 -199594758 -224558109 -243693024 -182555762 -237390752 -274940875
19034 -274940875 -253517645 -235061214 -211549744 -157125572 -182741932 -236596892 -241522104
19027 -241522104 -174367549 -143596978 -176984908 -251194123 -260211637 -222042045 -243035734
19020 -243035734 -195450196 -164970399 -234927319 -290646207 -268384247 -226252429 -209386027
19013 -209386027 -166332059 -131213495 -182966929 -222589448 -236877240 -245349561 -245541694
19006 -245541694 -253136941 -235439676 -201200152 -240801783 -260806347 -230983088 -228126375
18999 -228126375 -252638883 -294546432 -258719624 -199093623 -214969239 -201921164 -158018970
18992 -158018970 -166896409 -177427733 -162008938 -163200289 -137219994 -173604764 -177837080
18985 -177837080 -164528231 -180224715 -244883964 -218204621 -167069148 -210240534 -209942384
18978 -209942384 -217259241 -281238424 -285763887 -272326141 -253782831 -239954690 -296739846
18971 -296739846 -358330755 -330032448 -303171204 -263743961 -224719355 -165875241 -145569992
18964 -145569992 -169907723 -166476837 -157724710 -179363972 -188589817 -192545291 -153386554
18957 -153386554 -175020982 -156493369 -169830797 -161142022 -151362445 -190934808 -265962007
18950 -265962007 -272342762 -237227414 -194006435 -172658793 -184457491 -206592435 -203945698
18943 -203945698 -232371671 -263444732 -265078735 -293935124 -295233584 -293420328 -245785522
18936 -245785522 -211406842 -246838446 -273208602 -235449348 -234369807 -232965406 -287188859
18929 -287188859 -296660298 -306431002 -305641530 -259691334 -300221829 -255557208 -234264571
18922 -234264571 -284387520 -277924930 -346860293 -278748928 -161280218 -195839829 -213565148
18915 -213565148 -202098361 -176963690 -204124219 -236972091 -209612282 -237652236 -233929195
18908 -233929195 -137815447 -151073205 -151341172 -194007804 -222444464 -197873845 -196126402
18901 -196126402 -193408223 -195985950 -207757310 -195974222 -193103994 -172395314 -150261593
18894 -150261593 -136135029 -201047774 -187785043 -198596701 -207444277 -200778338 -229139581
18887 -229139581 -229521901 -220781058 -219841888 -185096604 -176099708 -186051176 -184151799 -184442589
18879 -184442589 -248245047 -265175767 -188116994 -84588075 -132306502 -209042114 -182288482
18872 -182288482 -198443037 -191628111 -225140506 -248191803 -186924823 -189403953 -170313616
18865 -170313616 -208229881 -313869252 -272902550 -224946645 -170515093 -177908307 -198450315
18858 -198450315 -220148598 -217092250 -243854976 -276053122 -220967651 -220236509 -233834863
18851 -233834863 -181539930 -141366994 -217500660 -198603604 -187876318 -162446724 -166623641
18844 -166623641 -181432529 -190133851 -198795789 -175790485 -186880130 -218370312 -269232332
18837 -269232332 -293673436 -281302545 -215089234 -206895482 -233762176 -234515385 -231885404
18830 -231885404 -197743081 -235738214 -222663878 -159200319 -155492171 -178335071 -215575258
18823 -215575258 -134881939 -134691286 -170017265 -165053227 -167174565 -169960205 -170764664 -181101263
18815 -181101263 -182444744 -226880407 -302848374 -296514047 -275687345 -208352658 -180825625
18808 -180825625 -140482572 -107663010 -139064549 -176992265 -232488083 -208101314 -167552323
18801 -167552323 -164423735 -170685397 -185713955 -137980764 -92412932 -131396941 -151101219
18794 -151101219 -134841767 -166273404 -203156197 -255122958 -295033931 -302801539 -261092617
18787 -261092617 -245137033 -239191710 -208442179 -198807753 -202876548 -206918268 -216902204 -199652411
18779 -199652411 -234107097 -249577862 -272849239 -245173127 -237988054 -261643117 -272010437
18772 -272010437 -284118661 -214305166 -184061308 -140797872 -163109365 -196466931 -211937488
18765 -211937488 -237737328 -280170167 -255391631 -199036966 -191579191 -199403438 -227046537
18758 -227046537 -226456576 -227450925 -234194974 -252020556 -222276760 -203554017 -248429388 -267684259
18750 -267684259 -245743409 -235206695 -233385619 -235716726 -238199370 -204122206 -218756434
18743 -218756434 -197086405 -219291770 -238312199 -222361945 -242151185 -232776721 -169333119
18736 -169333119 -145195678 -158595435 -147402467 -184108509 -184639855 -216795247 -213650035
18729 -213650035 -164892722 -201335420 -209300168 -229809490 -240042563 -223123011 -225433693
18722 -225433693 -174401225 -157964064 -154991113 -144839908 -136568555 -116381126 -166575867
18715 -166575867 -235639642 -234811494 -225672548 -238331916 -268171272 -242430967 -260707012
18708 -260707012 -254568878 -239815033 -227659329 -194444261 -163431029 -146692804 -202392405
18701 -202392405 -236502928 -199202436 -190061564 -203433483 -207623209 -204713725 -225638655
18694 -225638655 -262280170 -300061230 -315822592 -243111485 -162675912 -133131904 -173794157
18687 -173794157 -193982945 -230278473 -258321690 -256712670 -232930588 -249384141 -250905321
18680 -250905321 -220769930 -145166909 -124439618 -212795609 -237308136 -231295978 -244649071
18673 -244649071 -251512632 -229889096 -190333070 -137629542 -153475285 -232353288 -225202313
18666 -225202313 -185884870 -188960796 -234340226 -218876052 -243837173 -272121326 -261737972
18659 -261737972 -209501793 -203923237 -192498286 -214562970 -195631924 -211654636 -194413076
18652 -194413076 -171276820 -205680212 -186689737 -170749543 -150186602 -146936865 -210506929
18645 -210506929 -269100167 -255433135 -212890918 -247089911 -258800542 -255669879 -232638562
18638 -232638562 -222406166 -221815994 -263531245 -246998435 -245565264 -242122225 -269861510
18631 -269861510 -322699946 -333717177 -287355622 -253394483 -214370278 -215563543 -258379080
18624 -258379080 -248891060 -257882409 -207605492 -214302925 -207987156 -174925048 -210426053
18617 -210426053 -260142519 -326018675 -317643726 -283132813 -311198013 -245962819 -210840070
18610 -210840070 -234632095 -208346230 -164249909 -133820365 -139107115 -162146731 -179991448
18603 -179991448 -182870521 -195433887 -203256179 -185077060 -178604965 -202160977 -221143118
18596 -221143118 -260449226 -277913467 -237983322 -208652961 -225073355 -204988215 -230524414
18589 -230524414 -244365660 -232054071 -254207954 -197219220 -175173747 -234594626 -236904013
18582 -236904013 -246417882 -235852964 -193004656 -199200164 -268991346 -241735058 -270607580
18575 -270607580 -280279142 -254146648 -216100713 -238912328 -170144509 -168518805 -230672832
18568 -230672832 -241880197 -239170991 -230355938 -225644078 -208855996 -226761632 -197205948
18561 -197205948 -203325929 -187359866 -177266587 -168324257 -160794193 -175218464 -192452052
18554 -192452052 -182637373 -200359738 -190954157 -203954431 -251151137 -198877418 -192143430
18547 -192143430 -223609616 -251298392 -242999020 -208077413 -209177322 -236589533 -206318435
18540 -206318435 -200009534 -201714178 -207193520 -196112270 -207627886 -247594352 -207182150
18533 -207182150 -172088485 -180553333 -208613506 -289445989 -238382328 -176767525 -219935237
18526 -219935237 -259533089 -308448470 -263688875 -268934999 -299667252 -275269833 -232178581
18519 -232178581 -221774564 -231707832 -220639975 -179195932 -131836312 -119682932 -196092821
18512 -196092821 -216514724 -177149099 -161278844 -149915799 -147271959 -160523637 -204148783
18505 -204148783 -169279781 -171538900 -179852679 -201207273 -197875274 -221135057 -221377179 -217414259
18497 -217414259 -229076422 -230713029 -258421014 -237850146 -216570065 -202846813 -201864540
18490 -201864540 -196563444 -191000106 -234722490 -263533610 -271593934 -256541960 -227628423
18483 -227628423 -243002699 -272515239 -254850938 -227862204 -236952620 -243224211 -212007927
18476 -212007927 -199736007 -259549595 -239198707 -254876250 -208716218 -235917443 -235917722 -190089937
18468 -190089937 -157026058 -184810526 -183690502 -143954283 -169932068 -248241232 -227511591
18461 -227511591 -223366306 -292772562 -282347664 -302537805 -289537923 -237948216 -230767626
18454 -230767626 -229157202 -201185982 -156743516 -189132329 -195731335 -170593472 -206064334
18447 -206064334 -214523215 -242485068 -203277275 -210349526 -215091916 -183402944 -170779707
18440 -170779707 -171393838 -172563910 -189985956 -165000608 -146663234 -155470966 -141676937
18433 -141676937 -137321292 -172774643 -191344802 -193609926 -213594157 -286408468 -267956997
18426 -267956997 -227778913 -219869206 -253298873 -275429817 -196497543 -232841481 -292379502
18419 -292379502 -195272696 -229999667 -247693842 -237381019 -219929424 -195639085 -213120355
18412 -213120355 -222228309 -219791517 -190213514 -245735686 -263445513 -299182578 -258901191
18405 -258901191 -228145421 -198603613 -168302190 -224977241 -274662799 -223133790 -198976180
18398 -198976180 -270759569 -273653631 -219845678 -256442683 -215644764 -180910586 -198093708
18391 -198093708 -195517768 -162631986 -197723202 -189558538 -194270996 -239670740 -233973147
18384 -233973147 -257971367 -239064185 -177960902 -168270522 -239643506 -242104118 -226583110
18377 -226583110 -235300223 -238494856 -277599433 -265161106 -240444277 -175194624 -162150592
18370 -162150592 -227661430 -310567668 -247262217 -224459888 -208420447 -206891780 -192948216
18363 -192948216 -168489999 -211209372 -247051547 -197759182 -252538334 -248706697 -216662850
18356 -216662850 -174287537 -105041497 -115530023 -175393004 -204713062 -182494302 -191365038
18349 -191365038 -175738443 -168151636 -218053132 -203322340 -218584077 -201732539 -177019362
18342 -177019362 -210907292 -223244731 -235280185 -199788097 -161489135 -197937826 -172373227
18335 -172373227 -144073184 -186898603 -216071199 -232415312 -245186683 -272341488 -201861059
18328 -201861059 -169308530 -186981767 -230649878 -217660194 -241973540 -247374715 -238376103
18321 -238376103 -213846099 -214473738 -243862324 -239555406 -206460229 -206091759 -217586847 -192223773
18313 -192223773 -163886033 -178369664 -171402137 -190874022 -217609283 -210258889 -188123381
18306 -188123381 -196478295 -227543456 -278554815 -262226342 -214920212 -228624874 -164795336
18299 -164795336 -155221042 -227504149 -274195805 -265776614 -246202206 -223456741 -203373435
18292 -203373435 -201424160 -260801822 -251962161 -237637798 -225385034 -253637062 -207565664
18285 -207565664 -123475092 -166369166 -202407875 -289410672 -266854827 -203155322 -226968129
18278 -226968129 -236069622 -222269142 -213900706 -195096880 -196262581 -190896217 -212527718
18271 -212527718 -203688412 -249831306 -274388140 -262080545 -255760982 -210128825 -179418786
18264 -179418786 -191199615 -194839556 -220842635 -194056564 -188397775 -239319568 -190751286
18257 -190751286 -190059691 -240898086 -257099840 -317937178 -296664552 -202634969 -213076709
18250 -213076709 -169315460 -106028571 -188718937 -218807365 -207136742 -200856279 -185593995
18243 -185593995 -219741976 -200518786 -240489794 -261398708 -245496635 -249935800 -182141363
18236 -182141363 -167662889 -223214898 -213544257 -211424062 -227759894 -251603799 -236951812
18229 -236951812 -250465195 -234656195 -263016414 -237371878 -218896252 -208614762 -188760352
18222 -188760352 -175787993 -200272125 -230261202 -256921425 -248770672 -192459507 -179607128
18215 -179607128 -132928408 -102176713 -146126232 -212016338 -198505181 -210465101 -206698965
18208 -206698965 -222892406 -232522893 -257842701 -213123045 -219395550 -250891483 -224887441
18201 -224887441 -215650673 -245552255 -240083812 -197616751 -186558705 -192625660 -208441356
18194 -208441356 -172079418 -201229314 -206510908 -170686143 -203502691 -236844279 -243979613
18187 -243979613 -213742237 -199509855 -197555650 -165371589 -158528008 -213250399 -250334200
18180 -250334200 -252558066 -199548469 -160712800 -168462726 -156587011 -194707844 -233251684
18173 -233251684 -190638824 -140167750 -177535571 -212270150 -221418932 -239516101 -197516033
18166 -197516033 -212919148 -198997728 -223424045 -235278380 -189495958 -212519460 -202778950
18159 -202778950 -178620164 -203857264 -220193256 -232115275 -174433387 -168683416 -187882615
18152 -187882615 -152471449 -175327834 -188163500 -182071617 -161612758 -145612625 -153877932
18145 -153877932 -191703961 -162877817 -161530102 -238639400 -242681792 -234579359 -213120874
18138 -213120874 -189481349 -180061491 -210575389 -197730155 -182237434 -228812980 -277898531
18131 -277898531 -283420800 -252991075 -187800543 -201785669 -247575659 -189224457 -161974944
18124 -161974944 -229809304 -195153774 -181594357 -172712847 -201616549 -241672283 -250567498
18117 -250567498 -235472021 -225022248 -165366502 -194406974 -190339352 -209704971 -171712511
18110 -171712511 -184949665 -206540480 -179988887 -185272831 -198620224 -194441616 -183030360
18103 -183030360 -197590699 -233091574 -258768282 -234900749 -251710335 -306738551 -321909026
18096 -321909026 -287736913 -253373532 -202868585 -187252806 -149373128 -146792897 -154309417
18089 -154309417 -213296689 -249519323 -241342207 -192252343 -197044063 -226235780 -196276964
18082 -196276964 -138529595 -175631830 -196992663 -246336617 -278675464 -236730741 -163327562
18075 -163327562 -192702220 -202058551 -198566911 -275174787 -275915285 -234256198 -184774087
18068 -184774087 -188864569 -206690061 -226048327 -211715379 -217393000 -253168508 -233520206
18061 -233520206 -238725388 -219543196 -229486586 -244077423 -170483413 -146300275 -210044345
18054 -210044345 -188310017 -215273918 -217745040 -246793355 -244487632 -242554021 -268022649
18047 -268022649 -215894239 -225253650 -262313130 -238739514 -221442360 -208510047 -200548752
18040 -200548752 -186158033 -199411537 -270582239 -215657270 -115066872 -86537704 -123158653
18033 -123158653 -158656493 -151385837 -163644443 -193644861 -199155225 -214306391 -211012536
18026 -211012536 -224481883 -208925666 -205166218 -229464577 -227893838 -176622244 -182567286
18019 -182567286 -188174058 -202620520 -198825083 -184737763 -230161250 -239521727 -232393710
18012 -232393710 -283001334 -225903424 -168654793 -201076805 -232178803 -229612215 -216471788
18005 -216471788 -204249769 -209570958 -204249976 -168546512 -143174800 -161249626 -174527674
17998 -174527674 -160950906 -150031399 -139245498 -158260954 -156096971 -129450143 -138330179
17991 -138330179 -165710691 -171939518 -212926212 -247065181 -266741925 -225854262 -206917742
17984 -206917742 -206551079 -136414379 -159018800 -170255078 -181962928 -176316060 -197519930
17977 -197519930 -204405363 -210590961 -189454877 -177659635 -223360663 -278528940 -234506172
17970 -234506172 -208729970 -154300748 -157929737 -255237138 -303296092 -243131671 -228567730
17963 -228567730 -222799187 -163095976 -167760380 -237174408 -222612479 -227471430 -159591345
17956 -159591345 -172228651 -211224818 -208394419 -224134145 -247222429 -213630366 -133822188
17949 -133822188 -111932507 -125629352 -186661557 -209018630 -198294647 -240943730 -193322570
17942 -193322570 -231883668 -215927853 -192502382 -162890825 -154816575 -181560052 -160702286
17935 -160702286 -267550649 -255757413 -189039443 -152468592 -203233082 -208560939 -208186384
17928 -208186384 -188942608 -186229560 -202215329 -204507023 -181807318 -202492909 -213426370
17921 -213426370 -173281029 -146207827 -147105272 -150780988 -165434647 -174376234 -144964932
17914 -144964932 -151729619 -178630967 -218124495 -255594973 -279252503 -250290076 -207795998
17907 -207795998 -193885707 -213764027 -197839312 -179124244 -227091856 -275038314 -254878014
17900 -254878014 -297659733 -329273557 -308312315 -255185355 -200176371 -237666169 -249272388
17893 -249272388 -239482514 -199449015 -240773431 -206312401 -178001050 -217994389 -178648533
17886 -178648533 -202423877 -256803868 -240043530 -247411336 -201762731 -180639784 -173324907
17879 -173324907 -190238306 -215566949 -215979771 -238816956 -224483036 -149647666 -121437939
17872 -121437939 -99430534 -131060968 -239160334 -253224830 -224380771 -247596103 -312653560
17865 -312653560 -256125192 -205312507 -228062260 -207055376 -206558157 -142590563 -149780871
17858 -149780871 -243273084 -210101800 -222517673 -293982244 -245103639 -213675862 -246550147
17851 -246550147 -271157862 -279186300 -262432582 -260637759 -276333747 -285093240 -233156935
17844 -233156935 -224882125 -261053037 -266168737 -249401793 -190611959 -157781223 -167940227
17837 -167940227 -192905964 -219920448 -181958940 -223569613 -307814216 -233758635 -209239021
17830 -209239021 -244206410 -240064340 -229287050 -198880712 -209121842 -217685691 -241262038
17823 -241262038 -230423767 -228191056 -192257248 -62814385 -102008334 -141396708 -133239003
17816 -133239003 -151204992 -139632551 -120394696 -167528998 -138458644 -136806490 -177021102
17809 -177021102 -168309731 -126427339 -122617776 -165484678 -235953419 -219239670 -243627555
17802 -243627555 -239321125 -230457399 -240791392 -245490857 -224695840 -238432382 -305603540
17795 -305603540 -278548588 -225994999 -194145560 -245666108 -253527828 -243880884 -206577227
17788 -206577227 -225015602 -254729458 -199894136 -224500207 -210465915 -214469289 -208471760
17781 -208471760 -200175060 -190852581 -185260700 -171192302 -143040844 -153838173 -175502797
17774 -175502797 -201914343 -201385865 -202564076 -193985035 -197164509 -206050726 -175586492 -173914245
17766 -173914245 -142420070 -157305178 -167552690 -247616522 -217008007 -177946007 -197713249
17759 -197713249 -228967516 -223879800 -222105197 -193353177 -211429146 -219866994 -220697137 -248233568
17751 -248233568 -256904043 -167542773 -127432101 -136386242 -170070521 -235435181 -233567354
17744 -233567354 -180081503 -175560181 -217791969 -196048035 -206658985 -190536821 -197845986
17737 -197845986 -204124844 -199362101 -135066642 -149260978 -161883013 -177573474 -193553688
17730 -193553688 -174955634 -234412009 -265618230 -241524577 -216600012 -181416931 -151103228
17723 -151103228 -175185034 -165440899 -160290022 -201203795 -223014574 -193999324 -160316269
17716 -160316269 -177187260 -229679252 -244221078 -274014309 -238047934 -209398278 -181563084
17709 -181563084 -200548176 -213802625 -233253343 -218877990 -187472292 -225802429 -281675568
17702 -281675568 -316256004 -316157257 -255961944 -232083553 -228193500 -193899626 -196424400 -242429819
17694 -242429819 -254384471 -228256183 -221341820 -204972271 -192908224 -150125764 -126859696
17687 -126859696 -177632067 -230193687 -268265207 -228396784 -256692329 -176022618 -128899743
17680 -128899743 -181060437 -248516199 -279760572 -253254720 -133417655 -135838432 -122508953
17673 -122508953 -108701086 -150243752 -166105637 -209618496 -186558772 -150581836 -140601056
17666 -140601056 -186354436 -214713940 -177180607 -200044042 -210820669 -190288471 -212775868
17659 -212775868 -234619687 -233740887 -254368236 -274294943 -288036580 -342482023 -333674307
17652 -333674307 -359599874 -291565609 -246675377 -201686640 -145479857 -139327944 -164807558
17645 -164807558 -208758623 -235184161 -280712043 -266047606 -216038412 -157803312 -111855710
17638 -111855710 -164950769 -171180092 -180435501 -236463876 -233460490 -243280900 -271630552
17631 -271630552 -249663276 -251424072 -190948433 -150225451 -185353097 -220854255 -232708522
17624 -232708522 -202837310 -283539972 -299731321 -257319437 -223475008 -221065571 -242211046
17617 -242211046 -215739680 -183691856 -158513068 -215877705 -291480690 -289026634 -235069783
17610 -235069783 -249166034 -245257077 -227039257 -201991640 -207095233 -208316696 -164132969
17603 -164132969 -148611530 -159587988 -154658511 -174594954 -203944528 -218779841 -212260343
17596 -212260343 -205048806 -222001875 -265057983 -299838354 -252065501 -232264811 -222213398
17589 -222213398 -222388705 -228524708 -213654697 -242907184 -235740228 -210776651 -201941141 -190550359
17581 -190550359 -230251876 -185396904 -159122492 -201749041 -233878612 -218265824 -194942954
17574 -194942954 -262815862 -311435898 -275172912 -234968128 -225965610 -247203344 -286728638
17567 -286728638 -305127944 -271508529 -202972355 -184725117 -179507610 -252152816 -221930475
17560 -221930475 -159049958 -197990688 -212579053 -232278447 -245701852 -205544187 -251142736
17553 -251142736 -267939852 -244401772 -190728178 -200740225 -227525761 -229333038 -222184243
17546 -222184243 -180307914 -150558399 -162500707 -223741535 -251644813 -200999859 -200946725
17539 -200946725 -221655735 -192481536 -184612645 -215643363 -206102829 -269478553 -339123318
17532 -339123318 -311695710 -221956805 -229160507 -213605757 -197614528 -185323537 -209035594
17525 -209035594 -258844089 -232361200 -218182215 -246034644 -260836035 -209659623 -176832214
17518 -176832214 -173324671 -188007764 -221521819 -221129905 -194267589 -219694943 -223664212
17511 -223664212 -193640945 -230317577 -232544023 -227447581 -229729742 -242287468 -231681921
17504 -231681921 -199545862 -193866616 -184529611 -215044622 -180155059 -229126023 -242250289
17497 -242250289 -273374388 -273039838 -267677005 -257109374 -256656116 -273502858 -209985648 -185194765
17489 -185194765 -191992096 -184604387 -212353025 -228869035 -238495921 -179912044 -188071835
17482 -188071835 -182689640 -167302138 -190680351 -239590605 -242138327 -230380843 -224554131
17475 -224554131 -186425946 -157342868 -178873349 -178625385 -187767225 -203625020 -189258039
17468 -189258039 -204663783 -178267120 -170094829 -206468554 -289036659 -278164669 -233349362
17461 -233349362 -190695303 -178810276 -205592390 -198813427 -192235229 -178263116 -181140360
17454 -181140360 -156076984 -256119883 -263961191 -244486559 -265195483 -207793242 -222373962
17447 -222373962 -230756632 -276838308 -258411877 -244519217 -220662422 -228128642 -281885598
17440 -281885598 -298391788 -233807365 -214387970 -214946124 -214909998 -192646872 -213249465 -226888170
17432 -226888170 -224366686 -242777882 -246463794 -206449052 -179132354 -166243447 -191593527
17425 -191593527 -188698233 -193692302 -186868990 -183315951 -209239769 -201304211 -174241096 -202610073
17417 -202610073 -259917094 -284899196 -271729255 -256662529 -244348238 -239940476 -207893804
17410 -207893804 -203778009 -172884279 -204355070 -211219766 -218696217 -223213432 -155625406
17403 -155625406 -63337694 -92737593 -159883299 -248430081 -256622632 -225354528 -246401318
17396 -246401318 -256876434 -244103235 -211972348 -244802779 -260806356 -290119414 -289883922
17389 -289883922 -299763880 -319429651 -245383570 -216402394 -270680080 -257313837 -183898883
17382 -183898883 -162444696 -159843262 -194107739 -242701250 -182828943 -212484083 -274464294
17375 -274464294 -282284605 -220912319 -210238468 -239257643 -230587987 -215244409 -257966555
17368 -257966555 -237135752 -264417523 -258355341 -237388877 -272085275 -237151021 -218119087
17361 -218119087 -233079130 -252266482 -265813689 -253439778 -240037146 -260199352 -264936268
17354 -264936268 -216330397 -215920549 -185080239 -166483642 -141850918 -149724925 -177557971
17347 -177557971 -196374306 -226819288 -199226128 -192590431 -239693601 -205591278 -195344763
17340 -195344763 -221995909 -231893931 -214192600 -189107621 -161629593 -238041975 -274178444
17333 -274178444 -180482983 -181101204 -198604913 -220707466 -233655389 -268221304 -307410035
17326 -307410035 -276270935 -230845358 -215053000 -195329115 -244923168 -209688308 -153539548
17319 -153539548 -229336812 -177113374 -133225838 -143386546 -154610853 -153131429 -166976379
17312 -166976379 -194064400 -214205661 -147262467 -138152585 -178588138 -216929026 -247442040
17305 -247442040 -239725324 -244779681 -235040909 -223978533 -187196152 -151979420 -150561832
17298 -150561832 -239616725 -244348389 -239208195 -270347274 -244441482 -227868389 -255331877
17291 -255331877 -259181919 -211381053 -232471400 -282824049 -230716560 -213589469 -206839828
17284 -206839828 -236560776 -191871416 -207612853 -251166988 -296482368 -275685220 -284809646
17277 -284809646 -255036721 -262281901 -300277132 -280743229 -225921134 -236769691 -269916983
17270 -269916983 -234863758 -175199859 -170204863 -169638641 -156139907 -129513366 -119687364
17263 -119687364 -161155736 -166147116 -215552666 -167458315 -191376325 -224281290 -197336580
17256 -197336580 -218121090 -180883572 -178773091 -190114188 -180724249 -107797977 -138291234
17249 -138291234 -201099069 -207390041 -162987802 -160224476 -171546650 -181595234 -172494859
17242 -172494859 -235455680 -232429262 -232072321 -204084666 -181866130 -175281408 -214884202
17235 -214884202 -214890443 -214458854 -220445419 -224309296 -266319200 -249113231 -238940236 -200546828
17227 -200546828 -187685252 -175018349 -163487786 -184107610 -197148740 -166436707 -237687090
17220 -237687090 -288695164 -285020266 -244478468 -183455280 -136610263 -143194227 -144189046
17213 -144189046 -150609760 -202766716 -273603901 -264351060 -238226340 -190028928 -219859381
17206 -219859381 -279186156 -284639298 -282895978 -261346077 -209296091 -260827369 -254049746
17199 -254049746 -217606491 -227119254 -163844825 -210687909 -233335972 -175696271 -197932652
17192 -197932652 -205986538 -224807984 -221944952 -226175769 -234073932 -261432044 -234905245
17185 -234905245 -166539986 -210440690 -147964157 -156592353 -137044204 -175751441 -193362333
17178 -193362333 -208733506 -239895987 -158963817 -174121779 -204406687 -164300675 -184952313
17171 -184952313 -154363912 -162808749 -189392392 -200435517 -212566252 -202935895 -203863206
17164 -203863206 -205175002 -218321174 -187475776 -205262733 -246286476 -237717509 -183348955
17157 -183348955 -192830336 -208989943 -227193445 -194975093 -169730445 -166645425 -194869965
17150 -194869965 -202717423 -168514112 -180563507 -218771717 -198667399 -212681218 -201981031
17143 -201981031 -183784611 -178829211 -218709640 -218263636 -217696398 -221798839 -213614271 -193119049
17135 -193119049 -197985215 -189114012 -179914886 -200246701 -215453191 -210934258 -230318143
17128 -230318143 -218183566 -201476219 -214363382 -206815281 -209726363 -169458227 -156051760
17121 -156051760 -144085672 -181765685 -189573815 -160769022 -178545692 -163612029 -174738911
17114 -174738911 -197574594 -193888353 -214344022 -226390774 -187679325 -200639296 -214368460
17107 -214368460 -205468909 -236871029 -191720179 -195254936 -187794808 -160164565 -107973298
17100 -107973298 -140674325 -125971180 -162382410 -215812347 -248940397 -246495737 -261654700
17093 -261654700 -247775684 -198497507 -196324308 -187103204 -211959027 -212816567 -194062878
17086 -194062878 -218776595 -233212799 -207941909 -212915453 -227940734 -267460289 -236631434
17079 -236631434 -170964294 -184754404 -193403212 -218993347 -244790348 -209738458 -233949399
17072 -233949399 -185121583 -162623097 -151796870 -164742927 -161747941 -164368006 -161313929
17065 -161313929 -200582032 -187800346 -165970900 -217553460 -233687010 -168521988 -148991744
17058 -148991744 -141181641 -115055952 -179284302 -217355917 -198200245 -209472242 -170093111
17051 -170093111 -171809709 -207058025 -249947866 -250701896 -238323911 -187033983 -208870151
17044 -208870151 -257183488 -240606750 -214028408 -291349114 -313023221 -281425785 -254438928
17037 -254438928 -197237058 -220045207 -231408482 -185069964 -166580141 -200909124 -227846547
17030 -227846547 -268709950 -267254613 -229630957 -214248295 -166838245 -188127914 -179339851
17023 -179339851 -184743624 -186918181 -147886638 -159031581 -126321971 -138666916 -154754606
17016 -154754606 -192211764 -265635536 -235734270 -159995984 -173410512 -223829033 -229721287
17009 -229721287 -180291622 -186058583 -181280314 -200805153 -169128479 -101817037 -73145320
17002 -73145320 -56312570 -136197489 -216980270 -266228013 -200228488 -161831922 -191341042
16995 -191341042 -189976164 -113941884 -78225765 -122161409 -197068819 -194228414 -175652643
16988 -175652643 -154550663 -169923689 -183669546 -196238598 -191511472 -183216850 -241045190
16981 -241045190 -220215636 -157966227 -103992306 -182587506 -204569250 -198817811 -197979801
16974 -197979801 -184071875 -227198030 -237782624 -250611704 -256487123 -253221171 -253943791
16967 -253943791 -233638990 -255058384 -300324202 -308289337 -226636100 -209272955 -208150774
16960 -208150774 -222336602 -224059268 -234204385 -298573183 -271414771 -209927189 -209964604
16953 -209964604 -208511606 -227971510 -238557278 -268046844 -227579231 -186972016 -149165099
16946 -149165099 -185302443 -247201761 -228341157 -178408202 -123522616 -135362021 -142673672
16939 -142673672 -160562801 -186660922 -211453958 -177687963 -213811655 -202208142 -219531212
16932 -219531212 -255095370 -231431156 -202848055 -205262384 -194851313 -189129042 -216606788
16925 -216606788 -209414934 -261157904 -330013752 -337189565 -319304336 -321997645 -281412531
16918 -281412531 -202636404 -195500402 -199750902 -191336715 -188417773 -165714228 -194801013
16911 -194801013 -268366376 -322482087 -274690413 -263677972 -219798508 -230331807 -209235187
16904 -209235187 -184299418 -202282195 -257870016 -204921512 -191832987 -244501925 -222293493
16897 -222293493 -214845528 -205336648 -215455741 -144097153 -187420023 -233419842 -264693342
16890 -264693342 -284361767 -276693116 -242755341 -264742581 -239927690 -253894377 -249642832
16883 -249642832 -245587288 -216079421 -182485014 -215214538 -258703756 -240840470 -225449579
16876 -225449579 -270919005 -270365532 -264864407 -254816330 -258456644 -227962898 -237034735 -227146527
16868 -227146527 -227671956 -229596959 -166891555 -161024324 -171877134 -212867586 -271087994
16861 -271087994 -260084673 -247243804 -250205314 -199125992 -136062883 -156875397 -217648785
16854 -217648785 -228544074 -221032779 -236045501 -215773723 -205926895 -249898005 -213335105
16847 -213335105 -253103743 -195362523 -196075049 -166830416 -191302760 -213588258 -144268351
16840 -144268351 -150303741 -267310029 -323490253 -265871154 -252057677 -257949389 -257930365
16833 -257930365 -253737073 -265981778 -231570970 -157689613 -123446077 -97750190 -121442707
16826 -121442707 -203957542 -236689220 -233211312 -175849466 -172328466 -194416278 -151996195
16819 -151996195 -189288951 -188870820 -187462955 -260343218 -242820736 -260586751 -240795299
16812 -240795299 -227183892 -260920773 -285156335 -270416873 -247330611 -208324007 -201463150
16805 -201463150 -209981232 -239307551 -247533039 -239478267 -217386409 -184330307 -219585844
16798 -219585844 -237381154 -161869536 -150779223 -207983978 -208452414 -183144083 -168334874
16791 -168334874 -212967920 -163107428 -166622622 -223987539 -177669052 -164596518 -200415845
16784 -200415845 -187261077 -187178186 -153189201 -155353287 -204544550 -142249334 -147806330 -182172686
16776 -182172686 -231171005 -194620234 -184280225 -186985157 -182080722 -202369595 -167932131
16769 -167932131 -174355506 -163009867 -161496323 -197587067 -214090873 -229631490 -259922294
16762 -259922294 -296202450 -268532721 -209904460 -192266843 -203098811 -234515659 -236490375
16755 -236490375 -254732335 -266915821 -131358437 -119365095 -161662860 -163692712 -146673384
16748 -146673384 -182796504 -183572789 -194234552 -223055805 -242279786 -230492660 -204153151
16741 -204153151 -176620127 -157157748 -168964044 -131566933 -109286276 -143774936 -168786011
16734 -168786011 -185411872 -172260082 -193044296 -259188550 -277663722 -183011760 -137375633
16727 -137375633 -168234525 -177892567 -186182522 -227060793 -232438537 -251651396 -215175153
16720 -215175153 -198541254 -199952881 -204776515 -221974858 -223441388 -203512807 -225663526
16713 -225663526 -226697376 -238844352 -239361201 -234167598 -228151727 -241155201 -223972142 -225919271
16705 -225919271 -174588073 -128696764 -156539457 -134538848 -197679042 -213680717 -214611077
16698 -214611077 -193939000 -146250179 -194191301 -207812205 -192962015 -152745419 -145693852
16691 -145693852 -146753436 -133132490 -124031316 -157291683 -185002317 -169513986 -167155866
16684 -167155866 -165260490 -168175954 -170016663 -178521648 -220772924 -258496945 -253725197 -258102813
16676 -258102813 -235148857 -205508470 -230278811 -230183217 -212833295 -246591705 -233014495
16669 -233014495 -197026526 -156976059 -161915525 -193133677 -219074113 -238850098 -187534248
16662 -187534248 -237996718 -253979362 -246257457 -263129853 -228863323 -184227536 -215035013
16655 -215035013 -204478678 -182666812 -208808488 -209462280 -241985134 -263109804 -227572407
16648 -227572407 -202376776 -212347809 -195767969 -186115985 -216970532 -195642159 -207663276
16641 -207663276 -202383573 -181236224 -198112344 -180024617 -183334009 -182470429 -236792115
16634 -236792115 -243110278 -195239839 -183441326 -190225020 -228622852 -159455915 -132242581
16627 -132242581 -144282925 -201204779 -253622419 -264825210 -234637574 -254330902 -267015595
16620 -267015595 -261236602 -245086164 -256699087 -195613037 -139747890 -165372213 -185807262
16613 -185807262 -224035387 -204092641 -194665234 -211078116 -211957752 -201615101 -265536740
16606 -265536740 -237159606 -237142244 -191372845 -190879233 -169466383 -148515634 -170513668 -199447395
16598 -199447395 -195729343 -149925688 -153110170 -220303041 -226794411 -192933150 -162839666
16591 -162839666 -210577980 -208353024 -172692705 -225217200 -257451802 -251242639 -252482138
16584 -252482138 -233633644 -280735191 -267875229 -223314489 -205103687 -264596048 -239810863
16577 -239810863 -179398290 -170993945 -167371803 -171611239 -185860939 -183424039 -207012442
16570 -207012442 -214959172 -261995755 -225009508 -263685043 -226333929 -221597351 -248291004
16563 -248291004 -215781504 -245030907 -161979957 -103022505 -123054140 -139131274 -137081682
16556 -137081682 -179956524 -165421213 -177553164 -194144684 -274689769 -249655442 -182000719
16549 -182000719 -176688137 -222254902 -228006280 -204368578 -222298587 -200376116 -245286471
16542 -245286471 -257358750 -251476346 -284324421 -279413478 -213506226 -165269176 -121271022
16535 -121271022 -166058139 -175745349 -145043089 -143367059 -206539086 -155860156 -107060081
16528 -107060081 -116295274 -113204812 -130772194 -134323162 -126672081 -126713286 -115368846 -186951633
16520 -186951633 -171921952 -147602889 -140235527 -205397947 -265291483 -205887196 -166017191
16513 -166017191 -158456421 -169033936 -187709302 -175513294 -191965585 -217516950 -165430553
16506 -165430553 -163288038 -212392509 -249537052 -241382911 -229180931 -258772904 -236183251
16499 -236183251 -185483593 -168521788 -201618204 -253350777 -263035073 -206294179 -195621016
16492 -195621016 -217147779 -205083305 -268771243 -244411098 -221887709 -266824595 -258059462
16485 -258059462 -256797092 -263457457 -266809911 -263034444 -247681020 -218502814 -163673618
16478 -163673618 -140046242 -126496606 -161359771 -190600674 -158619456 -139870511 -160313010
16471 -160313010 -178467818 -206591974 -200772385 -230669028 -261037166 -225333936 -183451725
16464 -183451725 -178007453 -162233394 -156676564 -239256609 -241873838 -226501751 -242822972
16457 -242822972 -207511022 -250786583 -256719193 -187193645 -137045670 -151721314 -157686240
16450 -157686240 -168834223 -147267474 -150528382 -184006388 -220403349 -223123272 -194859509
16443 -194859509 -199922072 -210671225 -201690778 -196721744 -229416323 -230785075 -241733216
16436 -241733216 -243951998 -176796137 -159293475 -224446636 -222068134 -161535288 -157719483
16429 -157719483 -131602890 -109526969 -152907824 -184405719 -176312199 -184031618 -248754337
16422 -248754337 -256496489 -246845539 -215796095 -221258656 -179306315 -172799259 -161111229
16415 -161111229 -211439374 -194533684 -160074220 -197430810 -190736087 -187426696 -207455031
16408 -207455031 -259582164 -303748691 -271028474 -246389616 -231544319 -220369177 -250502171
16401 -250502171 -289807749 -272380818 -259759876 -231367062 -150552349 -183874802 -206399451
16394 -206399451 -178206609 -173046080 -196323838 -214971276 -184962590 -168853942 -228341922
16387 -228341922 -237803799 -185666125 -258548104 -304686270 -259122202 -225472836 -225019279
16380 -225019279 -235788540 -229416166 -205802296 -163799753 -177609656 -224337968 -224973546
16373 -224973546 -240072090 -226053268 -178107603 -223137826 -209761150 -198279609 -220890343
16366 -220890343 -163696756 -158542454 -113825411 -176298033 -192909852 -193866852 -225010868
16359 -225010868 -173359307 -185160867 -173510685 -199720048 -214643681 -265479228 -252598984
16352 -252598984 -270581573 -231982958 -156636765 -152006907 -136470394 -142560561 -166247096
16345 -166247096 -173051476 -230757893 -288475475 -259672975 -226272270 -208036497 -153080198
16338 -153080198 -177605225 -187458934 -196705800 -174022963 -168307346 -139056000 -116102087
16331 -116102087 -151319694 -181673920 -161027033 -190270219 -263844695 -195231817 -157480363
16324 -157480363 -274925943 -305219424 -290349309 -282544682 -234274887 -198754879 -126062059
16317 -126062059 -155324974 -185344629 -169118589 -217200732 -237574932 -213609869 -163911861
16310 -163911861 -148110529 -90072160 -154985687 -165277334 -174676740 -155670472 -170961459
16303 -170961459 -216336323 -191297082 -189049069 -175017673 -170293452 -151345207 -157688906
16296 -157688906 -149937026 -165116529 -164687243 -208740975 -246224408 -190127394 -104485810
16289 -104485810 -106874931 -158106070 -150711205 -144884596 -170930081 -153964875 -81629055
16282 -81629055 -70010750 -115994163 -198528600 -160984609 -193200220 -243279520 -178297872
16275 -178297872 -139950359 -196897816 -205580958 -194996976 -212343146 -235826671 -205609478
16268 -205609478 -150663871 -161772006 -123440272 -143146417 -170562132 -181249426 -157695037
16261 -157695037 -126052165 -159608950 -217386365 -246395256 -196378466 -153652080 -113268408
16254 -113268408 -77028712 -76997060 -147342346 -165490133 -208252586 -208636902 -184352012 -230458881
16246 -230458881 -254260241 -277305417 -319545618 -261393626 -232409616 -221288343 -210288744
16239 -210288744 -185029884 -190552605 -148684645 -156710969 -210673803 -222850706 -210625430
16232 -210625430 -178630009 -191187968 -202634283 -166107042 -182001101 -259437818 -268287335
16225 -268287335 -231480336 -206985909 -224508155 -214640264 -197552521 -194205224 -172126767
16218 -172126767 -172624002 -168968946 -123039217 -116924850 -159255074 -186187050 -172142799
16211 -172142799 -172994437 -198886684 -96367203 -144897395 -169427186 -151859123 -135543782
16204 -135543782 -115315394 -135305460 -97955056 -134219799 -159726374 -178260667 -216148112
16197 -216148112 -262952631 -236852432 -234647008 -263477723 -231308058 -227017028 -200958017
16190 -200958017 -181192967 -182001777 -214115006 -192797232 -140886302 -105760599 -154962115
16183 -154962115 -219602073 -236928510 -235804298 -226928652 -157609281 -128227525 -93630084
16176 -93630084 -109092088 -178582778 -183374789 -175609068 -173602783 -181518801 -227688150 -236423874
16168 -236423874 -206927918 -208350238 -221624651 -246181457 -222641269 -212588970 -164688503
16161 -164688503 -166882524 -200625492 -185560336 -160396838 -201551205 -176050730 -173186889
16154 -173186889 -183959747 -173703601 -199082326 -245623890 -256519500 -277225892 -205585388
16147 -205585388 -131507311 -144344255 -201314633 -214929541 -139723812 -127314984 -206544621
16140 -206544621 -203252389 -271253870 -328884801 -294520660 -266447643 -258407990 -254240989
16133 -254240989 -234492808 -216114634 -215517842 -211751696 -253987026 -208936509 -198016268
16126 -198016268 -157941627 -152287055 -176753528 -167738696 -127061426 -186208362 -184737766
16119 -184737766 -195240227 -117391118 -98103635 -194059520 -193920637 -230907071 -246975107
16112 -246975107 -239743924 -173409521 -133814679 -89501109 -141109693 -179946549 -221721683
16105 -221721683 -212536690 -189135333 -187000077 -220068198 -171148155 -133094397 -201749474
16098 -201749474 -227179042 -186114619 -174033179 -189384016 -200408928 -154067211 -138057132
16091 -138057132 -181993416 -218521536 -198796951 -153873344 -189798016 -217868113 -182224069
16084 -182224069 -183245374 -194877570 -171448492 -143824593 -156396558 -129011391 -162691447
16077 -162691447 -210770532 -265490353 -250403812 -274462730 -278338081 -183112599 -156829993
16070 -156829993 -185640056 -214972154 -259920811 -265004438 -283515329 -224422065 -231348560
16063 -231348560 -224100415 -190177500 -173646558 -186057303 -222412284 -207254476 -183193226
16056 -183193226 -162309761 -173814426 -131075231 -133110005 -134774869 -149169557 -255039804
16049 -255039804 -283347268 -267840740 -209259771 -164890568 -167639759 -182004291 -192718474
16042 -192718474 -182474533 -219875395 -249181172 -243686519 -228252940 -222104454 -252564700
16035 -252564700 -257775815 -188919918 -164888038 -179374499 -216915373 -163982055 -148699599
16028 -148699599 -148062901 -172469050 -168390874 -108417906 -121385293 -179279280 -221334784
16021 -221334784 -214498485 -186034827 -206061179 -210168622 -207620198 -196451181 -223827046
16014 -223827046 -281302135 -295655704 -283250056 -272044758 -238818114 -195197149 -153410262
16007 -153410262 -128836726 -145327257 -179705728 -173046309 -173283227 -129019264 -98767561
16000 -98767561 -114095015 -166609750 -199004371 -210614683 -167003820 -187415335 -220970904
15993 -220970904 -207649163 -152558044 -158188966 -148590074 -188464103 -211947790 -199993716
15986 -199993716 -187297932 -139746503 -163205934 -209879188 -202532619 -178627550 -174225199
15979 -174225199 -166706561 -162101951 -211642997 -256301158 -250653898 -196874906 -156396902
15972 -156396902 -192463180 -227046364 -224392841 -209516806 -182977485 -177488740 -188398755
15965 -188398755 -159674488 -168900402 -173394320 -167904509 -197885561 -209076071 -196451710
15958 -196451710 -172555346 -158739962 -210383941 -282792616 -277144685 -237495976 -175212734
15951 -175212734 -193642406 -204481497 -195842293 -199295718 -196755121 -229799425 -211434774
15944 -211434774 -194309202 -199950554 -226501617 -218168178 -219530058 -190396952 -150388677
15937 -150388677 -123973298 -149502862 -94536975 -90839331 -190069017 -237519542 -212235702
15930 -212235702 -184830614 -193863909 -196156007 -176856185 -181200597 -191339723 -188917364
15923 -188917364 -201345421 -194579612 -197369215 -141161616 -140388194 -187103153 -152817405
15916 -152817405 -171977662 -218997868 -168164622 -146957535 -144322273 -161702400 -149868344
15909 -149868344 -147227079 -155247393 -175264420 -155731974 -128179049 -134319019 -162519040
15902 -162519040 -197956240 -205364082 -176583334 -170840213 -178092595 -239299983 -264152981
15895 -264152981 -254113053 -222846168 -218484709 -209070398 -203819734 -210839568 -193203272
15888 -193203272 -215046669 -232832588 -205756338 -189328550 -135090704 -126367974 -139294073
15881 -139294073 -159869373 -175431449 -153315816 -190764578 -236874570 -227098782 -235836162
15874 -235836162 -251545937 -269166305 -286999429 -225234509 -206544706 -168307942 -173756768
15867 -173756768 -221418940 -215073512 -176687688 -185942147 -223231022 -214729498 -202168167
15860 -202168167 -178914674 -204735513 -205858617 -199196507 -196898113 -156183628 -110487327
15853 -110487327 -126696056 -108245369 -116731323 -146576641 -156660970 -148086812 -134126852
15846 -134126852 -94867493 -109559016 -121112642 -161547970 -200979156 -192336585 -169834406
15839 -169834406 -125418339 -143127130 -193244284 -207916279 -173139453 -156975254 -248557825
15832 -248557825 -229159472 -200931429 -128066469 -103532093 -215066933 -273227316 -218649569
15825 -218649569 -191256905 -158395568 -195272488 -195840510 -149915283 -173305506 -149390229
15818 -149390229 -200331738 -213738894 -234338352 -173199489 -191561343 -208300415 -166448782
15811 -166448782 -225566598 -202872117 -179129518 -149704766 -145739346 -127534940 -129420297
15804 -129420297 -154369781 -167604521 -191999813 -174732641 -168633666 -207492325 -199522587
15797 -199522587 -179968823 -159525797 -159528312 -148215359 -145366590 -142846036 -178540151 -161496547
15789 -161496547 -164745947 -182921952 -151507319 -123122003 -183950697 -227148818 -190724851
15782 -190724851 -199832261 -195745244 -190786386 -197311434 -158202039 -176448428 -229055157
15775 -229055157 -186901948 -165245870 -165207446 -203263843 -211731734 -224719616 -226675898 -217265821
15767 -217265821 -162098357 -201640792 -217459051 -217512410 -241131209 -225873591 -223931589
15760 -223931589 -257426331 -238943292 -208402516 -182423473 -138438330 -88157856 -170307994
15753 -170307994 -183284535 -210389885 -220380116 -224924601 -175934394 -170681690 -208141515
15746 -208141515 -181016084 -181303023 -202724159 -234434689 -249168110 -212231076 -160498400
15739 -160498400 -255171234 -275978499 -189429681 -206343563 -240911307 -257168814 -261492831
15732 -261492831 -160534022 -167276488 -159617635 -147658978 -198887582 -174461749 -160099033
15725 -160099033 -190524123 -167375690 -118731078 -145260696 -151062335 -175560810 -199173725
15718 -199173725 -164242645 -155352448 -192665356 -201180390 -155891999 -185165612 -174632005
15711 -174632005 -206726954 -185860059 -115574932 -116714878 -136026203 -200928632 -179878851
15704 -179878851 -164593911 -207305887 -237974705 -239813801 -220068248 -189330453 -213152364
15697 -213152364 -224447949 -228751547 -163015515 -166980785 -169276664 -191738833 -176036034
15690 -176036034 -193471903 -228714400 -179078226 -177662211 -229234425 -238895497 -220102321
15683 -220102321 -175632862 -209283924 -230042970 -250500546 -206986546 -154466647 -161495084
15676 -161495084 -174311254 -123921685 -139490544 -143371281 -152432272 -130901941 -141285308
15669 -141285308 -133145822 -114322941 -156388761 -151783318 -203871023 -215585483 -207877903
15662 -207877903 -212867556 -236022586 -250334232 -228491418 -243825551 -205001816 -179049356
15655 -179049356 -135071744 -84730007 -103760660 -159269925 -184088709 -194294348 -189383909
15648 -189383909 -190079329 -173660124 -193184337 -222974871 -218102378 -203763267 -166374183
15641 -166374183 -150745203 -96095430 -74999998 -113051922 -152655311 -158906898 -206629295
15634 -206629295 -186755212 -164257429 -232037051 -295725059 -232131924 -193915061 -213279312
15627 -213279312 -221144991 -229923660 -265562323 -283166784 -235317003 -158057256 -188722752
15620 -188722752 -213292390 -172999715 -178391520 -204494883 -151900565 -149427452 -199937944
15613 -199937944 -237111465 -176623983 -192687281 -189546320 -134317413 -134033447 -154053321
15606 -154053321 -211645977 -247589092 -198550652 -164386045 -140422248 -194923903 -182826120
15599 -182826120 -161240407 -179905975 -204032403 -205981437 -202675756 -182426407 -204714014
15592 -204714014 -210546508 -234851873 -230593116 -216000564 -209163171 -176342409 -149867264
15585 -149867264 -175239427 -172388881 -135141621 -119486895 -133639671 -229493382 -260243836
15578 -260243836 -215236150 -210199906 -233726996 -228343284 -200672149 -204290849 -191420320
15571 -191420320 -186082449 -207425273 -177811037 -88390352 -62690086 -117140583 -159277304
15564 -159277304 -181508329 -174599948 -162059620 -165363284 -144241546 -120856011 -178449528
15557 -178449528 -191655665 -161938195 -147798678 -190926812 -217142645 -186764631 -171735190
15550 -171735190 -169664377 -178879313 -180189032 -157597403 -171662706 -222760936 -217148271
15543 -217148271 -174289740 -154259869 -140907934 -188960125 -185847616 -169155579 -139924795
15536 -139924795 -171365952 -204578569 -224507260 -229055389 -271565246 -257064422 -212302048
15529 -212302048 -195876343 -190627708 -196191612 -195394553 -242275053 -224884991 -217512319 -241961788
15521 -241961788 -227546159 -190363309 -147047201 -134232973 -167189641 -246608173 -244386310
15514 -244386310 -212564781 -177155019 -167912862 -149084796 -129363068 -87535613 -109978673
15507 -109978673 -146665719 -186712812 -185706663 -180923308 -106150266 -131289043 -117254469
15500 -117254469 -144708815 -141803528 -170880957 -191638408 -177630251 -159186997 -144452396
15493 -144452396 -182064668 -209815014 -231127273 -207613120 -158660879 -151402895 -124801817
15486 -124801817 -137115885 -211878468 -204955225 -170647065 -166053306 -198511369 -218626115
15479 -218626115 -226516162 -209939185 -220413001 -197794990 -183642060 -185986667 -216251236
15472 -216251236 -214342238 -176632097 -167902685 -188732563 -144306545 -115416450 -84917906
15465 -84917906 -118267036 -174509462 -160275750 -177196435 -180458714 -155414237 -130465856
15458 -130465856 -116077326 -145574673 -174014375 -182294430 -161958459 -141474701 -132609256
15451 -132609256 -146209789 -180509717 -194000300 -185845899 -186874233 -168511679 -177117846
15444 -177117846 -144770095 -162439798 -147626376 -183480288 -168893875 -145507990 -153310150
15437 -153310150 -174943909 -179092989 -148320973 -166659770 -153789367 -221617121 -201885065
15430 -201885065 -175277422 -134335908 -156765900 -169420152 -173914739 -182333239 -206756129
15423 -206756129 -216069471 -192351609 -177974463 -184088170 -166980784 -210849950 -204174713
15416 -204174713 -176268348 -162577484 -164963113 -205412320 -177002272 -167394076 -140186215
15409 -140186215 -149925560 -131917137 -101083647 -152977420 -169087307 -203962193 -226076496
15402 -226076496 -267980176 -246224295 -184340522 -146120060 -153551854 -172041262 -177136505
15395 -177136505 -185871213 -127231635 -141720939 -186021561 -201368372 -191542805 -156292193
15388 -156292193 -116269258 -178905872 -241098255 -160001414 -146545256 -178354535 -157442584
15381 -157442584 -136662322 -109437360 -185180442 -190252558 -152830324 -181434316 -237753974
15374 -237753974 -223683312 -182158755 -191426464 -232202330 -168130242 -123953940 -124515753
15367 -124515753 -161660724 -204320125 -173764976 -189017283 -202848955 -217514193 -208875275
15360 -208875275 -178781703 -156387230 -114457527 -185740059 -248668550 -232753774 -224295687
15353 -224295687 -158313480 -169657525 -201015036 -181429876 -227143022 -190365523 -186007697
15346 -186007697 -222953509 -250407584 -245626088 -238389754 -157708711 -170014010 -166845531
15339 -166845531 -193749507 -203977994 -228959078 -190975161 -126239452 -143013477 -228332802
15332 -228332802 -259966189 -256988996 -202398489 -165632279 -138717555 -151222079 -157708530
15325 -157708530 -180705840 -235708409 -221710030 -204166166 -191597848 -199796156 -199076337
15318 -199076337 -202638728 -228233988 -197097746 -171482659 -221008885 -182219818 -196593108
15311 -196593108 -220214079 -216952297 -183530613 -175365686 -205512346 -201378350 -207636874
15304 -207636874 -248356962 -265629643 -234304265 -214001172 -209536215 -202738731 -296209858
15297 -296209858 -234153455 -123771134 -92669113 -112886739 -193438427 -229726305 -210493256
15290 -210493256 -174968234 -186258071 -237842233 -228756502 -293185558 -262370413 -195491235
15283 -195491235 -194259672 -170638569 -201393342 -234848588 -311575409 -296452604 -294638513
15276 -294638513 -279229796 -234241615 -213077458 -164526106 -182144645 -195014811 -203220697
15269 -203220697 -168992534 -194698096 -227438182 -218106164 -263105360 -221144191 -151370386
15262 -151370386 -152588172 -178037407 -207984187 -266170859 -265417044 -182868635 -216636236
15255 -216636236 -207516462 -141561996 -171258122 -157633056 -181278770 -196795769 -154626709
15248 -154626709 -166259178 -141518378 -169559041 -159204301 -136904270 -154993493 -155322889
15241 -155322889 -213371436 -223971611 -217241233 -184317872 -172088480 -202464279 -172440215
15234 -172440215 -171395017 -198618276 -150142351 -148339174 -210814854 -181743668 -103067897
15227 -103067897 -76830696 -138907424 -141843179 -189855122 -217753877 -191999554 -142841373
15220 -142841373 -117832024 -180548399 -229924484 -231167178 -171967347 -208453346 -214439188
15213 -214439188 -196481972 -225804650 -207190709 -159160810 -154172953 -158891624 -217272926
15206 -217272926 -214601388 -203124034 -264222995 -240170467 -178126524 -151237501 -173132107
15199 -173132107 -250957870 -256741331 -221560361 -177453054 -195466495 -210745142 -247985560
15192 -247985560 -215488191 -210353201 -196551551 -191984282 -171090192 -173021851 -149208166
15185 -149208166 -202162338 -230274048 -191513716 -179060868 -182090664 -187558144 -159239070
15178 -159239070 -148802192 -157616636 -187120215 -182445278 -119426063 -116062138 -146165521
15171 -146165521 -160509295 -128148882 -132403442 -160723945 -182243975 -202541530 -190353893
15164 -190353893 -214705214 -141722409 -142801988 -162085839 -161665106 -144209085 -190061255
15157 -190061255 -184285915 -179472284 -166900669 -167966024 -185025523 -201403838 -176315278
15150 -176315278 -156605899 -136353881 -160459609 -149127750 -175737798 -200772716 -187081438
15143 -187081438 -160808429 -197465318 -159082566 -159665131 -167129130 -199337604 -172655968
15136 -172655968 -175227833 -154600700 -170124384 -157441804 -138075555 -158076007 -132801768
15129 -132801768 -165297869 -160513250 -119461266 -134297712 -193560445 -228865899 -245695457
15122 -245695457 -164768938 -100787080 -114043676 -125524204 -140067540 -198382696 -193648023
15115 -193648023 -166180669 -192949769 -232827708 -208861033 -224369484 -247555159 -243492874
15108 -243492874 -230162586 -176521920 -122194879 -122203207 -170718092 -186152381 -174051131
15101 -174051131 -201740726 -143039815 -119807888 -103774007 -142468673 -241073795 -225349940
15094 -225349940 -153388829 -166464253 -232805469 -289793647 -258494070 -188826770 -190482428
15087 -190482428 -225694018 -204255576 -170271265 -194648574 -195104878 -172360408 -157848436
15080 -157848436 -169045573 -194030880 -150567551 -167855651 -214954758 -178959472 -189874486
15073 -189874486 -188160972 -153570657 -166799317 -139991215 -128999453 -137325413 -195863193
15066 -195863193 -233890569 -183682200 -133052293 -135513642 -205302811 -165008581 -130915771
15059 -130915771 -148775218 -136781503 -161385764 -186945404 -185878301 -195291889 -181486059
15052 -181486059 -160184616 -203668108 -222049024 -190604649 -177692507 -178344394 -154837604
15045 -154837604 -135784363 -133561077 -148535603 -217145601 -227854173 -210188865 -184004342
15038 -184004342 -182199886 -145453779 -159213702 -182491513 -182072138 -225345001 -241337103
15031 -241337103 -163463984 -172808321 -260662170 -269400431 -172223810 -155712726 -203490535
15024 -203490535 -204376989 -184632442 -182709836 -160418656 -175856126 -225458149 -196080990
15017 -196080990 -219037900 -281229847 -265078201 -238216522 -218095989 -223499905 -200889686
15010 -200889686 -163568693 -155166546 -188038107 -215408027 -211675692 -245372727 -250974869
15003 -250974869 -169462638 -158323662 -152089714 -143715023 -141067106 -97469782 -103600268
14996 -103600268 -163282654 -212754923 -194290181 -165931931 -158188762 -140218491 -191883047
14989 -191883047 -206611969 -164138254 -194621284 -203747491 -213573611 -193313928 -202461611
14982 -202461611 -247304802 -265058263 -206767864 -147299574 -165297390 -170038203 -128079516
14975 -128079516 -166645710 -155349609 -195137389 -177378467 -138105369 -197353146 -174345511
14968 -174345511 -143873955 -173866694 -179929739 -186218032 -186341978 -149381410 -194661727
14961 -194661727 -213980476 -253017861 -190157649 -206705783 -239819972 -211145070 -174673526
14954 -174673526 -170540825 -173815526 -191182664 -232327444 -211447290 -148449065 -126209013
14947 -126209013 -172113041 -171496231 -148334341 -145608752 -237241456 -277005578 -254193313
14940 -254193313 -211740799 -184142033 -204173379 -206073654 -180871746 -146651507 -112670155
14933 -112670155 -145096624 -158844223 -138932344 -138991646 -174949532 -202892387 -214089610
14926 -214089610 -195344996 -236354441 -224332806 -238557179 -204206810 -170575028 -187511402
14919 -187511402 -185087274 -153707296 -177153474 -171774932 -134200400 -203254871 -246585048
14912 -246585048 -210628406 -164912811 -220078060 -188625004 -179456511 -201889004 -230879443
14905 -230879443 -205341908 -206689328 -174977639 -154591665 -147709123 -101969076 -142492909
14898 -142492909 -147883629 -140089318 -143863492 -141582889 -110935287 -129432630 -117503465
14891 -117503465 -152224768 -168268890 -145585982 -138547308 -117743555 -107020527 -117536544
14884 -117536544 -74376483 -107543012 -129876719 -171837274 -146258981 -93243810 -164495596
14877 -164495596 -144141051 -82881485 -115137871 -148952765 -151196641 -149798719 -224695323
14870 -224695323 -182398098 -166698759 -134890993 -182414683 -157809875 -133596539 -140483013
14863 -140483013 -128405315 -170067110 -193172613 -182228214 -191031313 -154352304 -171415391
14856 -171415391 -186438472 -188784024 -216648937 -204535043 -186837683 -199818054 -190705063
14849 -190705063 -171337431 -210030438 -170054675 -170419203 -170433041 -160091803 -193702822 -208217376
14841 -208217376 -201080431 -179647475 -160171668 -189163162 -190106436 -205743598 -241434408
14834 -241434408 -264891074 -254209084 -225438012 -224332090 -209568468 -170059728 -134428877
14827 -134428877 -160452522 -168227659 -249626596 -253120732 -230231188 -233750697 -235456350
14820 -235456350 -230404377 -219693697 -227948854 -155785586 -160339179 -207921761 -177578316
14813 -177578316 -187218708 -178815340 -182733578 -247497082 -230077208 -167113065 -184436490
14806 -184436490 -190661104 -217831733 -203499214 -174106980 -172198093 -153283247 -126560534
14799 -126560534 -159313949 -168590443 -84464114 -144178419 -212918340 -155499373 -183247138
14792 -183247138 -212176615 -196508270 -170302982 -182809831 -192134622 -184255009 -191335353
14785 -191335353 -148380851 -99576093 -100042867 -137873144 -150365059 -156403614 -104983860
14778 -104983860 -87599660 -113918491 -133137426 -160658166 -178538773 -136875975 -207246778
14771 -207246778 -179793550 -160812757 -163429677 -159070538 -159792801 -171458447 -163208000 -149845589
14763 -149845589 -136928150 -135955129 -116051596 -106782589 -141125569 -145246506 -170418782
14756 -170418782 -198186690 -208870817 -216563715 -198813204 -238253387 -235013658 -208380319
14749 -208380319 -256642763 -214797178 -214289375 -184540527 -154590875 -156467761 -180143703
14742 -180143703 -185874007 -170147421 -175936330 -168949084 -217677394 -246246733 -244353449
14735 -244353449 -229225914 -237525616 -208570241 -238015289 -237894083 -257459887 -230196652
14728 -230196652 -200781387 -223633680 -219325660 -192020601 -198038564 -151900542 -159119066
14721 -159119066 -180398983 -193367351 -211733045 -206876389 -267532073 -228245580 -188380937
14714 -188380937 -190115591 -190577006 -178188486 -241016651 -248525425 -203459060 -183096490
14707 -183096490 -165899543 -177635602 -150009589 -148634941 -164359028 -163083213 -111767771
14700 -111767771 -136622270 -152297930 -100584597 -92914182 -116984207 -169737832 -190245772
14693 -190245772 -198323060 -202399955 -200203138 -179211690 -160309932 -195838224 -210493006
14686 -210493006 -195650256 -218412825 -240782906 -249690291 -223012275 -171264649 -201425542
14679 -201425542 -176901307 -197576152 -184615839 -182104792 -168544694 -180723919 -181153271
14672 -181153271 -202361114 -229004805 -177345349 -172015113 -190595855 -218426007 -212008078
14665 -212008078 -210662800 -214617743 -203984500 -202703278 -222751917 -208252075 -157432776
14658 -157432776 -121979753 -139612260 -178251051 -214383598 -173217758 -152467207 -147000919
14651 -147000919 -119039938 -158527624 -167440182 -130750740 -190746254 -186692763 -157832430
14644 -157832430 -157183374 -149084833 -119927148 -136351895 -205163851 -220939347 -196281926
14637 -196281926 -249846808 -279255525 -224689058 -180560015 -156602211 -187399914 -230912481
14630 -230912481 -214294887 -179445749 -206501945 -227355920 -237729220 -209478809 -196890967
14623 -196890967 -225721288 -248409995 -220731741 -145159341 -161349242 -197130068 -180170660
14616 -180170660 -224998873 -242181833 -221417628 -185930220 -205163273 -177379922 -166013421
14609 -166013421 -193900546 -194229797 -175019351 -215822978 -186953467 -161844151 -157544706
14602 -157544706 -118923341 -139007401 -150077652 -213591105 -195410100 -201171341 -226364921
14595 -226364921 -195432398 -140819905 -130826438 -191526019 -199330177 -233420981 -199193760
14588 -199193760 -142123830 -189909788 -200885891 -213968150 -175853019 -174719008 -186073899
14581 -186073899 -221352765 -187786486 -98973070 -174525172 -183850571 -118259526 -137867560
14574 -137867560 -190635103 -237825580 -160934433 -154488163 -137108051 -153694629 -126510095
14567 -126510095 -91809281 -144519311 -207641021 -222007375 -236658631 -238869734 -219665518
14560 -219665518 -208891275 -169670636 -155017568 -136708710 -135029258 -130580664 -73910817
14553 -73910817 -149336657 -182029157 -176449747 -198908793 -221904878 -240043012 -238885230
14546 -238885230 -244310252 -169004472 -175860808 -138550570 -118863289 -135976976 -153094175
14539 -153094175 -159843979 -170927125 -164801964 -176379987 -150893205 -140102900 -163585869
14532 -163585869 -173725236 -197659898 -187375822 -176892463 -132127048 -109041858 -114300023
14525 -114300023 -106607591 -146204459 -160573762 -188812270 -202502218 -168018349 -198220733
14518 -198220733 -197004576 -183774074 -211787567 -207786676 -235267785 -226896194 -216673997
14511 -216673997 -240175644 -245807650 -277078109 -289935914 -241381428 -248582924 -224375658
14504 -224375658 -192398193 -140624154 -126122412 -124636481 -146226497 -97893674 -51646970
14497 -51646970 -110996441 -166611175 -169332247 -133141391 -159016224 -170178476 -158592570
14490 -158592570 -174274532 -129220592 -117743648 -147245559 -170167127 -173015404 -170812918
14483 -170812918 -170823311 -174819460 -161154824 -182817511 -179778734 -173443524 -180352870 -184402172
14475 -184402172 -154889213 -217480208 -192550689 -178453514 -184628540 -191645489 -160524066
14468 -160524066 -194168998 -249321199 -248394284 -222516964 -194814102 -198796996 -171285745
14461 -171285745 -139021154 -174279782 -147840786 -162406029 -195047162 -188293126 -201859329
14454 -201859329 -228742788 -212068148 -184206251 -171440209 -196320231 -144114966 -146908759
14447 -146908759 -166336913 -179056067 -164449903 -138382861 -116210703 -160964758 -164364673
14440 -164364673 -196599635 -207718360 -183231131 -197710805 -191169315 -198212755 -182535880
14433 -182535880 -186056175 -181022775 -133082473 -103267667 -115061822 -177957180 -198439215
14426 -198439215 -182092102 -195368820 -215439529 -257813435 -234929435 -256299398 -188329900
14419 -188329900 -209710298 -295293084 -211904990 -160830750 -164272781 -165783153 -114080241
14412 -114080241 -108995831 -84850775 -79203506 -96376061 -153539710 -149402012 -167493775
14405 -167493775 -208055481 -158108736 -203163472 -211760806 -228173334 -183894577 -180526058
14398 -180526058 -183442278 -187817562 -150486090 -170459630 -195779759 -238975766 -205375457
14391 -205375457 -178186670 -120305439 -143461145 -160024967 -191229678 -186029288 -166115825
14384 -166115825 -193293882 -190506173 -191874349 -237642071 -227904971 -233752400 -247502284
14377 -247502284 -266515935 -229633506 -212791685 -258969347 -241077883 -245411416 -220363972
14370 -220363972 -154897093 -151581267 -147498031 -147774396 -205039722 -181117028 -156878780
14363 -156878780 -183532572 -208017992 -232286324 -177323382 -128859314 -181915009 -174904255
14356 -174904255 -166751122 -180283997 -187017252 -243912987 -225381621 -230101097 -188126459
14349 -188126459 -139919339 -144030675 -145409072 -140773924 -148874600 -161606290 -172251233
14342 -172251233 -171979603 -158271687 -168879458 -196510168 -185728881 -195864483 -255187817
14335 -255187817 -242116141 -165949726 -178152800 -148885994 -186858491 -180208157 -168950950
14328 -168950950 -150948947 -165883606 -158775422 -203132752 -233615337 -143998938 -183296765
14321 -183296765 -183988948 -146617194 -194035719 -195054001 -190246217 -163377757 -155744021 -163168864
14313 -163168864 -205645633 -210698320 -227030003 -220019868 -153079044 -141762870 -140957413
14306 -140957413 -149184176 -186120270 -203911573 -178536540 -162147866 -142813620 -174340367
14299 -174340367 -242904001 -290052506 -238531035 -209776401 -221265175 -203998412 -149493409
14292 -149493409 -149397301 -211327611 -250423864 -176979543 -114303245 -75956884 -75578034 -80881355
14284 -80881355 -75507757 -158805166 -150601640 -149653391 -122477773 -91347140 -125892539 -156716274
14276 -156716274 -126988078 -124146437 -142133125 -198628578 -230758807 -148388104 -149300863
14269 -149300863 -197524071 -152775173 -135706828 -143355199 -201344168 -242241966 -226306805
14262 -226306805 -209046040 -201160845 -242998832 -201791089 -156842553 -154366125 -174930655
14255 -174930655 -151579614 -140832638 -170370863 -149066404 -205702490 -228701674 -182960714
14248 -182960714 -176702903 -192587828 -205246929 -176393418 -154434286 -215992804 -180114090
14241 -180114090 -155363853 -146873022 -177376010 -273094793 -257395742 -152361567 -159216609
14234 -159216609 -184090939 -157542806 -189113671 -186188222 -154931266 -132918862 -151477892
14227 -151477892 -132941905 -133709323 -152007062 -158229574 -98511242 -132407651 -202648999
14220 -202648999 -174965462 -97212542 -130977868 -183333161 -167735688 -192341379 -137037430
14213 -137037430 -154944796 -186227780 -173668716 -170533452 -177372947 -203349427 -177950958
14206 -177950958 -171278329 -220401917 -184536008 -147474022 -146315541 -182927036 -169262290
14199 -169262290 -126483607 -99608712 -102917309 -139326874 -195615575 -200927962 -177794798
14192 -177794798 -158326918 -177994164 -179989600 -182042991 -168531271 -167537490 -181890305
14185 -181890305 -128582338 -131676640 -161716552 -120598702 -124982188 -154475697 -202929878
14178 -202929878 -122439162 -139968286 -178808381 -140739796 -157078301 -212509250 -200107232
14171 -200107232 -177497597 -163913634 -136813439 -151423885 -215625985 -183579473 -150394333
14164 -150394333 -181011374 -176483061 -221689098 -247515650 -243987272 -263514867 -291012133
14157 -291012133 -256923112 -213236891 -149820815 -136485642 -189491904 -225122601 -191555479
14150 -191555479 -129994699 -129955189 -174081425 -132382424 -163205457 -177941059 -155141933
14143 -155141933 -144471336 -150730632 -187331355 -159002424 -188991115 -216025268 -189740891
14136 -189740891 -179602820 -133172431 -151480581 -149022085 -136029437 -230359266 -248151575
14129 -248151575 -196679839 -187083970 -140330566 -202896608 -194379925 -179116047 -178683609
14122 -178683609 -179941990 -148954945 -138003859 -153947462 -223226830 -239996031 -252609236
14115 -252609236 -212336011 -209754732 -190031872 -145259795 -141640450 -185636298 -163988122
14108 -163988122 -127471218 -129237670 -115134137 -165911148 -190294873 -204793451 -197163570
14101 -197163570 -212693874 -200684578 -186946115 -266414461 -203527623 -152182527 -202327730
14094 -202327730 -212923435 -207596188 -252549502 -199896103 -167179193 -198256435 -247637850
14087 -247637850 -214116825 -210489544 -133408852 -164185309 -175342304 -183165093 -154219901
14080 -154219901 -188473465 -278818086 -280248881 -270724080 -282016204 -205876245 -181454112
14073 -181454112 -211025540 -197302620 -168400040 -133203562 -181190438 -191532669 -173202769
14066 -173202769 -147893454 -183708885 -178050463 -209326468 -211599349 -166357199 -200057795
14059 -200057795 -176957519 -157988718 -177774708 -137672394 -150282386 -186915180 -219673394
14052 -219673394 -224899384 -185244600 -186371441 -187912590 -212594810 -242649103 -208462844
14045 -208462844 -173713243 -158125218 -180524042 -190270209 -169519362 -155876356 -137848696
14038 -137848696 -148706863 -189940506 -171918282 -133201590 -185400087 -217189271 -258086334
14031 -258086334 -235783853 -215778512 -261975218 -264055556 -243989725 -188637643 -143355055
14024 -143355055 -167013729 -164638872 -185970911 -219454405 -155244752 -124841549 -75259337
$$ [...]
##END NTUPLES=NMR SPECTRUM
##END=
