##TITLE=19F_CA-8611
 DMSO. 24 sc
 25.6.2019
##JCAMPDX= 6.0         $$ Bruker NMR JCAMP-DX V2.0
##DATA TYPE= NMR SPECTRUM
##DATA CLASS= NTUPLES
##ORIGIN= UXNMR, Bruker Analytische Messtechnik GmbH
##OWNER= root
$$ XWIN-NMR		Version 3.5
$$ Tue Jun 25 15:36:13 2019 Russian Standard Time (UT+4h)  she@DPX200
##.OBSERVE FREQUENCY= 188.290927
##.OBSERVE NUCLEUS= ^19F
##.ACQUISITION MODE= SIMULTANEOUS
##.ACQUISITION SCHEME= undefined
##.AVERAGES= 24
##.DIGITISER RES= 16
##SPECTROMETER/DATA SYSTEM= spect
##.PULSE SEQUENCE= zg
##.SOLVENT NAME= DMSO
##.SHIFT REFERENCE= (INTERNAL, DMSO, 0, 101.251)
##AUDIT TRAIL= $$ (NUMBER, WHEN, WHO, WHERE, WHAT)
$$ ##TITLE= Audit trail, XWIN-NMR		Version 3.5
$$ ##JCAMPDX= 5.01
$$ ##ORIGIN= Bruker BioSpin GmbH
$$ ##OWNER= she
$$ F:/spectra/data/she/nmr/f19/1/pdata/1/auditp.txt
$$ ##AUDIT TRAIL=  $$ (NUMBER, WHEN, WHO, WHERE, WHAT)
(   1,<2019-06-25 15:35:22.01 +0400>,<she>,<DPX200>,
      <created by zg, POWCHK disabled, PULCHK disabled
       configuration hash MD5:
       00 E9 B6 7A A2 85 ED C7 34 08 36 98 17 FE 4E 26
       data hash MD5: 64K
       46 75 00 B1 36 46 7B 1F 67 9E 96 89 2C D1 62 EE>)
(   2,<2019-06-25 15:35:24.45 +0400>,<she>,<DPX200>,
      <Start of raw data processing
       efp BC_mod = 2 LB = 1 FT_mod = 6 PKNL = 1 PHC0 = 1238.32 PHC1 = -71.24426 SI = 64K 
       data hash MD5: 64K
       23 04 A5 9D F6 0E CE 47 75 DF 64 EB 6D 5F 24 4C>)
(   3,<2019-06-25 15:35:42.46 +0400>,<she>,<DPX200>,
      <pk PHC0 = -89.12739 PHC1 = 0 
       data hash MD5: 64K
       4B 99 02 93 A8 3E E4 A6 CA AE FE 9B BE 68 C1 42>)
(   4,<2019-06-25 15:35:45.29 +0400>,<she>,<DPX200>,
      <abs ABSG = 5 
       data hash MD5: 64K
       63 B3 53 39 8B B2 0E 89 76 4A 37 61 38 26 7E 1A>)
$$ ##END=
$$ 
$$ hash MD5
$$ BB 67 E5 31 30 3B 81 97 05 1A 1E 89 1D 49 59 06
##$RELAX= 
##$RELAX= 
##$RELAX= 
##$RELAX= 
##$RELAX= 
##$RELAX= 
##$RELAX= 
##$RELAX= 
$$ Bruker specific parameters
$$ --------------------------
##$DU= <F:/spectra>
##$EXPNO= 1
##$NAME= <f19>
##$PROCNO= 1
##$TYPE= <nmr>
##$USER= <she>
##$AMP= (0..31)
100 100 100 100 100 100 100 100 100 100 100 100 100 100 100 100 100 100 
100 100 100 100 100 100 100 100 100 100 100 100 100 100 
##$AQSEQ= 0
##$AQ_mod= 1
##$AUNM= <au_zg>
##$AUTOPOS= <>
##$BF1= 188.310428
##$BF2= 200.13
##$BF3= 200.13
##$BF4= 200.13
##$BF5= 200.13
##$BF6= 200.13
##$BF7= 200.13
##$BF8= 200.13
##$BYTORDA= 1
##$CFDGTYP= 0
##$CFRGTYP= 5
##$CHEMSTR= <none>
##$CNST= (0..31)
1 1 145 1 1 1 1 1 1 1 1 1 1 1 1 1 1 1 1 1 1 1 1 1 1 1 1 1 1 1 1 1 
##$CPDPRG= <>
##$CPDPRG1= <>
##$CPDPRG2= <>
##$CPDPRG3= <>
##$CPDPRG4= <mlev>
##$CPDPRG5= <mlev>
##$CPDPRG6= <mlev>
##$CPDPRG7= <mlev>
##$CPDPRG8= <mlev>
##$CPDPRGB= <>
##$CPDPRGT= <>
##$D= (0..31)
0 1.3 0 0 0 0 0 0 0 0 0 0 0.25 0 0 0 0 0 0 0 0 0 0 0 0 0 0 0 0 0 0 0 
##$DATE= 1561462521
##$DBL= (0..7)
120 120 120 11 120 120 24 19 
##$DBP= (0..7)
150 150 150 150 150 150 150 150 
##$DBP07= 0
##$DBPNAM0= <>
##$DBPNAM1= <>
##$DBPNAM2= <>
##$DBPNAM3= <>
##$DBPNAM4= <>
$$ [...]
##$SUBNAM3= <"">
##$SUBNAM4= <"">
##$SUBNAM5= <"">
##$SUBNAM6= <"">
##$SUBNAM7= <"">
##$SUBNAM8= <"">
##$SUBNAM9= <"">
##$SW= 251.107818259711
##$SWIBOX= (0..15)
0 1 0 0 0 0 0 0 0 0 0 0 0 0 0 0 
##$SW_h= 47281.3238770686
##$TD= 65536
##$TD0= 1
##$TE= 0
##$TE2= 300
##$TE3= 300
##$TEG= 300
##$TL= (0..7)
0 120 53 12 22 120 120 120 
##$TP= (0..7)
150 150 150 150 150 150 150 150 
##$TP07= 0
##$TPNAME0= <>
##$TPNAME1= <>
##$TPNAME2= <>
##$TPNAME3= <>
##$TPNAME4= <>
##$TPNAME5= <>
##$TPNAME6= <>
##$TPNAME7= <>
##$TPOAL= (0..7)
0.5 0.5 0.5 0.5 0.5 0.5 0.5 0.5 
##$TPOFFS= (0..7)
0 0 0 0 0 0 0 0 
##$TUNHIN= 0
##$TUNHOUT= 0
##$TUNXOUT= 0
##$USERA1= <user>
##$USERA2= <user>
##$USERA3= <user>
##$USERA4= <user>
##$USERA5= <user>
##$V9= 5
##$VALIST= <valist>
##$VCLIST= <CCCCCCCCCCCCCCC>
##$VD= 0
##$VDLIST= <DDDDDDDDDDDDDDD>
##$VPLIST= <PPPPPPPPPPPPPPP>
##$VTLIST= <TTTTTTTTTTTTTTT>
##$WBST= 1024
##$WBSW= 4
##$XGAIN= (0..3)
0 0 0 0 
##$XL= 0
##$YL= 0
##$YMAX_a= 7493
##$YMIN_a= -22673
##$ZGOPTNS= <>
##$ZL1= 120
##$ZL2= 120
##$ZL3= 120
##$ZL4= 120
##$ABSF1= 101.2514
##$ABSF2= -149.8503
##$ABSG= 5
##$ABSL= 3
##$ALPHA= 0
##$AQORDER= 0
##$ASSFAC= 0
##$ASSFACI= 0
##$ASSFACX= 0
##$ASSWID= 0
##$AUNMP= <proc_1d>
##$AZFE= 0.1
##$AZFW= 5
##$BCFW= 0
##$BC_mod= 2
##$BYTORDP= 0
##$COROFFS= 0
##$CY= -3
##$DATMOD= 1
##$DC= 0
##$DFILT= <>
##$DTYPP= 0
##$F1P= 0
##$F2P= 0
##$FCOR= 0.5
##$FTSIZE= 65536
##$FT_mod= 6
##$GAMMA= 0
##$GB= 0
##$INTBC= 1
##$INTSCL= 8.653935e-10
##$ISEN= 128
##$LB= 1
##$LEV0= 0
##$LPBIN= 0
##$MAXI= 10000
##$MC2= 0
##$MEAN= 0
##$ME_mod= 0
##$MI= 0.4277144
##$NCOEF= 0
##$NC_proc= -6
##$NLEV= 6
##$NOISF1= -61.99997
##$NOISF2= -62.99997
##$NSP= 0
##$NTH_PI= 0
##$NZP= 0
##$OFFSET= 101.2514
##$PC= 1
##$PHC0= 1149.193
##$PHC1= -71.24426
##$PH_mod= 1
##$PKNL= yes
##$PPARMOD= 0
##$PSCAL= 0
##$PSIGN= 0
##$REVERSE= no
##$SF= 188.29550247311
##$SI= 65536
##$SIGF1= -61
##$SIGF2= -65
##$SINO= 3.502647
##$SIOLD= 65536
##$SREGLST= <1H.CDCl3>
##$SSB= 0
##$STSI= 65536
##$STSR= 0
##$SW_p= 47281.3238770685
##$SYMM= 0
##$S_DEV= 0
##$TDeff= 65536
##$TDoff= 0
##$TI= <>
##$TILT= no
##$TM1= 0
##$TM2= 0
##$TOPLEV= 0
##$USERP1= <user>
##$USERP2= <user>
##$USERP3= <user>
##$USERP4= <user>
##$USERP5= <user>
##$WDW= 1
##$XDIM= 65536
##$YMAX_p= 490448522
##$YMIN_p= -4970671
$$ End of Bruker specific parameters
$$ ---------------------------------
##NTUPLES= NMR SPECTRUM
##VAR_NAME=  FREQUENCY,     SPECTRUM/REAL,   SPECTRUM/IMAG
##SYMBOL=    X,             R,               I
##VAR_TYPE=  INDEPENDENT,   DEPENDENT,       DEPENDENT
##VAR_FORM=  AFFN,          ASDF,            ASDF
##VAR_DIM=   65536,         65536,           65536
##UNITS=     HZ,            ARBITRARY UNITS, ARBITRARY UNITS
##FACTOR=    0.721466756344984, 1,           1
##FIRST=     19065.1839562469, 0,            0
##LAST=      -28216.1399208216, 0,           0
##MIN=       -28216.1399208216, -4970671,    0
##MAX=       19065.1839562469, 490448522,    0
$$ Real data points
##PAGE= N=1
##DATA TABLE= (X++(R..R)), XYDATA
$$ [...]
$$ plain form
29653 164914 584417 -872512 -794156 -1538952 -687846 -159319 10672 -377645 -146330 -204007
29643 -204007 81243 -706165 -1836180 -2302455 -2627344 -2030465 -614117 92974 361057
29634 361057 495044 -578155 18663 -523131 -1340347 -1978063 -2362999 -2463360 -1696192
29625 -1696192 -1704940 -1327945 -604649 -1204272 -1070137 107520 -310786 -424817 -787109 -76053
29615 -76053 -50305 595959 34181 68970 1322433 -316108 -1096332 -1966058 -1613689 -1812527
29605 -1812527 -689584 -274743 -29684 698945 559230 984713 1193000 1386830 1387387 -232968
29595 -232968 -1045787 -614556 -1580715 -961010 -113591 801482 1460256 972135 512908 -351486
29585 -351486 -1293805 -1955381 -1158715 112358 248435 -314358 310017 465124 -168717
$$ packed form
29653A64914M19503j456929P8356p44796Q51106N28527J69991l88317K31315n7677
29643b04007K85250p87408j130015m66275l24889N96879J416348P07091K68083
29634C61057J33987j073199N96818n41794q17216o37716l84936j00361P67168
29625a696192q748L76995P23296n99623J34135J177657m18306j14031l62292P11056
29615g6053K5748O46264n61778L4789J253463j638541p80224q69726L52369j98838
29605a812527J122943M14841K45059P28629j39715M25483K08287J93830N57j620355
29595b32968q12819M31231r66159O19705Q47419R15073O58774m88121m59227q64394
29585c51486r42319o61576P96666J271073J36077n62793O24375J55107o33841
$$ plain form
29576 -168717 -1430222 -775380 -171131 -971115 -1492048 -1728513 -1238369 334909 -547299
29567 -547299 -1680383 -1655616 -1710230 391421 565 58178 -851952 -92557 493858 829306
29557 829306 304507 90262 -339687 -321715 -1273298 -793512 468099 -17857 111415 -189993
29547 -189993 -1501051 -247258 923361 1486669 1715552 1155693 -140168 -451824 271353
29538 271353 332640 165006 809507 850003 399852 564639 1459149 -128716 -331040 -601885
29528 -601885 -1110290 -30750 389841 -497249 -1566258 -476955 1219815 364029 -960769
29519 -960769 -463397 222349 1021947 -40233 83689 1028877 -219518 -483729 -381702
29510 -381702 -683485 -63271 -515111 -757703 -1338640 -651007 597542 418210 -1715788
$$ packed form
29576a68717j261505O54842O04249p99984n20933k36465M90144J573278q82208
29567e47299j133084K4767n4614K101651l90856N7613r10130P59395N86415L35448
29557H29306n24799k14245m29949J7972r51583M79786J261611m85956J29272l01408
29547a89993j311058J253793J170619N63308K28883n59859j295861l11656P23177
29538B71353O1287j67634O44501M0496m50151J64787Q94510j587865k02324k70845
29528f01885n08405J079540M20591q87090j069009J089303J696770q55786j324798
29519i60769M97372O85746P99598j062180J23922R45188j248395k64211J02027
29510c81702l01783O20214m51840k42592n80937O87633J248549j79332k133998
$$ plain form
29501 -1715788 -1293347 -542978 -1493342 -2342850 -1898243 -2285293 -1761526 -424204 546623
29492 546623 1554886 1841772 292676 -341218 -1613283 -2577404 -1422156 -1923229 -241259
29483 -241259 -424401 -1418860 -1098995 -1370830 -890331 -637312 -647775 -2019228 -110891
29474 -110891 -1438827 -1991953 -1748866 -2378224 -2312467 -2759920 -3188863 -2474660 -2207903 -2552246
29464 -2552246 -2657906 -3186072 -2966831 -3301984 -2170841 -1937910 -1605754 -1367576 199543
29455 199543 -340155 26664 -83378 -1211804 -1063429 -1010051 -802985 -818986 -1431433 -2642564
29445 -2642564 -2520718 -1598202 -1277697 -540101 -1632762 -662511 639753 439914 619001
29436 619001 173358 -10882 -247979 -1562380 -1544107 -514952 -947162 -180374 -323793
$$ packed form
29501a715788M22441P50369r50364q49508M44607l87050N23767J337322R70827
29492E46623J008263K86886j549096o33894j272065r64121J155248n01073J681970
29483b41259j83142r94459L19865k71835M80499K53019j0463j371453J908337
29474a10891j327936n53126K43087o29358O5757m47453m28943P14203K66757l44343
29464b552246j05660n28166K19241l35153J131143K32931L32156K38178J567119
29455A99543n39698L66819j10042j128426J48375N3378K07066j6001o12447j211131
29445b642564J21846R22516L20505P37596j092661R70251J302264j99839J79087
29436F19001m45643j84240k37097j314401J8273J029155m32210P66788j43419
$$ plain form
29427 -323793 -1349194 -1220342 -1780142 -1021395 -539235 -1426410 -349343 286780 227312
29418 227312 -1326508 -377958 -82124 -1248945 -651600 -1018120 -419628 -1427130 -1419219
29409 -1419219 -646892 -751635 -943002 -1599560 -3006204 -2838960 -1815067 -910034 -194560
29400 -194560 -723500 -1509263 -383895 470300 880684 208589 -1078244 -826091 -636648
29391 -636648 -875308 -1144971 -459311 -267194 -921628 -179230 -1202339 -784815 1165908
29382 1165908 1103939 -183693 -650402 -155551 -1610186 -1563623 -994403 -99403 -91183 187743
29372 187743 43974 -818747 -22102 142138 -427063 106906 210964 -1174376 -1821057
29363 -1821057 -933838 -306702 -1134652 -1608434 -1502383 -1552273 -2052630 -1756487 -1218362 396270
$$ packed form
29427c23793j025401J28852n59800P58747M82160q87175J077067O36123n9468
29418B27312j553820R48550K95834j166821N97345l66520N98492j007502P911
29409a419219P72327j04743j91367o56558j406644J67244J023893R05033P15474
29400a94560n28940p85763J125368Q54195M10384o72095j286833K52153J89443
29391f36648k38660k69663O85660J92117o54434P42398j023109M17524J950723
29382A165908o1969j287632m66709M94851j454635M6563N69220Q95000Q220K78926
29372A87743j43769q62721P96645J64240n69201N33969J04058j385340o46681
29363a821057Q87219O27136q27950m73782J06051m9890n00357K96143N38125J614632
$$ plain form
29353 396270 848873 867422 -988013 -1904742 -2461120 -1860655 -1987409 -1746335 -1817928 -2335335
29343 -2335335 -450612 857022 -73831 -2255712 -3072953 -1924630 -1475262 -2168629 -2143291
29334 -2143291 -1190475 -963265 -282300 -337192 -511593 -853940 -1271121 -1046619 -1939783 -390947
29324 -390947 -507146 -1739099 -1548331 -1684057 -984945 1157295 226968 -1725262 -2430798
29315 -2430798 -2637097 -1131914 -609418 36236 213069 292206 154484 -313004 -1103314
29306 -1103314 -290993 -195119 -818095 -654710 -1765981 -1171936 464558 -226038 -263078
29297 -263078 -2044970 -3510986 -3521705 -1940326 -1420605 -1720556 -1683935 -1677037 -1767364 -721997
29287 -721997 -474438 275876 971526 840140 -96803 56319 -212693 -2331774 -2782466
$$ packed form
29353C96270M52603J8549j855435r16729n56378O00465j26754K41074p1593n17407
29343b335335J884723J307634r30853k181881q17241J148323M49368o93367K5338
29334b143291R52816K27210O80965n4892j74401l42347m17181K24502q93164J548836
29324c90947j16199j231953J90768j35726O99112K142240r30327j952230p05536
29315b430798k06299J505183N22496O45654J76833P9137j37722m67488p90310
29306a103314Q12321R5874o22976J63385j111271N94045J636494o90596l7040
29297b63078j781892j466016j0719J581379N19721k99951L6621O898r0327J045367
29287g21997K47559P50314O95650j31386r36943J53122k69012k119081m50692
$$ plain form
29278 -2782466 -1974354 -386343 239462 -924917 -1249571 -1330243 -842552 -328269 -328088 -569833
29268 -569833 -820254 -736690 586818 1661193 1484624 660042 1220097 -1180511 -1753984
29259 -1753984 -108613 883784 1210686 1537869 1037099 38626 -722457 -840101 -1012087
29250 -1012087 25921 1432348 782 -806513 -716302 -450037 -109846 -32581 -509531
29241 -509531 -550982 -180854 -2076702 -2040537 -1444367 -1417249 -851675 -1086437 -702799 -732316
29231 -732316 -117694 -55463 442369 695277 400873 428822 -373272 -13675 312382 28556
29221 28556 -877275 -1841188 -854681 -1750788 -1761367 -1953628 -1675062 -1059635 -557699 -370298
29211 -370298 -256163 -2156408 -2755189 -2836197 -1558237 628238 -1132456 -880691 243529
$$ packed form
29278b782466Q08112J588011O25805j164379l24654q0672M87691N14283J81k41745
29268e69833k50421Q3564J323508J074375j76569q24582N60055k400608n73473
29259a753984J645371R92397L26902L27183n00770r98473p61083j17644j71986
29250a012087J038008J406427j431566q07295R0211K66265L40191P7265m76950
29241e09531m1451L70128j895848L6165N96170K7118N65574k34762L83638k9517
29231g32316O14622O2231M97832K52908k94404K7949q02094L59597L26057k83826
29221B8556r05831r63913R86507q96107j0579j92261K78566O15427N01936J87401
29211c70298J14135j900245n98781q1008J277960K186475j760694K51765J124220
$$ plain form
29202 243529 638631 1229415 502157 -516063 -1004267 -2139217 -2934740 -2881093 -3807795
29193 -3807795 -3184728 -2359714 -411440 -188245 233171 93471 -879889 288490 -557851
29184 -557851 -485423 -537567 -4816 -400016 -641719 34556 802406 -51309 -1389961 -1337434
29174 -1337434 -2259617 -2146964 -998857 -1923261 -2179760 -1621420 -814746 -477810 513579
29165 513579 481074 -1685125 -2552295 -1668830 -1462462 -123851 -153318 71262 40575 -909686
29155 -909686 -1663797 -1822640 -897582 -746629 366065 -436909 248133 15831 -853497
29146 -853497 -759006 358328 -197330 -8582 -557443 342202 118650 225931 884652 -1003712
29136 -1003712 -3757215 -2065326 -754215 586776 -821351 -844571 18247 -220685 -821469
$$ packed form
29202B43529L95102N90784p27258j018220m88204j134950p95523N3647r26702
29193c807795O23067Q25014J948274K23195M21416j39700r73360J168379q46341
29184e57851P2428n2144N32751l95200k41703O76275P67850q53715j338652N2527
29174a337434r22183J12653J148107r24404k56499N58340Q06674L36936R91389
29165E13579l2505k166199q67170Q83465K06368J338611k9467K24580l0687r50261
29155i09686p54111j58843R25058J50953J112694q02974O85042k32302q69328
29146h53497R4491J117334n55658J88748n48861Q99645k23552J07281O58721j888364
29136a003712k753503J691889J311111J340991j408127k3220Q62818k38932o00784
$$ plain form
29127 -821469 -1000379 -1390260 -2565667 -2079248 -2162643 -184381 579757 195962 -84695
29118 -84695 261849 -405386 -971584 -1274905 -1327237 -1385049 -1057552 -1214481 -386679 -410014
29108 -410014 -472615 672918 -908407 -238836 776250 602482 -575978 -763066 -235559
29099 -235559 -146163 -1165834 -1672353 -841524 -1263143 -712444 -660683 -392407 -2064462 -2051264
29089 -2051264 1261811 1917602 -60858 -1130603 -1414779 -1408325 -1191978 89248 -211162
29080 -211162 222599 966156 54623 -798349 -1848642 -2110870 -108903 58277 -318535
29071 -318535 403575 -323016 -58505 899561 663331 927995 -2885 -1256927 -1024470
29062 -1024470 -584358 217960 -173345 -422292 -645847 -777685 -2387567 -1802537 -394706
$$ packed form
29127h21469j78910l89881j175407M86419q3395J978262P64138l83795k80657
29118h4695L46544o67235n66198l03321n2332n7812L27497j56929Q27802k3335
29108d10014o2601J145533j581325O69571J015086j73768j178460j87088N27507
29099b35559Q9396j019671n06519Q30829m21619N50699N1761K68276j672055J3198
29089b051264L313075O55791j978460j069745k84176O454K16347J281226l00410
29080b11162M33761P43557r11533q52972j050293k62228K001967J67180l76812
29071c18535P22110p26591K64511R58066k36230K64664r30880j254042K32457
29062a024470M40112Q02318l91305k48947k23555j31838j609882N85030J407831
$$ plain form
29053 -394706 -273199 -729440 248494 -282753 -858478 -1976452 -1854371 -1694643 -1492389
29044 -1492389 -1024335 -354871 25613 -516089 -498082 612474 -331001 -900410 288701
29035 288701 -528311 -202748 -1698023 -1714688 -2261889 -252959 -965542 -2069638 -783218
29026 -783218 -299331 65913 129453 -140042 194147 -337389 -2383085 -1651333 -579076
29017 -579076 -1121694 -1688025 -143988 283226 -774838 -1282700 -1406670 -2153810 -675466
29008 -675466 556381 -249590 -1045669 775760 245573 -360250 -1255884 -1526232 -1172295
28999 -1172295 231063 -645967 -314116 -346872 -448957 378657 300076 -1222038 -280307
28990 -280307 -266672 -697440 830621 211398 -256064 105294 -551617 -182747 -1188391
$$ packed form
29053c94706J21507m56241R77934n31247n75725j117974J22081J59728K02254
29044a492389M68054O69464L80484n41702J8007J110556r43475n69409J189111
29035B88701q17012L25563j495275j6665n47201K008930p12583j104096J286420
29026g83218M83887L65244O3540k69495L34189n31536k045696P31752J072257
29017e79076n42618n66331J544037M27214j058064n07862j23970p47140J478344
29008f75466J231847q05971p96079J821429n30187o05823q95634k70348L53937
28999a172295J403358q77030L31851l2756j02085Q27614p8581j522114R41731
28990b80307J3635m30768J528061o19223m67462L61358o56911L68870j005644
$$ plain form
28981 -1188391 -879291 -304718 422785 -41022 -416137 417536 1573354 563497 1708382
28972 1708382 1050464 -62907 79299 1231763 205052 -2886582 -2382874 -1407307 305607
28963 305607 710490 467505 -69796 -220342 126435 265375 -832277 -2381052 -1855288
28954 -1855288 40792 -152602 -803407 1311628 557653 107860 552187 -382620 -687306
28945 -687306 -2616233 -2084638 -1677822 -2180466 -1846394 -1050088 -1058636 -1856682 -498133 22614
28935 22614 -149378 784744 394056 -629488 -1582167 -82343 1535213 1358100 457079
28926 457079 663003 -1184516 -2126555 -1699318 -1824493 100947 92240 -126944 -1376222
28917 -1376222 -1331530 -44766 550961 -114763 -375061 -951057 -932965 -1105632 -1038937 -2006113
$$ packed form
28981a188391L09100N74573P27503m63807l75115Q33673J155818j009857J144885
28972A708382o57918j113371J42206J152464j026711l091634N03708R75567J712914
28963C05607M04883k42985n37301j50546L46777J38940j097652j548775N25764
28954a855288J896080j93394o50805K115035p53975m49793M44327r34807l04686
28945f87306j928927N31595M06816n02644L34072P96306q548p98046J358549N20747
28935B2614j71992R34122l90688j023544r52679J499824J617556j77113r01021
28926D57079K05924j847519r42039M27237j25175J925440q707k19184j249278
28917a376222M4692J286764N95727o65724k60298n75996J8092j72667O6695r67176
$$ plain form
28907 -2006113 -2206494 -700234 -1136279 -1929691 -952585 -252815 -387713 -613317 -1577814
28898 -1577814 -335813 172538 -383890 -388637 -242305 920637 590105 -1171681 -1205987
28889 -1205987 524805 470919 517334 156712 -829936 -630013 -1177241 -589078 793315
28880 793315 -169574 -157746 -473696 -1136319 -1786155 -512960 -305506 -724310 -998906 -1608963
28870 -1608963 -2247160 -2246287 -779813 -816984 -1821574 -2031847 -1377892 -475638 907288 2297867
28860 2297867 892032 -558841 -1518973 -2254562 -463389 -704434 -222242 -811378 -579782
28851 -579782 -1238459 -1352716 -2556504 -1975465 -881179 -286067 -446197 -961256 -888125
28842 -888125 16670 -383305 -757136 -1627360 -479589 -92648 -126027 521612 1034168 254896
$$ packed form
28907b006113k00381J506260m36045p93412R77106O99770j34898k25604r64497
28898a577814J242001N08351n56428m747J46332J162942l30532j761786l4306
28889a205987J730792n3886M6415l60622r86648J99923n47228N88163J382393
28880G93315r62889J1828l15950o62623o49836J273195K07454m18804k74596o10057
28870a608963o38197Q73J466474l7171j004590k10273O53955R02254J382926J390579
28860B297867j405835j450873r60132p35589J791173k41045M82192n89136K31596
28851e79782o58677j14257j203788N81039J094286N95112j60130n15059P3131
28842h88125R04795l99975l73831q70224J147771L86941l3379O47639N12556p79272
$$ plain form
28832 254896 -572741 -1918209 -2426216 -742365 -564053 -292351 463070 -1769379 -3049208
28823 -3049208 -2456917 -1791267 -890448 366801 77027 238622 -404129 -1197024 -1851857
28814 -1851857 -1316485 -687862 -542861 235749 1143024 436348 372777 -1461920 -3275627
28805 -3275627 -2736301 -2380018 -1800867 -964716 -992173 -1214006 -501705 -561968 198540 -225777
28795 -225777 -1001832 -236907 -297811 -907961 -1241763 -940548 402437 292374 605996 859850
28785 859850 727947 382416 -437262 -800423 -1502269 -1707762 -1364580 -1322078 -922673 -1513204
28775 -1513204 -3029191 -2488648 -2443936 -1774345 -1973736 -606762 -667004 -1443892 -1000753
28766 -1000753 -520071 -2329143 -1935721 -1327161 -1104234 -1289245 1036025 1137728 -325900
$$ packed form
28832B54896q27637j345468n08007J683851J78312K71702P55421k232449j279829
28823c049208N92291O65650R00819J257249k89774J61595o42751p92895o54833
28814a851857N35372O28623J45001P78610R07275p06676o3571j834697j813707
28805c275627N39326L56283N79151Q36151k7457k21833P12301o0263P60508m24317
28795b25777p76055P64925o0904o10150l33802L01215J342985j10063L13622K53854
28785H59850j31903l45531q19678l63161p01846k05493L43182M2502L99405n90531
28775a513204j515987N40543M4712O69591j99391J366974o0242p76888M43139
28766a000753M80682j809072L93422O08560K22927j85011K325270J01703j463628
$$ plain form
28757 -325900 732343 -438667 -539383 -1275571 -772125 -71081 40379 -623998 -1587203
28748 -1587203 -984321 179846 -265539 -603187 -1308622 -883246 39565 -1609996 -1681193
28739 -1681193 -936049 -1491641 -1734647 -259683 32037 1366262 525555 157137 -800462
28730 -800462 -1174639 -1089411 -1516436 -1474567 -1252643 -180160 1062620 1235561 -280092
28721 -280092 -911199 -1773249 -789940 -1407122 -858951 -1872811 -1688539 -638070 -207151
28712 -207151 1380866 1079474 330166 -881328 -2003434 -1879320 -2298187 -719019 -764726
28703 -764726 -136317 -1925056 -3179838 -2933328 -2235741 -1126210 -1347779 -2015812 -1239399
28694 -1239399 -882634 269083 952179 -311049 -635523 314604 328697 -35837 55675
$$ packed form
28757c25900J058243j171010j00716p36188N03446P01044J11460o64377r63205
28748a587203O02882J164167m45385l37648p05435M25376R22811j649561p1197
28739a681193P45144n55592k43006J474964K91720J334225q40707l68418r57599
28730h00462l74177Q5228m27025M1869K21924J072483J242780J72941j515653
28721b80092o31107q62050R83309o17182N48171j013860J84272J050469M30919
28712b07151J588017l01392p49308j211494j122106J24114m18867J579168m5707
28703g64726O28409j788739j254782K46510O97587J109531k21569o68033P76413
28694a239399L56765J151717O83096j263228l24474R50127J4093l64534R1512
$$ plain form
28685 55675 -183945 -717885 -1252340 -998111 -1173175 -1420458 -685653 -665646 -1732941 -1598073
28675 -1598073 -1483365 -2233139 -1843667 -2316902 -3112285 -2199130 -2479357 -1940171 -2234365
28666 -2234365 -2588156 -2216564 -1656996 -2261538 -1905329 -1714439 -2302197 -1546874 -631416
28657 -631416 -120829 86647 -336182 -1328439 -426206 199816 461372 541400 621604 460132
28647 460132 368371 -54612 -248840 -1110735 -525105 -68992 -1547032 -1469287 -1024111 -376579
28637 -376579 -494778 -1165217 -1847366 -2639555 -570010 511593 565802 679407 -742986
28628 -742986 -467451 -972900 -776682 -1733448 -3128983 -2834859 -3031246 -2542301 -2200565
28619 -2200565 -1658057 -3416766 -3145210 -1902798 -290227 948733 -786812 292569
$$ packed form
28685E5675k39620n33940n34455K54229j75064k47283P34805K0007j067295J34868
28675a598073J14708p49774L89472m73235p95383R13155k80227N39186k94194
28666b234365l53791L71592N59568o04542L56209J90890n87758P55323R15458
28657f31416N10587K07476m22829r92257R02233O26022K61556Q0028Q0204j61472
28647D60132r1761m22983j94228q61895N85630M56113j478040P7745M45176O47532
28637c76579j18199o70439o82149p92189K069545J081603N4209J13605j422393
28628g42986K75535n05449J96218r56766j395535K94124j96387M88945L41736
28619b200565N42508j758709K71556J242412J612571J238960j735545J079381
$$ plain form
28611 292569 -663554 -615909 -1122898 -1310779 -932871 -1718980 -1815838 -1095457 -529255 868085
28601 868085 1492480 594537 -93472 -602709 831400 958248 112231 -1256313 -1852442
28592 -1852442 -799619 -1039070 -1500381 -1906017 -3041931 -2505193 -461544 80065 -807392
28583 -807392 -951472 -928382 -2210725 -1742536 -40989 746382 365102 -791156 -1012877
28574 -1012877 -1640070 -1920081 -2039459 -1495208 -1624367 -1622864 -1349307 -1458550 -1464925 -1724293
28564 -1724293 -902399 -465171 -292175 418967 2320405 684706 507973 -403156 -677461
28555 -677461 571062 -60106 -739627 -495767 666418 825392 -159626 575695 816412
28546 816412 286140 -340554 -481806 -55198 -1006935 -995054 376460 -590710 -998078 -461935
$$ packed form
28611B92569r56123M7645n06989j87881L77908p86109r6858P20381N66202J397340
28601H68085O24395q97943o88009n09237J434109J26848q46017j368544n96129
28592a852442J052823k39451m61311m05636j135914N36738K043649N41609q87457
28583h07392j44080K3090j282343M68189J701547P87371l81280j156258k21721
28574a012877o27193k80011j19378N44251j29159J503K73557j09243o375k59368
28564a724293Q21894M37228J72996P11142J901438j635699j76733r11129k74305
28555f77461J248523o31168o79521K43860J162185J58974r85018P35321K40717
28546H16412n30272o26694j41252M26608r51737J1881J371514r67170m07368N36143
$$ plain form
28536 -461935 -1260436 -1344706 38871 -1032147 -3617385 -2288654 -1503952 -1977576 -396624
28527 -396624 -1896166 -865450 -968355 -2121512 -1649149 -1686160 -718674 -2285510 -598119
28518 -598119 -1442517 -1496323 -944740 -432266 367496 -822592 -1037929 -940556 -734088 -1013432
28508 -1013432 -524557 -1635549 -3259668 -1835323 -1441268 -2537422 -1714848 -599484 676657
28499 676657 -1823475 -1656016 -468404 -650476 31076 433573 967805 1195616 121901
28490 121901 869210 750170 -1835879 -2314290 -1207896 -252929 571755 -867386 -298715
28481 -298715 -634859 114216 -101728 405500 477716 -813319 -742236 -1042278 -1166228 458933
28471 458933 456220 -1082942 -2413317 -301650 497607 507397 727501 519011 -401805 55704
$$ packed form
28536d61935p98501q4270J383577j071018k585238J328731P84702m73624J580952
28527c96624j499542J030716j02905j153157M72363l7011R67486j566836J687391
28518e98119q44398n3806N51583N12474P99762j190088k15337R7373K06468k79344
28508a013432M88875j110992j624119J424345L94055j096154Q22574J115364J276141
28499F76657k500132J67459J187612j82072O81552M02497N34232K27811j073715
28490A21901P47309j19040k586049m78411J106394R54967Q24684j439141N68671
28481b98715l36144P49075k15944N07228P2216j291035P1083l00042j23950J625161
28471D58933k713j539162j330375K111667P99257R790K20104k08490r20816M57509
$$ plain form
28461 55704 1066517 -516728 -1472340 -890223 -698996 98100 -737854 -309977 -485015
28452 -485015 -1679466 -3341813 -3231515 -1581700 -841386 -1601433 -506049 -1038547 -740940
28443 -740940 1431478 1329772 453717 -367716 311615 -141243 -1630039 -1675398 -1070564
28434 -1070564 236438 -88450 -1418230 -1376685 -943848 -830153 -1655037 -964153 275675
28425 275675 538495 1484683 185493 -233470 -926966 -2815509 -2855371 -458688 905791
28416 905791 -284684 -1028745 -630609 -712466 -1936337 -1529752 -1100342 -894774 -1188801
28407 -1188801 -1162636 -417045 -714817 25722 1059255 620045 1086709 728712 1240422
28398 1240422 1576284 964032 501605 -30852 -1189866 -1280789 -500390 96863 -76652
$$ packed form
28461E5704J010813j583245r55612N82117J91227P97096q35954M27877j75038
28452d85015j194451j662347J10298J649815P40314p60047J095384n32498K97607
28443g40940K172418j01706q76055q21433O79331m52858j488796m5359O04834
28434a070564J307002l24888j329780M1545M32837J13695q24884O90884J239828
28425B75675K62820R46188j299190m18963o93496j888543l9862K396683J364479
28416I05791j190475p44061L98136q1857j223871M06585M29410K05568k94027
28407a188801K6165P45591k97772P40539J033533m39210M66664l57997N11710
28398A240422L35862o12252m62427n32457j159014r0923P80399N97253j73515
$$ plain form
28389 -76652 61128 507122 -1522378 -1469713 -372297 731882 1317397 1894608 810823
28380 810823 -143345 -62240 -859710 -460008 -247965 389771 429144 -449855 -332273 -1551722
28370 -1551722 -2080966 -1092534 -1714664 -1752180 -561612 -827766 -557647 -887820 -1777031
28361 -1777031 -1089473 -1823756 -1072336 -1987608 -1031826 -669098 -1047521 -1873160 -1240017
28352 -1240017 -814351 882089 155151 -1556097 -2038330 -1191272 -1595025 -1866937 -1258263
28343 -1258263 -849623 -607806 -1716009 -1225847 -399505 -995325 -125477 -330980 -549967
28334 -549967 -638218 -735980 -293746 -1365805 -1739295 -734546 -186923 353754 -424062 -663974
28324 -663974 -1192946 -1355446 -3226883 -3613655 -2507021 -2445841 -2271014 -2308581 -1849125 -2269405
$$ packed form
28389g6652J37780M45994k029500N2665J097416J104179N85515N77211j083785
28380H10823r54168Q1105p97470L99702K12043O37736L9373q78999J17582j219449
28370a551722n29244R88432o22130l7516J190568k66154K70119l30173q89211
28361a777031O87558p34283P51420r15272R55782L62728l78423q25639O33143
28352a240017M25666J696440p26938j711248m82233Q47058m03753k71912O08674
28343a258263M08640K41817j108203M90162Q26342n95820Q69848k05503k18987
28334e49967q8251r7762M42234j072059l73490J004749N47623N40677p77816k39912
28324f63974n28972j62500j871437l86772J106634O1180J74827l7567M59456m20280
$$ plain form
28314 -2269405 -2241032 -2021307 -2033135 -1158920 -1398908 -368693 -790278 -462794 -1191875 -2228382
28304 -2228382 -1905607 -664053 -440326 -1327089 -2008437 -2723501 -2268877 -2018472 -1696483
28295 -1696483 -2495222 -1784877 -906505 -327881 -877637 -683393 -2009798 -1236668 222443
28286 222443 -483244 -612756 -979738 -1106949 -1964624 -2048957 -1266925 572808 -274877 -615541
28276 -615541 -870741 -1891846 -2170948 -2003170 -161517 1773901 -901162 -595631 -410880
28267 -410880 180533 1192978 529856 205201 -716862 -80404 973219 992127 -298107
28258 -298107 920581 1715058 -489916 -1228741 -682845 -477755 -187210 167402 678969
28249 678969 720099 -987075 -1547981 -2241267 -1203434 -396435 -907737 -613229 166843
$$ packed form
28314b269405K8373K19725j1828Q74215k39988J030215m21585L27484p29081j036507
28304b228382L22775J241554K23727q86763o81348p15064M54624K50405L21989
28295a696483p98739P10345Q78372N78624n49756J94244j326405P73130J459111
28286B22443p05687j29512l66982j27211q57675q4333P82032J839733q47685l40664
28276f15541k55200j021105k79102J67778J841653J935418k675063L05531J84751
28267d10880N91413J012445o63122l24655r22063O36458J053623J8908j290234
28258b98107J218688P94477k204974p38825N45896K05090K90545L54612N11567
28249F78969M1130j707174n60906o93286J037833Q06999n11302K94508P80072
$$ plain form
28240 166843 -750376 -1455978 -1391744 -829851 -1045065 -502669 -1397784 -1838002 -1587348 -1340471
28230 -1340471 -64 -1598 -295972 -381304 -1199379 -1274384 -1315386 -612744 60094 -549850
28220 -549850 719661 519700 147178 -1483110 -1015107 744489 1243600 265299 -1379980
28211 -1379980 -2286703 -1648786 35009 449190 -86592 -339542 -1079956 -402276 -1374813
28202 -1374813 14840 878111 841811 -709946 -1072251 357161 -854353 -2147341 -1752461
28193 -1752461 -340553 69475 -796069 -949727 -379282 -1684805 -2047049 -1311491 -652518
28184 -652518 -1215563 -2195138 -437903 363656 212745 -440099 -1381317 -2291052 -1217937
28175 -1217937 102532 -78461 276993 768427 1325791 1009397 520357 -835006 -1047632
$$ packed form
28240A66843r17219p05602O4234N61893k15214N42396q95115m40218K50654K46877
28230a340471J340407j534k94374q5332q18075p5005m1002P02642O72838o09944
28220e49850J269511j99961l72522j630288M68003J759596M99111r78301j645279
28211a379980r06723O37917J683795M14181n35782k52950p40414O77680r72537
28202a374813J389653Q63271l6300j551757l62305J429412j211514j292988L94880
28193a752461J411908M10028q65544j53658N70445j305523l62244P35558O58973
28184f52518n63045r79575J757235Q01559j50911o52844r41218r09735J073115
28175a217937J320469j80993L55454M91434N57364l16394m89040j355363k12626
$$ plain form
28166 -1047632 -768318 115366 -245565 -2190630 -2494832 -839462 -1307145 -3266165 -2495519
28157 -2495519 -1359954 -1381091 -973122 -1939100 -1705275 -787595 -978173 -458141 -349714
28148 -349714 -212512 563073 550519 1115460 -1449832 -1611877 -2259950 -2364312 -2221771 -2661605
28138 -2661605 -2936802 -1781187 -683142 -1182424 -302966 -662209 -763641 -1450300 -1423407
28129 -1423407 -1428771 -2371795 -1663681 -1589008 -807109 92552 -1300179 -1983334 -1038326 -457021
28119 -457021 -341609 476164 -510450 -200985 -1055166 -2100977 -2996966 -2506845 -1191467
28110 -1191467 -2229592 -2288061 -2619109 -1602778 -1594380 -1097925 81825 204908 -503986
28101 -503986 -828341 -627890 -736777 -663471 -1912889 -2925070 -2249752 -635431 -560978
$$ packed form
28166a047632K79314Q83684l60931j945065l04202J655370m67683j959020P70646
28157b495519J135565k1137M07969r65978K33825R17680j90578N20032J08427
28148c49714J37202P75585j2554N64941k565292j62045o48073j04362J42541m39834
28138b661605k75197J155615J098045m99282Q79458l59243j01432o86659K6893
28129a423407n364r43024P08114P4673P81899Q99661j392731o83155R45008N81305
28119d57021J15412Q17773r86614L09465q54181j045811q95989M90121J315378
28110a191467j038125n8469l31048J016331Q398M96455J179750J23083p08894
28101e03986l24355K00451j08887P3306j249418j012181O75318J614321P4453
$$ plain form
28092 -560978 -1400477 -641610 -1348334 -1521900 -1361813 -1288859 -1439265 -619007 -1159718 -126732
28082 -126732 248670 -499350 -933494 -1207519 -195230 -620998 -877549 -819068 47496 613938
28072 613938 -1585984 -1616013 -2175124 -2053521 -803802 -903777 -364157 519252 -310913 -641957
28062 -641957 -853099 -495306 -361269 -1131562 -1922226 -1629481 -1022775 -487526 492107 878827
28052 878827 -280811 -350199 -697963 -1844690 -579410 -1440858 -2842882 905487 762288
28043 762288 -165610 -1921761 -2609776 -1013032 -115874 319577 -960083 -439081 -270246
28034 -270246 -1169173 -212757 228372 648183 -102292 274892 1416398 1398570 1021272 85300
28024 85300 -563588 -387784 192209 -103265 1731700 -41106 90578 312036 -173914
$$ packed form
28092e60978q39499P58867p06724j73566J60087P2954j50406Q20258n40711J032986
28082a26732L75402p48020m34144k74025J012289m25768k56551N8481Q66564N66442
28072F13938k199922l0029n59111J21603J249719r9975N39620Q83409q30165l31044
28062f41957k11142L57793J34037p70293p90664K92745O06706N35249R79633L86720
28052H78827j159638o9388l47764j146727J265280q61448j402024L748369j43199
28043G62288r27898j756151o88015J596744Q97158M35451j279660N21002J68835
28034b70246q98927R56416M41129M19811p50475L77184J141506j7828l77298r35972
28024H5300o48888J75804N79993k95474J834965j772806J31684K21458m85950
$$ plain form
28015 -173914 93262 -132971 512048 -174331 -434099 -898065 -1917003 -760159 -640763
28006 -640763 -961239 -1486054 123346 846547 145663 -1044262 -1377714 114348 781210
27997 781210 889718 -304023 -252350 1853893 1882848 2848019 2063229 1086890 537188 -542870
27987 -542870 665990 813182 665130 223146 -517197 17427 496184 -569466 -1438445
27978 -1438445 -1232671 -708526 113556 -237246 717281 -558303 -1315922 -2117955 -1452668
27969 -1452668 -1390058 -1309427 -542578 -1393227 -703578 344515 730747 972486 850553 -469752
27959 -469752 -212894 -226404 941927 270339 194895 -245606 -820944 -1786980 -766566 -524860
27949 -524860 108447 476610 2396606 1890303 1505107 1930458 862595 -1671201 -1651096
$$ packed form
28015a73914K67176k26233O45019o86379k59768m63966j018938J156844J19396
28006f40763l20476n24815J609400P23201p00884j189925l33452J492062O66862
27997G81210J08508j193741N1673K106243K8955R65171p84790r76339n49702j080058
27987e42870J208860J47192j48052m41984p40343N34624M78757j065650q68979
27978a438445K05774N24145Q22082l50802R54527j275584p57619q02033O65287
27969a452668O2610Q0631P66849q50649O89649J048093L86232K41739j21933j320305
27959d69752K56858j3510J168331o71588p5444m40501n75338r66036J020414K41706
27949e24860O33307L68163J919996n06303l85196M25351j067863k533796K0105
$$ plain form
27940 -1651096 -48126 -518662 -75047 -249306 -969429 823138 2580149 1322789 -293209
27931 -293209 -1076219 -1265230 -2053642 -2020593 -2265914 -1394002 -664822 -1422541 -2287987 -1298032
27921 -1298032 -2034439 -1281832 -272455 -305743 -334728 502396 395598 198425 -51232 526146
27911 526146 992338 -951825 -1756284 -1324645 328886 -19966 -1206463 -850143 -375512
27902 -375512 -1322661 -1798125 -1504439 -1514827 -151811 -552476 -968703 -1080878 -1104443 -368898
27892 -368898 -855679 -2422324 -2916230 -683644 -1907286 -1851397 -281925 -1138879 -1177966
27883 -1177966 -1499302 -645270 -1960597 -2758302 -2609409 -2490967 -1181911 1969182 3412413
27874 3412413 996658 467731 24021 -1000409 -1277138 -1000490 250011 692260 -494633
$$ packed form
27940a651096J602970m70536M43615j74259p20123J792567J757011j257360j615998
27931b93209p83010j89011p88412L3049k45321Q71912P29180p57719q65446R89955
27921a298032p36407P52607J009377l3288k8985Q37124j06798j97173k49657N77378
27911E26146M66192j944163q04459M31639J653531l48852j186497L56320M74631
27902c75512r47149m75464K93686j0388J363016m00665m16227j12175k3565P35545
27892c68898m86781j566645m93906K232586j223642N5889J569472q56954l9087
27883a177966l21336Q54032j315327p97705J48893J18442J309056L151093J443231
27874C412413k415755n28927m43710j024430k76729K76648J250501M42249j186893
$$ plain form
27865 -494633 -1638464 -2374634 -2046895 -2583290 -2512184 -1251663 -692056 -310346 -1598180
27856 -1598180 -1168492 -61515 -1784645 -2375675 -2213649 -1638034 -1764916 -1496030 -1343849
27847 -1343849 -2245954 -1771206 -688110 -1093579 -600182 -586543 188847 268523 -1530723
27838 -1530723 -2100903 -2335094 -1263331 -1437096 -652094 -1301313 -1763077 -1750905 -1636070
27829 -1636070 -1458903 -702818 -242361 -1404386 -1907433 -856647 -1238354 -809397 -888202
27820 -888202 -121518 19996 333941 -80860 -902109 -1044963 -176131 -835864 -1529952 -2341778
27810 -2341778 -1398908 -1299702 -316209 -1227040 -1625863 -312435 -400314 -1253976 -1407553 -635193
27800 -635193 792886 1124700 581386 -69107 -1348740 -2296597 -2872209 -1748216 263487
$$ packed form
27865d94633j143831p36170L27739n36395P1106J260521N59607L81710j287834
27856a598180M29688J106977j723130n91030J62026N75615j26882K68886J52181
27847a343849r02105M74748J083096m05469M93397J3639P75390P9676j799246
27838a530723n70180k34191J071763j73765P85002o49219m61764J2172J14835
27829a636070J77167P56085M60457j162025n03047J050786l81707M28957p8805
27820h88202P66684J41514L13945m14801q21249j42854Q68832o59733o94088q11826
27810b341778R42870R9206R83493r10831l98823J313428q7879q53662j53577P72360
27800f35193J428079L31814n43314o50493j279633r47857n75612J123993K011703
$$ plain form
27791 263487 1827720 1239256 1042087 -493752 -940364 -293170 662886 910045 753827
27782 753827 518005 916220 5989 -1276021 -1525003 -1789466 -268746 212124 737888
27773 737888 -384182 -358363 334032 191559 -1224005 -682467 -436374 -544856 -238766
27764 -238766 -1176107 -1249776 -1689806 -2795727 -918179 -707123 -1448973 -1747982 -2079281
27755 -2079281 -148373 1028169 -45162 879009 2246912 2312971 2339367 1749163 2219745
27746 2219745 282274 -823475 -837091 -1148573 -929738 -159001 580754 -40823 -792171
27737 -792171 -1299068 -2321416 -1936797 -2642379 -1629148 -313003 1059568 476236 818785
27728 818785 1831592 1492848 314392 -277832 -105002 -1320487 -554374 -1117283 -1816311
$$ packed form
27791B63487J564233n88464j97169j535839m46612O47194R56056K47159j56218
27782G53827k35822L98215r10231j282010k48982k64463J520720M80870N25764
27773G37888j122070K5819O92395j42473j415564N41538K46093j08482L06090
27764b38766r37341p3669m40030j105921J877548K11056p41850k99009l31299
27755b079281J930908J176542j073331R24171J367903O6059K6396n90204M70582
27746B219745j937471j105749j3616l11482K18835P70737P39755o21577p51348
27737g92171n06897j022348L84619p05582J013231J316145J372571n83332L42549
27728H18785J012807l38744j178456n92224J72830j215485P66113n62909o99028
$$ plain form
27719 -1816311 -2628785 -3930044 -4140680 -2348857 199276 667059 -286428 -329017 177934
27710 177934 -73933 -58299 633538 915618 1776913 1780985 1338272 495216 -793532 -86889
27700 -86889 585203 -864226 -2345350 -2132066 -1815450 -1529152 -3112010 -3469273 -1472223
27691 -1472223 -1394791 -84241 -297445 -444890 220703 109378 -237572 275216 718934
27682 718934 850301 475240 70904 -60146 -297499 -2631000 -3549217 -1575103 -1813054
27673 -1813054 -1415089 298419 50397 -664191 -923689 -222186 495035 639886 -374556
27664 -374556 -620755 615340 1143549 1346829 3169242 1447471 760947 -728732 -665829
27655 -665829 18201 -276016 587523 615034 706178 -361367 -631698 -117455 -980295 -960491
$$ packed form
27719a816311q12474j301259k10636J791823K548133M67783r53487m2589N06951
27710A77934k51867J5634O91837K82080Q61295M072m42713q43056j288748P06643
27700h6889O72092j449429j481124K13284L16616K86298j582858l57263J997050
27691a472223P7432J310550k13204j47445O65593j11325l46950N12788M43718
27682G18934J31367l75061m04336j31050k37353k333501r18217J974114k37951
27673a813054L97965J713508k48022p14588k59498P01503P17221J44851j014442
27664c74556k46199J236095N28209K03280J822413j721771o86524j489679O2903
27655f65829O84030k94217Q63539K7511R1144j067545k70331N14243q62840J9804
$$ plain form
27645 -960491 -695484 -277897 265870 1978837 2910139 1832908 758365 -859565 -1290487
27636 -1290487 -877444 -994510 -1476107 -518392 -301736 348682 637656 -277337 -1260898
27627 -1260898 -1792005 -1194982 735086 280012 154226 -804993 -1611205 -910720 -878727
27618 -878727 -489503 -2011444 -3505402 -2198027 -2008129 -1691925 -1283127 -1094341 -870394
27609 -870394 21907 588 -1458944 -323022 493015 -755095 -1414675 -776528 471121
27600 471121 989694 1086210 942320 1134646 -48618 108489 1237423 20104 -1404588
27591 -1404588 -905000 -1182541 -1877113 -1988999 -47265 580679 -961123 -1624045 -644480
27582 -644480 -809880 420729 -14845 -1344479 -1872332 -214026 1651634 1752357 1922391
$$ packed form
27645i60491K65007M17587N43767J712967R31302j077231j074543j617930m30922
27636a290487M13043j17066m81597R57715K16656O50418K88974r14993r83561
27627a260898n31107N97023J930068m55074j25786r59219q06212P00485L1993
27618h78727L89224j521941j493958J307375J89898L16204M08798J88786K23947
27609h70394Q92301k1319j459532J135922Q16037j248110o59580O38147J247649
27600D71121N18573R6516j43890J92326j183264J57107J128934j217319j424692
27591a404588M99588k77541o94572j11886J941734O27944j541802o62922R79565
27582f44480j65400J230609m35574j329634n27853J658306J865660J00723J70034
$$ plain form
27573 1922391 1289978 -231532 191953 1653233 1175454 1420131 661464 844621 111002
27564 111002 -821786 -1153199 357208 1271852 -10461 58117 -292680 -51126 -59155 -107260
27554 -107260 -276677 -1474306 -1487958 -2206067 -1444765 -673906 -1607385 -1488945 -1140270 -577586
27544 -577586 -1023584 -1491856 -2355733 -696442 -1785062 -2520506 -2518051 -1349945 -629178
27535 -629178 -793937 -1020451 -700250 -1241161 777768 -396427 -2323812 -1419803 -516871
27526 -516871 -849601 -1663938 -394589 -168687 -157287 1217337 760805 409246 -406952
27517 -406952 763452 1401269 1216312 684596 8309 -600997 -523469 -839239 864104
27508 864104 1405742 161103 -180808 667012 710390 -564934 -1330038 -1724894 -1198604
$$ packed form
27573A922391o32413j521510M23485J461280m77779K44677p58667J83157p33619
27564A11002r32788l31413J510407R14644j282313O8578l50797K41554q029m8105
27554a07260j69417j197629j3652p18109P61302P70859r33479J18440L48675N62684
27544e77586m45998m68272q63877J659291j088620p35444K455J168106P20767
27535f29178j64759k26514L20201n40911K018929j174195j927385R04009R02932
27526e16871l32730q14337J269349K25902J1400J374624m56532l51559q16198
27517d06952J170404O37817j84957n31716o76287o09306P7528l15770J703343
27508H64104N41638j244639l41911Q47820M3378j275324p65104l94856N26290
$$ plain form
27499 -1198604 -200444 504543 511554 -228179 -1186275 -144540 -1729374 -2603860 -1792790
27490 -1792790 -1015571 -1146962 -1695541 -557077 -535054 -2711995 -1768169 -2172479 -355521
27481 -355521 -323438 -1846174 -976737 -621527 -1071916 -489380 231008 -151368 -1156386
27472 -1156386 -1217176 -337254 -104261 515616 783173 807301 1260692 1001527 -290754 359764
27462 359764 372571 970573 533198 -543435 -741141 -366193 667059 534392 -257774
27453 -257774 -386644 -2431110 -2664377 -1485192 -141537 699732 -375956 -671359 -91499
27444 -91499 -107047 362346 310701 145441 509389 1671397 -324905 -297410 -473956 -75610
27434 -75610 -822113 -967634 226464 1261978 83118 -147399 -552574 -17221 51857
$$ packed form
27499a198604R98160P04987P011p39733r58096J041735j584834q74486Q11070
27490a792790P77219j31391n48579J138464K2023k176941R43826m04310J816958
27481c55521L2083j522736Q69437L55210m50389N82536P20388l82376j005018
27472a156386o0790Q79922K32993O19877K67557K4128M53391k59165j292281O50518
27462C59764J2807N98002m37375j076633j97706L74948J033252j32667p92166
27453b57774j28870k044466k33267J179185J343655Q41269j075688k95403N79860
27444i1499j5548M69393n1645j65260L63948J162008j996302K7495j76546L98346
27434g5610p46503j45521J194098J035514j178860k30517m05175N35353O9078
$$ plain form
27425 51857 213731 622071 1353642 1154577 284603 30982 971832 817601 449517 52622
27415 52622 6425 -254900 -1043748 -1004740 -689713 -1934165 -1869088 -872374 -652305 -928097
27405 -928097 -2698436 -3452028 -3209729 -1920167 -31619 -1021684 -1763485 -1820593 -2829604
27396 -2829604 -1969189 -1460201 -850538 -1867223 -1361101 -43782 119062 967715 -156263
27387 -156263 384572 1264606 114404 -1010628 -1768195 -486243 -214747 -1473056 -1646436
27378 -1646436 -1673956 -866088 132540 -420204 -936091 -1371913 662908 1622311 -191219
27369 -191219 -1628359 -516272 158604 -2209835 -1920518 316873 21473 852461 1092495
27360 1092495 335925 -234492 581144 821926 -799410 -1445799 -1561623 -272325 -1083516
$$ packed form
27425E1857J61874M08340P31571j99065q69974k53621R40850j54231l68084l96895
27415E2622m6197k61325p88848L9008L15027j244452O5077R96714K20069k75792
27405i28097j770339p53592K42299J289562J888548r90065p41801n7108j009011
27396b829604Q60415N08988O09663j016685N06122J317319J62844Q48653j123978
27387a56263N40835Q80034j150202j125032p57567J281952K71496j258309j73380
27378a646436k7520Q07868R98628n52744n15887m35822K034821R59403j813530
27369a91219j437140J112087O74876k368439K89317K237391k95400Q30988K40034
27360A092495p56570n70417Q15636K40782j621336o46389j15824J289298q11191
$$ plain form
27351 -1083516 -1471258 -387452 -626346 -1018757 -723849 -104554 -576759 86885 1092676
27342 1092676 569492 529688 -502131 -879302 -212443 -1282362 -618566 -990236 -1043207
27333 -1043207 -1668905 -1322456 -1399085 -764973 -66290 111407 588451 538230 -905685 -462642
27323 -462642 -316841 -323844 -196785 249656 -245903 -919573 561479 313201 965220 1430536
27313 1430536 1924793 2263855 1791063 2517975 1811441 1188622 1438921 1188778 -76130
27304 -76130 -1787630 -1288105 -1109053 -1844523 -1398221 -1586049 -1043696 -1202978 -1225740 -942271
27294 -942271 -667274 -685858 -520339 -184079 -211626 -293727 -1775823 -593517 -902774 -1582012
27284 -1582012 -1806032 -1352716 -929999 -1705637 -2114821 -2077663 -1448611 -54981 -1053297
$$ packed form
27351a083516l87742J083806k38894l92411K94908O19295m72205O63644J005791
27342A092676n23184l9804j031819l77171O66859j069919O63796l71670n2971
27333a043207o25698L46449p6629O34112O98683J77697M77044n0221j443915M43043
27323d62642J45801p003J27059M46441m95559o73670J481052k48278O52019M65316
27313A430536M94257L39062m72792P26912p06534o22819K50299k50143j264908
27304g6130j711500M99525J79052p35470M46302j87828N42353j59282k2762K83469
27294i42271K74997j8584J65519L36260k7547q2101j482096J182306l09257o79238
27284a582012k24020M53316M22717p75638m09184L7158O29052J393630r98316
$$ plain form
27275 -1053297 -1500536 229040 563844 1197095 406429 1177568 2160947 972350 -416432
27266 -416432 -377318 -1219046 -2004649 -2581951 -2474474 -2462091 -1197087 -1116587 -888488 156173
27256 156173 293501 -367459 186703 -196108 275369 1058908 1948912 684054 -1087076
27247 -1087076 -1356241 -1054932 -1388262 -921205 422869 2564297 1578093 -366598 327982
27238 327982 -30487 -430222 -41417 -855802 -186071 -621917 -1212363 -137781 -1164957
27229 -1164957 -2696010 -2417811 -290438 305705 48312 375938 -454561 -889716 318340
27220 318340 1035921 62327 -120314 658961 1023734 1055917 -62701 -471816 367573 245224
27210 245224 214588 1381580 667042 -439441 502114 442658 -919630 -1441323 385445
$$ packed form
27275a053297m47239J729576L34804O33251p90666P71139R83379j188597j388782
27266d16432L9114q41728p85603n77302J07477J2383J265004Q0500K28099J044661
27256A56173J37328o60960N54162l82811M71477P83539Q90004j264858j771130
27247a087076k69165L01309l33330M67057J344074K141428r86204j944691O94580
27238C27982l58469l99735L88805q14385O69731m35846n90446J074582j027176
27229a164957j531053K78199K127373N96143k57393L27626q30499m35155J208056
27220C18340P17581r73594j82641P79275L64773L2183j118618m09115Q39389j22349
27210B45224l0636J166992p14538j106483R41555n9456j362288n21693J826768
$$ plain form
27201 385445 -252353 -1504704 -766736 -1154695 -1337429 -2363926 -1760251 -2645673 -3035893
27192 -3035893 -2225192 -1958112 -1762167 -3480117 -1837851 -576396 295195 2165984 1881129
27183 1881129 474592 -2234298 -2053938 -1384354 -1293196 -1453635 -2462346 -1790710 -83675
27174 -83675 560069 386853 1515186 -108061 -242272 -1456875 -1275407 -1228341 -1400591
27165 -1400591 -258700 -108802 -782085 -61864 128224 445863 -725933 -2038008 -619167
27156 -619167 855860 2022171 1742969 260059 -1830578 -1348719 -994376 -1546184 -2366591
27147 -2366591 -1524249 102754 218226 -393262 -1136918 -2123159 -666491 920854 2231696
27138 2231696 3303208 2172172 830661 699148 303324 -265209 -237245 -1310772 -2283203
$$ packed form
27201C85445o37798j252351P37968l87959j82734j026497O03675q85422l90220
27192c035893Q10701K67080J95945j717950J642266J261455Q71591J870789k84855
27183A881129j406537k708890J80360O69584R1158j60439j008711O71636J707035
27174h3675O43744j73216J128333j623247j34211j214603J81468M7066j72250
27165a400591J141891J49898o73283P20221J90088L17639j171796j312075J418841
27156f19167J475027J166311k79202j482910k090637M81859L54343n51808q20407
27147b366591Q42342J627003J15472o11488p43656r86241J456668J587345J310842
27138B231696J071512j131036j341511j31513l95824n68533K7964j073527r72431
$$ plain form
27129 -2283203 -2068032 -820755 -548910 -759816 -290113 15666 -881918 -1946957 -1989487
27120 -1989487 -798277 759299 615634 204602 339573 -53946 -47645 -436696 -919339
27111 -919339 -1054866 12925 269942 690119 -358004 -1019496 -1012197 -694927 1061295
27102 1061295 1507988 1447199 1349769 851350 -702211 -1011455 -1394908 -594212 201569 438097
27092 438097 663417 581515 1073625 616211 33164 -222064 505681 1742887 2184413 208677
27082 208677 -224053 66138 -815971 -194306 911758 441086 178351 1103922 1426227
27073 1426227 1823602 1595907 2329981 1712932 1235941 1086460 2846273 2200255 1182366
27064 1182366 1159570 1152101 1228163 420705 1265629 1636441 1269199 1002637 1815708 1541104
$$ packed form
27129b283203K15171J247277K71845k10906M69703L05779q97584j065039m2530
27120a989487J191210J557576j43665m11032J34971l93519O301l89051m82643
27111i19339j35527J067791K57017M20177j048123o61492P299L17270J756222
27102A061295M46693o0789r7430m98419j553561l09244l83453Q00696P95781K36528
27092D38097K25320q1902M92110m57414n83047k55228P27745J237206M41526j975736
27082B08677m32730K90191q82109O21665J106064m70672k62735R25571L22305
27073A426227L97375k27695P34074o17049m76991j49481J759813o46018j017889
27064A182366k2796p469P6062q07458Q44924L70812l67242k66562Q13071k74604
$$ plain form
27054 1541104 1167614 665535 -26091 -856655 32798 317247 1259512 1387426 689130
27045 689130 103129 682060 1451390 1755890 2271669 2982064 2735568 3808013 4331223
27036 4331223 5083363 3371090 2602359 2830439 3038950 1654578 1577706 2853882 3597401
27027 3597401 5120505 6173959 5312956 5133737 4035652 4050389 3295060 3004429 2668695
27018 2668695 1698264 2671117 1212321 1172289 2148761 3392328 2733475 3810029 4122498
27009 4122498 3114509 3194595 3160888 2969454 2462278 1846526 1851654 1309243 1990569 720809
26999 720809 -1148455 -124168 1780467 762454 1064392 741236 1530417 206191 54677
26990 54677 684951 396287 2174686 1019360 -838900 -180909 808724 -422138 56705
$$ packed form
27054A541104l73490n02079o91626q30564Q89453K84449R42265J27914o98296
27045F89130n86001N78931P69330L04500N15779P10395k46496J072445N23210
27036D331223P52140j712273p68731K28080K08511j384372p6872J276176P43519
27027C597401J523104J053454q61003j79219j098085J4737p55329k90631l35734
27018B668695r70431R72853j458796m0032R76472J243567o58853J076554L12469
27009D122498j007989Q0086l3707j91434n07176o15752N128n42411O81326j269760
26999G20809j869264J024287J904635j018013L01938l23156P89181j324226j51514
26990E4677O30274k88664J778399j155326j858260O57991R89633j230862M78843
$$ plain form
26981 56705 948691 1594054 2265727 1957723 1179725 1573853 2439884 3936871 2841967
26972 2841967 1327631 190139 322002 2364031 2021427 644023 1398297 2354021 2059175
26963 2059175 1228354 2034443 3089320 3006712 1459052 1891111 1967820 1559656 1707221
26954 1707221 4018957 4700219 3713622 2141325 2323257 3957653 4005740 3035975 1673222
26945 1673222 2608104 4528466 5157554 4957690 4912057 5598852 5850313 6246810 6028500
26936 6028500 5677131 4733927 5482121 6047075 5107781 5377553 6776995 7753351 8801061
26927 8801061 9668503 9494761 10261230 11285968 10422219 10942507 11823584 13319527 14060783
26918 14060783 15248232 17242226 18506211 19529546 21155508 24205228 28862542 32016566
$$ packed form
26981E6705Q91986O45363O71673l08004p77998L94128Q66031J496987j094904
26972B841967j514336j137492J31863K042029l42604j377404P54274R55724k94846
26963B059175q30821Q06089J054877q2608j547660M32059P6709m08164J47565
26954A707221K311736O81262r86597j572297J81932J634396M8087r69765j362753
26945A673222R34882J920362O29088j99864m5633O86795K51461L96497k18310
26936F028500l51369r43204P48194N64954r39294K69772J399442R76356J047710
26927H801061Q67442j73742P66469J024738q63749N20288Q81077J495943P41256
26918A4060783J187449J993994J263985J023335J625962L049720M657314L154024
$$ plain form
26910 32016566 35097312 39705711 47185053 53888440 63512253 75190692 90192429 110583404
26902 110583404 138181830 176574522 226767007 260259414 253602453 237166006 235221719
26895 235221719 254708753 292409475 321707216 312903556 291387524 286681166 304104758
26888 304104758 348903507 417289635 480032223 484461971 441929443 411481520 415600951
26881 415600951 450726331 490448522 478411634 409910052 342404370 302199112 285278367
26874 285278367 290681601 307138117 310882402 286020803 253222217 236535243 238366393
26867 238366393 250226592 248638346 217410287 174784287 139253566 112955056 93844585
26860 93844585 79625582 69995847 62538075 55915737 47838927 42527577 38781015 35745505
$$ packed form
26910C2016566L080746M608399P479342O703387R623813J1678439J5001737K0390975
26902A10583404K7598426L8392692N0192485L3492407o656961j6436447j944287
26895B35221719J9487034L7700722K9297741q803660k1516032m706358J7423592
26888C04104758M4798749O8386128O2742588M429748m2532528l0447923M119431
26881D15600951L5125380L9722191j2036888o8501582o7505682m0205258j6920745
26874B85278367N403234J6456516L744285k4861599l2798586j6686974J831150
26867B38366393J1860199j588246l1228059m2626000l5530721k6298510j9110471
26860I3844585j4219003r629735p457772o622338q076810n311350l746562l035510
$$ plain form
26852 35745505 31851775 27320204 25744675 24460601 23003266 21799427 21682527 19179379
26844 19179379 16339968 15921395 16436040 13949840 11845296 12258080 13121671 11519863 10421230
26835 10421230 10775610 10836241 9637547 9883232 9084061 9142215 8969403 9256509 9391496
26826 9391496 7283135 6674685 7440033 8224574 6720330 7294039 6807832 6534629 6549128
26817 6549128 4870833 4364933 4420776 5155321 6065278 5322838 3893448 3692672 2444715
26808 2444715 1557122 2842451 3107767 3193910 3323131 4881216 5319597 3847073 2947132
26799 2947132 3623138 4980661 5319711 4259881 3209066 2789966 3897804 4266722 4538396
26790 4538396 3881299 3568294 3743156 5770856 5079560 4109915 3475918 3458896 2965783
$$ packed form
26852C5745505l893730m531571j575529j284074j457335j203839j16900k503148
26844A9179379k839411m18573N14645k486200k104544M12784Q63591j601808j098633
26835A0421230L54380O0631j198694K45685p99171N8154j72812K87106J34987
26826I391496k108361o08450P65348P84541j504244N73709m86207k73203J4499
26817F549128j678295n05900N5843P34545R09957p42440j429390k00776j247957
26808B444715q87593J285329K65316Q6143J29221J558085M38381j472524q99941
26799B947132O76006J357523L39050j059830j050815m19100J107838L68918K71674
26790D538396o57097l13005J74862K027700o91296r69645o33997j7022m93113
$$ plain form
26781 2965783 3185309 4604116 5097196 2997034 2450002 2691920 3753753 3015400 1778569
26772 1778569 606977 1241041 2694901 2888256 2753703 2321231 982187 1156612 2523649
26763 2523649 2942724 3042757 2348527 1946444 1113886 -233662 54058 1255961 1461115
26754 1461115 2551171 3294344 3290254 3077440 2075236 1112780 1231717 1084914 1559236
26745 1559236 1870803 2071242 2054318 1077568 903961 2049533 1857793 411410 -63625
26736 -63625 -931608 -741114 240331 77092 -27365 -128430 -230581 483077 -115858 538620
26726 538620 1054412 1312781 1573618 2266586 1595708 759798 1403856 2044469 2477964 3098064
26716 3098064 3290309 3067076 2649311 3017720 2796941 2475651 482509 1927711 2194571
$$ packed form
26781B965783K19526J418807M93080k100162n47032K41918J061833p38353j236831
26772A778569j171592O34064J453860J93355j34553m32472j339044J74425J367037
26763B523649M19075J00033o94230m02083q32558j347548K87720J201903K05154
26754A461115J090056P43173m090k12814j002204r62456J18937j46803M74322
26745A559236L11567K00439j6924r76750j73607J145572j91740j446383m75035
26736f3625q67983J90494R81445j63239j04457j01065j02151P13658n98935O54478
26726E38620N15792K58369K60837O92968o70878q35910O44058O40613M33495O20100
26716C098064J92245k23233m17765L68409k20779l21290j993142J445202K66860
$$ plain form
26707 2194571 1384359 1064103 2706639 1816620 3586051 3214920 2504408 3443079 3996306
26698 3996306 2482772 979566 2281848 1583878 2543748 3476490 3924583 3421848 3641889
26689 3641889 2602629 1691757 787056 684778 1433709 1872531 2858822 2173101 812033
26680 812033 2625529 2639184 2601762 2645494 2618644 4203588 3909975 3007286 1569661 -416996
26670 -416996 -655173 -930553 -443326 262622 336851 90637 340591 306487 1048222 1660674
26660 1660674 1577069 2041215 923809 1404168 1359045 612569 587083 1663823 1914440 1041383
26650 1041383 1480631 404798 1159495 701042 146113 930656 735333 -528241 -543931
26641 -543931 -1460722 -1029781 -1135516 -462237 -299738 325934 -235823 -108163 1132149
$$ packed form
26707B194571q10212l20256J642536q90019J769431l71131p10512R38671N53227
26698C996306j513534j503206J302282o97970R59870R32742M48093n02735K20041
26689C641889j039260r10872r04701j02278P48931M38822R86291o85721j361068
26680H12033J813496J3655l7422M3732k6850J584944k93613r02689j437625j986657
26670d16996k38177k75380M87227P05948P4229k46214K49954l4104P41735O12452
26660A660674q3605M64146j117406M80359m5123p46476k5486J076740K50617q73057
26650A041383M39248j075833P54697m58453n54929P84543j95323j263574j5690
26641e43931r16791M30941j05735O73279J62499O25672n61757J27660J240312
$$ plain form
26632 1132149 719985 -433869 -49538 756943 -321275 -360491 205968 611939 427698
26623 427698 1936217 1593821 377623 1591154 1067139 232040 -245247 -1305074 -1203147
26614 -1203147 -826955 317991 935698 388396 820796 594784 646240 457768 -231739
26605 -231739 757008 920275 1047423 560086 -329810 461408 1244283 925878 1051308 183090
26595 183090 981879 1352942 594744 2853772 2576069 1066887 -440461 547306 749092
26586 749092 698063 500155 487369 -239700 567079 1899259 2231830 256000 -212966 -705324
26576 -705324 -1431932 42337 -431106 -590713 -736544 421125 -3103 -1463681 -636212
26567 -636212 -759768 -843930 -472363 -765808 537972 1720864 1772394 970992 -399997
$$ packed form
26632A132149m12164j153854L84331Q06481j078218l9216N66459M05971j84241
26623D27698J508519l42396j216198J213531n24015q35099m77287j059827J01927
26614a203147L76192J144946O17707n47302M32400k26012N1456j88472o89507
26605b31739R88747J63267J27148m87337q89896P91218P82875l18405J25430q68218
26595A83090P98789L71063p58198K259028k77703j509182j507348R87767K01786
26586G49092n1029j97908j2786p27069Q06779J332180L32571j975830m68966m92358
26576g05324p26608J474269m73443j59607j45831J157669m24228j460578Q27469
26567f36212j23556q4162L71567k93445J303780J182892N1530q01402j370989
$$ plain form
26558 -399997 -120354 796217 631635 -446433 -1411871 -446657 92475 890698 256714
26549 256714 268165 -764862 -1098261 -1513923 -1933094 -294809 948741 955877 1395206 1943792
26539 1943792 1416881 702072 873721 601108 -70818 279866 676677 468599 -1105200
26530 -1105200 -1988297 -12134 -466071 159330 584406 1060067 363859 697111 1894762
26521 1894762 790152 -296774 -463207 -96628 -214503 803059 1792214 1371806 -468548
26512 -468548 968745 797260 -880809 -647265 806577 805048 866658 1773919 1986877 2244254
26502 2244254 2193588 2474241 1695565 1570724 1246960 253265 -231506 -1495957 -1040806
26493 -1040806 -747635 -564127 174841 441003 145137 -245401 -1242512 -430435 213504
$$ packed form
26558c99997K79643R16571j64582j078068r65438R65214N39132P98223o33984
26549B56714J1451j033027l33399m15662m19171J638285J243550P136M39329N48586
26539A943792n26911p14809J71649k72613o71926L50684L96811k08078j573799
26530a105200q83097J976163m53937O25401M25076M75661o96208L33252J197651
26521A894762j104610j086926j66433L66579j17875J017562R89155m20408j840354
26512d68548J437293j71485j678069K33544J453842j529O1610R07261K12958K57377
26502B244254n0666K80653p78676j24841l23764r93695m84771j264451M55151
26493a040806K93171J83508P38968K66162k95866l90538r97111Q12077O43939
$$ plain form
26484 213504 202276 502509 -315363 343257 2000948 1638501 1403389 2571149 2370472
26475 2370472 1744419 2435972 217587 -988207 -26991 -1222004 -367083 1733376 2138692
26466 2138692 1766743 1765678 231233 413183 795089 194542 -1406126 -1218804 -1663784
26457 -1663784 -536358 -22279 -667198 -1102989 -1481445 1963556 2267557 2171991 1864593
26448 1864593 264018 296038 -354958 1520752 1843461 1634714 985059 865680 -679865
26439 -679865 -377791 -578201 -541794 431387 510111 586493 -384253 -551343 -1855346 -1535279
26429 -1535279 237966 968302 1950647 2999751 2758743 1465596 687480 357844 159552
26420 159552 -143311 -909841 -1244550 -241096 1379677 913117 -201008 -715711 238774
$$ packed form
26484B13504j1228L00233q17872O58620J657691l62447k35112J167760k00677
26475B370472o26053O91553k218385j205794R61216j195013Q54921K100459M05316
26466B138692l71949j065j534445J81950L81906o00547j600668J87322m44980
26457a663784J127426N14079o44919m35791l78456L445001L04001r5566l07398
26448A864593j600575L2020o50996J875710L22709k08747o49655j19379j545545
26439f79865L02074k00410L6407R73181P8724P6382r70746j67090j304003L20067
26429a535279J773245P30336R82345J049104k41008j293147p78116l29636j98292
26420A59552l02863p66530l34709J003454J620773m66560j114125n14703R54485
$$ plain form
26411 238774 -651567 -1238558 -550863 716103 862268 -1370070 -1270551 174983 -1809305
26402 -1809305 -3052311 -2148775 -1883979 -2275871 -2083656 -1154476 -261049 1651695 1315825
26393 1315825 -822937 -1859787 -1607540 -916441 -151301 59864 1716787 1614069 1757516
26384 1757516 2005144 2949245 1376115 1323808 1804829 655653 -692358 -1380716 -46232
26375 -46232 1308273 1273076 934033 1645313 66614 -360441 549637 1290355 1985815 1235446
26365 1235446 8580 -637791 12429 1164390 1708038 1531927 833197 2257650 2592103
26356 2592103 -568306 -669275 286190 519248 984992 1035973 1084596 -1396870 -458648
26347 -458648 570620 55136 1308271 378722 80607 2686 252746 -66991 -1061947
$$ packed form
26411B38774q90341n86991O87695J266966J46165k232338R9519J445534j984288
26402a809305j243006R03536K64796l91892J92215R29180Q93427J912744l35870
26393A315825k138762j036850K52247O91099P65140K11165J656923j02718J43447
26384A757516K47628R44101j573130n2307M81021j149176j348011o88358J334484
26375d6232J354505l5197l39043P11280j578699m27055R10078P40718O95460p50369
26365A235446j226866o46371O50220J151961N43648j76111o98730J424453L34453
26356B592103l160409j00969R55465K33058M65744N0981M8623k481466R38222
26347d58648J029268n15484J253135r29549k98115p7921K50060l19737r94956
$$ plain form
26338 -1061947 -466169 378825 59762 -622026 749065 449107 -918577 -2129815 -883510
26329 -883510 413132 1044609 -8671 397789 1205137 530160 -547645 95886 1197588
26320 1197588 2205128 1137756 -828183 -583790 -1469582 -2747292 -2554201 -292547 66624
26311 66624 578556 525877 1534000 1001572 -312866 -98067 -1285437 -1370589 -175221
26302 -175221 1051009 1081009 1299774 532735 345350 50450 -206038 -1170373 -828183 -436606
26292 -436606 -1352432 -2235113 -1778684 -97964 -81244 -170665 -1692107 -1337032 -951542 -299478
26282 -299478 622874 321385 158645 50529 -491797 -1294509 38288 -96260 -796026
26273 -796026 -272350 341933 587617 -160859 -623660 -57038 -724189 -598398 699910
$$ packed form
26338a061947N95778Q44994l19063o81788J371091k99958j367684j211238J246305
26329h83510J296642O31477j053280M06460Q07348o74977j077805O43531J101702
26320A197588J007540j067372j965939K44393q85792j277710J93091K261654L59171
26311F6624N11932n2679J008123n32428j314438K14799j187370q5152J195368
26302a75221J226230L0000K18765p67039j87385k94900k56488r64335L42190L91577
26292d36606r15826q82681M56429J680720J6720q9421j521442L55075L85490O52064
26282b99478R22352l01489j62740j08116n42326q02712J332797j34548o99766
26273g96026N23676O14283K45684p48476m62801N66622o67151J25791J298308
$$ plain form
26264 699910 1246625 542636 652487 1255761 495153 1399633 1342151 987824 705884 715257
26254 715257 -1290619 -1494301 -46891 367636 70524 439175 854216 486620 420093
26245 420093 63734 -1309966 -217179 -357399 59123 -774610 -2509009 -784918 -508046
26236 -508046 -897318 -434750 -771630 -773359 -549051 970544 2278135 1858048 1385549 1348565
26226 1348565 1760946 2004793 1658205 784514 -372933 -1611741 -1452698 -1028472 -362164
26217 -362164 588855 -747652 -577232 -789320 416443 1046832 114994 436155 -1168700
26208 -1168700 -378554 521661 487473 697420 -577782 -447402 290 687702 955993
26199 955993 443177 -912470 -210425 524368 1681637 -618453 -1096215 -670020 -231132
$$ packed form
26264F99910N46715p03989J09851O03274p60608R04480n7482l54327k81940R373
26254G15257k005876k03682J447410M14527k97112L68651M15041l67596o6527
26245D20093l56359j373700J092787j40220M16522q33733j734399J724091K76872
26236e08046l89272M62568l36880j729K24308J519595J307591m20087m72499l6984
26226A348565M12381K43847l46588q73691j157447j238808J59043M24226O66308
26217c62164R51019j336507J70420k12088J205763O30389r31838L21161j604855
26208a168700P90146R00215l4188K09947j275202J30380M47692O87412K68291
26199I55993n12816j355647P02045P34793J157269k300090m77762M26195M38888
$$ plain form
26190 -231132 376607 615297 663524 189057 21000 16641 748563 18478 197443 52474
26180 52474 -190181 -649638 -1045632 -444358 1766808 3340809 3701316 2475007 993629
26171 993629 464991 807397 -691908 -774584 -435457 -150226 -803290 196507 1540132
26162 1540132 1299394 638691 577101 -1401692 -2315314 -1089435 -285431 464364 -466705
26153 -466705 -572450 -909741 -667219 -865158 -1007284 -1404270 -1079157 646338 1390456
26144 1390456 -2217 -1176388 -1892303 -1148206 -715499 -1684293 -2007573 -2281624 -2890312
26135 -2890312 -1473288 -587790 79143 701417 -333916 -1848196 -2612161 -1478520 -306265
26126 -306265 73678 770019 1190580 401774 347962 879595 -71110 -111254 311100 326328
$$ packed form
26190b31132O07739K38690M8227m74467j68057m359P31922p30085J78965j44969
26180E2474k42655m59457l95994O01274K211166J574001L60507j226309j481378
26171I93629n28638L42406j499305q2676L39127K85231o53064R99797J343625
26162A540132k40738o60703o1590j978793r13622J225879Q04004P49795r31069
26153d66705j05745l37291K42522j97939j42126l96986L25113J725495P44118
26144A390456j392673j174171p15915P44097M32707r68794l23280k74051o08688
26135b890312J417024Q85498O66933O22274j035333j514280p63965J133641J172255
26126c06265L79943O96341M20561p88806n3812N31633r50705m0144M22354J5228
$$ plain form
26116 326328 543726 511630 104661 -117194 690284 422311 1342536 1250931 -85807 -375504
26106 -375504 420447 -465567 -671434 -1460939 -926880 114442 139108 334753 1613742
26097 1613742 -25590 -131085 -1132478 -1106530 1173804 1847586 1089663 1296986 149739
26088 149739 357702 -39029 -303022 -298030 -876269 -1712777 -1667691 334430 1596507 1947168
26078 1947168 1521736 1022251 89453 -987616 -807329 -689191 35737 -858807 -1016996
26069 -1016996 251600 -95098 125786 1311833 1027059 742962 499471 -527163 -289138
26060 -289138 -757341 23578 1737654 2811452 3113289 3103724 2390260 1831476 1218971 189510
26050 189510 497337 1653671 1622937 438802 -253746 -118626 -821073 30732 263267
$$ packed form
26116C26328K17398l2096m06969k21855Q07478k67973R20225r1605j336738k89697
26106c75504P95951q86014k05867p89505N34059J041322K4666J95645J278989
26097A613742j639332j05495j001393K5948K280334O73782p57923K07323j147247
26088A49739K07963l96731k63993M992n78239q36508M5086K002121J262077L50661
26078A947168m25432m99485r32798j077069J80287J18138P24928q94544j58189
26069a016996J268596l46698K20884J186047k84774k84097k43491j026634K38025
26060b89138m68203P80919J714076J073798L01837r565p13464n58784o12505j029461
26050A89510L07827J156334l0734j184135o92548J35120p02447Q51805K32535
$$ plain form
26041 263267 110269 55158 -1108950 -1582214 -665610 -536366 -1355115 -1055681 -2299533
26032 -2299533 -1685536 -988894 -613453 1261837 -262338 -60558 1544229 554965 309512
26023 309512 2313 760265 722460 946788 920711 277620 662922 989890 2288654 1701701
26013 1701701 350117 125536 -211288 -423857 632160 -949075 -721866 -635571 -1838777
26004 -1838777 -2072859 -537731 104881 532663 1165789 1547997 -852854 -630575 -148983
25995 -148983 -1630752 -102497 -1379922 -1217980 -1094600 -1930590 -37807 348493 -208178
25986 -208178 349958 294103 60982 -820878 -212524 20902 -1439654 -265921 221369
25977 221369 291004 -86979 -5326 -167590 -596873 -1738314 -1960728 464448 748007 336068
$$ packed form
26041B63267j52998n5111j164108m73264R16604J29244q18749K99434j243852
26032b299533O13997O96642L75441J875290j524175K01780J604787r89264k45453
26023C09512l07199P57952l7805K24328k6077o43091L85302L26968J298764n86953
26013A701701j351584k24581l36824k12569J056017j581235K27209Q6295j203206
26004a838777k34082J535128O42612M27782O33126L82208k400851K22279M81592
25995a48983j481769J528255j277425J61942J23380q35990J892783L86300n56671
25986b08178N58136n5855k33121q81860O08354K33426j460556J173733M87290
25977B21369O9635l77983Q1653j62264m29283j141441k22414K425176K83559m11939
$$ plain form
25967 336068 -194617 -1059273 -2423234 -1796131 -1087836 -321542 391646 173165 96048 555610
25957 555610 520667 965061 306775 -1376051 -1964375 -2458425 859936 2797433 2455645
25948 2455645 301638 13654 570751 167123 551332 241308 -1741214 -1411956 -362405
25939 -362405 54892 19652 -2240799 -2347314 57843 377155 213168 228476 138012 359808
25929 359808 445094 136606 -1212064 -123592 1275914 1070829 -826812 -582861 -561081
25920 -561081 110787 982754 773016 -90538 -671059 74923 773875 1072750 17027
25911 17027 -1300766 -1710816 -850763 -375411 -442160 -1278320 -1816755 -1217329 -361541 -648566
25901 -648566 -616006 978579 1204951 1321161 1425905 782213 467741 -787922 -1297312
$$ packed form
25967C36068n30685q64656j363961O27103P08295P66294P13188k18481p7117M59562
25957E55610l4943M44394o58286j682826n88324m94050L318361J937497l41788
25948B455645k154007k87984N57097m03628L84209l10024j982522L29258J049551
25939c62405M17297l5240k260451j06515K405157L19312j63987J5308r0464K21796
25929C59808Q5286l08488j348670J088472J399506k05085j897641K43951K1780
25920e61081O71868Q71967k09738q63554n80521P45982O98952K98875j055723
25911A7027j317793m10050Q60053M75352o6749q36160n38435N99426Q55788k87025
25901f48566L2560J594585K26372J16210J04744o43692l14472j255663n09390
$$ plain form
25892 -1297312 195081 135725 329431 1081421 1957580 255305 -917115 -311475 139799
25883 139799 967032 554608 140646 1377492 1206479 1142421 1486416 -1378486 -1428370 -7694
25873 -7694 -1687109 -2042479 -1701176 -188587 1544998 1280920 975348 1287563 417824
25864 417824 330601 -467273 -1194636 -431277 -394173 -26573 -162679 -1215182 613519 647142
25854 647142 -84887 -661669 -245423 -61014 1054576 1054262 -61537 767523 -773530 -858188
25844 -858188 -449099 -180381 -346509 338984 1401119 1577367 859712 -653605 -50933
25835 -50933 -724529 -240464 142552 -127253 -548773 -205103 14281 -343094 -8103 -377691
25825 -377691 -311898 -16543 -174412 -1253577 -184317 432299 388795 -156367 559369 958839
$$ packed form
25892a297312J492393n9356J93706P51990Q76159j702275j172420O05640M51274
25883A39799Q27233m12424m13962J236846j71013o4058L43995k864902m9884J420676
25873g694j679415l55370L41303J512589J733585k64078l05572L12215q69739
25864D17824q7223p97874p27363P63359L7104L67600j36106j052503J828701L3623
25854F47142p32029n76782M16246J84409J115590l14j115799Q29060j541053q4658
25844h58188M09089K68718j66128O85493J062135J76248p17655j513317O02672
25835e0933o73596M84065L83016k69805m21520L43670K19384l57375L34991l69588
25825c77691O5793K95355j57869j079165J069260O16616m3504n45162P15736L99470
$$ plain form
25815 958839 1275743 2096711 990123 -945509 163358 -245926 -264828 248001 -347752
25806 -347752 692629 1208186 1964376 725142 64182 786451 172219 -290010 -553133
25797 -553133 -140366 251390 831859 613925 370667 562296 -874393 -602733 -917370
25788 -917370 -821431 -877355 1838657 1058092 -998055 -30636 1018698 -157426 -921547
25779 -921547 -270587 185739 604925 -108846 -245185 999120 920801 -73238 -310599 141941
25769 141941 759498 -734363 -588275 -406822 -666977 141755 685860 196988 1585710
25760 1585710 1023512 972645 1225663 208103 -968850 -135751 -1341094 -927723 95395
25751 95395 -469369 -1489086 -1139932 -649312 -1072829 -2659727 -2808201 -1557027 -1568678
$$ packed form
25815I58839L16904Q20968j106588j935632J108867m09284j8902N12829n95753
25806c47752J040381N15557P56190j239234o60960P22269o14232m62229k63123
25797e53133M12767L91756N80469k17934k43258J91629j436689K71660l14637
25788i17370R5939n5924K716012p80565k056147R67419J049334j176124p64121
25779i21547O50960M56326M19186p13771j36339J244305p8319r94039k37361M52540
25769A41941O17557j493861J46088J81453k60155Q08732N44105m88872J388722
25760A585710n62198n0867K53018j017560j176953Q33099j205343M13371J023118
25751I5395n64764j019717L49154M90620m23517j586898j48474J251174j1651
$$ plain form
25742 -1568678 70250 1157051 834906 -809737 -1032691 -761210 -846938 -812151 -367329
25733 -367329 80342 355868 1015930 693380 -377055 -211315 -1005283 -155020 799506
25724 799506 -479192 -221276 553465 334012 952571 1218815 1419462 1319868 -190607
25715 -190607 -394540 -1824639 -1437508 -261674 196037 563516 1782673 987756 -144135
25706 -144135 -65329 179901 1455755 1106361 800744 113640 -1224670 -350871 -1148447
25697 -1148447 -1510600 -666759 -438958 -62126 600829 271820 1084281 1103074 -994491
25688 -994491 -1788901 -610763 -1645404 -1451263 -131121 291909 941064 1309593 346604
25679 346604 434112 729799 322436 1119865 680968 -134679 -1648805 -1465603 -1294711 247294
$$ packed form
25742a568678J638928J086801l22145j644643k22954K71481q5728L4787M44822
25733c67329M47671K75526O60062l22550j070435J65740p93968Q50263R54526
25724G99506j278698K57916P74741k19453O18559K66244K00647r9594j510475
25715a90607k03933j430099L87131J175834M57711L67479J219157p94917j131891
25706a44135P8806K45230J275854l49394l05617o87104j338310Q73799p97576
25697a148447l62153Q43841K27801L76832O62955l29009Q12461J8793k097565
25688i94491p94410J178138j034641J94141J320142M23030O49155L68529r62989
25679C46604Q7508K95687m07363P97429m38897q15647j514126J83202J70892J542005
$$ plain form
25669 247294 1387710 1394269 -13851 375579 2159362 1861804 -132469 663654 1794668
25660 1794668 932803 -434193 -728017 229846 836387 883241 718845 -261412 -418055
25651 -418055 -355525 -1387970 -1032930 -811535 -553952 264667 1319752 745690 -737651
25642 -737651 -1437026 -952408 -674690 -1479892 -893798 -301266 121124 1386998 2044664
25633 2044664 2080660 710370 -730520 -368585 -410339 -356247 -112081 -1176946 -579156
25624 -579156 -406721 241178 -283331 496637 984127 961713 353477 -1610274 -1712084 173906
25614 173906 516799 -14444 1262240 2341131 2753881 700812 1597823 2253380 879084
25605 879084 456639 -849715 -1247190 -496586 -302680 446435 -798106 -282766 -170193
$$ packed form
25669B47294J140416O559j408120L89430J783783k97558j994273P96123J131014
25660A794668q61865j366996k93824R57863O06541M6854j64396r80257j56643
25651d18055O2530j032445L55040K21395K57583Q18619J055085n74062j483341
25642g37651o99375M84618K77718q05202N86094N92532M22390J265874O57666
25633B044664L5996j370290j440890L61935m1754N4092K44166j064865N97790
25624e79156J72435O47899n24509P79968M87490k2414o08236j963751j01810J885990
25614A73906L42893n31243J276684J078891M12750k053069Q97011O55557j374296
25605H79084m22445j306354l97475P50604J93906P49115j244541N15340J12573
$$ plain form
25596 -170193 1131927 1306354 1358763 1839747 -193541 -718629 -515228 -583347 -296269 -381
25586 -381 678722 1207038 844120 1599166 917592 2012539 2569532 849183 -542022 -648905
25576 -648905 -613112 -390518 -492072 517563 370468 -600566 -1335894 -843507 -896725 -1130188
25566 -1130188 -418569 -26145 -47947 -969722 -276358 -1008398 -354355 -1228904 -1029956 513238
25556 513238 60796 96504 962611 1395477 156201 73117 603405 -206487 -429371 -43891
25546 -43891 221191 -1511438 -794038 -397825 242392 540051 275107 365582 792450 1092697
25536 1092697 1303606 446126 764234 812672 -207791 -710279 -500245 1719397 1717151 187199
25526 187199 911179 -257920 -1126543 -1351210 -763903 290463 -792265 -1657908 34952
$$ packed form
25596a70193J302120J74427N2409M80984k033288n25088K03401o8119K87078K95888
25586c81O79103N28316l62918P55046o81574J094947N56993j720349j391205j06883
25576f48905L5793K22594j01554J009635j47095r71034p35328M92387n3218k33463
25566a130188P11619L92424k1802r21775O93364p32040O54043q74549J98948J543194
25556E13238m52442L5708Q66107M32866j239276q3084N30288q09892k22884L85480
25546d3891K65082j732629P17400L96213O40217K97659k64944R0475M26868L00247
25536A092697K10909q57480L18108M8438j020463n02488K10034K219642k246j529952
25526A87199P23980j169099q68623k24667N87307J054366j082728q65643J692860
$$ plain form
25517 34952 -606159 -970945 -832966 1066382 1238324 -780651 -590446 -452522 -1222042
25508 -1222042 -1213113 -13598 -307292 -1514938 -1132717 -374961 740129 880515 592329
25499 592329 -766421 -1606849 -1436559 -93279 -642557 -485213 606213 1661804 1333225
25490 1333225 163834 -435948 -278159 -433952 523187 487091 -192235 69912 16934 1321739
25480 1321739 565670 -168609 -206940 35083 1070179 -78908 -1514699 -376426 -653274
25471 -653274 -714947 844686 1427365 202062 711755 1590228 1562827 900659 3055036
25462 3055036 3207643 1990201 342910 -956808 -1603249 -578161 146707 -256057 108924
25453 108924 1090698 867806 156426 74416 -497290 -990097 326394 475908 1241563 1013392
$$ packed form
25517C4952o41111l64786J37979J899348J71942k018975J90205J37924p69520
25508a222042Q929J199515k93694j207646L82221P57756J115090J40386k88186
25499E92329j358750q40428J70290J343280n49278J57344J091426J055591l28579
25490A333225j169391n99782J57789j55793R57139l6096o79326K62147n2978J304805
25480A321739p56069p34279l8331K42023J035096j149087j435791J138273k76848
25471f53274o1673J559633N82679j225303N09693Q78473k7401o62168K154377
25462C055036J52607j217442j647291j299718o46441J025088P24868m02764L64981
25453A08924R81774k22892p11380q2010n71706m92807J316491J49514P65655k28171
$$ plain form
25443 1013392 1843957 2053690 866282 890277 167562 959948 1572678 681057 -86058
25434 -86058 463056 -441322 396242 528064 1467859 2093064 1225382 776325 -891744 -1569684
25424 -1569684 -1789171 -1425507 -2143039 -190297 564065 351274 146236 -495993 -1031002
25415 -1031002 -104116 1549750 1641514 1600228 478851 -159272 114086 -362127 -2129786
25406 -2129786 -1932142 -58984 -61994 -849396 99099 658926 -31228 627463 1393958 575386
25396 575386 595820 1007385 -4891 -480109 -1852657 -1166042 28206 319118 110522
25387 110522 -461628 -647907 -1212694 -1078946 243573 -639059 -915153 -863179 -1053527 -553055
25377 -553055 -87175 382801 -1179127 -1667040 508040 1247634 1707783 1193584 696097
$$ packed form
25443A013392Q30565K09733j187408K3995p22715P92386O12730q91621p67115
25434h6058N49114r04378Q37564J31822R39795O25205q67682m49057j668069o77940
25424a569684k19487L63664p17532J952742P54362k12791k05038o42229n35009
25415a031002R26886J653866R1764m1286j121377o38123K73358m76213j767659
25406b129786J97644J873158l010p87402R48495N59827o90154O58691P66495q18572
25396E75386K0434M11565j012276m75218j372548O86615J194248K90912k08596
25387A10522n72150j86279n64787J33748J322519q82632k76094N1974j90348N00472
25377e53055M65880M69976j561928m87913K175080P39594M60149n14199m97487
$$ plain form
25368 696097 1886889 1001310 -1192388 -1900513 -664206 57622 -1239182 -664707 627976
25359 627976 1823849 1936309 1006514 -354470 47848 -592852 -116635 -105008 -1079885
25350 -1079885 -373857 1383557 1379180 2034184 1427903 -126480 -311906 -944167 -376899
25341 -376899 -2325917 -1847695 -452555 799019 13213 -391848 132757 -469382 -830296
25332 -830296 -442080 378268 19521 -1649857 -1249483 -464837 -1016250 -613114 -424204
25323 -424204 1233842 1156941 1048622 737116 533137 -63424 998452 372466 -1461201
25314 -1461201 -179724 -244244 -778727 -1193811 -403470 -1004482 147723 331296 -960491
25305 -960491 -651360 -906807 -957604 -307422 1124824 364204 -521090 485361 -1103875
$$ packed form
25368F96097J190792q85579k193698p08125J236307P21828j296804N74475J292683
25359F27976J195873J12460r29795j360984M02318o40700M76217J1627r74877
25350a079885P06028J757414m377O55004o06281j554383j85426o32261N67268
25341c76899j949018M78222J395140J251574p85806m05061N24605o02139l60914
25332h30296L88216Q20348l58747j669378M00374P84646n51413M03136J88910
25323d24204J658046p6901j08319l11506k03979n96561J061876o25986j833667
25314a461201J281477o4520n34483m15084P90341o01012J152205J83573j291787
25305i60491L09131k55447n0797O50182J432246p60620q85294J006451j589236
$$ plain form
25296 -1103875 -794435 -598765 519568 679229 -348616 -1250368 -304720 -652961 -1224488
25287 -1224488 -939237 -128107 -1048987 -942208 -223728 -128650 -43932 -567319 -1051139 -323039
25277 -323039 1501957 1842636 1871006 1548455 428846 -458195 1440655 2386481 -5257
25268 -5257 -1290695 -1102946 -2596650 -1656245 -487491 -871159 -1336365 -1337668 -1645854 262451
25258 262451 1499646 740412 118919 1350787 996690 -786132 -2660946 -2432382 -141360
25249 -141360 639439 1423268 457991 -788106 -736484 -1160043 -1137048 -852890 1224791 907866
25239 907866 83686 -849946 -893662 -398128 -494120 -150740 -633807 -92148 -1443329 -1078450
25229 -1078450 -809836 74695 245296 -932572 -1116668 917379 706471 387496 323757
$$ packed form
25296a103875L09440J95670J118333J59661j027845r01752R45648l48241n71527
25287a224488K85251Q11130r20880J06779P18480R5078Q4718n23387m83820P28100
25277c23039J824996L40679K8370l22551j119609q87041J898850R45826k391738
25268e257j285438J87749j493704R40405J168754l83668m65206j303l08186J908305
25258B62451J237195p59234o21493J231868l54097j782822j874814K28564K291022
25249a41360P80799P83829r65277j246097N1622m23559K2995K84158K077681l16925
25239I07866q24180r33632m3716M95534r5992L43380m83067N41659j351181L64879
25229a078450K68614Q84531J70601j177868j84096K034047k10908l18975o3739
$$ plain form
25220 323757 -281283 -475657 -313272 608324 2332165 2146285 1635861 1151330 -640221
25211 -640221 -1506250 -1237301 -1959574 -1946001 -1011677 -349419 294073 -137696 -1373709 -1803081
25201 -1803081 -2265257 -2354616 -1986677 -1477076 313810 1000514 -44 -763561 -1009273
25192 -1009273 -1301536 -2180240 -2182 1006048 -470670 -1222459 -1478489 -1161829 -645785
25183 -645785 -637914 -565402 -937397 -1563161 -37840 -274263 576902 717376 -732020 70236
25173 70236 60754 -22468 382053 -723705 -233989 -849903 -851163 801877 1328325 -442493
25163 -442493 -1324749 -366698 -859703 -934380 -492876 -683790 -198701 890716 724688 640921
25153 640921 1511266 278411 142173 1582521 1815259 300114 185791 128050 -563934
$$ packed form
25220C23757o05040j94374J62385R21596J723841j85880n10424m84531j791551
25211f40221q66029K68949p22273J3573R34324O62258O43492m31769j236013m29372
25201a803081m62176q9359L67939N09601J790886O86704j000558p63517k45712
25192a009273k92263q78704K178058J008230j476718p51789k56030L16660N16044
25183f45785P871P2512l71995o25764J525321k36423Q51165J40474j449396Q02256
25173G0236r482q3222M04521j105758M89716o15914j260J653040N26448j770818
25163d42493q82256R58051m93005p4677M41504j90914M85089J089417j66028q3767
25153F40921Q70345j232855j36238J440348K32738j515145j14323n7741o91984
$$ plain form
25144 -563934 -832270 -940018 -542747 1251033 819852 -349163 460573 -530992 -1618230
25135 -1618230 460448 1367426 852536 129441 1560372 2253283 2071067 1902 203119
25126 203119 -671211 -438406 -218865 295952 1178604 166594 -11916 214267 1423115
25117 1423115 1007846 -407201 854747 948623 413218 801730 888046 939987 1392754 311068
25107 311068 1394329 -558455 -2528900 -1335247 -1813458 -802060 424190 616989 1249834
25098 1249834 1484404 1015729 1174830 575342 203356 328195 318903 2456 -622475 156133
25088 156133 161578 1209470 1442446 1760045 2514339 912885 799182 39171 282825 679330
25078 679330 -676854 162163 -603464 -908534 -210435 -1320888 -1212664 -314999 -39383
$$ packed form
25144e63934k68336j07748L97271J793780m31181j169015Q09736r91565j087238
25135a618230K078678R06978n14890p23095J430931O92911j82216k069165K01217
25126B03119q74330K32805K19541N14817Q82652j012010j78510K26183J208848
25117A423115m15269j415047J261948R3876n35405L88512Q6316N1941M52767j081686
25107C11068J083261j952784j970445J193653m78211J011398J226250J92799O32845
25098A249834K34570m68675J59101n99488l71986J24839r292l16447o24931P78608
25088A56133N445J047892K32976L17599P54294j601454j13703p60011K43654L96505
25078F79330j356184Q39017p65627l05070O98099j110453J08224Q97665K75616
$$ plain form
25069 -39383 712662 1498423 1406744 268234 152617 7819 -1116433 -329084 -686530 405748
25059 405748 593979 816713 -271936 -170847 -2106325 -2670175 -2214645 -2897711 -1157148
25050 -1157148 46475 139870 -399186 1498920 203041 -417985 -376673 524852 665319
25041 665319 1403573 378085 573420 -549568 -1274390 -1079829 -969415 -1097614 -1570261
25032 -1570261 -1272368 -1819347 -1679396 -1363288 -405936 413311 555409 -1032614 -1331508
25023 -1331508 -1753903 -2089030 -1831371 -1148251 -328617 -1138205 -655732 319275 952689
25014 952689 1136646 667424 929416 -682679 -708268 -630584 129805 -72067 1395352 2302228
25004 2302228 449086 1410131 1986464 2497349 1348022 -451856 -240962 -303294 -250236
$$ packed form
25069c9383P52045P85761r1679j138510j15617j44798j124252P87349l57446J092278
25059D05748J88231K22734j088649J01089j935478n63850M55530o83066J740563
25050a157148J203623R3395n39056J898106j295879o21026M1312R01525J40467
25041F65319P38254j025488J95335j122988p24822J94561J10414j28199m72647
25032a570261K97893n46979J39951L16108R57352Q19247J42098j588023k98894
25023a331508m22395l35127K57659O83120Q19634q09588M82473R75007O33414
25014I52689J83957m69222K61992j612095k5589P7684P60389k01872J467419R06876
25004B302228j853142R61045N76333N10885j149327j799878K10894o2332N3058
$$ plain form
24995 -250236 404340 37755 -1372152 -921600 1273184 1876512 924656 771300 -17351
24986 -17351 -455762 -1211319 -199544 -1250054 -1114007 -123510 373645 1448476 -328965
24977 -328965 -218404 -1097187 -1991204 -845029 803594 1510193 1647954 433687 -1326661
24968 -1326661 -883916 -797374 -1127018 -868191 -198963 -1308178 -955912 -498560 242999
24959 242999 811932 406259 1486849 2083778 1253926 2161807 1908927 1339913 290186
24950 290186 490891 485649 -202262 -333790 -1644619 -833800 -782697 -994995 -1156961 -1839095
24940 -1839095 -1299892 321620 520437 287444 982499 1819809 1435412 1062102 755458
24931 755458 62063 -400841 265459 991507 -119577 85226 -141582 -1545816 -618659
$$ packed form
24995b50236O54576l66585j409907M50552K194784O03328r51856j53356p88651
24986a7351m38411p55557J011775j050510J36047R90497M97155J074831j777441
24977c28965J10561q78783q94017J146175J648623P06599J37761j214267j760348
24968a326661M42745Q6542l29644K58827O69228j109215L52266M57352P41559
24959B42999N68933m05673J080590N96929q29852R07881k52880n69014j049727
24950B90186K00705n242o87911j31528j310829Q10819N1103k12298j61966o82134
24940a839095N39203J621512J98817k32993O95055Q37310l84397l73310l06644
24931G55458o93395m62904O66300P26048j111084K04803k26808j404234R27157
$$ plain form
24922 -618659 1131315 611558 529109 892944 756886 -617171 -1569899 -657448 -426828
24913 -426828 -151506 355276 432359 1542261 1108082 164669 -93853 -323048 -489721 241408
24903 241408 -606393 -909595 -456198 753213 1595323 1335937 286310 -161268 -881895
24894 -881895 -1295482 -570408 1389180 511780 -44102 328406 -629425 -1077859 -720451
24885 -720451 -1485746 -530872 583524 -87044 -631667 -1352863 -406838 -1256635 -736065
24876 -736065 -285472 783934 992526 2170246 1086750 -12814 890759 1570898 513946
24867 513946 610611 1853544 644343 90629 517894 853449 -767695 659162 160011
24858 160011 652226 -274686 -140999 269378 -701827 -1181753 -830539 658045 2215453
$$ packed form
24922f18659J749974n19757q2449L63835j36058j374057r52728R12451K30620
24913d26828K75322N06782P7083J109902m34179r43413k58522k29195j66673P31129
24903B41408q47801l03202M53397J209411Q42110k59386j049627m47578p20627
24894h81895m13587P25074J959588q77400n55882L72508r57831m48434L57408
24885g20451p65295R54874J114396o70568n44623p21196R46025q49797N20570
24876g36065M50593J069406K08592J177720j083496j099564R03573O80139j056952
24867E13946R6665J242933j209201n53714M27265L35555j621144J426857m99151
24858A60011M92215r26912J33687M10377r71205m79926L51214J488584J557408
$$ plain form
24849 2215453 1825170 1003332 243355 1036711 1602138 312576 247922 -459092 -1171551
24840 -1171551 -1496836 -207647 906707 984034 1380811 582905 -149465 768288 1078472
24831 1078472 245119 -134686 732224 -800219 209839 434292 1181785 1994589 1715257
24822 1715257 102243 -1183597 -1124270 -298143 425092 356971 1205390 1605097 608013
24813 608013 542574 981200 1544836 2794042 193698 -1587685 -1151835 -54226 598497
24804 598497 -866990 156503 1447393 1930750 512152 163741 -785878 184857 579796
24795 579796 -587174 -968422 -148135 -132740 357142 630864 245776 619622 1393676 418296
24785 418296 21782 488964 538049 -488580 -1469381 -1865565 -1947376 -1624500 -542228 -765338
$$ packed form
24849B215453l90283q21838p59977P93356N65427j289562o4654p07014p12459
24840a171551l25285J289189J114354P7327L96777p97906p32370R17753L10184
24831A078472q33353l79805Q66910j532443J010058K24453P47493Q12804k79332
24822A715257j613014j285840N9327Q26127P23235o8121Q48419L99707r97084
24813F08013o5439M38626N63636J249206k600344j781383M35850J097609O52723
24804E98497j465487J023493J290890M83357j418598l48411r49619R70735L94939
24795E79796j166970l81248Q20287J5395M89882K73722l85088L73846P74054r75380
24785D18296l96514M67182M9085j026629r80801l96184q1811L22876J082272k23110
$$ plain form
24775 -765338 -722504 292108 -24056 1221845 -27803 -889354 -612696 -1285722 -288647
24766 -288647 787231 947429 541650 811065 1103604 2112707 894485 -482962 -548301
24757 -548301 320557 1688474 1975408 1477127 1788295 2277518 1943907 389197 859331
24748 859331 1201989 58907 199044 -672314 -1729915 -1123412 -1307417 -1665623 -850065
24739 -850065 -1480162 -327216 -901182 -1861317 -1792066 -953074 352562 -133816 193139
24730 193139 -90629 -260315 -503417 369063 728648 -857678 -940883 -1048534 23317
24721 23317 365725 917645 444298 591516 269877 1719771 1592538 589384 150848
24712 150848 56514 615121 -266956 106673 -941358 344858 -319427 -825910 -742288 1419131
$$ packed form
24775g65338M2834J014612l16164J245901j249648q61551K76658o73026R97075
24766b88647J075878J60198m05779K69415K92539J009103j218222j377447o5339
24757e48301Q68858J367917K86934m98281L11168M89223l33611j554710M70134
24748H59331L42658j143082J40137q71358j057601O06503j84005l58206Q15558
24739h50065o30097J152946n73966r60135O9251Q38992J305636m86378L26955
24730A93139k83768j69686k43102Q72480L59585j586326q3205j07651J071851
24721B3317L42408N51920m73347J47218l21639J449894j27233j003154m38536
24712A50848r4334N58607q82077L73629j048031J286216o64285n06483Q3622K161419
$$ plain form
24702 1419131 1352427 2446426 1833739 1101564 479156 1839983 1613280 -475193 -1501420
24693 -1501420 -1435936 1060932 970879 349178 -280843 172997 -510925 -1197074 216462
24684 216462 542324 375161 940211 2134323 1430338 545361 -114829 -856381 513495
24675 513495 771817 1535913 1961462 446876 -52107 363290 -877914 -470195 -261917
24666 -261917 -1834838 -1482189 -363461 949303 591700 654618 759299 781775 1266535
24657 1266535 1701239 1971051 1803981 1496704 1542623 1158571 -458979 -1574418 -2131884
24648 -2131884 -1775433 -672904 -91662 90260 993456 1609513 545431 178800 389870
24639 389870 574664 1345 57764 -424616 448783 1184923 483663 281307 -634644 229625
$$ packed form
24702A419131o6704J093999o12687p32175o22408J360827k26703k088473j026227
24693a501420O5484K496868r0053o21701o30021M53840o83922o86149J413536
24684B16462L25862j67163N65050J194112p03985q84977o60190p41552J369876
24675E13495K58322P64096M25549j514586m98983M15397j241204M07719K08278
24666b61917j572921L52649J118728J312764l57603O2918J04681K2476M84760
24657A266535M34704K69812j67070l07277M5919l84052j617550j115439n57466
24648b131884L56451J102529N81242J81922R03196O16057j064082l66631K11070
24639C89870J84794n73319N6419m82380Q73399P36140p01260k02356r15951Q64269
$$ plain form
24629 229625 -1114293 -1638310 771052 1693823 1445448 2082627 2438606 1951852 1539580
24620 1539580 1585574 1976420 3084857 2427386 1095078 380185 1489602 1069206 747721
24611 747721 696193 401327 -190073 -753748 -364175 -844310 1282487 848817 -515499
24602 -515499 1934822 1856605 -170265 -434745 -817048 -445552 -92872 397314 551306
24593 551306 1573413 1725215 468313 669199 1185416 576272 78749 874726 1610996
24584 1610996 431793 1558701 626228 -250817 489241 1954019 2119265 1212495 2591750
24575 2591750 1038538 269974 706957 711617 263385 1776155 1406855 1986873 490403
24566 490403 -859875 -391482 -242720 258647 789301 220173 918369 141984 1417903
$$ packed form
24629B29625j343918n24017K409362R22771k48375O37179L55979m86754m12272
24620A539580M5994L90846J108437o57471j332308p14893J109417m20396l21485
24611G47721n1528k94866n91400n63675L89573m80135K126797m33670j364316
24602e15499K450321p8217k026870k64480l82303L71496L52680M90186J53992
24593E51306J022107J51802j256902K00886N16217o09144m97523P95977P36270
24584A610996j179203J126908r32473q77045P40058J464778J65246r06770J379255
24575B591750j553212p68564M36983M660m48232J512770l69300N80018j496470
24566D90403j350278M68393J48762N01367N30654n69128O98196p76385J275919
$$ plain form
24557 1417903 629677 1038077 42907 1479375 841259 459830 -1384996 -2063682 -330013
24548 -330013 32813 -455944 98376 -630930 353452 -99701 -348361 -351507 -615378 -946563
24538 -946563 -878714 483757 752466 1366327 1129010 98282 1652719 879621 -98826
24529 -98826 -318754 -182358 -190051 -829071 294203 1307003 2297054 1777779 630150 844874
24519 844874 1685529 1945701 2656191 2377948 1727890 1235859 -13114 -412584 -446908 -798621
24509 -798621 -335987 -957120 -1347673 261927 1315951 1912739 1862903 -329504 -242061
24500 -242061 948158 2172076 1331584 1668831 1616796 1644910 1792017 1236233 -142582
24491 -142582 -1877421 -287447 361506 -262727 -552211 196938 86908 -675083 -736833
$$ packed form
24557A417903p88226M08400r95170J436468o38116l81429j844826o78686J733669
24548c30013L62826m88757N54320p29306R84382m53153k48660l146k63871l31185
24538i46563O7849J362471K68709O13861k37317j030728J554437p73098r78447
24529i8826k19928J36396p693o39020J123274J012800R90051n19275j147629K14724
24519H44874Q40655K60172P10490k78243o50058m92031j248973l99470l4324l51713
24509g98621M62634o21133l90553J609600J054024N96788m9836k192407Q7443
24500b42061J190219J223918q40492L37247n2035K8114J47107n55784j378815
24491a42582j734839J589974O48953o24233k89484P49149j10030p61991o1750
$$ plain form
24482 -736833 -1306693 -595880 677825 531128 -9418 -467858 -818978 85053 452676
24473 452676 42443 313336 726025 1010420 109530 1488832 879177 -1755 -432597
24464 -432597 389482 -627589 30105 1017842 1307951 584277 108073 1252563 1152080
24455 1152080 -545950 -1171743 -245035 -620710 524767 63948 -1079750 -1240285 538896
24446 538896 2028877 2421209 661386 -1094668 -891906 -1332144 192024 -355900 59453
24437 59453 1119129 979462 620975 1212687 1041904 1040671 483484 998570 -471427 -1114952
24427 -1114952 321665 618204 661804 -188690 1044277 1629239 -194951 49375 -171002
24418 -171002 353066 807146 -281334 1340927 2526644 1640906 660223 1365519 1745285
$$ packed form
24482g36833n69860P10813J273705j46697n40546m58440l51120R04031L67623
24473D52676m10233K70893M12689K84395r00890J379302o09655q80932m30842
24464d32597Q22079j017071O57694R87737K90109p23674m76204J144490j00483
24455A152080j698030o25793R26708l75675J145477m60819j143698j60535J779181
24446E38896J489981L92332j759823j756054K02762m40238J524168n47924M15353
24437E9453J059676j39667l58487N91712j70783j233n57187N15086j469997o43525
24427a114952J436617K96539M3600q50494J232967N84962j824190K44326k20377
24418a71002N24068M54080j088480J622261J185717q85738r80683P05296L79766
$$ plain form
24409 1745285 1381095 1581437 337225 -1071300 -1176369 -1010972 -1763886 -1055085 916843
24400 916843 -25110 -174479 314189 -470482 186383 563519 496016 1633479 1152286 1236627
24390 1236627 1901351 1791262 1747316 1704153 2199421 853357 1322743 -48974 126170
24381 126170 1793537 652464 157339 172220 1232711 -127987 -821566 -380261 -167106
24372 -167106 227692 -1251160 -1148207 -844414 601744 928067 1166471 1546946 1118132
24363 1118132 788751 -178622 -128386 893357 1248718 1618747 -96091 -1172605 -1281173
24354 -1281173 -1074483 -1297908 -1011642 -1576918 -1528494 -921646 272702 976949 -217287
24345 -217287 81530 550723 1521286 -59688 -1363335 -1008059 218025 542494 148566
$$ packed form
24409A745285l64190K00342j244212j408525j05069J65397p52914P08801J971928
24400I16843r41953j49369M88668p84671O56865L77136o7503J137463m81193Q4341
24390A236627O64724j10089m3946m3163M95268j346064M69386j371717J75144
24381A26170J667367j141073m95125J4881J060491j360698o93579M41305K13155
24372a67106L94798j478852J02953L03793J446158L26323K38404L80475m28814
24363A118132l29381r67373N0236J021743L55361L70029j714838j076514j08568
24354a281173K06690k23425K86266n65276M8424O06848J194348P04247j194236
24345b17287K98817M69193R70563j580974j303647L55276J226084L24469l93928
$$ plain form
24336 148566 68432 702447 -897379 -1104709 -127402 751387 577776 153269 582834 1832999
24326 1832999 1945911 1244385 1111342 2048570 3461244 3097528 1877692 1402551 567599
24317 567599 728621 2106080 1593751 480162 762684 1795886 2608444 2489391 2477601
24308 2477601 1323562 1603796 1150933 1093983 1314412 303229 -247206 -2122900 -1714029
24299 -1714029 172543 -216932 541641 819276 487629 1147718 1237439 1302734 1390215 1161458
24289 1161458 599628 2416947 3926802 2196244 1388549 1222732 158381 -873161 -946125
24280 -946125 -165254 1136366 686183 -143999 281097 847701 101253 -466368 -401976 515513
24270 515513 983843 896534 860128 1022985 956929 442559 770453 1557033 456621 11965
$$ packed form
24336A48566q0134O34015j599826k07330R77307Q78789j73611m24507M29565J250165
24326A832999J12912p01526j33043R37228J412674l63716j219836m75141q34952
24317E67599J61022J377459n12329j113589K82522J033202Q12558j19053j1790
24308B477601j154039K80234m52863n6950K20429j011183n50435j875694M08871
24299a714029J886572l89475P58573K77635l31647O60089Q9721O5295Q7481k28757
24289A161458n61830J817319J509855j730558q07695j65817j064351j031542p2964
24280i46125P80871J301620m50183q30182M25096N66604p46448n67621O4392R17489
24270E15513M68330q7309l6406J62857o6056n14370L27894P86580j100412m44656
$$ plain form
24260 11965 123438 1343372 2624692 844430 1351087 1940269 1516447 380071 268189
24251 268189 1039288 465283 792599 815304 -958480 -1017903 5707 -1042121 -23613
24242 -23613 831579 95428 -890222 -895533 -583978 431987 924196 305284 531745 900006
24232 900006 1567442 1558448 1981579 26561 -1186845 -1260930 -510279 -1117222 -2065753 -1703885
24222 -1703885 -373590 -857463 805381 988046 211712 -924515 -1830497 -2637332 -889355
24213 -889355 229500 557229 769898 1518760 1868928 1275083 1037980 1170471 1420096
24204 1420096 2003071 1831373 1591533 748317 -1281654 -1153758 -1257903 -2495747 -2170915
24195 -2170915 -1126338 723943 886566 -594733 -697125 -2345498 -1800661 -1701845 -317218
$$ packed form
24260A1965J11473J219934J281320j780262N06657N89182m23822j136376j11882
24251B68189P71099n74005L27316K2705j773784n9423J023610j047828J018508
24242b3613Q55192p36151r85650n311L11555J015965M92209o18912K26461L68261
24232I00006O67436q994M23131j955018j213406p4085P50651o06943r48531L61868
24222a703885J330295m83873J662844J82665p76334j136227r05982q06835J747977
24213h89355J118855L27729K12669P48862L50168n93845k37103J32491K49625
24204A420096N82975j71698k39840q43216k029971J27896j04145j237844L24832
24195b170915J044577J850281J62623j481299j02392j648373N44837R8816J384627
$$ plain form
24186 -317218 -1142416 -1607837 -362622 358799 1756647 1920195 874333 -859394 -1166035
24177 -1166035 1154533 1952314 1962221 1234072 -58206 545841 1084077 1355262 1649495
24168 1649495 534954 46572 399737 833517 950407 1077164 1204944 1870975 594645
24159 594645 -1137423 -614816 -358884 397507 337547 -97150 971324 898640 1364750 1163960
24149 1163960 -479291 1071498 458182 -360149 -741582 -291201 820825 733803 46308
24140 46308 143694 416100 1627138 563971 -1340827 -1337963 -410744 165996 -107559 425207
24130 425207 34986 164532 893732 272017 -220716 -396819 -213647 1061733 1174060
24121 1174060 1119425 1985828 756100 1689571 2772866 1061651 -1220047 -1589359 128573
$$ packed form
24186c17218q25198m65421J245215P21421J397848J63548j045862j733727l06641
24177a166035K320568P97781R907p28149j292278O04047N38236K71185K94233
24168A649495j114541m88382L53165M33780J16890J26757J27780O66031j276330
24159E94645j732068N22607K55932P56391n9960m34697J068474p2684M66110k00790
24149A163960j643251J550789o13316q18331l81433M50381J112026q7022o87495
24140D6308R7386K72406J211038j063167j904798K864R27219N76740k73555N32766
24130D25207l90221J29546P29200o21715m92733j76103J83172J275380J12327
24121A174060n4635Q66403j229728R33471J083295j711215k281698l69312J717932
$$ plain form
24112 128573 -461763 -1390619 -1103143 -495121 278890 43248 -424592 1381641 1127736
24103 1127736 -395403 -1961048 -847033 1155410 1012509 39609 -646168 30756 470608
$$ packed form
24112A28573n90336r28856K87476O08022P74011k35642m67840J806233k53905
24103A127736j523139j565645J114015K002443j42901r72900o85777O76924M39852
$$ [...]
##END NTUPLES=NMR SPECTRUM
##END=
