##TITLE=19F_CA-8586
 DMSO. 24 sc
 30.4.2019
##JCAMPDX= 6.0         $$ Bruker NMR JCAMP-DX V2.0
##DATA TYPE= NMR SPECTRUM
##DATA CLASS= NTUPLES
##ORIGIN= UXNMR, Bruker Analytische Messtechnik GmbH
##OWNER= root
$$ XWIN-NMR		Version 3.5
$$ Tue Apr 30 14:28:31 2019 Russian Standard Time (UT+4h)  she@DPX200
##.OBSERVE FREQUENCY= 188.290927
##.OBSERVE NUCLEUS= ^19F
##.ACQUISITION MODE= SIMULTANEOUS
##.ACQUISITION SCHEME= undefined
##.AVERAGES= 24
##.DIGITISER RES= 16
##SPECTROMETER/DATA SYSTEM= spect
##.PULSE SEQUENCE= zg
##.SOLVENT NAME= DMSO
##.SHIFT REFERENCE= (INTERNAL, DMSO, 0, 101.251)
##AUDIT TRAIL= $$ (NUMBER, WHEN, WHO, WHERE, WHAT)
$$ ##TITLE= Audit trail, XWIN-NMR		Version 3.5
$$ ##JCAMPDX= 5.01
$$ ##ORIGIN= Bruker BioSpin GmbH
$$ ##OWNER= she
$$ F:/spectra/data/she/nmr/f19/1/pdata/1/auditp.txt
$$ ##AUDIT TRAIL=  $$ (NUMBER, WHEN, WHO, WHERE, WHAT)
(   1,<2019-04-30 14:27:38.67 +0400>,<she>,<DPX200>,
      <created by zg, POWCHK disabled, PULCHK disabled
       configuration hash MD5:
       00 E9 B6 7A A2 85 ED C7 34 08 36 98 17 FE 4E 26
       data hash MD5: 64K
       51 10 A4 42 9A 4A AF DC C1 0D 92 0D 8F 49 C3 FD>)
(   2,<2019-04-30 14:27:44.40 +0400>,<she>,<DPX200>,
      <Start of raw data processing
       efp BC_mod = 2 LB = 1 FT_mod = 6 PKNL = 1 PHC0 = 932.1469 PHC1 = 622.1557 SI = 64K 
       data hash MD5: 64K
       55 68 E9 18 04 B9 33 BE 7C 65 83 0F 3B 87 08 29>)
(   3,<2019-04-30 14:27:57.21 +0400>,<she>,<DPX200>,
      <pk PHC0 = -27.25017 PHC1 = 0 
       data hash MD5: 64K
       A6 52 C3 0B AF E1 0E 3D 01 12 15 67 0F 9E CD 5D>)
(   4,<2019-04-30 14:28:09.07 +0400>,<she>,<DPX200>,
      <abs ABSG = 5 
       data hash MD5: 64K
       B4 BD F9 46 ED 99 F6 58 98 E3 90 06 E0 8C B3 DE>)
$$ ##END=
$$ 
$$ hash MD5
$$ 2D 27 ED 39 14 57 FB 94 68 61 8D DE D4 56 86 28
##$RELAX= 
##$RELAX= 
##$RELAX= 
##$RELAX= 
##$RELAX= 
##$RELAX= 
##$RELAX= 
##$RELAX= 
$$ Bruker specific parameters
$$ --------------------------
##$DU= <F:/spectra>
##$EXPNO= 1
##$NAME= <f19>
##$PROCNO= 1
##$TYPE= <nmr>
##$USER= <she>
##$AMP= (0..31)
100 100 100 100 100 100 100 100 100 100 100 100 100 100 100 100 100 100 
100 100 100 100 100 100 100 100 100 100 100 100 100 100 
##$AQSEQ= 0
##$AQ_mod= 1
##$AUNM= <au_zg>
##$AUTOPOS= <>
##$BF1= 188.310428
##$BF2= 200.13
##$BF3= 200.13
##$BF4= 200.13
##$BF5= 200.13
##$BF6= 200.13
##$BF7= 200.13
##$BF8= 200.13
##$BYTORDA= 1
##$CFDGTYP= 0
##$CFRGTYP= 5
##$CHEMSTR= <none>
##$CNST= (0..31)
1 1 145 1 1 1 1 1 1 1 1 1 1 1 1 1 1 1 1 1 1 1 1 1 1 1 1 1 1 1 1 1 
##$CPDPRG= <>
##$CPDPRG1= <>
##$CPDPRG2= <>
##$CPDPRG3= <>
##$CPDPRG4= <mlev>
##$CPDPRG5= <mlev>
##$CPDPRG6= <mlev>
##$CPDPRG7= <mlev>
##$CPDPRG8= <mlev>
##$CPDPRGB= <>
##$CPDPRGT= <>
##$D= (0..31)
0 1.3 0 0 0 0 0 0 0 0 0 0 0.25 0 0 0 0 0 0 0 0 0 0 0 0 0 0 0 0 0 0 0 
##$DATE= 1556620057
##$DBL= (0..7)
120 120 120 11 120 120 24 19 
##$DBP= (0..7)
150 150 150 150 150 150 150 150 
##$DBP07= 0
##$DBPNAM0= <>
##$DBPNAM1= <>
##$DBPNAM2= <>
##$DBPNAM3= <>
##$DBPNAM4= <>
$$ [...]
##$SUBNAM3= <"">
##$SUBNAM4= <"">
##$SUBNAM5= <"">
##$SUBNAM6= <"">
##$SUBNAM7= <"">
##$SUBNAM8= <"">
##$SUBNAM9= <"">
##$SW= 251.107818259711
##$SWIBOX= (0..15)
0 1 0 0 0 0 0 0 0 0 0 0 0 0 0 0 
##$SW_h= 47281.3238770686
##$TD= 65536
##$TD0= 1
##$TE= 0
##$TE2= 300
##$TE3= 300
##$TEG= 300
##$TL= (0..7)
0 120 53 12 22 120 120 120 
##$TP= (0..7)
150 150 150 150 150 150 150 150 
##$TP07= 0
##$TPNAME0= <>
##$TPNAME1= <>
##$TPNAME2= <>
##$TPNAME3= <>
##$TPNAME4= <>
##$TPNAME5= <>
##$TPNAME6= <>
##$TPNAME7= <>
##$TPOAL= (0..7)
0.5 0.5 0.5 0.5 0.5 0.5 0.5 0.5 
##$TPOFFS= (0..7)
0 0 0 0 0 0 0 0 
##$TUNHIN= 0
##$TUNHOUT= 0
##$TUNXOUT= 0
##$USERA1= <user>
##$USERA2= <user>
##$USERA3= <user>
##$USERA4= <user>
##$USERA5= <user>
##$V9= 5
##$VALIST= <valist>
##$VCLIST= <CCCCCCCCCCCCCCC>
##$VD= 0
##$VDLIST= <DDDDDDDDDDDDDDD>
##$VPLIST= <PPPPPPPPPPPPPPP>
##$VTLIST= <TTTTTTTTTTTTTTT>
##$WBST= 1024
##$WBSW= 4
##$XGAIN= (0..3)
0 0 0 0 
##$XL= 0
##$YL= 0
##$YMAX_a= 44552
##$YMIN_a= -33794
##$ZGOPTNS= <>
##$ZL1= 120
##$ZL2= 120
##$ZL3= 120
##$ZL4= 120
##$ABSF1= 101.2514
##$ABSF2= -149.8503
##$ABSG= 5
##$ABSL= 3
##$ALPHA= 0
##$AQORDER= 0
##$ASSFAC= 0
##$ASSFACI= 0
##$ASSFACX= 0
##$ASSWID= 0
##$AUNMP= <proc_1d>
##$AZFE= 0.1
##$AZFW= 5
##$BCFW= 0
##$BC_mod= 2
##$BYTORDP= 0
##$COROFFS= 0
##$CY= -3
##$DATMOD= 1
##$DC= 0
##$DFILT= <>
##$DTYPP= 0
##$F1P= 0
##$F2P= 0
##$FCOR= 0.5
##$FTSIZE= 65536
##$FT_mod= 6
##$GAMMA= 0
##$GB= 0
##$INTBC= 1
##$INTSCL= 8.653935e-10
##$ISEN= 128
##$LB= 1
##$LEV0= 0
##$LPBIN= 0
##$MAXI= 10000
##$MC2= 0
##$MEAN= 0
##$ME_mod= 0
##$MI= 0.4277144
##$NCOEF= 0
##$NC_proc= -2
##$NLEV= 6
##$NOISF1= -61.99997
##$NOISF2= -62.99997
##$NSP= 0
##$NTH_PI= 0
##$NZP= 0
##$OFFSET= 101.2514
##$PC= 1
##$PHC0= 904.8967
##$PHC1= 622.1557
##$PH_mod= 1
##$PKNL= yes
##$PPARMOD= 0
##$PSCAL= 0
##$PSIGN= 0
##$REVERSE= no
##$SF= 188.29550247311
##$SI= 65536
##$SIGF1= -61
##$SIGF2= -65
##$SINO= 3.502647
##$SIOLD= 65536
##$SREGLST= <1H.CDCl3>
##$SSB= 0
##$STSI= 65536
##$STSR= 0
##$SW_p= 47281.3238770685
##$SYMM= 0
##$S_DEV= 0
##$TDeff= 65536
##$TDoff= 0
##$TI= <>
##$TILT= no
##$TM1= 0
##$TM2= 0
##$TOPLEV= 0
##$USERP1= <user>
##$USERP2= <user>
##$USERP3= <user>
##$USERP4= <user>
##$USERP5= <user>
##$WDW= 1
##$XDIM= 65536
##$YMAX_p= 514087406
##$YMIN_p= -839771
$$ End of Bruker specific parameters
$$ ---------------------------------
##NTUPLES= NMR SPECTRUM
##VAR_NAME=  FREQUENCY,     SPECTRUM/REAL,   SPECTRUM/IMAG
##SYMBOL=    X,             R,               I
##VAR_TYPE=  INDEPENDENT,   DEPENDENT,       DEPENDENT
##VAR_FORM=  AFFN,          ASDF,            ASDF
##VAR_DIM=   65536,         65536,           65536
##UNITS=     HZ,            ARBITRARY UNITS, ARBITRARY UNITS
##FACTOR=    0.721466756344984, 1,           1
##FIRST=     19065.1839562469, 0,            0
##LAST=      -28216.1399208216, 0,           0
##MIN=       -28216.1399208216, -839771,     0
##MAX=       19065.1839562469, 514087406,    0
$$ Real data points
##PAGE= N=1
##DATA TABLE= (X++(R..R)), XYDATA
$$ [...]
48209F3546Q2949o0294r6046p272j13065J3436J85663K4549j60N5894j1481j24280
$$ 63546 146495 86201 -9845 -17117 -130182 -116746 68917 93466 93306 149200 137719 13439
48197A3439P555L3071K9908J9209k3919l3860K7455m7806L4869R596n1271q1044
$$ 13439 20994 54065 83973 103182 79263 45403 72858 25052 59921 69517 18246 -62798
48185f2798o9554j3710J21290L1444J20585m850j21998N6844j104j12929k7603
$$ -62798 -132352 -146062 -24772 6672 127257 122407 409 57253 56149 -56780 -84383
48174h4383m060j787R8436l7372j3374n2983J1692O0119J1701q5303k9948l1989
$$ -84383 -88443 -90230 8206 -29166 -42540 -95523 -83831 -23712 -12011 -97314 -127262 -159251
48162a59251J20439Q4538r2881K8816J4863j3735K8514r5751k9019O4419N4195
$$ -159251 -38812 45726 -47155 -18339 -3476 -17211 11303 -84448 -113467 -49048 5147
48151E147j6389j3141m8415J8616P9002k0073k0505L9520m2179n7002R9038N1014
$$ 5147 -11242 -24383 -72798 -54182 24820 4747 -15758 23762 -18417 -75419 23619 74633
48139G4633q3467j30239L5979J37775k2205l8659l973q2698l0428J34032O3177
$$ 74633 -8834 -139073 -103094 34681 12476 -26183 -30156 -112854 -143282 -9250 53927
48128E3927M2518j7616o3889O7020j26776m2039P1675m7346m8477R0835Q104N2149
$$ 53927 96445 78829 14940 81960 -44816 -86855 -15180 -62526 -111003 -20168 -12064 40085
48116D0085k5453N5586K4336q5815J3291n1739o026k9965r7710M2011J68145o7173
$$ 40085 14632 70218 94554 8739 22030 -29709 -35735 -65700 -163410 -121399 46746 -20427
48104b0427l0986J01045m5665m5826o5534J4353L4850M0383R7324m7367r98J9252
$$ -20427 -51413 49632 3967 -41859 -107393 -93040 -58190 -17807 79517 32150 31152 50404
48092E0404n8533J599J04594J1496q1891m5768p3617l0272L0085L7624Q014r615
$$ 50404 -8129 -6530 98064 109560 27669 -18099 -91716 -121988 -91903 -54279 -46265 -55880
48080e5880P4946J28826N793j36170q2288j3389q2586m687O2140K0368J2574J31453
$$ -55880 19066 147892 153685 17515 -64773 -78162 -160748 -165435 -103295 -82927 -70353 61100
48068F1100j2867n2711n4572q0071J6474J0038Q8695j3749j3566N9602j4780K0213
$$ 61100 48233 -4478 -59050 -139121 -122647 -112609 -23914 -37663 -51229 8373 -6407 13806
48056A3806k8411P047j5263j2169m0994O492M782l6440O4008M687n8651O0096
$$ 13806 -14605 -7558 -22821 -34990 -75984 -69492 -64710 -101150 -37142 -32455 -91106 -31010
48044c1010J46760l0525r4491p209K2054m6386R7922N5241o9400o6668L8344M5891
$$ -31010 115750 85225 -9266 -16475 5579 -40807 57115 112356 42956 -23712 14632 60523
48032F0523K1266o192j04403o3067n625j3596P435J08488J38946j3801k5990l2498
$$ 60523 81789 75597 -28806 -91873 -97498 -111094 -103659 4829 143775 129974 103984 71486
48020G1486k1566O929O2457m4534n3567J0701r0442M5575N1341q7775p6m3830
$$ 71486 49920 56849 119306 74772 21205 31906 -58536 -12961 38380 -49395 -49471 -93301
48008i3301M0773k4811r725J8625j7893P3859j2659R8786m0663J7809L9043o712
$$ -93301 -52528 -77339 -87064 -68439 -86332 -12473 -25132 73654 32991 50800 89843 83131
47996H3131r0693R704P2887K0403l0255p253r2833j7691Q3507n912n5591p0538
$$ 83131 -7562 2142 75029 95432 65177 57924 -34909 -52600 30907 24995 -30596 -101134
47984a01134N2048M2051j1856M1868l0662Q393O0750P307m0194n3736J07203J8088
$$ -101134 -49086 -7035 -18891 22977 -7685 708 61458 68765 28571 -25165 82038 100126
47972A00126n8328K3379J0834n1442l6523K985l4912Q5154l7269p7378K5903l5547
$$ 100126 41798 65177 76011 24569 -11954 -8969 -43881 41273 4004 -73374 -47471 -83018
47960h3018R2549R3851L2827r9435k8033o3322M4567p0384L4526O9743K1705O5242
$$ -83018 9531 103382 136209 36774 8741 -54581 -10014 -80398 -45872 23871 45576 110818
47948A10818m7530j08030m6613J49061K3470J2713K6626M9816o3282j3246l3841
$$ 110818 63288 -44742 -91355 57706 81176 93889 120515 170331 107049 93803 59962
47937E9962l7322m1246p501n7848o9377J5851P8444j6638M7147N5028k3510L378
$$ 59962 22640 -18606 -26107 -83955 -153332 -137481 -59037 -75675 -28528 26500 2990 6368
47925F368j339j014K1056K1804O791M2101o1361l8854j6526N0596J984K0396q3733
$$ 6368 5029 4015 25071 46875 53666 95767 34406 -4448 -20974 29622 31606 52002 -31731
47912c1731n9594N7654L1170J7289O8774m6074J9181n387n7100q610j9692m277
$$ -31731 -91325 -33671 -2501 14788 83562 37488 56669 51282 -5818 -14428 -34120 -38397
47900c8397l7155k8045J4712Q0344j6798O3753q16j928K7053J053K1735J3962
$$ -38397 -75552 -103597 -88885 -8541 -25339 38414 37598 35670 62723 63776 85511 99473
47888I9473l5405j03777j1068l0993K8915j3022J00398j2000j4059k3609q4456
$$ 99473 64068 -39709 -50777 -81770 -52855 -65877 34521 22521 8462 -15147 -99603
47877i9603l1637N1771K8620P3113l691l6955Q2617J3331m9897l9225j22239k2548
$$ -99603 -131240 -79469 -50849 22264 18573 -18382 64235 77566 27669 -11556 -133795 -156343
47865a56343Q6830J9568J0389J06578n8446J366j8499j8859p566N8438j4788M829
$$ -156343 -69513 -49945 -39556 67022 8576 9942 -8557 -27416 -34982 23456 8668 13497
47853A3497r236j0307j30002m2722K5202Q4689J14101j07725j18282K0083J16295
$$ 13497 4261 -6046 -136048 -178770 -153568 -68879 45222 -62503 -180785 -160702 -44407
47842d4407J16205j0112K8282M2135l7430l8398N1395k527m8060m710P590l489
$$ -44407 71798 61686 89968 132103 94673 56275 107670 105143 57083 52373 59963 56474
47830E6474q9322m267M9959p3581l4060N515j790J27067K0434l9411L1157k9611
$$ 56474 -32848 -37115 12844 -60737 -94797 -89282 -91072 35995 56429 17018 48175 18564
47818A8564M05j7443K143l0784k7687P3243l3706o360r39L248k3401l661j7856
$$ 18564 18969 1526 3669 -27115 -54802 18441 -15265 -21625 -22564 -19316 -42717 -46378 -64234
47805f4234j6745k6949O5114K7312L9514L7682m836N6179p1358k9680k6127m4064
$$ -64234 -80979 -107928 -42814 -15502 24012 61694 56858 113037 41679 11999 -14128 -58192
47793e8192N6230j894l7902m8667R1497J9608m9617K3229M8309j9005l8252r0809
$$ -58192 -1962 -3856 -41758 -90425 1072 20680 -28937 -5708 42601 23596 -14656 -105465
47781a05465M6086l5746P0910J4530J1021J8428k0926J569O1130l4843J1306l1398
$$ -105465 -59379 -95125 -24215 -9685 1336 19764 -1162 407 61537 26694 38000 6602
47769F602r845J492J7405l4540j3340O9907k06n6167K9513j0591N897K8289N4
$$ 6602 -3243 -1751 15654 -18886 -32226 37681 37475 -18692 10821 230 6127 34416 34470
47756C4470J6624Q91k4076n4833K1354l4238p601K5194J10651o3179j98719K8667
$$ 34470 51094 51985 27909 -26924 -5570 -39808 -47409 -22215 88436 25257 -173462 -144795
47744a44795N1995L1599L0270k0823K0454O6763o3823r351L3255P0814M0593m9432
$$ -144795 -92800 -61201 -30931 -51754 -31300 35463 -28360 -37711 -4456 66358 106951 57519
47732E7519N233O2826m3691K4716q729j57662j0888O4279K6833l7508Q9545J1029
$$ 57519 62752 125578 81887 106603 97874 -59788 -70676 -6397 20436 -17072 72473 83502
47720H3502M272o7251K7616q3673o4438N8161L3491L9139J0471J0373j14681N1555
$$ 83502 87774 20523 48139 -35534 -99972 -41811 -8320 30819 41290 51663 -63018 -11463
47708a1463O1003r6109n5395k9760K2095P7646j8539j05604j7787M0794O8943
$$ -11463 49540 -46569 -101964 -131724 -109629 -31983 -50522 -156126 -173913 -133119 -64176
47697f4176O696l7906k3455K3270P7525j9325m5527n2239L2391J06282J2946l0899
$$ -64176 -57480 -95386 -118841 -95571 -18046 -37371 -82898 -135137 -102746 3536 16482 -14417
47685a4417k8986N9156j30620L2860J9301l6336R9690K9453K1073M6970K0533
$$ -14417 -43403 15753 -114867 -82007 -62706 -99042 648 30101 51174 98144 118677
47674A18677k826j00150L137K2417r0591Q4364L6522N8075q235o1387k2681o0956
$$ 118677 115851 15701 18838 41255 -49336 35028 71550 129625 121390 60003 37322 -23634
47662b3634p9514L805N6263N1684o2297R498M6357l5423M5013n8674M271R8118
$$ -23634 -103148 -99343 -43080 8604 -53693 -44195 2162 -33261 11752 -46922 -42651 55467
47650E5467j9160N802Q933l0043o996L8049J14163k0459j9449l2054l4290m0668
$$ 55467 36307 42109 51042 20999 14003 52052 166215 145756 126307 94253 59963 19295
47638A9295n690M4130L5478k4435K9143P985q5084q989p1301K7111m161J0234
$$ 19295 13605 57735 93213 68778 97921 105906 20822 11833 -59468 -32357 -36518 -26284
47626b6284m5125J9908J4336J17059l901m3661p8947J2388O8852O535n6167L2643
$$ -26284 -71409 -51501 -37165 79894 75993 32332 -46615 -34227 34625 41160 -15007 17636
47614A7636P9161l3159j02324n0911L8707P5067l1235j19072L9758O0070p3086
$$ 17636 96797 63638 -38686 -89597 -50890 24177 -7058 -126130 -86372 -26302 -99388
47603i9388J15743O1699o9829o1646o1436N0396P3329p2448O9707k9942p1479
$$ -99388 16355 78054 8225 -53421 -114857 -64461 8868 -63580 6127 -23815 -95294
47592i5294M4827P4062m0229l2565O4322k4714n1646M0604J1058k6647L7797Q1864
$$ -95294 -50467 23595 -16634 -49199 15123 -9591 -61237 -20633 -9575 -36222 1575 83439
47580H3439l6683O1539j4034n5789l3446K3002L002m4702k0691k3233p9965M3102
$$ 83439 46756 108295 94261 38472 5026 28028 31030 -13672 -34363 -57596 -137561 -94459
47568i4459n7486l0045N0170J56596K2748j1893k2671r3314l782k3676K0335J35225
$$ -94459 -151945 -181990 -131820 24776 47524 35631 12960 -80354 -84136 -107812 -87477 47748
47556D7748O5832r6898p8797j04455J10844J27195l6225j9587k1648J07461k6506
$$ 47748 113580 16682 -62115 -166570 -55726 71469 35244 15657 -5991 101470 74964
47545G4964n8625p744l8862L190N4529q414q454M78P432J7693M5012j35056k3357
$$ 74964 16339 8595 -30267 -27077 27452 19038 10584 11062 18494 36187 81199 -53857 -77214
47532g7214K16Q8822p0896o9992l8031Q2969J93186n2016k5452P7946N9072j00618
$$ -77214 -76998 11824 -59072 -129064 -167095 -84126 109060 57044 31592 109538 168610 67992
47520F7992K3813R894R683n0460Q002O1631q5629j6789P291J0857J9366p4374
$$ 67992 91805 101699 111382 60922 68924 130555 44926 28137 35428 46285 65651 -8723
47508h723K7526L579M8316r8469q24L2464j3844l7509m6270O5152M0553K5706
$$ -8723 18803 22382 70698 -27771 -28595 3869 -9975 -47484 -93754 -28602 11951 37657
47496C7657l9328m5950J3891P7500k7663j2484K2177l3502l350p832J6704m1624
$$ 37657 -1671 -47621 -33730 43770 16107 3623 25800 -7702 -11052 -18884 -2180 -43804
47484d3804o8203m4993K6276J09412O0500p188l5763N0491J34209l0487j30097
$$ -43804 -112007 -157000 -130724 -21312 39188 32000 -3763 46728 180937 150450 20353
47473B0353k9977k7101P2775k7989J2030Q612p6535j4716q8195R7846L0390q9805
$$ 20353 -9624 -36725 36050 8061 20091 28703 -47832 -62548 -150743 -52897 -22507 -112312
47461a12312n0907J1196R6072J15864j6131q5729N5619M4472p6578r383J1603
$$ -112312 -163219 -152023 -55951 59913 43782 -41947 13672 58144 -18434 -27817 -16214
47450a6214P5964k6615M0489Q844j04712r5894N7688R9895J6739J4767j7434o1318
$$ -16214 59750 33135 73624 82468 -22244 -118138 -60450 39445 56184 70951 53517 -7801
47438g801m040O0419p6074L0464k7020L4106k121J3228q819o4241m14J18497r285
$$ -7801 -11841 48578 -27496 2968 -24052 10054 7933 21161 12342 -51899 -52313 66184 56899
47425E6899r3845n5428j0694M9205j2674Q321k6430m189M5741j9840k9769L3996
$$ 56899 -36946 -92374 -103068 -53863 -66537 -58216 -84646 -88835 -43094 -62934 -92703 -58707
47413e8707n418P738R6269o0759n5898q63l170K8053L9923O5699m6309j35177
$$ -58707 -64125 -56387 39882 -20877 -76775 -77638 -80808 -52755 -12832 52867 6558 -128619
47401a28619J5770L3720M7537l802j6151o2352j2351O1617M0506K5702q412L4541
$$ -128619 -112849 -79129 -31592 -35394 -51545 -113897 -126248 -64631 -24125 1577 -6835 27706
47389B7706Q285k0341K2907N9493l5152j0019l7828R782j04826L0602J845J6741
$$ 27706 35991 15650 38557 98050 62898 52879 15051 24833 -79993 -49391 -47546 -30805
47377c0805P4734L2106m1270j9195r7813J4700J11272j05698n079l3142j5404
$$ -30805 43929 76035 34765 15570 -82243 -67543 43729 -61969 -67048 -100190 -115594
47366a15594O7191l7182M3550j5825k6620K6684R7406k5921l9605m2896K1712
$$ -115594 -48403 -85585 -42035 -57860 -84480 -57796 39610 13689 -25916 -68812 -47100
47355d7100k2872o140L2813k191L849o281K6187m1300j3935Q3430M8949M6249
$$ -47100 -69972 -76112 -43299 -45490 -41641 -47922 -21735 -63035 -76970 6460 55409 101658
47343A01658r841q5379J5617j7633q7657q685M6716N2648k1367O5571k3640p4767
$$ 101658 91817 6438 22055 4422 -83235 -91920 -45204 7444 -13923 51648 28008 -46759
47331d6759M1943L9370j04385p3279o024J14246J5015O1663l827j456l2551l576
$$ -46759 -4816 34554 -69831 -143110 -149134 -34888 -19873 41790 37963 36507 3956 380
47319C80N6278r0193k7898Q7748M3096k1983o3640K1920R422O761J449K1615Q797
$$ 380 56658 -33535 -61433 26315 69411 47428 -16212 5708 15130 21891 23340 44955 53752
47306E3752j3657j5098J15863r6698j3478M0466j7035j6659k0403k1392j4502
$$ 53752 40095 24997 140860 44162 30684 71150 54115 37456 17053 -4339 -18841
47295a8841P4617n5991m534j2079o7358m5574J15574R180P6556K8206j01578l8360
$$ -18841 55776 -215 -4749 -16828 -84186 -129760 -14186 -5006 71550 99756 -1822 -40182
47283d0182L8223m1432q8399O6329j2474K0663K3182J1185n4447M5269l9598o2018
$$ -40182 -1959 -43391 -131790 -65461 -77935 -57272 -34090 -22905 -77352 -32083 -71681 -133699
47271a33699O1551Q6058N3592O3383q6285l5607o9191p5643R9621P325o923k4438
$$ -133699 -72148 13910 67502 130885 44600 8993 -60198 -135841 -36220 -28895 -35818 -60256
47259f0256Q0911N5196o5531j02562q7973J35686J36435j843n3883o5799L1730
$$ -60256 20655 75851 10320 -92242 -180215 -44529 91906 90063 36180 -29619 2111
47248B111P1927j3451O5673o6896o1623J10369n6149N0447r1335J46809O520k8070
$$ 2111 74038 60587 126260 59364 -2259 108110 51961 102408 11073 157882 164402 136332
47236A36332j77814m3656N1898O5246k5054o8700n48O0342j6025M9726j7443q5305
$$ 136332 -41482 -85138 -33240 32006 6952 -61748 -62296 -1954 -17979 31747 14304 -71001
47224g1001j9121J4449m593L7439K1982M4517P6490m2356J591l4112j8738K6365
$$ -71001 -90122 -75673 -80266 -42827 -20845 23672 100162 57806 59397 25285 6547 32912
47212C2912q7249l4445M9274N4573M2512o8244m3885P4924O430j5966l7250M0638
$$ 32912 -54337 -88782 -39508 15065 57577 -10667 -54552 20372 26802 10836 -26414 14224
47200A4224J9581j9549n6282m5182M4875j9058P9067L2720P7985r1922j10356
$$ 14224 33805 14256 -42026 -87208 -42333 -61391 17676 50396 128381 36459 -73897
47189g3897l8054L1812N8156n4921J06993l6728n456O8548O9280J7427k3785j5943
$$ -73897 -111951 -80139 -21983 -76904 30089 -6639 -12095 56453 125733 143160 119375 103432
47177A03432k8442n7177J7316j913q2392K0079m2767m5294L1590K7321J4973l389
$$ 103432 74990 17813 35129 33216 -49176 -29097 -71864 -117158 -85568 -58247 -43274 -46663
47165d6663p1958O2001n1585j07829J12212Q2763j073N9206K3413m6227K7468
$$ -46663 -118621 -56620 -108205 -216034 -103822 -21059 -22132 37074 60487 14260 41728
47154D1728l3174j07971N4147N8340J828Q1466k3113r5280r8584K8643J01399
$$ 41728 8554 -99417 -45270 13070 14898 96364 73251 -22029 -120613 -91970 9429
47143I429n1007R805k0678p0748j40760J66758M9840K2869M4020L3026J44155
$$ 9429 -41578 -31773 -52451 -123199 -263959 -97201 -47361 -24492 19528 52554 196709
47132A96709J9698p5289j32721n0721J9235p972r5388N0581J35656M5818p7840
$$ 196709 216407 141118 8397 -42324 -23089 -31061 -126449 -75868 59788 105606 27766
47121B7766k2435p3926O2843p9075m01J31736L6415o7894k9107Q256p9249O3065
$$ 27766 5331 -68595 -5752 -84827 -85228 46508 82923 15029 -14078 -5822 -85071 -22006
47109b2006J14763J1106K364m6409J0235K0331J4569p0010J8340q37L0285K4367
$$ -22006 92757 103863 106227 59818 70053 90384 104953 34943 53283 52446 82731 107098
47097A07098r9901M2183K6121r240n2881q3139J29784m3723m7661J49889K5638
$$ 107098 7197 49380 75501 66261 13380 -69759 60025 16302 -31359 118530 144168
47086A44168j20094m9779O587o9219J23568m795l2794q1388Q0591N5854j00432
$$ 144168 24074 -25705 -19118 -88337 35231 30436 -2358 -83746 -3155 52699 -47733
47075d7733P761l6554J25075n8364j19627J5700J566m5291M161J10714M0366R5453
$$ -47733 -39972 -76526 48549 -9815 -129442 -113742 -112176 -157467 -153306 -42592 -2226 93227
47063I3227K3849k4716j8203l20j4623m5231p687l3539n8938k2321J02669M8883
$$ 93227 117076 92360 74157 73837 59214 13983 6296 -27243 -86181 -108502 -5833 43050
47051D3050p3498L1810k8253K0642P3080l9459m0710K7063j9017k5804o462r1901
$$ 43050 -30448 1362 -26891 -6249 66831 27372 -13338 13725 -5292 -31096 -37558 -129459
47039a29459O8184M6966n0795j0457K8550M5766O465j1391j07465J0374j185J3119
$$ -129459 -61275 -14309 -65104 -75561 -47011 -1245 5220 -6171 -113636 -103262 -104447 -91328
47027i1328M2762J23727K87o3744L3121k3654j28794L1393Q0067k2182j0229n6836
$$ -91328 -48566 75161 75448 11704 44825 21171 -107623 -76230 3837 -18345 -28574 -85410
47015h5410N3745L5922o7606j11063P4762l9681k0827J21205K2874j2067Q8110
$$ -85410 -31665 4257 -63349 -174412 -99650 -139331 -160158 -38953 -16079 -28146 59964
47004E9964j05495r8720M3515P4258k6078o4067L1141J7575L454J12121l515q6315
$$ 59964 -45531 -144251 -100736 -26478 -52556 -116623 -85482 -67907 -64453 47668 44153 -42162
46992d2162L6014n0379J7310K1001k4362M2185j0994J891R9586l072j6645j9731
$$ -42162 -6148 -56527 -39217 -18216 -42578 -393 -11387 -9496 90090 87018 70373 50642
46980E0642j3034j1870r2494q2654J45006j7681j2815K0201K3950j0978r3019
$$ 50642 37608 25738 -66756 -149410 -4404 -22085 -34900 -14699 9251 -1727 -94746
46969i4746J9084n4789o9786L8407M1838P2699n0341l1907Q94j2946L929o5324
$$ -94746 -75662 -130451 -200237 -161830 -119992 -47293 -97634 -129541 -128647 -141593 -137664 -202988
46957b02988J53801j2159m1429m2400J7287M0918k9820N2207J08985N4915J9766
$$ -202988 -49187 -61346 -102775 -145175 -127888 -86970 -116790 -64583 44402 99317 119083
46946A19083k9906l3052o1891n2699n1768L3193L5524K5803O152o7420p0472K5195
$$ 119083 89177 56125 -5766 -58465 -110233 -77040 -41516 -15713 -9561 -76981 -147453 -122258
46934a22258L5542N7825l4366m843k9633j6308M8219P8601N561n4614M2749l6523
$$ -122258 -86716 -28891 -63257 -68100 -97733 -114041 -65822 12779 18340 -36274 6475 -30048
46922c0048o9157K0214J86832l7957j08085l6655q81k5999l997Q9960J0842L4102
$$ -30048 -99205 -78991 107841 69884 -38201 -74856 -75737 -101736 -105733 -15773 -4931 29171
46910B9171n2946M2411q2860l8259L621J3546l4535J03981L1237j3293O4816n2577
$$ 29171 -23775 18636 -64224 -102483 -98862 -85316 -119851 -15870 15367 2074 66890 14313
46898A4313r2790l9848M0559P7528k880N274m8623k244J103p2369L8059j0292
$$ 14313 -78477 -118325 -77766 -238 -3118 2156 -46467 -48711 -47608 -119977 -81918 -92210
46886i2210Q0158k3174K635L6381k2227r7935p8401N618J5049P5050Q5108K464
$$ -92210 -12052 -35226 -32591 3790 -18437 -116372 -194773 -189155 -174106 -99056 -13948 -11484
46874a1484p5904K2606j8126j02019l6l669O6047k246J6730l2435P4072Q7084
$$ -11484 -87388 -64782 -82908 -184927 -184963 -188632 -122585 -124831 -108101 -140536 -66464 20620
46862B0620J0105m5958K5041p0417L6335j5715k5579P2041m6154j5595N4428n8733
$$ 20620 30725 -15233 9808 -60609 -24274 -39989 -65568 6473 -39681 -55276 -848 -59581
46850e9581l1384o747l206P1629L8013j2280K6851J2301K4644J136M6739m3278
$$ -59581 -90965 -97712 -100918 -29289 8724 -3556 23295 35596 60240 61376 108115 64837
46838F4837m8654n7563K7290L4636m5563j8391M0177r798J0125K8899o8111m5269
$$ 64837 16183 -41380 -14090 20546 -25017 -43408 -3231 -13029 -2904 25995 -42116 -87385
46826h7385M8430K6565l8565M3622j6296o1394N6788P6828p0710j21216M1879
$$ -87385 -38955 -12390 -50955 -7333 -23629 -85023 -28235 48593 -22117 -143333 -101454
46815a01454J07677J3589l749k4956L586l9716N9501K7601j5120m7608p2038o903
$$ -101454 6223 19812 16063 -8893 -5307 -45023 14478 42079 26959 -20649 -92687 -99590
46803i9590m7758k7441Q5980p3728L4307k6296O0191N0818O7793M6548j09071
$$ -99590 -147348 -174789 -88809 -162537 -128230 -154526 -94335 -43517 24276 70824 -38247
46792c8247J18325k8045m9972q069J5229j4425O1438J0089m1337K367J5856K3515
$$ -38247 80078 52033 2061 -6008 9221 -5204 56234 66323 24986 27353 43209 66724
46780F6724m8409l1473L8056q4325n0776J18571L4449Q673k9625l6438Q6809j6933
$$ 66724 18315 -13158 24898 -59427 -110203 8368 42817 51490 21865 -14573 72236 55303
46768E5303o5017K4178k2148p9170j0111N8568K1496r129p1980K0542M0835l7501
$$ 55303 -9714 14464 -7684 -86854 -96965 -38397 -16901 -26030 -98010 -77468 -36633 -74134
46756g4134m6599O1718k4331J02776K7111p8005p1492j8875R9187K2782j6598
$$ -74134 -120733 -59015 -83346 19430 46541 -31464 -102956 -121831 -22644 138 -16460
46745a6460l8609n4710o5709J2875O5666k734O218j2736k7254J09752n3747L7891
$$ -16460 -55069 -109779 -175488 -162613 -96947 -99681 -93463 -106199 -133453 -23701 -77448 -39557
46733c9557L8459J2858J0644J9674n5797Q151j4636Q4884Q7816l4433k2092k1694
$$ -39557 -1098 11760 22404 42078 -13719 -5568 -20204 64680 152496 118063 95971 74277
46721G4277K2685m8818M3022m5425l6398l522o5664J07570l5805k2566L3426O8184
$$ 74277 96962 48144 91166 45741 9343 5821 -59843 47727 11922 -10644 22782 90966
46709I0966n5926l8711k5687r5591m429K4276M9118K9700Q0304p8k6766k2278
$$ 90966 35040 -3671 -29358 -124949 -129378 -105102 -55984 -26284 54020 53942 27176 4898
46697D898L379J6210K5321L2480q8469K1198k8231k5292M182K9053J11669k4864
$$ 4898 8277 24487 49808 82288 -6181 15017 -13214 -38506 -34324 -5271 106398 81534
46685H1534m8608j157l2866n0807L8139J07842l1699j09612j4849O2091j4875
$$ 81534 32926 31769 -1097 -51904 -13765 94077 62378 -47234 -62083 8 -14867
46674a4867p9803m339k426K1516k0956k2518j3516Q3971N7027O6830k805j6316
$$ -14867 -94670 -99009 -101435 -79919 -100875 -123393 -136909 -52938 4089 70919 68114 51798
46662E1798r2876k1393K6451j7112O371k6216j9738J2359J0603o5887K0978m3589
$$ 51798 -41078 -62471 -36020 -53132 -46761 -72977 -92715 -80356 -69753 -135640 -114662 -158251
46650a58251M6506K5656J2685l755J0004M1238j2194k886J33659l3672m0608p3209
$$ -158251 -111745 -86089 -73404 -77159 -67155 -25917 -38111 -40997 92662 58990 18382 -54827
46638e4827j6057J7181M2422L8211n934j2442N6235m5618K661j4919n6266k0661
$$ -54827 -70884 -53703 -11281 26930 20996 8554 64789 19171 21832 6913 -49353 -70014
46626g0014N571J5376K0874K3078L9274p4613P0467K0714l9253o2683O9863k9462
$$ -70014 -64443 -49067 -28193 -5115 34159 -40454 30013 50727 11474 -51209 18654 -10808
46614a0808%o3334O8380O2328q0525k3322m3290Q2003j6527L8355P0339o1803
$$ -10808 -10808 -74142 -5762 56566 -23959 -47281 -90571 -8568 -25095 13260 83599 21796
46602B1796o33o9245N0673M4437k9722J7215l9091m340j03834n0226O3187L2321
$$ 21796 21163 -48082 2591 47028 17306 34521 -4570 -8910 -112744 -162970 -99783 -67462
46590f7462k43K4002m8696K8617O769o4092m8049Q5845j0718M3193N5217p9041
$$ -67462 -67705 -43703 -92399 -63782 -57013 -121105 -169154 -83309 -94027 -50834 4383 -74658
46578g4658j8022P5848p081j4998o0616J2346J9553J10790K7544M683j5760n9825
$$ -74658 -92680 -16832 -23913 -38911 -99527 -87181 -67628 43162 70706 75389 59629 -196
46566a96M6499L5859n6844O836M9051l8488N0820o7185K8197L0478o9725n9254
$$ -196 46303 82162 25318 32154 81205 42717 93537 26352 54549 85027 15302 -43952
46554d3952J2930L6459q71J46520N860q2927N7423o6377j2411k7586n2283O869
$$ -43952 -31022 5437 4566 151086 156946 74019 131442 65065 52654 25068 -27215 -20346
46542b0346j5550l1682J8400J6599l9636N9164M3656n1754p0731M109n9758N6578
$$ -20346 -35896 -67578 -49178 -32579 -72215 -13051 30605 -21149 -91880 -87771 -147529 -90951
46530i0951P3016q835m6572m5899L5090L6702N9169R000j9106L8502j1410j2914
$$ -90951 -17935 -26770 -73342 -119241 -84151 -47449 11720 20720 1614 40116 28706 15792
46518A5792j5327j5460o0651K8276J6388l8974M1243R4362k1085n0372k8909j00593
$$ 15792 465 -14995 -75646 -47370 -30982 -69956 -28713 65649 44564 -5808 -34717 -135310
46506a35310l3387R3855K9143p1472o3689K4895J55968K1116o401p7676j2509
$$ -135310 -168697 -74842 -45699 -117171 -180860 -155965 3 21119 14718 -62958 -75467
46495g5467P7300K8782m7156L1059m9186k4127P916j06459m7866J60544M3982
$$ -75467 1833 30615 -16541 14518 -34668 -58795 -50879 -157338 -205204 -44660 -678
46484f78l5000Q4930j2606K6694L3049r0552p9456L184K2216J22796j330n0473
$$ -678 -35678 49252 36646 63340 96389 5837 -73619 -70435 -48219 74577 73247 22774
46472B2774m1816O2844j8247l9737K1633p9893l5255M6554L8815K1440k1498j4915
$$ 22774 -19042 43802 25555 -14182 7451 -72442 -107697 -61143 -22328 -888 -22386 -37301
46460c7301j7447m4083M0534M6419l2354k0464k45O3305k3426O067K1198p2044
$$ -37301 -54748 -98831 -58297 -11878 -44232 -64696 -64941 -1636 -25062 -18995 2203 -69841
46448f9841j03816Q3003k0122J2780P6430L458r4231J32114P7997K2380l0711
$$ -69841 -173657 -90654 -110776 -97996 -21566 -18108 -112339 19775 97772 120152 89441
46437H9441L2886l8766m0793m8523m334p7601K8243P1063L311j2604p8723n135
$$ 89441 122327 83561 42768 -5755 -10089 -87690 -59447 11616 14927 2323 -76400 -81535
46425h1535K9490j30588L1378O5637J08547j452j3269o0458M670k1917j7723l5946
$$ -81535 -52045 -182633 -151255 -85618 22929 21477 8208 -52250 -47580 -69497 -87220 -123166
46413a23166M3638P8668o220l0951l3074q068l6763O1480L756p3265q367P8133
$$ -123166 -79528 -860 -7080 -38031 -71105 -79173 -115936 -54456 -50700 -123965 -132332 -54199
46401e4199J38858o3234p4867J6971m3787m8463o2925J6692k1424k9487Q1814
$$ -54199 84659 21425 -53442 -36471 -80258 -128721 -191646 -174954 -196378 -225865 -144051
46390a44051J43191M304l0748n2843m3538J7486N4540N6875J4953n4534l9256
$$ -144051 -860 3444 -27304 -80147 -123685 -106199 -51659 5216 20169 -34365 -73621
46379g3621R6554J3069q733j3506j2166L7492m2507q2111o3595M3075P1792k2056
$$ -73621 22933 36002 27269 13763 1597 39089 -3418 -85529 -149124 -106049 -34257 -56313
46367e6313k9322J1309j0081R2968j8398O1638O301m1645n9299M6157j5413j3782
$$ -56313 -85635 -74326 -84407 8561 -9837 51801 58102 16457 -42842 3315 -12098 -25880
46355b5880O328N2229m2495L1111N493m6655l9921J5772N0499K9352r6749k3163
$$ -25880 -19552 32677 -9818 21293 26786 -19869 -59790 -44018 6481 35833 -60916 -84079
46343h4079K2744m6607J55427J9937q8796J2359J2971j8822O9217o5931n9383
$$ -84079 -61335 -107942 47485 67422 -21374 -9015 3956 -14866 54351 -11580 -70963
46332g0963Q9234l9903l7401j7784k0536J20527m6602r1216k4174N2136J9553
$$ -70963 18271 -21632 -59033 -76817 -97353 23174 -23428 -114644 -138818 -86682 -67129
46321f7129J8205p2556m4720L8316J28130J9622O3646R975j13573M707O9996M5998
$$ -67129 -48924 -121480 -166200 -127884 246 19868 83514 93489 -20084 -15377 54619 100617
46309A00617p7154J1806K7868r0067q4237n0959K8899J71633k413p9847L9357
$$ 100617 23463 35269 63137 -26930 -111167 -162126 -133227 38406 35993 -43854 -4497
46298d497J7921M1261M169j1237M7976K2183n7830j7889M1680P0092m2552l2929
$$ -4497 13424 54685 58854 47617 95593 117776 59946 42057 83737 153829 111277 78348
46286G8348R5843j13025j00964K2312M6039k1745n2977p7918l2946M9134Q4776
$$ 78348 174191 61166 -39798 -17486 28553 6808 -46169 -124087 -157033 -107899 -23123
46275b3123L1388m8391k350n1759O4608O6273q0303K8506K8354K2008k5339R7936
$$ -23123 8265 -40126 -42476 -94235 -29627 36646 -43657 -15151 13203 35211 9872 107808
46263A07808k2405k4521q903K6730L1727l8866j2055m6660q3077J1879q8981P1652
$$ 107808 85403 60882 51979 78709 110436 71570 59515 12855 -70222 -58343 -147324 -75672
46251g5672J6741R9033j1865j16239K5402R433Q9952k3112Q546P0183q3569K2123
$$ -75672 -58931 40102 28237 -88002 -62600 -53167 36785 13673 22219 92402 8833 30956
46239C0956J00605j4205q7984r9939o8676K0697R8938J03650K0016j9810K7934
$$ 30956 131561 117356 29372 -70567 -139243 -118546 -19608 84042 104058 84248 112182
46228A12182j9056r9248q2784Q211L1346P8604M6941j06321J9801N7169k8344
$$ 112182 93126 -6122 -88906 -80695 -49349 29255 76196 -30125 -10324 46845 18501
46217A8501l5828J4818J5604k5327j01582m2596P1895N4659K2667p9749n5831
$$ 18501 -17327 -2509 13095 -12232 -113814 -156410 -84515 -29856 -7189 -86938 -142769
46206a42769M6782N2384m8879n4540N3434M0832J3876j1304q2060K2300M8543
$$ -142769 -95987 -43603 -92482 -147022 -93588 -52756 -38880 -50184 -132244 -109944 -61401
46195f1401L800j4345l5148n3130J17431M3980Q3952K1184m7639Q3032K3968j07162
$$ -61401 -57601 -71946 -107094 -160224 -42793 1187 85139 106323 58684 141716 165684 58522
46183E8522o1165M3548J4968o3718l6528o0544J5968J41684j9324L1446J362p299
$$ 58522 -2643 40905 55873 -7845 -44373 -104917 -88949 52735 33411 64857 66219 58920
46171E8920m3235k7595l9274o2391j5853R582Q853J06220M467l2345P5482q2759
$$ 58920 15685 -11910 -51184 -113575 -129428 -119846 -110993 -4773 -306 -32651 42831 -39928
46159c9928m5134j6333M2280L5917p4662L7581n3659m6041j9171N5547J5628j7731
$$ -39928 -85062 -101395 -59115 -23198 -97860 -60279 -113938 -159979 -179150 -123603 -107975 -125706
46147a25706N7571J6587P1791N1868M4972q7941o9927J9521n9199k6302L7113
$$ -125706 -68135 -51548 20243 72111 117083 29142 -40785 -21264 -80463 -106765 -69652
46136f9652R4824L8801r307r3729L717R2134p8297O904M1774j07825k2281J62221
$$ -69652 25172 63973 54666 -39063 -35346 56788 -21509 -14605 27169 -80656 -102937 59284
46124E9284Q8817m3318j10576l1038R9389L4985m9488k7012q1903P0768P1896
$$ 59284 148101 104783 -5793 -36831 62558 97543 48055 21043 -60860 9908 81804
46113H1804L5806n1939n2970q706l6931j6684n698J36414J9307L0892J3547o4534
$$ 81804 117610 65671 12701 3995 -32936 -49620 -55318 81096 100403 131295 144842 80308
46101H0308r9746L2254K3393q026l0793P567K2006q3330n6388L9967R1141L1484
$$ 80308 -19438 12816 36209 28183 -2610 4957 26963 -56367 -112755 -72788 18353 49837
46089D9837l66O8519j8106m5171q660J5046L4746m4029j4954p3515n6899R5996
$$ 49837 49471 117990 99884 54713 46053 61099 95845 51816 36862 -36653 -93552 2444
46077B444j916l5508J1377J2925K7196L1923r1808j9567M4279N7468Q8073m3187
$$ 2444 528 -34980 -23603 -10678 16518 48441 -43367 -62934 -18655 38813 126886 83699
46065H3699J5619Q591K3612l3488n197j15763j22926K6755J3423m5481j6812N0683
$$ 83699 99318 107909 131521 98033 92836 -22927 -145853 -119098 -105675 -151156 -167968 -117285
46053a17285N2913n2708n461j0095R9923R6645K1676j8364l3649l7120N6574r00
$$ -117285 -64372 -117080 -122541 -132636 -32713 63932 85608 67244 33595 -3525 53049 52149
46041E2149K3734p1191m9834R260n4959P6310J0286J4101j7477k3906N73J2879
$$ 52149 75883 4692 -45142 -35882 -90841 -14531 -4245 9856 -7621 -31527 -30954 -18075
46029a8075k344m882M3408M7309m3148l9929q8270J11496q7339k1534J0706N8022
$$ -18075 -20419 -25301 18107 65416 22268 -17661 -105931 5565 -81774 -103308 -92602 -34580
46017c4580R9943j18190r7069J69211R5887j05627J194M5405r153l28k5163p018
$$ -34580 65363 -52827 -149896 19315 115202 9575 10769 56174 47021 46693 21530 14512
46005A4512j1741k8890l9713l8948M3528J17896J14643M1436l8271j45022q450
$$ 14512 2771 -26119 -65832 -104780 -61252 56644 171287 212723 174452 29430 20980
45994B0980j2239N8369M4060l4551l4285j14217K7811K7257j8899o832k394P5489
$$ 20980 8741 67110 111170 76619 42334 -71883 -44072 -16815 -35714 -42546 -44940 30549
45982C0549N3480k8203j31436k9622J85965q4546j106M0039P846k9096K3252K7846
$$ 30549 84029 55826 -75610 -105232 80733 -3813 -4919 35120 42966 13870 37122 64968
45970F4968q3085l3728L7471J3021l7272k3963k2723j5655L0727M657M3470q8931
$$ 64968 -18117 -51845 -14374 -1353 -38625 -62588 -85311 -100966 -70239 -65582 -22112 -111043
45958a11043m2613J1628k3880J32688l5072l8393O9578N2999J1202j2240J7220
$$ -111043 -153656 -142028 -165908 -33220 -68292 -106685 -37107 15892 27094 14854 32074
45947C2074l5042o5749j554L5260J4534L7131m4167K2097P2776q974m4667k7857
$$ 32074 -2968 -68717 -70271 -35011 -20477 16654 -27513 -5416 67360 58386 13719 -14138
45935a4138n8173L4574M6087k3770k4001m2852j8776L5414L6136m7531j4966J1582
$$ -14138 -72311 -37737 8350 -15420 -39421 -82273 -101049 -65635 -29499 -77030 -91996 -80414
45923h0414j696O8565J7571o9091m511n9448J08430j2466J0106J1589q048J5198
$$ -80414 -82110 -13545 4026 -65065 -69576 -129024 -20594 -33060 -22954 -11365 -19413 -4215
45911d215Q148j5365Q219M5723l5872l9374L6612j1999o1309j2473L999j6498
$$ -4215 3933 -11432 -3213 42510 6638 -32736 3876 -8123 -69432 -81905 -77906 -94404
45899i4404N6165O5955k2222Q8543j01699j09321R8290j8101l5061R7615O589
$$ -94404 -38239 27716 5494 94037 -7662 -116983 -18693 -36794 -71855 25760 32349
45888C2349n0565O4409j26057J9349M7265m68j6087m4525l1810k1362M6911M5720
$$ 32349 -18216 46193 -79864 -60515 -13250 -13718 -29805 -74330 -106140 -127502 -80591 -34871
45876c4871j5823R4657r996n9563j0364M2221L3936j8495J7138m9685J4878L3689
$$ -34871 -50694 43963 33967 -25596 -35960 6261 40197 21702 38840 -10845 4033 37722
45864C7722q663L5017K2350k314Q2207o650M4840p3802n0060p9979l2959R4602
$$ 37722 29059 64076 86426 84112 166319 159669 204509 130707 80647 668 -32291 62311
45852F2311J7493l3904j8687N2610j3967k1833j2457P847j14895n510N4315m3973
$$ 62311 79804 45900 27213 79823 65856 44023 31566 39413 -75482 -80992 -26677 -70650
45840g0650N2551j2719O5620q2343L977L7695l1979o1418J69K5991p706M1130
$$ -70650 -18099 -30818 34802 -47541 -43564 -5869 -37848 -99266 -99097 -73106 -80812 -39682
45828c9682J00158n37n112r171K2770Q2N073j3077K101M9546L4237j02174J6014
$$ -39682 60476 59939 54827 45656 68426 68508 73581 60504 62605 112151 146388 44214 60228
45815F0228j6705J945q8378M2587M6886N1534q1l9408K4493n1259j5640m0866
$$ 60228 43523 45468 -42910 -323 46563 98097 98016 58608 83101 31842 16202 -24664
45803b4664L6531O5571l7798o3139j3401n8718p1259R2874P1801m9973p9685q0416
$$ -24664 11867 77438 39640 -23499 -36900 -95618 -166877 -74003 -2202 -52175 -131860 -212276
45791b12276R4582Q7462J5686K994j20865j6388P9247n1102m0630N1065J43764
$$ -212276 -117694 -30232 -14546 -11552 -132417 -148805 -69558 -120660 -161290 -110225 33539
45780C3539K6056n5762p1877o0800M2878n5507K7300N3141N2700K093K8323J0945
$$ 33539 59595 3833 -68044 -128844 -85966 -141473 -114173 -61032 -8332 -6239 22084 33029
45768C3029j5509j7572m0635j7369K8112K1360O2037O986J3832n2619L4609J12963
$$ 33029 17520 -52 -40687 -58056 -29944 -8584 53453 60439 74271 21652 56261 169224
45756A69224n3050j9489r1122O5814q3884P4417m358p2558q6431K526P3790M3688
$$ 169224 116174 96685 5563 71377 -12507 61910 57552 -15006 -101437 -98911 -25121 18567
45744A8567R4536p7778q0842Q8791J3172K1696p3515r7383M7363J7653K1213K3124
$$ 18567 113103 35325 -45517 43274 56446 78142 4627 -92756 -45393 -27740 -6527 16597
45732A6597r1548r798k3283P9496P870k3127o8945m4690M2552l7876n6622J27691
$$ 16597 -74951 -84749 -108032 -28536 -20666 -43793 -112738 -157428 -114876 -152752 -209374 -81683
45720h1683P2276l2794J4509L6010N302m1029o745k8619K2521J7590O3976l8077
$$ -81683 -9407 -42201 -27692 8318 13620 -27409 -34154 -62773 -40252 -22662 41314 3237
45708C237q6991p0001J1656M6937R8105P0607n2138L1791K9273k2678j1073p4268
$$ 3237 -83754 -153755 -142099 -95162 2943 73550 21412 53203 82476 59798 48725 -25543
45696b5543O1692m1091k456k2892r0930P0471N3302N514Q3099p2939q0978L3963
$$ -25543 36149 -4942 -7398 -30290 -121220 -50749 2553 8067 91166 18227 -62751 -28788
45684b8788J4276N061K2340J0868m577q1034M5938Q7974M1163k5781p0103l9510
$$ -28788 -14512 -9451 12889 23757 19180 -61854 -15916 72058 113221 87440 17337 -22173
45672b2173R8770J3503N461j3026J0965q5185j1370L9084l383M575L4906l7783
$$ -22173 76597 90100 95561 82535 93500 8315 -3055 36029 32646 37221 72127 34344
45660C4344N1663l8290j10794l4250R3554N3503J2251m708P2402J6120l0772r8856
$$ 34344 86007 47717 -63077 -97327 -3773 49730 61981 57273 129675 145795 115023 16167
45648A6167r4503M117p448N2814O6080J8562p4754K6276O0520N746k9364j06212
$$ 16167 -78336 -74219 -81667 -28853 37227 55789 -18965 7311 67831 73577 44213 -61999
45636f1999Q8653m5257k2637M1044k353J3074O9150l6909r816l5245k8457R5147
$$ -61999 26654 -18603 -41240 -196 -2549 10525 79675 42766 32950 -2295 -30752 64395
45624F4395j6189p2356q2383J0698M0860Q3206L2570j6472j7064K0780m8279N2667
$$ 64395 48206 -24150 -106533 -95835 -54975 28231 60801 44329 27265 48045 -234 52433
45612E2433N3504n8273L8582M3554m9745p6155o3720L6393J2177L2641n1019M6462
$$ 52433 105937 47664 86246 129800 80055 3900 -59820 -23427 -11250 21391 -29628 16834
45600A6834N2737o9292L9268j4643l5346N9191r8131O529P0088m1624m10O8995
$$ 16834 69571 279 39547 24904 -10442 48749 -49382 -42853 27235 -14389 -14799 54196
45588E4196n5351J1523J5188p8645J4171l210L6664r613m2804j6441L3417r3208
$$ 54196 -1155 10368 25556 -53089 -38918 -42128 -5464 -15077 -57881 -74322 -40905 -134113
45576a34113n1646J6917O4909Q9892O2778n229n020n1117k841p8471M8838M1710
$$ -134113 -185759 -168842 -103933 -14041 48737 43508 38488 -12629 -15470 -93941 -45103 -3393
45564c393N396L7975p7335J2704K7122k0111j5255M4624K011L8571p4933k6558
$$ -3393 2003 39978 -37357 -24653 2469 -17642 -32897 11727 13738 52309 -22624 -49182
45552d9182j7555L7969j1370k5745m5652r21q3500J13940k0225M584n5605N9876
$$ -49182 -66737 -28768 -40138 -65883 -111535 -112456 -195956 -82016 -102241 -97657 -153262 -93386
45540i3386P9326n1447o9221p4993J20317R9578N0154p2782j1611l6354O9372
$$ -93386 -14060 -65507 -134728 -209721 -89404 10174 60328 -12454 -24065 -60419 8953
45529H953k5793p5598N1967N57O1527j3369k9951J02816K6036r418O40p7588Q944
$$ 8953 -16840 -92438 -40471 -39914 21613 8244 -21707 81109 107145 97727 98367 20779 29723
45516B9723n8313M147O5327m596n4038Q653k7019O8902P2740j13659q8384R2306
$$ 29723 -28590 -24443 40884 36288 -17750 -9097 -36116 32786 105526 -8133 -96517 -4211
45504d211N8k9151J2869l4450m7130Q9196N9477j06149J8078J31266p3166N2p5
$$ -4211 -4153 -33304 -20435 -54885 -102015 -12819 46658 -59491 -41413 89853 16687 16739 16664
45491A6664M1245K4595n5105M202j2918q060J0723o3200O4453O9720q0660n9682
$$ 16664 57909 82504 27399 31601 18683 10623 21346 -41854 22599 92319 11659 -48023
45479d8023M2176m923P9092j8980n5280J3075j8492j29997J48172O4574n9953
$$ -48023 -5847 -10770 68322 49342 -5938 7137 -11355 -141352 6820 71394 11441
45468A1441n1310m9346O2646Q7717P3620q1251j31431j1442n4939j2074K5112
$$ 11441 -39869 -89215 -26569 61148 134768 53517 -77914 -89356 -144295 -156369 -131257
45457a31257Q3649R9929r5564k4820l924P2302J28667J1820l8573o4297q1061
$$ -131257 -47608 52321 -43243 -68063 -71987 315 128982 140802 102229 37932 -43129
45446d3129L9185J9431K8540M9833L737o3069k5291L2090K9276m9047q7624N8784
$$ -43129 -3944 15487 44027 93860 97597 34528 9237 41327 70603 21556 -66068 -7284
45434g284Q7937p9860j7494n0146J7788J32367M7170p4710n015k8398R5267n2150
$$ -7284 80653 793 -16701 -66847 -49059 83308 130478 55768 50753 22355 117622 65472
45422F5472L8000n3732j3643O163k9136m1764N1701O9911J3215J0836l8613o8589
$$ 65472 103472 49740 36097 42260 13124 -28640 23061 92972 106187 117023 78410 9821
45410I821K9096j3486q4947O7213N9589r651o1967j1472O3237o0239o9353M8871
$$ 9821 38917 25431 -59516 7697 67286 57635 -4332 -15804 47433 -12806 -82159 -33288
45398c3288k1072M2624l9990k9618J3970P9553J00414L49j12039j4904N1304N7124
$$ -33288 -54360 -11736 -51726 -81344 -67374 12179 112593 112942 903 -14001 37303 94427
45386I4427m7457m6810J8871j7273J6151Q5429j4917p4101n354m2955k8733k7006
$$ 94427 46970 160 19031 1758 17909 103338 88421 14320 8966 -33989 -62722 -89728
45374h9728J0597L6528n6651l1505N3154M0259L9702k0547N908O9656m6825m1432
$$ -89728 -79131 -42603 -99254 -130759 -77605 -37346 2356 -18191 -12283 57373 10548 -30884
45362c0884l0883P5729R7477J24692n3507O263o4197j14529K6402l683L7207J7227
$$ -30884 -61767 13962 111439 236131 182624 188887 124690 10161 36563 32880 70087 87314
45350H7314n2374L7568K5802N5616j84890r3046Q5573m862J9594M6927n398n9983
$$ 87314 34940 72508 98310 153926 -30964 -124010 -38437 -43299 -23705 23222 17824 -42159
45338d2159K8371n6997n5647J207L9329J4213P2563P3870J577n2498l5097L9071
$$ -42159 -13788 -70785 -126432 -125225 -85896 -71683 880 74750 76327 23829 -11268 27803
45326B7803Q1868O7501J0223j03870j0954k1044k9293K7016j10838L1314p6810
$$ 27803 109671 177172 187395 83525 72571 51527 22234 49250 -61588 -30274 -107084
45315a07084J1901J13520J5962j8077J5946J5383L4513N743R3079q6425j23392
$$ -107084 -95183 18337 34299 16222 32168 47551 82064 87807 180886 94461 -28931
45304b8931k7126q838N9181k9924k9194J13315q3957n032J8166M6973l3563M6817
$$ -28931 -56057 -64895 -5714 -35638 -64832 48483 -35474 -40506 -22340 24633 -8930 37887
45292C7887P1776p234m2862r0785k3281r60J4225n7979J04765L8261j37271L3179
$$ 37887 109663 102429 59567 -31218 -54499 -55459 -41234 -99213 5552 43813 -93458 -60279
45280f0279L0738Q094m9230L6735m296M8996q8523J8680J03258N04m529q869n7578
$$ -60279 -29541 -21447 -70677 -33942 -38238 10758 -77765 -59085 44173 44677 40148 31279 -26299
45267b6299P4772j03541M2979M5186N1341n0445j01498J0822R4145L1575p6172
$$ -26299 48473 -55068 -12089 33097 84438 33993 -67505 -56683 37462 69037 -7135
45256g135J8917K9599L0431l1036l6732l1360m8127j6828P693m812p5046P1413
$$ -7135 11782 41381 71812 40776 4044 -27316 -75443 -92271 -84578 -89390 -164436 -93023
45244i3023M4514K1971r299P7614m3010m877P6889J6549K0583q0691l2389j2524
$$ -93023 -48509 -26538 -35837 41777 -1233 -6110 70779 87328 107911 27220 -5169 -17693
45232a7693L5584l898k3422k4785O1587Q41l0763l304o3732J5754p6989O2438
$$ -17693 17891 13993 -9429 -34214 27373 28214 -2549 -5853 -69585 -53831 -130820 -68382
45220f8382M0378m0660Q051J1310l802M1433M3482j7619N0505l5103j04198N4157
$$ -68382 -28004 -68664 -60613 -49303 -53105 -11672 31810 14191 64696 29593 -74605 -20448
45208b0448n7569l3885K8199J16506l84M4364j6079n2440Q697o3813L3605N7295
$$ -20448 -78017 -111902 -83703 32803 32419 76783 60704 8264 16961 -46852 -13247 44048
45196D4048l238n467m3018n0446p671Q9932N6692P3626o7612J1498r829q2234
$$ 44048 40810 35343 -7675 -58121 -65792 24140 80832 154458 86846 98344 88515 6281
45184F281L8646o5271o1382N1931J06466L4248q0180l2204k292M4669j10916L9981
$$ 6281 44927 -20344 -81726 -29795 76671 110919 30739 -1465 -3757 40912 -70004 -30023
45172c0023M1605j988p3471N5903L0115j0061N0727M0495q5740o368j8680K8399
$$ -30023 11582 9594 -63877 -7974 22141 12080 62807 103302 17562 11194 -7486 20913
45160B0913l1850K0858J4831M4875l3255N7903R8910o0420j04011L2632k0872
$$ 20913 -10937 9921 24752 69627 36372 94275 193185 132765 28754 61386 40514
45149D0514n8889M8209J7400j928O8591n3372j6825Q255J5366m6606O1600M1746
$$ 40514 -18375 29834 47234 45306 113897 60525 43700 51955 67321 20715 82315 124061
45137A24061l0549p8558P2474n0330m905q106k4344R272J29436K4476m1675K9396
$$ 124061 93512 14954 87428 37098 32193 24087 -257 9015 138451 162927 121252 150648
45125A50648l1853l1140k7570L6513o6550J8961M3796o3591j0508J31931P17j28175
$$ 150648 118795 87655 60085 96598 30048 49009 92805 29214 18706 150637 151354 23179
45113B3179N1436l3167n2689L1841r0729j02488Q0405J27706O5777l7412l8321
$$ 23179 74615 41448 -11241 20600 -70129 -172617 -92212 35494 101271 63859 25538
45102B5538J4200L063j8241J1696O8343l623q8824J12998k3231o3267o730P4196
$$ 25538 39738 42801 24560 36256 104599 100976 12152 125150 101919 38652 31922 106118
45090A06118L8801j5586n8401j7543m9218O4568P7812q941j6147O542j4301o2841
$$ 106118 144919 129333 70932 53389 4171 68739 146551 137610 121463 128005 113704 50863
45078E0863j3903M7689l1656j5192P488j17514m5264N7824l5567N4576K6568L2492
$$ 50863 36960 84649 52993 37801 45289 -72225 -117489 -59665 -95232 -40656 -14088 18404
45066A8404n7838L3117M7646K6451o1133m6492P4120P2732q5250K3995O6088K5358
$$ 18404 -39434 -6317 41329 67780 6647 -39845 34275 107007 21757 45752 111840 137198
45054A37198o8764l6898Q7236n102n5839K5299J1543p1417n1497N2414L5088K5151
$$ 137198 68434 31536 118772 113670 57831 83130 94673 23256 -28241 24173 59261 84412
45042H4412L6472m1973p8163j138P2347L9242M5263J3699r1159P2646m897n0695
$$ 84412 120884 78911 748 -390 71957 111199 156462 170161 79002 151648 146751 96056
45030I6056J4419J8922n2275n5088j3646L9844P6014L7135M2543l6868n1862O0969
$$ 96056 110475 129397 77122 22034 8388 48232 124246 161381 203924 167056 115194 176163
45018A76163j6456j00100M3840r414o091R0183m870j18441j09359j06335l2768
$$ 176163 159707 59607 103447 94033 87942 178125 173255 54814 -54545 -160880 -193648
45007a93648J76089Q5077k8011L6221O9604m1792k0105O6050j747J7892o6311
$$ -193648 -17559 67518 39507 75728 145332 103540 83435 149485 147738 165630 99319
44996I9319m2660K0221k3084P3191r4097m8126J38810R7076r6006J5624n7023
$$ 99319 56659 76880 53796 126987 32890 -15236 123574 220650 124644 140268 83245
44985H3245m2423K2671K2666Q4092R2443J3613m4030o7064n4517N4025l3843K9482
$$ 83245 40822 63493 86159 170251 262694 276307 232277 165213 110696 164721 130878 160360
44973A60360O7724l819j30043k1892p913K6442N0074N7614o8316k643l4896m0568
$$ 160360 228084 224265 94222 72330 64417 90859 140933 198547 130231 127588 92692 52124
44961E2124n4586o162J4745L5875j3819M1622O1347j02642o9663o7853O2001J21542
$$ 52124 -2462 -8624 6121 41996 28177 69799 131146 28504 -41159 -109012 -47011 74531
44949G4531P6469j5488o0273Q272K3526o5353L1017Q3276J42831P329n7878j5559
$$ 74531 151000 135512 75239 83511 107037 41684 72701 155977 298808 306137 248259 232700
44937B32700N7231P4727r5896p1635N3825J10142l5655j72903k2399j2616K4301
$$ 232700 289931 364658 268762 197127 250952 361094 325439 152536 130137 117521 141822
44926A41822K7161o461R532m2545J2186J50783q3253m6682O772J44912M0532m6472
$$ 141822 168983 162522 172054 129509 141695 292478 209225 162543 169315 314227 354759 308287
44914C08287q6466j8912N9275m1809P7513J53898N074K6783O1374M7002K3924
$$ 308287 221821 202909 262184 220375 297888 451786 456860 483643 545017 592019 615943
44903F15943P3895Q0313J99226J40910M18702O25578N84734K12762m15755p67575
$$ 615943 689838 770151 969377 1110287 1528989 2154567 2739301 2952063 2536308 1768733
44893A768733m99076l26013j83728o0688P343M8885K4592q6283j70155k8781l2625
$$ 1768733 1269657 943644 759916 699228 706571 755456 780048 693765 523610 494829 462204
44882D62204j3587J0940k6146N3465o3906j35683j8305N3990J02008m2650o2590
$$ 462204 448617 459557 433411 486876 422970 287287 268982 322972 424980 382330 319740
44871C19740K2725k8886O3052P8594p8199n3567N820R729M4377P3635N6698n9184
$$ 319740 342465 313579 376631 455225 377026 323459 329279 339008 383385 457020 513718 454534
44859D54534m0101J8094O675q9807n3037K9028L4084K2363O5610J21139l7321
$$ 454534 414433 432527 439202 349395 296358 325386 359470 381833 447443 568582 531261
44848E31261p9331l4096k7997P1481J7100J0496J4959L5674o5o323K0536k1071
$$ 531261 451930 417834 389837 461318 478418 488914 503873 539547 539482 533159 553695 532624
44836E32624j96756K9111J20907L6222M1576P6533P1162l6749j10953j7619J38148
$$ 532624 335868 364979 485886 522108 563684 640217 711379 674630 563677 546058 684206
44825F84206P0612O4559N8813q6487J3735K2904n7785m1333O581L6277M8500M6045
$$ 684206 754818 819377 878190 791703 805438 828342 770557 729224 735805 772082 820582 866627
44813H66627J47870J16408l60P4539J12133R2138L7055N1006J89055K67588K04930
$$ 866627 1014497 1130905 1130545 1205084 1317217 1409355 1446410 1497416 1686471 1954059 2158989
44802B158989J90589N8392K9954j6440J15439O9342r5421M360K13758R9696K35397
$$ 2158989 2349578 2407970 2437924 2421484 2536923 2606265 2510844 2515204 2728962 2828658 3064055
44791C064055J59112J8023j17889N6369K04311J17522J29662L52537K97734M37851
$$ 3064055 3223167 3241190 3123301 3179670 3383981 3501503 3631165 3983702 4281436 4719287
44781D719287L11517K60987L63257K63436M9839K81730M50277O38681R80206J132659
$$ 4719287 5030804 5291791 5655048 5918484 5968323 6250053 6700330 7339011 8319217 9451876
44771I451876P12969M83019M54248R67383J581810K209121K798684L117217L137257
$$ 9451876 10164845 10647864 11102112 12069495 13651305 15860426 18659110 21776327 24913584
44762B4913584L606805M172453N194820O349671Q498703J1351217J6410224K3815463
$$ 24913584 28520389 32692842 37887662 44237333 52736036 64087253 80497477 104312940
44754A04312940L7947252O2910236J09875848J32156643O6884487o1836311j32359411
$$ 104312940 142260192 205170428 315046276 447202919 514087406 452251095 319891684
44747C19891684j13259620o4442794l6820870k2632170j5698015j2268563j0068329
$$ 319891684 206632064 142189270 105368400 82736230 67038215 54769652 44701323
44740D4701323q210887o281437m898351l608323k786150k431347j940934j537756
$$ 44701323 36490436 30208999 25310648 21702325 18916175 16484828 14543894 13006138
44732A3006138j378971j136817j033268p50205o88254o36889o97762l71776m10851
$$ 13006138 11627167 10490350 9457082 8706877 8018623 7381734 6683972 6312196 5901345
44723E901345l59276l31957k11683l23268k57721k87084k63468k12485j30591
$$ 5901345 5542069 5210112 4998429 4675161 4417440 4130356 3866888 3654403 3523812
44714C523812j82967j80474j87706j34091j63473p5465j61972j11905j76148j13687
$$ 3523812 3340845 3160371 2972665 2838574 2675101 2599636 2437664 2325759 2149611 2035924
44704B035924r0785m1998J1430n840q7880k8330J06681N5164J57940K79672M21464
$$ 2035924 1945139 1903141 1914571 1908731 1820851 1792521 1899202 1954366 2112306 2391978 2813442
44693B813442P45134Q12549K57505p78459j027279o32650l68046k42907r0276
$$ 2813442 3558576 4371125 4628630 3850171 2822892 2190242 1822196 1579289 1489013
44684A489013q3910r2420q5900J3937l0622q9386r8871j06234r2167j20766q8050
$$ 1489013 1405103 1312683 1226783 1240720 1210098 1120712 1021841 915607 823440 702674 614624
44673F14624J05392n3438l2016R0926P9634p064O8780j23932o3064K144N7174
$$ 614624 720016 666578 634562 725488 805122 798058 866838 742906 679842 681986 739160
44662G39160n0088j426n059j6908p4510k8386r5150O4966m479P8685l4788K3292
$$ 739160 689072 687646 682587 665679 591169 562783 467633 532599 528120 606805 572017 595309
44650E95309K2682M4345m8915o794n2734j8148L3112L6416p3390o8344k4414P2803
$$ 595309 617991 662336 613421 606627 553893 535745 568857 605273 531883 463539 439125 511928
44638E11928M7159N5437m0549m0215o5481l7156J30379Q2216P3497J39593J10291
$$ 511928 559087 614524 573975 533760 468279 431123 561502 643718 717215 856808 967099
44627I67099L19074N96864Q08463P96385L02007o16256r24916p22139l91962j98058
$$ 967099 1286173 1883037 2691500 3487885 3789892 3173636 2248720 1526581 1134619 936561
44617I36561j14779j70149q9492m9464K3l8227q1303m1416k913J1764O9775j14124
$$ 936561 821782 651633 562141 512677 512700 474473 393170 351754 348841 360605 430380 316256
44605C16256k4478R2022J21979m5442n2359m1368o9077k6064j4367n9592O7983
$$ 316256 291778 383800 505779 460337 407978 366610 297533 271469 257102 197510 265493
44594B65493j7931O8635l8878M4399k7281n3161j7321P5933o7095R2445J04006
$$ 265493 247562 316197 277319 321718 294437 241276 223955 299888 232793 325238 429244
44583D29244j4839m353J48659J37614K72232K46098N14539M20361r9718m36634
$$ 429244 414405 410052 558711 696325 968557 1214655 1729194 2149555 2049837 1613203
44573A613203m51792l06054k39121j01365j08637r4707M6432p0015p3919l607
$$ 1613203 1161411 855357 616236 514871 406234 311527 357959 287944 214025 210418
44563B10418k492l2146j2367K8234O2714Q7644Q6781n3287r0178k1891J12808
$$ 210418 207926 175780 163413 191647 254361 342005 428786 375499 285321 263430 376238
44552C76238k8762M384P0126J00320J81249J41504J80665N07264P24893N30783
$$ 376238 347476 351860 421986 522306 703555 845059 1025724 1532988 2257881 2788664
44542B788664j08193n89890n95872m35227l05641j27928j18022N0480p4073j36192
$$ 2788664 2680471 2090581 1494709 1059482 753841 625913 507891 558371 484298 348106
44532C48106k1366J10013n9713o7700j04220m9955j9159R3174K5248M7148k8409
$$ 348106 326740 436753 377040 309340 205120 155165 136006 229180 254428 301576 273167
44521B73167p9076m9075O5225K8318l3594k4945q838k6526Q5176o465p8349k4476
$$ 273167 194091 145016 210241 238559 204965 180020 171182 144656 229832 223367 145018 120542
44509A20542J0570K7184p7577O15K6304l0689l1075M1226J9139M3856J0245j4937
$$ 120542 131112 158296 80719 81334 107638 76949 45874 87100 106239 150095 160340 145403
44497A45403K4379j9214j8691j203o3705k2019J40032K253J7977K968K0186J1144
$$ 145403 169782 150568 131877 130674 66969 44950 184982 187235 205212 208180 228366 239510
44485B39510p5126o3150O994m7061L7613K2889P0544p1481q015Q956o447J6059
$$ 239510 164384 101234 108228 61167 98780 121669 192213 120732 112717 121673 115226 131285
44473A31285J4636q9920l625j8072M2735N4841k7252q3487M0420L6154j0027j2311
$$ 131285 145921 56001 52376 34304 77039 131880 104628 21141 61561 97715 87688 75377
44461G5377J8292r021R2308p327O06j60440k2559L7021L9684K1578M2044q4599
$$ 75377 93669 84648 176956 169629 170235 9795 -12764 24257 63941 85519 127563 42964
44449D2964o8179K8678J3310k9798L4064l7077L4736L2516Q3441Q918p9479m1260
$$ 42964 -25215 3463 16773 -13025 21039 -16038 18698 51214 134655 143573 64094 22834
44437B2834J5353M5226j5754J595j2453M284M2783Q5871j00301p8351J12176p850
$$ 22834 38187 83413 67659 69254 56801 61085 103868 189739 89438 11087 123263 115413
44425A15413K3231j6591n0661k8314L0491n6503m1390m4067Q0994J08370R7553
$$ 115413 138644 122053 71392 43078 73569 17066 -24324 -68391 12603 120973 218526
44414B18526p3019j34728J1069N4848M048l3172k2456N4216j24168J8887O6625
$$ 218526 145507 10779 21848 76696 80744 47572 25116 79332 -44836 -25949 40676
44403D0676M8597j8664m4462M3175M3581J9076K6157q6074P0324n212O031p3152
$$ 40676 89273 70609 26147 69322 112903 131979 158136 72062 142386 137174 143205 70053
44391G0053J071K3110j7217l4176M9478j6789j8763l1028R9446q1939k5019J54268
$$ 70053 71124 94234 77017 42841 92319 75530 56767 25739 125185 43246 18227 172495
44379A72495O4183r7002j6233q0954l2909l9733J9373P3395O3400l8372K6284
$$ 172495 236678 139676 123443 42489 9580 -30153 -10780 62615 126015 87643 113927
44368A13927j2809k5273l4178K5575O9028p5682o0801P6602n2310n8589j10315
$$ 113927 101118 75845 41667 67242 136270 60588 -213 76389 24079 -34510 -144825
44357a44825K1953J04060J6254o6805M2017L720P95O0542R5474P1523p8609N0583
$$ -144825 -122872 -18812 -2558 -69363 -27346 -23626 -22831 37711 133185 204708 126099 176682
44345A76682k3079j35186m5215Q0590J3166q0269J5226L4716j8713O473j4876
$$ 176682 153603 18417 -26798 53792 66958 -13311 1915 36631 17918 24391 9515
44334I515m1324P699P785q7396K94J7021O6413Q2580L4629k0377m1940j1833K0797
$$ 9515 -31809 -24110 -16325 -103721 -103427 -86406 -19993 62587 97216 76839 34899 23066 43863
44321D3863q5629l627j823J9077N9613p26J4719R786M8305O8596j9502o5177O4929
$$ 43863 -41766 -45393 -47216 -28139 31474 30748 45467 55253 103558 172154 152652 87475 152404
44308A52404j7464M1596M654l8773j06260n2519N9775k1088r301R5302j1234j3127
$$ 152404 134940 176536 181190 142417 36157 -16362 43413 22325 13024 108326 97092 83965
44296H3965O1700l1279k6324j14872j0039n5667K055J9079J30436M5061R166O5783
$$ 83965 145665 114386 88062 -26810 -36849 -92516 -90461 -71382 59054 104115 113281 179064
44284A79064q4289p6045l8445J9102J18123l8815k7056o145Q327N9965p3473l7641
$$ 179064 94775 18730 -19715 -613 117510 78695 51639 45494 53821 113786 40313 2672
44272B672l4889N1884m4282Q204j5340L7763K4339K6014n5203M9807k0540k3379
$$ 2672 -32217 19667 -24615 -16411 -31751 6012 30351 56365 1162 50969 30429 7050
44260G050q1423K4901J56187J7919j88622O0808Q7308j9882l5713n5713J8619
$$ 7050 -74373 -49472 106715 124634 -63988 -3180 84128 64246 28533 -27180 -8561
44249h561k3412l3793J9580j877m4232J06565m1590j7401M7365J15966R5446k1853
$$ -8561 -31973 -65766 -46186 -48063 -92295 14270 -27320 -44721 2644 118610 214056 192203
44237A92203o0925o2606o2291m9184N5937O363n9050N6665R2924J4598L7244r1409
$$ 192203 131278 68672 6381 -42803 13134 19497 -39553 17112 110036 124634 161878 70469
44225G0469R450n5762j4874K1412M913q5666j5973j7593r1722N8587R2351R9573
$$ 70469 79919 24157 9283 30695 35608 -50058 -66031 -83624 -175346 -116759 -24408 75165
44213G5165j6561o3588m8260M2456L2936j0490n4183l0343J08313N0518k6687
$$ 75165 58604 -4984 -53244 -10788 22148 11658 -42525 -72868 35445 85963 59276
44202E9276l8018k7864n62l187J3252P5068N2084K2624l9930n8009o6677L7596
$$ 59276 21258 -6606 -7168 -10355 2897 77965 130049 152673 112743 54734 -11943 25653
44190B5653Q5603q3029j7388k4565N499p787l9155R5024l8166o8865O8203J9906
$$ 25653 111256 28227 10839 -13726 -8227 -16014 -55169 39855 1689 -67176 1027 20933
44178B0933Q355m6985n2411K4060K3369K0855Q5993n2474k5828N3013K1798J02583
$$ 20933 29288 -17697 -70108 -46048 -22679 -1824 84169 31695 5867 58880 80678 183261
44166A83261n5613n9856q9163k041K4601j6479O4686J9057n1337L5818j3779p35
$$ 183261 127648 67792 -21371 -23412 1189 -15290 49396 68453 17116 52934 39155 38420
44154C8420J8019M5509m0440k9064J639j11571P0184O3347q500n6929p366M588
$$ 38420 56439 101948 61508 32444 34083 -77488 -7304 56043 47543 -9386 -16752 -12164
44142a2164O582M1865p1594K3257O4008N0434J0531K9419K211o5860r9605l403
$$ -12164 -5582 36283 -35311 -12054 51954 102388 112919 142338 144549 78689 -20916 -24319
44130b4319J06867o0364J3843K3931M104k1641o5213L878l7263N990L4477J2535
$$ -24319 82548 22184 36027 59958 64062 42421 -22792 -18914 -56177 -50187 -15710 -3175
44118c175O6711L7531m4887J569p7680R4421k5304j998L9663J11676k5958j04473
$$ -3175 63536 101067 56180 57749 -19931 74490 49186 47188 86851 198527 172569 68096
44106F8096L8166l5993j00331J6247j9911M3549L5715J4087j205K8457m8528M7332
$$ 68096 106262 70269 -30062 -13815 -33726 9823 45538 59625 58420 86877 38349 85681
44094H5681o4448P3328p3262j21886N6558n4438K5024O1987m9813M0351n5586
$$ 85681 21233 94561 21299 -100587 -44029 -98467 -73443 -11456 -61269 -20918 -76504
44083g6504K0639P6367K737p3998L595m9585j750N2295j7522L1867J4699j5709
$$ -76504 -55865 20502 23239 -50759 -47164 -96749 -98499 -46204 -63726 -31859 -17160 -32869
44071c2869M2120O220N7728l0349J0377m6940l6925k8409P5330R7818k4617j15218
$$ -32869 9251 15471 73199 42850 53227 6287 -30638 -59047 16283 114101 89484 -25734
44059b5734P88M5844J0378K243K0931J5930j1033l6043o2716l1174J13868M1190
$$ -25734 -24946 20898 31276 33519 54450 70380 59347 23304 -39412 -70586 43282 84472
44047H4472o1994l1821R2130m0799r8863l5745N8072M9007O250l9581M1148o376
$$ 84472 22478 -9343 82787 41988 -56875 -92620 -34548 14459 20709 -18872 22276 15900
44035A5900j15608O0980M1055K4912J522o2530M3873j2928N3354o0K724m1310
$$ 15900 -99708 -38728 2327 27239 28761 -33769 10104 -2824 50530 50470 53194 11884
44023A1884j1934k6060K8530N0659K5620O6933L7072p8218m419q2214O8557K4110
$$ 11884 -50 -26110 2420 53079 78699 145632 182704 104486 100067 17853 86410 110520
44011A10520M6446o8939p0861J21195q2896p8370J66449K6085r4211M2836o7741
$$ 110520 156966 88027 17166 138361 55465 -22905 143544 169629 75418 118254 50513
44000E0513K7997l1180K3445p0499P4603P3378m0802n4305K3703J412j2268j6755
$$ 50513 78510 47330 70775 276 74879 148257 107455 53150 76853 78265 65997 49242
43988D9242l6319k102M4096L1537p9093p649K7483l0757M7843p4616l9530M8971
$$ 49242 12923 10821 54917 86454 7361 -288 27195 -3562 44281 -30335 -69865 -20894
43976b0894k0717J7450J65633Q963j01114O1829j3951j8715q853n6088p30N0876
$$ -20894 -41611 -24161 141472 150435 49321 111150 97199 78484 69631 13543 12813 63689
43964F3689O3650m8509j4810j1482m0526o1682N8768K0802O508k2599o6442L8592
$$ 63689 127339 78830 64020 52538 12012 -49670 9098 29900 36408 13809 -52633 -14041
43952a4041N7081K7363p5063l1514K0553k1564P2932L2306k7235J6596J0867l2340
$$ -14041 43040 70403 -4660 -36174 -15621 -37185 35747 68053 40818 57414 68281 35941
43940C5941P6066J1788l7721k8798M1348k8280r26o9256k3468M8891R910r918
$$ 35941 112007 123795 86074 57276 98624 70344 69418 162 -23306 25585 35495 25577
43928B5577J9194o112J9052L8631J7948Q361n757j358o5041J5631l7843k2000
$$ 25577 44771 38659 57711 96342 114290 122651 116894 115536 50495 66126 28283 6283
43916F283J0448j2949O5023J6725q6994J9072L3594M7245J18909j05435j23805
$$ 6283 16731 3782 68805 85530 -1464 17608 51202 98447 217356 111921 -11884
43905a1884K7341M4987k6669l350j31217l7746R6175P6687m6716M7594l3316j21622
$$ -11884 15457 60444 33775 30425 -100792 -138538 -42363 34324 -12392 35202 1886 -119736
43893a19736l9747J27937J00993o6327p85J928o5934R9109J23851q2246J2600
$$ -119736 -159483 -31546 69447 3120 2335 4263 -61671 37438 161289 79043 91643
43882I1643L669O9445P697q7684m3573j7864J3328l3000q5573K6866o9592p4285
$$ 91643 95312 164757 172454 84770 41197 23333 36661 3661 -81912 -55046 -124638 -198923
43870a98923R8976L0494n224j4214M0057K7018K418O0327K7233j38673n4319P3521
$$ -198923 -99947 -69453 -74677 -88891 -48834 -21816 -19398 40929 68162 -70511 -124830 -51309
43858e1309L9083l4328m3418L2396O7594O2779q040K0844N1261n8831m4138p415
$$ -51309 -12226 -46554 -89972 -57576 10018 72797 64757 85601 136862 78031 33893 26478
43846B6478K5536N874L805j12867k0990K7796N7934R4941m4366o2451J9186J2579
$$ 26478 52014 57888 61693 -51174 -72164 -44368 13566 108507 64141 1690 20876 33455
43834C3455M926k1396M1867N2255M8923m5247k5954m4527P121j8473l145P5496
$$ 33455 38381 16985 58852 111107 160030 114783 88829 44302 51423 32950 29805 105301
43822A05301R9310r4240m1145P0929P508m306o0767n3287J896P518L341m1452
$$ 105301 204611 110371 69226 140155 147663 143357 82590 29303 31199 38717 42058 606
43810F06q964K8380J1329M4313J05819j01864j26603Q7797O4564m4606j01746
$$ 606 -8358 20022 31351 75664 181483 79619 -46984 40813 105377 60771 -40975
43799d0975l2871M8977J7797k467J0329j439r442m3222P0883K6718M7738J7615
$$ -40975 -73846 -24869 -7072 -9539 790 -649 -10091 -53313 17570 44288 92026 109641
43787A09641O4998L1868j68229m9748N1348R033r973j5732M2362m764j22143j3513
$$ 109641 174639 206507 38278 -11470 39878 48911 38938 23206 65568 60804 -61339 -74852
43775g4852R4904P44K0597L8707N5221K2847n6762j2808k6505J7122K5247m8318
$$ -74852 20052 20796 41393 80100 135321 158168 101406 88598 62093 79215 104462 56144
43763E6144K2277K5265M7206o0200r8948r5624K6673Q6020L0982l4456J30210
$$ 56144 78421 103686 150892 90692 -8256 -103880 -77207 8813 39795 5339 135549
43752A35549k8097o6491J0542o392r2554l2141L391M7380o525j6221L0485K7213
$$ 135549 107452 40961 51503 45111 -47443 -79584 -76193 -28813 -35338 -51559 -21074 6139
43740F139J03806r5785o7741R5120l204j25105P6126M3829K806m033N5679l5410
$$ 6139 109945 14160 -53581 41539 38335 -86770 -10644 33185 35991 31958 87637 52227
43728E2227k1799k3484N3703J1798k2766n0922m6840l30L1371K2663o688O5274
$$ 52227 30428 6944 60647 72445 49679 -1243 -48083 -48413 -17042 5621 -1067 64207
43716F4207l1798j8702M1951r7462j092R2747O0019L588j05953j9149M9465J8586
$$ 64207 32409 13707 55658 -41804 -42896 49851 109870 113458 7505 -11644 37821 56407
43704E6407Q447n244Q6864j05500o832O3938j11809Q0872M120o2847o8695j8468
$$ 56407 64854 59610 146474 40974 34142 98080 -13729 67143 71263 8416 -60279 -78747
43692g8747O1578o258K6229L8708l7320k2800l423J6791k469p1749j2011M5443
$$ -78747 -17169 -23427 2802 41510 4190 -18610 -22033 -5242 -7711 -79460 -91471 -46028
43680d6028O9958o7776o4183k0669R7346J6567J8660Q9363L0359k2257L5449K1008
$$ -46028 23930 -43846 -108029 -128698 -31352 -14785 3875 93238 123597 101340 136789 157797
43668A57797q679j8607q1174k0955m3249O2168L4980p5433L4786j4687n6131n888
$$ 157797 149118 130511 49337 28382 -14867 47301 82281 6848 41634 26947 -29184 -35072
43656c5072R7198m3624j3377k4209k225J6064n7651J28220Q4669l8610o1613k7164
$$ -35072 62126 18502 5125 -19084 -21309 -5245 -62896 65324 149993 111383 49770 22606
43644B2606j16116m5224K5473L9963K9555J2132K6764K4240O9882j02845K7729
$$ 22606 -93510 -138734 -113261 -73298 -43743 -31611 -4847 19393 89275 -13570 14159
43633A4159m218N5998P5248J1092p6706n6697J4890Q9674J7822j35990q9885Q866
$$ 14159 9941 65939 141187 152279 75573 18876 33766 123440 141262 5272 -84613 -75747
43621g5747N9359N953K6183j33933m2168J17320o322k6919K1057N1508q7635q6084
$$ -75747 -16388 -10435 15748 -118185 -160353 -43033 -49355 -76274 -55217 -3709 -91344 -177428
43609a77428R5229K7312R5680p568k0195q108N0128k6141K7398j5639K3778p6562
$$ -177428 -82199 -54887 40793 33225 13030 4922 55050 28909 56307 40668 64446 -12116
43597a2116p1449K8635P5590M4026K9774L5247k3115p6688o5470J00568L7709
$$ -12116 -83565 -54930 20660 64686 94460 129707 106592 29904 -35566 65002 102711
43586A02711M950P865K9658K2227j7532m4363m7229r3596o918J8048j3987P4857
$$ 102711 107661 115526 145184 167411 149879 105516 58287 -35309 -42227 -24179 -38166 36691
43574C6691j7805L3320P397o3528k2565Q505K4265L8299O4312m7514l9134M0649
$$ 36691 18886 52206 59603 -3925 -26490 -17985 6280 44579 108891 61377 22243 62892
43562F2892J7758L280j8764n3389m507K0340M677j1460l5252J1539P8449N3544
$$ 62892 80650 83930 65166 11777 7270 27610 32287 20827 -14425 -2886 75563 129107
43550A29107K1532j1377r2612m4257p047M2242J6841k2814J8611J4706O2075m6060
$$ 129107 150639 139262 46650 2393 -4654 37588 54429 31615 50226 64932 127007 80947
43538H0947R216P501J5851k5669o9805o546M1216m0902Q1476q5732k5036K4617
$$ 80947 90163 97664 113515 87846 18041 11495 52711 11809 93285 7553 -17483 7134
43526G134M3749O206k5585K517j9232p2245l687R6859m0691l1676k483Q7267l8222
$$ 7134 50883 57089 31504 34021 14789 -57456 -61143 35716 -4975 -36651 -39134 48133 9911
43513I911o7575L0893J481K139l6392M6078M8977L0143o1077l533o3997r8369
$$ 9911 -57664 -26771 -25290 -23151 -59543 -13465 35512 65655 4578 1045 -62952 -161321
43501a61321O9433L9913r2564J22885Q1231j48049J3272Q4486l6500J5330Q394
$$ -161321 -91888 -51975 -144539 -21654 59577 -88472 -75200 9286 -27214 -11884 -3490
43490c490k4739N020P0322L191o9940l6535P9805N7361l8592N8165M1571j37663
$$ -3490 -28229 -23209 47113 50304 -19636 -56171 23634 80995 42403 100568 142139 4476
43478D476q664J00121k763p42l9367j8272J820l1049J2547j4632K8323r3324j02710
$$ 4476 -4188 95933 93170 92428 53061 34789 36609 5560 18107 3475 31798 -61526 -164236
43465a64236J13617J19785k5933J6898J9613K6496j21553p0665J05212k8375r811
$$ -164236 -50619 69166 43233 60131 79744 106240 -15313 -85978 19234 -9141 -18952
43454a8952R716j2008J88318l6325p9202j00226o3285L6349L9602L4818P447K0153
$$ -18952 -9236 -21244 167074 130749 51547 -48679 -111964 -75615 -36013 -1195 6252 26405
43442B6405J1056k0696J186R047k4710J7292o7631N9687P6815n1380l6355k9000
$$ 26405 37461 16765 17951 26998 2288 19580 -48051 11636 88451 37071 716 -28284
43430b8284K1282M5039l7004L2873O0695r8813j4635l5183J03285p093J039k0948
$$ -28284 -7002 38037 1033 33906 94601 -4212 -18847 -54030 49255 42162 43201 22253
43418B2253L3101q7589L1501j4466K6080J9301j8639j471q6795R33K4565L3613
$$ 22253 55354 -32235 -734 -15200 10880 30181 11542 10071 -76724 -75791 -51226 -17613
43406a7613j5971l3310m3937P6723J6149q7308n9110J29466O1527m8530K8194
$$ -17613 -33584 -66894 -110831 -34108 -17959 -105267 -164377 -34911 26616 -21914 6280
43395F280l6404K5690R2502j8653l895r4489K9661L3220p0768K2936K5400Q7350
$$ 6280 -30124 -4434 88068 69415 65520 -28969 692 33912 -36856 -13920 11480 98830
43383I8830Q326j2854l2877q8756n5413n48l6749j9752O7722M0026M1644P2369
$$ 98830 107156 94302 61425 -27331 -82744 -83292 -120041 -139793 -72071 -32045 9599 81968
43371H1968j027Q2601n914J5337p1329P3713P0005j42645q1132M9159j4078m7852
$$ 81968 80941 163542 157628 172965 101636 175349 245354 102709 21577 70736 56658 8806
43359H806J2310q4062O7848p094j7728m858j1748J65613o4761L2137M0768l9387
$$ 8806 21116 -62946 4902 -2192 -19920 -24778 -36526 129087 64326 96463 137231 97844
43347I7844n5005M5180M7285n3543L0894j3130O496o7350r825m4010k3557J955
$$ 97844 42839 88019 135304 81761 112655 99525 106021 38671 28846 -15164 -38721 -36766
43335c6766M594O0358O1785m0235p9677O5358j02724P3149R0852l1519R134l494
$$ -36766 -32172 28186 89971 49736 -29941 35417 -67307 5842 96694 65175 74309 70815
43323G0815M3572l9679l3973K3075M5766M467k2586j1074j07670j2360P3971m896
$$ 70815 114387 74708 40735 63810 109576 114043 91457 80383 -27287 -39647 34324 29428
43311B9428l230O9169J50957j60015j1397Q9109j6907r6026N2755M0772l9182
$$ 29428 26198 95367 246324 86309 74912 164021 147114 51088 103843 144615 105433
43300A05433j1739L003j9542j723l3164L5240P7991o2390q9603j5096J05530n3663
$$ 105433 93694 96697 77155 75432 42268 77508 155499 93109 3506 -11590 93940 40277
43288D0277r7515k0073k2639l220O8207R4919N1383M4988n8942p3136L580o9294
$$ 40277 -57238 -77311 -99950 -103170 -34963 59956 111339 156327 97385 24249 27829 -41465
43276d1465m6122N3405k0785J55524j0682p4229n980M1397n2954J02367J2609
$$ -41465 -87587 -34182 -54967 100557 89875 15646 9666 51063 -1891 100476 113085
43265A13085o1561K80j1903k0865m2110M587m4986J2999N0933Q1564L4659l3745
$$ 113085 51524 51804 39901 19036 -23074 -18487 -63473 -50474 459 82023 116682 82937
43253H2937l9005j9930Q0021j6399j0681l6536r3291j1459J2911O7472l8777l0412
$$ 82937 43932 24002 104023 87624 76943 40407 -52884 -64343 -51432 16040 -22737 -53149
43241e3149M4994M0227L8908P9j9212Q7163M5175r623o2214j02180n7475m131
$$ -53149 -8155 32072 70980 71059 51847 139010 184185 174562 112348 10168 -47307 -51438
43229e1438M3506j2909Q066P4627n6353N4331Q110k659R592L2796j20632n1076
$$ -51438 -7932 -20841 -12775 61852 5499 59830 67940 65281 74873 107669 -12963 -64039
43217f4039J27257J15902N808j977p8767q7071M9819k2363K8979o8216r7875R9184
$$ -64039 63218 179120 184928 182951 104184 17113 66932 44569 73548 5332 -92543 6641
43205F641K1119K4580m2204J9466K564K4557K900N4865L2751l3728K8475p1772
$$ 6641 27760 52340 10136 29602 32166 56723 59623 114488 147239 113511 141986 70214
43193G0214j5976j3272o586K5577p0212P5613K2812M2327k0378k1421j30555k1829
$$ 70214 54238 40966 34380 59957 -10255 65358 88170 130497 110119 88698 -41857 -63686
43181f3686J47646n5117k7639Q0220J8033o2962K9227o3269j4321j3777l3092
$$ -63686 83960 28843 1204 81424 99457 36495 65722 2453 -11868 -25645 -58737
43170e8737R2305k1164L968m1837m3898k3232N5352K5694L8925l0786k2652M9495
$$ -58737 33568 12404 16372 -25465 -69363 -92595 -37243 -11549 27376 -3410 -26062 23433
43158B3433l859m4827j0713J3045P4835n3514q5025O1797L1781N614K2300k6937
$$ 23433 19574 -25253 -35966 -22921 51914 -1600 -86625 -24828 6953 12567 34867 7930
43146G930J04139l3132r0442K3355k2722J8810p9382o3860R7806L2371M8479m2736
$$ 7930 112069 78937 -11505 11850 -10872 7938 -71444 -135304 -37498 -5127 43352 616
43134F16K7403L1200q549j06665n4338J0334l3625N5652N2159l0828O5236k9962
$$ 616 28019 59219 50670 -55995 -110333 -99999 -133624 -77972 -25813 -56641 8595 -21367
43122b1367j3916k7310J46364J2303l45n5930m0563l0129R68j2542m0851J06322
$$ -21367 -35283 -62593 83771 96074 95729 39799 -764 -30893 -29925 -42467 -83318 23004
43110B3004L3412N302P2804l2976l0607J2076K4182l4050O5745M5914q1746j1194
$$ 23004 56416 61718 134522 101546 70939 83015 107197 73147 138892 184806 103060 91866
43098I1866J5029m8712k4945l0170j2168J385j4756L8938j04630j9286J06484
$$ 91866 106895 58183 33238 3068 -9100 -7715 -22471 16467 -88163 -107449 -965
43087i65N0066L7597m1398k133J9731N5802l7533p0271K0538J8177P8567J0969
$$ -965 49101 86698 45300 43167 62898 118700 81167 10896 31434 49611 128178 139147
43075A39147K6616j01551J0926J1447L1294o4814k5221k0809J9086O2466n4316
$$ 139147 165763 64212 75138 86585 117879 53065 27844 7035 26121 88587 34271
43064C4271J4818m0194j1173O665n2416j4003J01828M5013L6720q9237k1812J7729
$$ 34271 49089 8895 -2278 4387 -48029 -62032 39796 84809 121529 32292 10480 28209
43052B8209j2914m5928J00779N3253L1702m4392m0153J9507l8785P9408k5941
$$ 28209 15295 -30633 70146 123399 155101 110709 70556 90063 51278 130686 104745
43041A04745r5089p4397k9967J6340J893N6822K4115J886o505k3608j0857R0037
$$ 104745 9656 -64741 -94708 -78368 -76475 -19653 4462 6348 -157 -23765 -34622 55415
43029E5415M7749n7489K1814M994o7678J3608m3231m9799m1462Q0936J30857k595
$$ 55415 103164 45675 67489 72483 4805 18413 -24818 -74617 -116079 -35143 95714 93119
43017I3119l2193p994j0033M2119L8220J02p4601K9008J6791k2866k9181N170
$$ 93119 60926 52932 42899 85018 123238 123340 48739 77747 94538 71672 42491 47661
43005D7661k5425m0765J05882K9086l2437n1813l2883J3983R8711J04331p4200
$$ 47661 22236 -18529 87353 116439 84002 32189 -694 13289 112000 216331 142131
42994A42131m7589j46121Q6748N719o2126p690O4464L734l3020m6987K2247q0031
$$ 142131 94542 -51579 35169 40888 -21238 -28928 35536 39270 6250 -40737 -18490 -98521
42982i8521J2855L9531K1604O784o0263M1454O682O2875J4392l2167M7692j3668
$$ -98521 -85666 -46135 -24531 -17747 -78010 -36556 -29874 33001 47393 15226 62918 49250
42970D9250m8107k2752m0935m0461K1959M5708K7125M6415L0411R467r9237m0591
$$ 49250 1143 -21609 -62544 -103005 -81046 -35338 -8213 38202 68613 78080 -21157 -61748
42958f1748K9750l6842J921P0418k4807L4366L2167K573j05436L5065N1324P3889
$$ -61748 -31998 -68840 -66919 3499 -21308 13058 45225 47798 -57638 -22573 28751 102640
42946A02640k0190J9449r9445l9770N4773N6685j1128J3584j5639J3315m4440
$$ 102640 82450 101899 2454 -37316 17457 74142 63014 76598 60959 74274 29834
42935B9834l0678j01219o522o1258O7911L8129J33643P2814l8975m9614j2495
$$ 29834 -844 -102063 -108585 -169843 -101932 -63803 69840 142654 103679 54065 41570
42924D1570l2778J28483K2544l6291m9373J698q8326m2531K5383m1011m2687k4109
$$ 41570 8792 137275 159819 123528 74155 75853 -12473 -55004 -29621 -70632 -113319 -137428
42912a37428j4096N7554K938J5386J09855P3512j5146M7573k6926q3310l1515
$$ -137428 -151524 -93970 -91032 -75646 34209 107721 92575 140148 113222 29912 -1603
42901a603P879j5563j1384p3874O6487J58825l3235p798k8522m5300P2045l1347
$$ -1603 6276 -9287 -20671 -94545 -28058 130767 97532 89734 61212 15912 87957 56610
42889E6610l4052l3488N0645L501n135q514K5691k3907J4061l921j07740k1969
$$ 56610 22558 -10930 39715 43216 38081 29567 55258 31351 45412 41491 -66249 -88218
42877h8218r24O2313J473o1553N0656M9328m5938L5520J5332m0938R5317M7897
$$ -88218 -89142 -26829 -25356 -86909 -36253 13075 -32863 2657 17989 -22949 72368 120265
42865A20265n0302L4574o0296m9393j9967l6244k9669k537O7826M817o4880L8567
$$ 120265 69963 104537 44241 -5152 -25119 -61363 -91032 -93569 -25743 -20926 -85806 -47239
42853d7239N417k942j801m2329P8443O1188N194r5345o0233O3300K8781o3013
$$ -47239 -41822 -44764 -46565 -88894 -10451 50737 55931 -39414 -99647 -36347 -7566 -70579
42841g0579k5216M1191O1412J9961m6875R6741L9782l3135r4792N989L1880k4398
$$ -70579 -95795 -54604 6808 26769 -20106 76635 116417 83282 -11510 -5521 26359 1961
42829A961n1398M1141o7497k2627O1487k693j8943j0043R3776L3330l18O02M7585
$$ 1961 -49437 -8296 -75793 -98420 -36933 -39626 -58569 -68612 25164 58494 58176 58778 106363
42816A06363j22008k9542o3845R5347M0603K0985m2802m211L1844Q3758k75j01529
$$ 106363 -15645 -45187 -109032 -13685 26918 47903 5101 890 32734 116492 116217 14688
42804A4688m6261k2451J4228J9637N5366N6626m7444m8861R363R3979q3713m1415
$$ 14688 -31573 -54024 -39796 -20159 35207 91833 44389 -4472 4891 98870 15157 -26258
42792b6258P3315n295j8562p0164k3338L0519n2867O6465n465m2170m042L1886
$$ -26258 47057 41762 23200 -46964 -70302 -39783 -92650 -26185 -31650 -73820 -77862 -45976
42780d5976J0344K5037m4008N78Q6220j2842l595O5133M7799q1935m7064L1164
$$ -45976 -35632 -10595 -54603 -54025 32195 19353 15758 80891 128690 46755 -309 30855
42768C0855P2768k1082l1835N5942n7042n0028N7451J6464q0056k5622J8055j3586
$$ 30855 103623 82541 50706 106648 49606 -422 57029 73493 -6563 -32185 -14130 -27716
42756b7716m2218M7796Q9657O6897R320k1177R881m56n2824k0915p809n0935L4815
$$ -27716 -69934 -22138 67519 134416 143736 122559 132440 131984 79160 58245 50436 -499 34316
42743C4316L1154L3654M1229j8839k2706K0892o3415j919k0368r9765R0289O9339
$$ 34316 65470 99124 140353 121514 98808 119700 56285 54366 33998 -65767 24522 93861
42731I3861j28045o9736M0583p0685L3197J0412K8022J22697M8670j04878k7289
$$ 93861 -34184 -103920 -63337 -134022 -100825 -90413 -62391 60306 108976 4098 -23191
42720b3191M9016L0490k6447p2144Q4212n5634k2930Q0881Q2801p3205j7986p086
$$ -23191 25825 56315 29868 -42276 41936 -13698 -36628 44253 127054 53849 35863 28777
42708B8777k7489o1199l3931m108o4029j271Q9295M1680n4690j8899O4633J00394
$$ 28777 1288 -59911 -93842 -97950 -161979 -163250 -73955 -32275 -86965 -105864 -41231 59163
42696E9163K7524o903N1094k5256q8456l9309L8733K3388K3367o6741j0444K3861
$$ 59163 86687 79784 130878 105622 17166 -22143 16590 39978 63345 -3396 -13840 10021
42684A0021k1938l0853q7952J48845M6876l0798L637j3105j01561k1203R3166
$$ 10021 -11917 -42770 -130722 18123 64999 34201 37838 24733 -76828 -98031 -4865
42673d865N5841n1548M4148N3294l8772M7455M1921o5119q5902o7224J55837P9318
$$ -4865 50976 -572 43576 96870 58098 105553 147474 82355 -3547 -70771 85066 164384
42661A64384n7941m3552J0547L968j5852q9212J0298j0409j3207J30035J2935
$$ 164384 106443 62891 73438 77406 61554 -27658 -17360 -27769 -40976 89059 101994
42650A01994p1178j3787M4017l2721K2457J67706j14788k313K5726j7756j4249
$$ 101994 30816 17029 61046 28325 50782 218488 103700 101387 127113 109357 95108
42639I5108l0096j4281q0702r6185P3837J1707o322j9950O8510J8529K5821Q6764
$$ 95108 65012 50731 -29971 -126156 -52319 -40612 -46934 -66884 1626 20155 45976 132740
42627A32740n8773K6471o1353l9657k87J2466Q1805M4927p8441n1838l6802J5701
$$ 132740 73967 100438 39085 -572 -859 11607 93412 138339 59898 8060 -28742 -13041
42615a3041R0915o032q2286K6193K3493o0112K3024N0687p0918L489m0299J3440
$$ -13041 77874 71842 -10444 15749 39242 -20870 2154 52841 -18077 -14588 -54887 -41447
42603d1447L3173j8546p490n3887P1728l8065K7083m1073O5747O149Q8232l6103
$$ -41447 -8274 -26820 -34310 -88197 -16469 -54534 -27451 -68524 -2777 3372 91604 55501
42591E5501R492P8290Q909o9037r9527j0352R1247k9478l1979O0225J4328o4361
$$ 55501 64993 143283 152192 83155 -16372 -26724 64523 35045 3066 63291 77619 13258
42579A3258m4677n864Q6697Q3185m6819l5463Q9098p7901r7511J59295J9827p6994
$$ 13258 -31419 -37283 49414 132599 85780 50317 139415 61514 -35997 123298 143125 66131
42567F6131L5618M7018j09243K1581k0931l9300m010N2809L6549R990j0218P574
$$ 66131 101749 148767 39524 61105 40174 874 -3136 49673 86222 96212 85994 93568
42555I3568p301q5743J4141N6107k7848o5875o0466j06563R9203Q3029k7642P5344
$$ 93568 86267 524 14665 70772 42924 -22951 -83417 -189980 -90777 -7748 -35390 39954
42543C9954M8380m8680j04908n3930J5954O121Q2268M8720q0636m514n4318N1406
$$ 39954 88334 39654 -65254 -119184 -103230 -97109 -14841 33879 -46757 -51271 -105589 -54183
42531e4183M9302j11833O2024J21617j3975j00589j41664P0764J09983J9160l0387
$$ -54183 -4881 -116714 -54690 66927 52952 -47637 -189301 -118537 -8554 10606 -19781
42520a9781k1325K6747J0453N5094M703R2306P2611j69242m0708k6080K2603M2306
$$ -19781 -41106 -14359 -3906 51188 55891 148197 220808 51566 10858 -15222 7381 49687
42508D9687M2782k6273l4509K1274m0507O1202j5928p1522L2197Q527j8031l9094
$$ 49687 92469 66196 31687 52961 12454 73656 57728 -13794 18403 26930 8899 -30195
42496c0195j1399O3916n885O674m0354k3015m86l3185O8506o9774Q1626L6355
$$ -30195 -41594 22322 16437 23111 -17243 -40258 -40744 -73929 -5423 -75197 6429 42784
42484D2784j02781M3747q4059L860J069K8298N9814J1312N4851J9233l7489q3490
$$ 42784 -59997 -16250 -100309 -96449 -95380 -67082 -7268 4044 58895 78128 40639 -42851
42472d2851o5652m878J02409M9505k1298o2387L6570P4677o3231q1054p9140N89
$$ -42851 -108503 -113381 -10972 38533 17235 -45152 -8582 66095 2864 -78190 -157330 -156741
42460a56741J0485q157N3359J32996O6981r7098r5745m5729N1278P2217k318j5265
$$ -156741 -146256 -154413 -101054 31942 98923 1825 -93920 -139649 -88371 -16154 -18472 -33737
42448c3737p697n5491P5503Q7331o2442m179O0587j08566Q9842M9127j6241j22493
$$ -33737 -41434 -96925 -21422 65909 3467 -712 59875 -48691 41151 90278 74037 -48456
42436d8456j01142R4334l4149J7891J3835J7386P9425J08992n267m0528l6870
$$ -48456 -149598 -55264 -89413 -71522 -57687 -40301 39124 148116 142849 102321 65451
42425F5451j1569j22767k0046N1316m120J7934j1585M6279P2484J5493k4980m4796
$$ 65451 53882 -68885 -88931 -37615 -41735 -23801 -35386 10893 83377 98870 73890 29094
42413B9094N095N562p6660J6603O1303L99j5199p43n1283n2254L3986m6261k5553
$$ 29094 34189 39751 -36909 -20306 40997 41396 26197 25454 -25829 -78083 -44097 -90358 -115911
42400a15911P5104Q5288o0835k2745L7520M7592o588m2422k1231N0681J0631j611
$$ -115911 -40807 44481 -16354 -39099 -1579 46013 39425 -2997 -24228 26453 37084 35473
42388C5473N9898r7102p7088N2887r0859k4747P2086K8188k3982P9529O0290K1233
$$ 35473 95371 -1731 -78819 -25932 -116791 -141538 -69452 -41264 -65246 14283 74573 95806
42376I5806k6111q6350M2678m9226n9540N523J19011L9157r3802k5471J6539L68
$$ 95806 69695 -16655 26023 -23203 -82743 -77220 41791 80948 -12854 -38325 -21786 -21418
42364b1418N6519k8203L2649J8751p9601k8516M413N4668k4238l174P3051o9401
$$ -21418 35101 6898 39547 58298 -21303 -49819 -45406 9262 -14976 -18150 54901 -14500
42352a4500L2285n437l0211k865R1210L1557q6136n5655P1740K2606k3031L4975
$$ -14500 17785 12348 -17863 -20728 70482 102039 15903 -39752 31988 54594 31563 66538
42340F6538l4531L5820k4684K6707J8041K1341K0876p5076m9880K3067k042Q348
$$ 66538 32007 67827 43143 69850 87891 109232 130108 55032 5152 28219 26177 34525
42328C4525m0222J07359m0922p9407K5324p3018j2790L5369O8905k7976J1877
$$ 34525 -5697 101662 60740 -18667 6657 -66361 -79151 -43782 25123 -2853 9024
42317I024K814j00011J04194J2938j3976o3606p6573M3148O8288r481J4216m820
$$ 9024 11838 -88173 16021 28959 14983 -48623 -125196 -82048 -13760 -23241 -9025 -13845
42305a3845m1307Q3656j0440L0028L4549p999j10682L3483K6485M5051R601r5700
$$ -13845 -55152 28504 18064 48092 82641 74642 -36040 -2557 23928 68979 78580 -17120
42293a7120L0254m469p6241J0866n498L9612L5313j6463M5522o6700N3496j0828
$$ -17120 13134 8665 -67576 -56710 -62208 -22596 12717 -3746 41776 -24924 28572 17744
42281A7744Q6110k3485n5683N5356j844j8196q4348J32535K6741j22286j25600
$$ 17744 103854 80369 24686 80042 78198 60002 -24346 108189 134930 12644 -112956
42270a12956K8850M1017J4859O1280P4657m821m6526N8815n064q5945j24416p5584
$$ -112956 -84106 -43089 -28230 33050 107707 102886 56360 115175 110111 24166 -100250 -175834
42258a75834M0035N0657J05482P612k9553O0170j2846k9822N6499j6290K5760
$$ -175834 -135799 -85142 20340 27952 -1601 58569 45723 15901 72400 56110 81870
42247H1870m9913j9362q201m6773l9559j0678M2994O7609l9395n0860J5976L1703
$$ 81870 31957 12595 4394 -42379 -81938 -92616 -49622 17987 -21408 -72268 -56292 -24589
42235b4589l8227M3603k057K3460K9032M8468n5118q4009N6946m3389q0033M8977
$$ -24589 -62816 -19213 -21270 2190 31222 79690 24572 -59437 -2491 -45880 -125913 -76936
42223g6936P9239J13472n5496j11157P10K5792M8439l4831M8677K801n2602q1708
$$ -76936 2303 115775 60279 -50878 -50168 -24376 24063 -10768 37909 40710 -11892 -93600
42211i3600l6785r475R3577k5801m9582N6263O7044M8518M3107m5128N185k225
$$ -93600 -130385 -139860 -46283 -72084 -121666 -65403 1641 50159 93266 48138 53323 51098
42199E1098j3626N2165N4441o3296l5439o2638R567Q8896K7252j04687K9539R8326
$$ 51098 37472 89637 144078 80782 45343 -17295 -7728 81168 108420 3733 33272 131598
42187A31598j8539r5809l6223J5835O4598K5354p2625j0970Q327K3445N4467K3374
$$ 131598 113059 17250 -18973 -3138 61460 86814 14189 3219 11546 34991 89458 112832
42175A12832L9415o3153k8133l2098J0076k0131n7805n487O2086l1934n4236l7131
$$ 112832 152247 89094 60961 28863 38939 18808 -38997 -44484 17602 -14332 -68568 -105699
42163a05699K8075L8139K4167r3966q8622R2249J07488P1869n4372q033o849K1028
$$ -105699 -77624 -39485 -15318 -109284 -197906 -105657 1831 73700 19328 11295 4446 25474
42151B5474L5462R753Q5225P499r3418m2565k6498M8275q3419j7963k6591N8795
$$ 25474 60936 70689 155914 163413 69995 27430 932 49207 -34212 -52175 -78766 -19971
42139a9971J10246j8329q1657l5342J14489m5090q1587l0772L0873J21263k936
$$ -19971 90275 71946 -9711 -45053 69436 24346 -57241 -88013 -57140 64123 61187
42128F1187q231L5515L9702O2859j03478j25676O0770o376j5867k5635J8690K174
$$ 61187 52956 88471 128173 191032 87554 -38122 22648 16272 405 -25230 -6540 -4366
42116d366N5018k0966p5561K1376J4044J7263l178p5016N1885L2175q5177o5800
$$ -4366 50652 29686 -45875 -24499 -10455 6808 3630 -71386 -19501 12674 -72503 -138303
42104a38303P3378L4173L298l1516l0163L4980J6193J37600K0331k9411J9984
$$ -138303 -64925 -30752 -27454 -58970 -89133 -54153 -37960 99640 119971 90560 110544
42093A10544l836J0706p6397p8715k9634n128J5598M3537n471P7609l7104n5067
$$ 110544 106708 117414 41017 -37698 -67332 -72460 -56862 -13325 -18796 58813 21709 -33358
42081c3358K6269l3831j06498J20334J35309k3029l3443N7678l8912K1913J6987
$$ -33358 -7089 -40920 -147418 -27084 108225 85196 51753 109431 70519 92432 109419
42070A09419p0045l7751L3022L395N1819O421J2805j5222p8168P0036j6187J2149
$$ 109419 39374 1623 34645 38040 89859 96280 109085 93863 15695 85731 69544 81693
42058H1693m5824K0689J3408J9922R7620j16173O907l5085j02204L3389m946j0997
$$ 81693 35869 56558 69966 89888 187508 71335 78242 43157 -59047 -25658 -30604 -41601
42046d1601Q8438K7117m4138k1130L9451M2326n0191K4717K3555K035r3659r1242
$$ -41601 46837 73954 29816 8686 48137 90463 40272 64989 88544 90579 -3080 -94322
42034i4322K5113P4152L3452j1072l3825K7653q6065r5857K9258J48131P1632
$$ -94322 -69209 4943 38395 27323 -6502 21151 -64914 -160771 -131513 16618 88250
42023H8250l2480p762n969Q9082k8591p6850q1699M1133m5008K85R028M3992J74
$$ 88250 55770 48008 42039 131121 102530 25680 -56019 -14886 -59894 -59609 -50581 -6589 -6415
42010f415n5777n2622P6615k679k6249K5605J1460m2284O2911J9745l7746R5021
$$ -6415 -62192 -114814 -38199 -40878 -67127 -41522 -30062 -72346 -9435 10310 -27436 67585
41998F7585J7613l0636l4510o9937j5049m5799J4521l829n3272K3153J32402P4517
$$ 67585 85198 54562 20052 -49885 -64934 -110733 -96212 -100041 -153313 -130160 2242 76759
41986G6759N3951o5995o0504j6671L8136O5489m749r7566q2566K7488J710q8860
$$ 76759 130710 64715 4211 -12460 25676 91165 86416 -11150 -93716 -66228 -64518 -153378
41974a53378K8400J40254K9000o9030j6567M5898M460L4533m3227n596L6686n0717
$$ -153378 -124978 15276 44276 -24754 -41321 4577 9037 43570 343 -5253 31433 -19284
41962a9284o8229m0553L4614R8036K2909O1456j3571m8121j9170O125M54P4074
$$ -19284 -87513 -128066 -93452 4584 27493 88949 75378 27257 8087 14212 14666 88740
41950H8740K6424K8599j73931k6700J8199P2800M0041l7388r563p2086q972J1758
$$ 88740 115164 143763 -30168 -56868 -38669 34131 74172 36784 27221 -44865 -53837 -42079
41938d2079K3238m5671J37951n677M6321J934k6739p7752K5226J8635k2961j06282
$$ -42079 -18841 -64512 73439 67762 114083 116017 89278 11526 36752 55387 32426 -73856
41926g3856j5470J23291R3001N33k8100K9482o3130k866Q451o550r5050o8687
$$ -73856 -89326 33965 126966 127499 99399 128881 65751 62885 71336 64786 -30264 -98951
41914i8951N8025j7472Q4550m327K0697j15334j4391k2722J6976N3590j0760O1028
$$ -98951 -40926 -58398 26152 21825 42522 -72812 -87203 -109925 -92949 -39359 -50119 10909
41902A0909P340j5836l4019p8537N831L4540P94O5233J5122k2431K78m812J7108
$$ 10909 18249 2413 -31606 -110143 -104312 -69772 -68978 -3745 11377 -11054 -10776 -15588 1520
41889A520O0708m6837N895k0268N0508j6634n3740N2685k4478R0097m8607k0394
$$ 1520 62228 15391 21286 1018 51526 34892 -18848 33837 9359 99456 50849 30455
41877C0455j19905j3235L2959n0314n24J3457L3291J23300j1627r1964K0593p9156
$$ 30455 -89450 -102685 -69726 -120040 -120564 -107107 -73816 49484 37857 -54107 -33514 -112670
41865a12670N5112Q2277m1069m1641l2932k9808M3801j3501J7830j8319J0024
$$ -112670 -57558 24719 -16350 -57991 -90923 -120731 -76930 -90431 -72601 -90920 -80896
41854h0896j4790R167K3315L2647m7008J04116r296K7474n0225p638M5732R5802
$$ -80896 -95686 -86519 -63204 -30557 -77565 26551 17255 44729 -5496 -13134 32598 128400
41842A28400j59185j2130J13782N1540k2175j2542n6839o6060J0051K7776n8137
$$ 128400 -30785 -42915 70867 122407 100232 87690 30851 -35209 -25158 2618 -55519
41831e5519m0330j3944k0161R0527P8641l7602O2673l7422J5205M4024J0552n3345
$$ -55519 -95849 -109793 -129954 -39427 39214 1612 64285 26863 42068 86092 96644 43299
41819D3299J449P642l7119l5988l3498o1827J00458R8708K5498k8464p8251M6894
$$ 43299 44748 52390 15271 -20717 -54215 -116042 -15584 83124 108622 80158 1907 48801
41807D8801M2556N270l7803P528k4530q5608l0541P3362j4936J3365k2675J12366
$$ 48801 91357 96627 58824 66352 41822 -43786 -74327 -965 -15901 -2536 -25211 87155
41795H7155O333r5546o6654K6597Q4641L730q2592j3505k7131J3247J20988n383
$$ 87155 93488 -2058 -68712 -42115 42526 46256 -36336 -49841 -76972 -63725 57263 51880
41783E1880o4874k672M1221k3299j7466R3949K7878k3063L011j7045m9698p014
$$ 51880 -12994 -15666 25555 2256 -15210 78739 106617 83554 86565 69520 19822 12808
41771A2808K1050l2568k1J7103k9766L2150K734n7982j901J14215k1360l2772
$$ 12808 33858 1290 1269 18372 -11394 20756 23490 -34492 -36393 77822 56462 23690
41759B3690O312o7005Q0386N1623L3756j01309o7882n382J5873J04385k0999r3684
$$ 23690 30002 -37003 43383 95006 128762 27453 -40429 -45811 -29938 74447 53448 -40236
41747d0236L6602J5905n3190K6468j0777O1870m9043k622m9351Q596l7066n1771
$$ -40236 -3634 12271 -40919 -14451 -25228 36642 -12401 -15023 -64374 -55778 -92844 -144615
41735a44615K6077J19863N5382l1677L3742M5489l5405k7218k1234p6133m0843
$$ -144615 -118538 1325 56707 25030 58772 104261 68856 41638 20404 -55729 -96572
41724i6572N460L5996J27352j5726k9886j06474k0325M5781R3426R6740P635j34690
$$ -96572 -91112 -55116 72236 56510 26624 -79850 -100175 -54394 39032 135772 143407 8717
41712H717o2548N833k1711l4749N0897N8302R4288m5180n7312K841q181J1115
$$ 8717 -53831 -47998 -69709 -104458 -53561 4741 99029 53849 -3463 -622 -8803 2312
41700B312Q0497m7028j09507N1070P4176p9800k9641J21755J02709j10501r3696
$$ 2312 82809 35781 -73726 -22656 51520 -28280 -57921 63834 166543 56042 -37654
41689c7654P7491M9766n759k9006j5602j19817o4222K5930O31Q8406J03797M7886
$$ -37654 39837 89603 83844 54838 39236 -80581 -144803 -118873 -118242 -29836 73961 121847
41677A21847q7902n0784J1483L3316K2152o4943N0287m5944P504N178o5037j5360
$$ 121847 33945 -16839 -5356 27960 50112 -14831 35456 -10488 -2984 2194 -62843 -78203
41665g8203J18740p9032l8153O4206J0833Q632R783L8318j12988j9833Q3030K5651
$$ -78203 40537 -38495 -76648 -12442 -1609 7023 16806 55124 -57864 -77697 5333 30984
41653C0984O3202m1300l5865O0374j16734o7677L8816J05250j0485r9967o4986
$$ 30984 94186 52886 17021 77395 -39339 -107016 -68200 37050 26565 -73402 -138388
41642a38388K5774P3011L449k1940K9725L8009K393r7356P1545r798q2629k1812
$$ -138388 -112614 -39603 -36154 -58094 -28369 9640 12033 -85323 -13778 -23576 -106205 -128017
41630a28017Q5422K4747n9960l5708l4564R2655M4678O794k4797o1923l5335J13896
$$ -128017 -42595 -17848 -77808 -113516 -148080 -55425 -10747 -3953 -28750 -90673 -126008 -12112
41618a2112L2035K444M4433p7983J9948K9710O1340j0050j6086N1389j22414J9608
$$ -12112 19923 22367 66800 -11183 8765 38475 99815 89765 73679 125068 2654 22262
41606B2262Q345p3932l4017O0318Q3632o3163N5368M8059J1967K2354p0638j17311
$$ 22262 30607 -43325 -77342 -17024 66608 3445 58813 106872 118839 141193 70555 -46756
41594d6756n5003L6339O7217P6889j25171n7759R382L6006J4692j9049k8212J6463
$$ -46756 -101759 -65420 1797 78686 -46485 -104244 -94862 -58856 -44164 -63213 -91425 -74962
41582g4962J35362O8923q1006o286m0978K109P4364m073L3731j7133r6141p9870
$$ -74962 60400 129323 48317 42031 1053 3162 77526 73453 107184 90051 -6090 -85960
41570h5960O7823J43637r464O447K0827o6288q8692k8848O106l1247L9147N1989
$$ -85960 -18137 125500 116036 122483 143310 77022 -11670 -40518 -34412 -65659 -26512 25477
41558B5477N5076J787j9186n2791n6536K7901k5933P2342K1646J4240r3663l0825
$$ 25477 80553 82340 63154 10363 -46173 -18272 -44205 28137 49783 64023 -29640 -60465
41546f0465J8541R1819L68r8908l4242K1958P1899N133o4581Q911l8423l2064
$$ -60465 -41924 49895 50263 -48645 -82887 -60929 10970 16103 -48478 -39567 -77990 -110054
41534a10054N3541P1319K4855L2343k4961o5716m3944J00241O4268j06172K8291
$$ -110054 -56513 14806 39661 72004 47043 -18673 -62617 37624 101892 -4280 24011
41523B4011J5308m5297M7638j935P6958j3542q1715m6174L0541m2255l6325J35176
$$ 24011 39319 -5978 41660 39725 116683 103141 21426 -24748 5793 -36462 -72787 62389
41511F2389p6287L2060R462n501L8776M2845k1392l0161K3289J2969j879o0539
$$ 62389 -13898 18162 27624 22123 60899 103744 82352 52191 75480 88449 86570 26031
41499B6031M3039R5187m8077o1454m1396j4530K4338j23627k5818R0419j2305
$$ 26031 69070 164257 116180 54726 13330 -1200 23138 -100489 -126307 -35888 -48193
41488d8193j6863L2697j8570o1113k7840M5291M5673m1531K0648K2444j07144
$$ -48193 -65056 -32359 -50929 -112042 -139882 -94591 -48918 -90449 -69801 -47357 -154501
41477a54501J3868k0357l3241L4587J37496K5105R851J0707Q208o5245o5659R3488
$$ -154501 -140633 -160990 -194231 -159644 -22148 2957 12808 23515 31723 -33522 -99181 -5693
41465e693P4281o040J7826q5027m8563J8104n220P6379j214n1438K1831N5327
$$ -5693 68588 62548 80374 -4653 -53216 -35112 -40332 36047 34833 -16605 5226 60553
41453F0553j8274j707M955m8429K8883K5005M6038n501q2625J4250k3016J0704
$$ 60553 42279 40572 45527 -2902 25981 50986 97024 91523 8898 23148 132 10836
41441A0836o8263n5253J10081Q6729j20518m0282J0981K6724L6716j5821N8092
$$ 10836 -57427 -112680 -2599 84130 -36388 -76670 -65689 -38965 -2249 -18070 40022
41430D0022K9424k2252j2381k311j2585J9128M6728J3499o866p3712M3835m4236
$$ 40022 69446 47194 34813 32502 19917 39045 85773 99272 92406 18694 62529 18293
41418A8293q6051o7978j4738P7749M6193O9548o017M2512k9425k477O3932k1328
$$ 18293 -67758 -135736 -150474 -72725 -26532 43016 36999 79511 50086 47609 111541 90213
41406I0213k3991J4425p3680N3215J2888l332l7633N89P849J6555N7395J4139
$$ 90213 66222 80647 6967 60182 73070 69738 32105 32694 40543 57098 114493 128632
41394A28632K5956K6314p7494p9480n7077L9401N7548m4501J3755j3902k1550
$$ 128632 154588 180902 103408 23928 -33149 6252 63800 19299 33054 19152 -2398
41383b398l1570L3752M7688Q846r798p9549K2946J0335Q656M341J3446n8979P6494
$$ -2398 -33968 -216 47472 56318 46520 -33029 -10083 252 8908 13249 26695 -32284 44210
41370D4210K6638j1884K9683j1371j8477o2823N1614J06236K6372j19037L0159
$$ 44210 70848 58964 88647 77276 58799 -4024 47590 153826 180198 61161 91320
41359I1320l8307p3328l2943m952J7174q624j3153R112L1561K874Q5921O5805
$$ 91320 53013 -20315 -53258 -58210 -41036 -49660 -62813 -53701 -22140 -19266 66655 132460
41347A32460n6454Q882n6243J4157m5018o2849k100K401J789k5662P7530L3588
$$ 132460 76006 84888 28645 42802 -2216 -65065 -67165 -64764 -62975 -88637 -11107 22481
41335B2481n5814j425r463O8506M7311J1591N568n305r906m2560Q1183J5723r7638
$$ 22481 -33333 -34758 -44221 24285 71596 83187 88755 83450 73544 30984 112167 127890 30252
41322C0252p421o0669O0528M0308l9120k954P6117L1316o8728m4269m8812p3771
$$ 30252 22831 -37838 22690 62998 23878 20924 97041 128357 59629 15360 -33452 -107223
41310a07223Q0100L3888L4339K8335k0099o4301o6598j6136R5816l5268q8589
$$ -107223 -27123 6765 41104 69439 49340 -14961 -81559 -97695 -1879 -37147 -125736
41299a25736M0692m408m711n1515J00883J9689L1355n1730J6328K2977P499r3072
$$ -125736 -85044 -89452 -94163 -145678 -44795 -25106 6249 -45481 -29153 -6176 1323 -91749
41287i1749j8932N3101P3696N1323N6050o3593K3606l4713p6865p1056N6173O4806
$$ -91749 -110681 -57580 16116 67439 123489 59896 83502 48789 -28076 -99132 -42959 21847
41275B1847p6278m2360K8370O9447k0126l4394J25204k448k287o9641m0530k7382
$$ 21847 -54431 -96791 -68421 1026 -19100 -53494 71710 69262 66975 -2666 -43196 -70578
$$ [...]
##END NTUPLES=NMR SPECTRUM
##END=
