##TITLE=19F_CA-8566
 CDCl3. 24 sc
 11.2.2019
##JCAMPDX= 6.0         $$ Bruker NMR JCAMP-DX V2.0
##DATA TYPE= NMR SPECTRUM
##DATA CLASS= NTUPLES
##ORIGIN= UXNMR, Bruker Analytische Messtechnik GmbH
##OWNER= root
$$ XWIN-NMR		Version 3.5
$$ Mon Feb 11 14:06:10 2019 Russian Standard Time (UT+4h)  she@DPX200
##.OBSERVE FREQUENCY= 188.290927
##.OBSERVE NUCLEUS= ^19F
##.ACQUISITION MODE= SIMULTANEOUS
##.ACQUISITION SCHEME= undefined
##.AVERAGES= 24
##.DIGITISER RES= 16
##SPECTROMETER/DATA SYSTEM= spect
##.PULSE SEQUENCE= zg
##.SOLVENT NAME= DMSO
##.SHIFT REFERENCE= (INTERNAL, DMSO, 0, 98.3737)
##AUDIT TRAIL= $$ (NUMBER, WHEN, WHO, WHERE, WHAT)
$$ ##TITLE= Audit trail, XWIN-NMR		Version 3.5
$$ ##JCAMPDX= 5.01
$$ ##ORIGIN= Bruker BioSpin GmbH
$$ ##OWNER= she
$$ F:/spectra/data/she/nmr/f19/1/pdata/1/auditp.txt
$$ ##AUDIT TRAIL=  $$ (NUMBER, WHEN, WHO, WHERE, WHAT)
(   1,<2019-02-11 14:05:13.54 +0400>,<she>,<DPX200>,
      <created by zg, POWCHK disabled, PULCHK disabled
       configuration hash MD5:
       00 E9 B6 7A A2 85 ED C7 34 08 36 98 17 FE 4E 26
       data hash MD5: 64K
       B6 49 E7 43 77 CF 88 6D 81 74 80 58 AD 73 2A 55>)
(   2,<2019-02-11 14:05:15.95 +0400>,<she>,<DPX200>,
      <Start of raw data processing
       efp BC_mod = 2 LB = 1 FT_mod = 6 PKNL = 1 PHC0 = 1689.582 PHC1 = 41.75593 SI = 64K 
       data hash MD5: 64K
       6A F0 22 5E D7 A8 16 50 BC 13 C3 AA 40 41 14 D5>)
(   3,<2019-02-11 14:05:33.00 +0400>,<she>,<DPX200>,
      <pk PHC0 = -14.45459 PHC1 = 0.4 
       data hash MD5: 64K
       02 08 CA 36 79 45 CB B5 6F 0D D7 AC 8D CE D9 6F>)
(   4,<2019-02-11 14:05:36.65 +0400>,<she>,<DPX200>,
      <abs ABSG = 5 
       data hash MD5: 64K
       FD FC 5B 9E 3C 83 13 44 3B 2F 02 82 33 C1 5C 6E>)
$$ ##END=
$$ 
$$ hash MD5
$$ 6E 95 3C 0A 72 FF 7F 93 55 CB 00 63 0F 81 B6 FA
##$RELAX= 
##$RELAX= 
##$RELAX= 
##$RELAX= 
##$RELAX= 
##$RELAX= 
##$RELAX= 
##$RELAX= 
$$ Bruker specific parameters
$$ --------------------------
##$DU= <F:/spectra>
##$EXPNO= 1
##$NAME= <f19>
##$PROCNO= 1
##$TYPE= <nmr>
##$USER= <she>
##$AMP= (0..31)
100 100 100 100 100 100 100 100 100 100 100 100 100 100 100 100 100 100 
100 100 100 100 100 100 100 100 100 100 100 100 100 100 
##$AQSEQ= 0
##$AQ_mod= 1
##$AUNM= <au_zg>
##$AUTOPOS= <>
##$BF1= 188.310428
##$BF2= 200.13
##$BF3= 200.13
##$BF4= 200.13
##$BF5= 200.13
##$BF6= 200.13
##$BF7= 200.13
##$BF8= 200.13
##$BYTORDA= 1
##$CFDGTYP= 0
##$CFRGTYP= 5
##$CHEMSTR= <none>
##$CNST= (0..31)
1 1 145 1 1 1 1 1 1 1 1 1 1 1 1 1 1 1 1 1 1 1 1 1 1 1 1 1 1 1 1 1 
##$CPDPRG= <>
##$CPDPRG1= <>
##$CPDPRG2= <>
##$CPDPRG3= <>
##$CPDPRG4= <mlev>
##$CPDPRG5= <mlev>
##$CPDPRG6= <mlev>
##$CPDPRG7= <mlev>
##$CPDPRG8= <mlev>
##$CPDPRGB= <>
##$CPDPRGT= <>
##$D= (0..31)
0 1.3 0 0 0 0 0 0 0 0 0 0 0.25 0 0 0 0 0 0 0 0 0 0 0 0 0 0 0 0 0 0 0 
##$DATE= 1549879513
##$DBL= (0..7)
120 120 120 11 120 120 24 19 
##$DBP= (0..7)
150 150 150 150 150 150 150 150 
##$DBP07= 0
##$DBPNAM0= <>
##$DBPNAM1= <>
##$DBPNAM2= <>
##$DBPNAM3= <>
##$DBPNAM4= <>
$$ [...]
##$SUBNAM3= <"">
##$SUBNAM4= <"">
##$SUBNAM5= <"">
##$SUBNAM6= <"">
##$SUBNAM7= <"">
##$SUBNAM8= <"">
##$SUBNAM9= <"">
##$SW= 251.107818259711
##$SWIBOX= (0..15)
0 1 0 0 0 0 0 0 0 0 0 0 0 0 0 0 
##$SW_h= 47281.3238770686
##$TD= 65536
##$TD0= 1
##$TE= 0
##$TE2= 300
##$TE3= 300
##$TEG= 300
##$TL= (0..7)
0 120 53 12 22 120 120 120 
##$TP= (0..7)
150 150 150 150 150 150 150 150 
##$TP07= 0
##$TPNAME0= <>
##$TPNAME1= <>
##$TPNAME2= <>
##$TPNAME3= <>
##$TPNAME4= <>
##$TPNAME5= <>
##$TPNAME6= <>
##$TPNAME7= <>
##$TPOAL= (0..7)
0.5 0.5 0.5 0.5 0.5 0.5 0.5 0.5 
##$TPOFFS= (0..7)
0 0 0 0 0 0 0 0 
##$TUNHIN= 0
##$TUNHOUT= 0
##$TUNXOUT= 0
##$USERA1= <user>
##$USERA2= <user>
##$USERA3= <user>
##$USERA4= <user>
##$USERA5= <user>
##$V9= 5
##$VALIST= <valist>
##$VCLIST= <CCCCCCCCCCCCCCC>
##$VD= 0
##$VDLIST= <DDDDDDDDDDDDDDD>
##$VPLIST= <PPPPPPPPPPPPPPP>
##$VTLIST= <TTTTTTTTTTTTTTT>
##$WBST= 1024
##$WBSW= 4
##$XGAIN= (0..3)
0 0 0 0 
##$XL= 0
##$YL= 0
##$YMAX_a= 29543
##$YMIN_a= -37209
##$ZGOPTNS= <>
##$ZL1= 120
##$ZL2= 120
##$ZL3= 120
##$ZL4= 120
##$ABSF1= 98.37372
##$ABSF2= -152.7273
##$ABSG= 5
##$ABSL= 3
##$ALPHA= 0
##$AQORDER= 0
##$ASSFAC= 0
##$ASSFACI= 0
##$ASSFACX= 0
##$ASSWID= 0
##$AUNMP= <proc_1d>
##$AZFE= 0.1
##$AZFW= 5
##$BCFW= 0
##$BC_mod= 2
##$BYTORDP= 0
##$COROFFS= 0
##$CY= -3
##$DATMOD= 1
##$DC= 0
##$DFILT= <>
##$DTYPP= 0
##$F1P= 0
##$F2P= 0
##$FCOR= 0.5
##$FTSIZE= 65536
##$FT_mod= 6
##$GAMMA= 0
##$GB= 0
##$INTBC= 1
##$INTSCL= 8.653935e-10
##$ISEN= 128
##$LB= 1
##$LEV0= 0
##$LPBIN= 0
##$MAXI= 10000
##$MC2= 0
##$MEAN= 0
##$ME_mod= 0
##$MI= 0.4277144
##$NCOEF= 0
##$NC_proc= -3
##$NLEV= 6
##$NOISF1= -61.99997
##$NOISF2= -62.99997
##$NSP= 0
##$NTH_PI= 0
##$NZP= 0
##$OFFSET= 98.37372
##$PC= 1
##$PHC0= 1675.127
##$PHC1= 42.15593
##$PH_mod= 1
##$PKNL= yes
##$PPARMOD= 0
##$PSCAL= 0
##$PSIGN= 0
##$REVERSE= no
##$SF= 188.296044280273
##$SI= 65536
##$SIGF1= -61
##$SIGF2= -65
##$SINO= 3.502647
##$SIOLD= 65536
##$SREGLST= <1H.CDCl3>
##$SSB= 0
##$STSI= 65536
##$STSR= 0
##$SW_p= 47281.3238770685
##$SYMM= 0
##$S_DEV= 0
##$TDeff= 65536
##$TDoff= 0
##$TI= <>
##$TILT= no
##$TM1= 0
##$TM2= 0
##$TOPLEV= 0
##$USERP1= <user>
##$USERP2= <user>
##$USERP3= <user>
##$USERP4= <user>
##$USERP5= <user>
##$WDW= 1
##$XDIM= 65536
##$YMAX_p= 315340999
##$YMIN_p= -1047381
$$ End of Bruker specific parameters
$$ ---------------------------------
##NTUPLES= NMR SPECTRUM
##VAR_NAME=  FREQUENCY,     SPECTRUM/REAL,   SPECTRUM/IMAG
##SYMBOL=    X,             R,               I
##VAR_TYPE=  INDEPENDENT,   DEPENDENT,       DEPENDENT
##VAR_FORM=  AFFN,          ASDF,            ASDF
##VAR_DIM=   65536,         65536,           65536
##UNITS=     HZ,            ARBITRARY UNITS, ARBITRARY UNITS
##FACTOR=    0.721466756344984, 1,           1
##FIRST=     18523.3820098237, 0,            0
##LAST=      -28757.9418672448, 0,           0
##MIN=       -28757.9418672448, -1047381,    0
##MAX=       18523.3820098237, 315340999,    0
$$ Real data points
##PAGE= N=1
##DATA TABLE= (X++(R..R)), XYDATA
$$ [...]
42390B5043j36752R5150K14070q8564q9179L2722O9580j1224j0417q7668M8889
42379F1650N159o9148j8625J6219o9979L5894J6487R4783j4003M8296j45538P4559
42367C5754q5064p9409N8404o6499J85771J9652n8876J84872N7842j74378l1711
42356D6358r8043j2383m7154j75059J06641Q4081K2581j44771p676J44640P6735
42345d050M8850O319L5776m2951Q3254j46569J0466k5336k10907J1479Q4606p38
42333a49801n8443J19173p2002O7298l254j2300J26782O1903L5510J19648j13904
42322A20610n8826J80789j39782p1849k5931L6054K20678m5549k40431l9222J32134
42311F8675P3014j62238j64738J19734L2466J81686O7784p7696p864J46155k6241
$$ y = [25043, -111709, -16559, 197511, 108947, 19768, 52490, 122070, 110846, 100429, 12761, 61650, 66809, -2339, -20964, -4745, -74724, -38830, -22343, 72440, 58437, 106733, -38805, 35754, -49310, -128719, -70315, -136814, 48957, 68609, 9733, 194605, 252447, 78069, 46358, -51685, -64068, -111222, -286281, -179640, -95559, -72978, -217749, -225425, -80785, -4050, 44800, 51119, 86895, 43944, 127198, -19371, -8905, -34241, -245148, -233669, -149063, -149801, -208244, -89071, -161073, -93775, -97029, -109329, 17453, 79356, 114866, 234514, 120610, 61784, 242573, 102791, 30942, 5011, 41065, 261743, 216194, -24237, -63459, 68675, 141689, -20549, -185287, -65553, -33087, 148599, 216383, 138687, 130823, 276978, 250737]
42300B50737p7643k35183q1908K8383J18607J8654P8364n4375j94495K7562O8704
42289e2593J2052J5655J50198j12740j21997o1505J36487K58296M216r1632J13217
42278B49654O0878j79872j47690o0974J06161k8760p2561R0932L8464N9266r1596
42267B3902r4597Q7435Q9887Q1709r8037k15667L2675K10272R1991q124j94283
42256G163J15143k4156j12720j96605j42369M8031J06002L40254R238j00606O5334
42245A14709J55417k8188k52628j00160M776J83258J5687o1279K68259j47083
42235A52768k01482J1120k9389J29194j180m1500j41221J27119j9064k792q6936
42224a03363L2275J26360l804k9766j37491R0085M8838q605j39623M1722P559
$$ y = [250737, 173094, -62089, -143997, -115614, 2993, 21647, 100011, 45636, -148859, -121297, -52593, -40541, -24886, 125312, 12572, -109425, -170930, -34443, 223853, 228069, 136437, 249654, 310532, 130660, -17030, -78004, 28157, -603, -73164, 17768, 56232, 115498, 23902, -70695, 16740, 106627, 188336, 90299, -125368, -92693, 117579, 209570, 201446, 7163, 122306, 98150, -14570, -211175, -353544, -305513, -199511, 140743, 149981, 49375, 114709, 270126, 241938, -10690, -110850, -106074, 77184, 92871, 31592, 299851, 152768, -48714, -37594, -66983, 62211, 61031, 19531, -121690, 5429, -13635, -16427, -103363, -71088, 55272, 51468, 21702, -115789, -25704, 23134, 14529, -125094, -83372, -75813]
42213g5813k0975o8337O511P9701K66604m3907q5075r888M7279n2564N43J008
42201D5087j16351J28392J12715k23762k2976K33939R6054q6477l66667J8302
42191a81744K80122N9520j00822m0284j6331j34184J18630k09225p1725J69758
42181a26285M9081N9889p8821O4104N7837J01645J52663j46204l9816o2653k13749
42170a82309j8380J45428J12028j7994N2622o0834j19973J7946J56891O6118J11116
42159B62659l3655o8778L9739j39886o2616p1353k4041J18496J5615Q6461j21272
42148A369J00183p147p1784m339p649M5260J82453J53896j78843k25162n6536
42137f8299J57194N6876k5808l9213N9695k21455k9364R7480K33562J29487j38019
$$ y = [-75813, -96788, -165125, -158614, -78913, 187691, 143784, 58709, 48821, 96100, 43536, 44079, 45087, -71264, 57128, 169843, -53919, -76895, 157044, 253098, 166621, -200046, -181744, 98378, 157898, 57076, 16792, 461, -133723, -15093, -224318, -296043, -126285, -77204, -17315, -96136, -32032, 25805, 127450, 280113, 133909, 94093, 31440, -182309, -200689, -55261, 56767, 38773, 91395, 30561, -89412, -71466, 85425, 151543, 262659, 229004, 160226, 199965, 60079, -2537, -73890, -97931, 20565, 36180, 122641, 1369, 101552, 94405, 22621, 18282, 10633, 55893, 238346, 392242, 213399, -11763, -68299, 88895, 145771, 119963, 80750, 140445, -81010, -110374, -12894, 220668, 350155, 212136]
42126B12136k45970K0571K15339K8358N7404j03374q3609p4076n8516n5867K6497
42115f1107J02220j24616M7220K09298Q1589k45283p6426N8074Q7251j36058o0205
42104a18043M9879P572j68008j81298m4140J34319J95609n427J7403O2277O207
42093d3650m5285k3256K9607R1759l5524R4333L9249J03759p2573p0504p8605
42082a0690K4879n0834k9367J77211j3084j50653j06815P4048J53872P8493l5839
42071A11221r616n2033P50Q52j15168Q3202q4320j98460p3861J56370K73523J20043
42059B12503k40441L8713K09051j02508j69140j12795l1297K2510m9482L5496
42049a87390P0435Q8667j35201L2813J14808K08479j48461j24853J3141j01752
$$ y = [212136, -33834, -13263, 202076, 230434, 287838, 184464, 100855, 26779, -31737, -87604, -61107, 41113, -83503, -36283, 173015, 254604, 9321, -67105, -9031, 78220, -57838, -118043, -68164, -60592, -228600, -409898, -454038, -319719, -124110, -129537, -112134, -49857, -43650, -88935, -112191, -82584, 9175, -26349, 67984, 107233, 210992, 138419, 67915, -10690, 14189, -36645, -66012, 111199, 98115, -52538, -159353, -85305, 68567, 147060, 111221, 101605, 49572, 50322, 51174, -63994, 19208, -65112, -263572, -337433, -181063, 92460, 212503, -27938, 10775, 219826, 117318, -51822, -164617, -195914, -173404, -222886, -187390, -116955, -28288, -163489, -130676, -15868, 192611, 44150, -80703, -67562, -169314]
42039a69314m3037K4123R385J05320J2560M1038J20905p4460P048o1049L0141
42028B660J95088L0068m623j3121o0960n8192L4699l0892J54150p890j24623K7
42016A16391j55578j50487L0676K4091N2292P3636R9512j69748j0821J0737M3284
42005c6015o2721J07183J3262R3918j06693p8304J31507J85939J19394j18055
41995B49415j08269M941j2232k11448j6765J37182j08032O3495K295j08325M2802
41984f4941J46457p473k2970P724m761k337R2630n9024K1103n9453K45630j8685
41972B73900j57725j10779p011J79595k36039j79192n6757L4871K32602P0796
41962D4261q8627m5125N1232J44265p0725r3866J69174j7888N5672j04055r0792
$$ y = [-169314, -212351, -188228, -178843, -73523, -60963, -19925, 100980, 26520, 33568, -27481, 2660, 197748, 227816, 223193, 210072, 149112, 90920, 125619, 94727, 248877, 240987, 116364, 116391, -39187, -189674, -158998, -134907, -82615, -8979, 90533, -79215, -90036, -79299, -36015, -98736, 8447, 21709, 115627, 8934, -69370, 62137, 248076, 367470, 249415, 141146, 146087, 133855, -77593, -94358, 42824, -65208, -1713, 582, -107743, -64941, 81516, 74043, 51073, 58797, 54036, 51699, 144329, 85305, 106408, 46955, 292585, 273900, 116175, 5396, -1615, 177980, -58059, -237251, -294008, -259137, -26535, 44261, -44366, -89491, -38259, 106006, 35281, -58585, 110589, 92701, 148373, 44318, -46474]
41951d6474J6596l7843j1107o001k5056m4447Q6471O5527l439P2366Q4080j59039
41939h366l8807j4423o1086j9395J97756J18039k24225j36980J18320K4512J046
41928d3609K14661j21413j16321j924P7371J94343j28241j80954m9171O2806K2655
41917f9797J15474j75972r7611Q1630P4283k6761j75492j9623J28439K2684L3145
41906a09601m6799J41237O9459p4118M6110j15100O8989j8355Q8846J26875o3227
41895A14316R4036o690j47979M6827j2190p0802N505q3076J02652J2388j52211
41884i7224J6249j23072r836J15793O0731j19598j10495J86009Q2010J3868O3147
41873G7582Q0740q0518R9440k08689k42352J18876Q8125n608M1606R0974P1213
$$ y = [-46474, -29878, -67721, -78828, -84829, -109885, -154332, -67861, -2334, -5773, 66593, 150673, -8366, -47173, -61596, -122682, -142077, 55679, 173718, -50507, -187487, -69167, -44655, -43609, 171052, 49639, -66682, -68606, 8765, 203108, 74867, -106087, -155258, -92452, -69797, 45677, -130295, -227906, -146276, -71993, -98754, -274246, -293869, -165430, -142746, -109601, -156400, -15163, 54296, -19822, 26288, -88812, -19823, -38178, 50668, 177543, 114316, 208352, 201662, 53683, 100510, 88320, 17518, 23023, -60053, 42599, 54987, -97224, -80975, -204047, -213883, -98090, -37359, -156957, -267452, -81443, 567, 14435, 77582, 158322, 77804, 177244, -31445, -273797, -154921, -66796, -72404, -30798, 60176, 131389]
41862A31389j85494j99453L5421M1398R5747j01570O9840K5559Q2943K37108k5359
41851B07529k27918l4877J09792O7j24504j09578J69470o4542l2990J46356J5752
41840E4557Q1186N2116k42531r282O2720j11872K0291r5427j59856K39259r811
41829a18650l4831M6257k1623p3245J59801P2092j43760Q3403Q5215k7749N0321
41818G7231J18453j09719L8566j3804Q4531r43j63191K0447q164j29653j40472
41807b26718J71924J85410n224n9466k18589r1177K44531N9963K718k04808Q3121
41796e8315J15957o3853r4140o0627N4221l4320m239K13887r5220p751q6250P4365
41784d6285J4944Q6357J47145j6515N2059r6082p9783o7805j58480k2445J08015
$$ y = [131389, -54105, -253558, -218137, -176739, -80992, -182562, -112722, -87163, -4220, 232888, 207529, -20389, -55266, 54526, 54593, -69911, -179489, -10019, -74561, -107551, 38805, 54557, 135743, 187859, -54672, -63954, -1234, -113106, -92815, -188242, -348098, -108839, -118650, -153481, -107224, -128847, -202092, -42291, 29801, -113959, -30556, 54659, 26910, 77231, 195684, 85965, 124531, 110727, 195258, 194315, 31124, 51571, 43407, -86246, -226718, -54794, 130616, 125392, 65926, -152663, -243840, 691, 60654, 63372, -141436, -58315, 57642, -6211, -100351, -160978, -106757, -141077, -145316, 68571, -26649, -34400, -120650, -46285, -31341, 55016, 202161, 185646, 237705, 141623, 61840, -5965, -164445, -186890, -78875]
41773g8875J48309J11656l42808q5958Q2077l090J79907K27665J1535k5794q0302
41762A44322q9433j7768j9409J7820J51238R9823j27594j69391k4015K08730Q8964
41751B63287J6574q8447j20105l0316m3269j12247R8666J24907j8076n5062L8698
41740G4610J7839o5187l1796O5363j56730N1939L3904P2694J9418m0083j1377
41729C0594k2115J14880N6979k05837k02906M8973J8276J57376K2915j48865K63699
41718A33969K35985N232j48425q9045N972j16036J07947L7866j62105J36338J58822
41707C06520j09984L760j0995r2423M2538L3318P9295M213p0210L2147p1000M0684
41695A87863L3763j15322J277r886L2609o9901k8653K2005j55613m287j02239
$$ y = [-78875, 69434, 181090, -161718, -247676, -165599, -168689, 11218, 238883, 250418, 224624, 144322, 54889, 37121, 17712, 35532, 186770, 286593, 158999, -10392, -34407, 174323, 263287, 279861, 191414, 71309, 40993, -2276, -114523, -15857, 109050, 90974, 35912, 74610, 92449, 27262, -4534, 60829, -95901, -43962, -10058, 62636, 82054, 41971, 30594, 8479, 123359, 180338, -25499, -228405, -179432, -161156, -3780, 19135, -129730, 133969, 369954, 375186, 226761, 137716, 143688, 27652, 135599, 173465, 11360, 147698, 306520, 196536, 200296, 189301, 96878, 139416, 172734, 252029, 256242, 186032, 218179, 147179, 187863, 221626, 106304, 107581, 97695, 130304, 60403, 31750, 53755, -101858, -106145, -208384]
41684b08384l7902J64383K1828J34082o9914j70193n3297j4236J9033L15942R0238
41673A91580q4635m0838r0130J18064n7616n5364K9216J8616j3346j0888j582
41662C077j04072k6196J57109J39715j50149r8797M7824N6516M7799J42136l3325
41651A81637n3527P1106J28689j55405k07895J11850j80907j68995N5436L6615
41641a81396P7720J66323O6696J3401q216J29111O8500q1438k39253J6196J42003
41630A69647R9728L9216j07860j02361j29193q9773Q096P5559j14049J66092n1024
41619c5922P949p7364J87254J20837j75683n8984R1141K1478k25539p276P1358
41608h0751L0726K91421j13426k07464K47950M1993k0462j29345J23528p4435
$$ y = [-208384, -246286, -81903, -60075, 74007, 4093, -166100, -219397, -233633, -214600, 101342, 191580, 106945, 66107, -24023, 94041, 36425, -18939, 10277, 28893, 15547, 4659, 3077, -100995, -127191, 29918, 169633, 19484, -79313, -31489, 25027, 72826, 214962, 181637, 128110, 199216, 327905, 172500, -35395, 76455, -104452, -273447, -218011, -181396, -103676, 62647, 129343, 142744, 134528, 263639, 332139, 250701, 11448, 27644, 169647, 269375, 308591, 200731, 98370, -30823, -120596, -112500, -36941, -150990, 15102, -35922, -27973, -105337, 81917, 202754, 27071, -31913, 59228, 80706, -144833, -152109, -80751, -50025, 241396, 127970, -79494, 168456, 210449, 189987, 60642, 184170, 109735]
41598A09735m6337j9292J44353j10041j61846N67P2649o0983J7071K6312J5495
41587a2317k2252m6130M2779k7665K13591M6758p6778P1679R8409k25663O9294
41576A31705J4762n2306M0912j30699n3894K1243J09927r6925Q7389M3790r3306
41565B2598M6296J13845m803j06939q0264P6984l9675m8451j94951L5130N1745
41554a28485k1063J37042j68103O8812K62211O319l7347q6530o0218n2932J19963
41543C9669J42930j60198j28468J0535N4510J81905L3798m108k9032j67969n9178
41532h5606J25440j27922n1982N3830m1947O7986j00648J4057J86353j89028J12616
41521c6851N819l4259P3032J7178j6855R9136O7247j50186r03J06672k0455q7089
$$ y = [109735, 63398, 44106, 188459, 78418, -83428, -82861, -10212, -71195, -54124, -27812, -12317, -34569, -80699, -37920, -65585, 148006, 194764, 117986, 189665, 288074, 62411, 131705, 146467, 94161, 135073, 4374, -49520, -28277, 81650, -15275, 72114, 115904, 22598, 68894, 182739, 177936, 70997, -9267, 67717, 28042, -20409, -215360, -180230, -128485, -149548, -12506, -180609, -111797, 150414, 156733, 119386, 32856, -27362, -80294, 39669, 182599, 22401, -106067, -95532, -41022, 140883, 174681, 170573, 141541, -26428, -85606, 39834, -88088, -140070, -86240, -128187, -60201, -160849, -146792, 39561, -149467, -36851, -31032, -65291, 7741, 24919, 8064, 107200, 174447, 24261, 23358, 130030, 109575, 22486]
41509B2486j8702J2766J01121L848Q7752O8816j02053j92579P4884J37480j91224
41498D595J967O6380m4857J35273k9566P9079k2734j24762k5836J07407m2295
41487A04651j116l8619m7717O3520J2355j88144p4538O5583K19118K3086j6971
41476A21208J33483k13642M3460L5994P3585M8987j35049o4622o7310j06256l5600
41465a65762R6054n8414l2271J2769j2732N5150j3718k0934m1930J4724j3550
41454a80614L6360K3699M6909j35210j444J38023J13309Q1440J032O2111R6911
41443B82526k07540j04837j57079j09220J37325J96375q0248N5416j37951K6086
41433i9147L5560r9998J44854N1131l3132o9783J64024j09228j63019j44008J39578
$$ y = [22486, 3784, 16550, 117671, 121519, 209271, 278087, 176034, -16545, 58339, 195819, 4595, 6562, 72942, 28085, 163358, 133792, 212871, 190137, 65375, 39539, 146946, 104651, 103535, 64916, 17199, 80719, 93074, -95070, -169608, -104025, 115093, 138179, 121208, 254691, 41049, 84509, 120503, 194088, 243075, 108026, 43404, -23906, -130162, -165762, -69708, -128122, -160393, -147624, -160356, -105206, -118924, -139858, -181788, -167064, -180614, -144254, -120555, -73646, -208856, -210300, -72277, 41032, 122472, 123504, 185615, 282526, 74986, -29851, -186930, -296150, -158825, 37550, -42698, 12718, -125233, -99147, -63587, -163585, -18731, 32400, -732, -70515, 93509, -15719, -178738, -322746, -183168]
41422a83168J47554j06985R6602J64453m4654j17947r3631R9134M7037k1220j04572
41411a17397K18584J18641k8460j67749j10414R5461N0301n2209j56646J72839
41401B2951J52842L44j39409o6639l9992j07834k09736J55006J97774J6940l7273
41390e5026p4563k0842M4058O365J42371j07545p5660Q2118p2290k34720J40213
41379b25521J84513Q4606J44130m0450j41335j49360M0018M5162J48236M7238
41369A37237N2318j79834k26788l9034O5389O4665J98960j60142R5990K15254
41359B24015N40j27189O9014l5959J34867n1846j58999j7477J71l8111J05268
41348A04294j46303k830J04367K4478L6168k50069r0963J58277P8719J10237J8104
$$ y = [-183168, -35614, -142599, -45997, 118456, 73802, -44145, -137776, -38642, 8395, -12825, -117397, 101187, 219828, 191368, 23619, -86795, 8666, 58967, 6758, -149888, 22951, 175793, 176137, 36728, -29911, -69903, -177737, -387473, -232467, -34693, -17753, -55026, -129589, -150431, -106373, -100008, 42363, -65182, -140842, -58724, -131014, -365734, -225521, -41008, 43598, 187728, 147278, 5943, -143417, -103399, -58237, 89999, 137237, 189555, 9721, -217067, -256101, -190712, -126047, 72913, -87229, 8761, 224015, 224555, 97366, 166380, 130421, 265288, 213442, 54443, 36966, 37137, -974, 104294, -42009, -44839, 59528, 84006, 120174, -129895, -220858, -62581, 16138, 126375, 144479]
41337A44479J49609j16997j41254J28057R9778L1547j35277k7581o5373n172O4688
41326A26504o1875m6996P438J7468j3456N808J33814j3285j2715l3046J10739
41315B20398J4692k43029k45371J45903J89023m6232q6135N4398M3283m8920j42481
41304a44471l4663r886P8552J93744J24887M8413k13000k03967k9236J96367J07972
41293A14712k70884P7533J42521p8269M2526o1655n8299K0874k6366l7017O8592
41282f5732K35792J14169k2733l0740l5579m1835j34832m2357j83385J23373K66778
41271A82919j14810j87217K9453L07308Q9890j41156j4209n0480j00196J22208
41261A23710j56941j73553m8603J39626J84467k22643N7319J3398n2074J66153
$$ y = [144479, 294088, 177091, 35837, 163894, 263672, 295219, 159942, 132361, 66988, 61816, 126504, 64629, 17633, 25071, 42539, 29083, 34891, 168705, 155420, 142705, 109659, 220398, 235090, -7939, -253310, -107407, 81616, 35384, -50751, 3647, 46930, -1990, -144471, -179134, -189020, -110468, 83276, 208163, 256576, 43576, -160391, -189627, 6740, 114712, -156172, -78639, 63882, -14387, 28139, -33516, -91815, -70941, -97307, -134324, -65732, 170060, 284229, 261496, 230756, 195177, 153342, 18510, -23847, -207232, -83859, 182919, 68109, -119108, -89655, 217653, 307543, 166387, 152178, 101698, 1502, 123710, -33231, -206784, -255387, -115761, 68706, -153937, -96618, -83220, -135294, 30859]
41251C0859J24912p20K5361n5160P584r9476k8893P0411J1046q7201J54866K4416
41239A78005p8037J46558q3184j66296j0600Q0886k70099O7001L8685l6060M1738
41228i1403K4496n9643O170L7058J00575J20554P9093r7515j41426J51567q1927
41217D7599r6527j5555J59799q0191j03905J82560J7129n0006N538k09175J11259
41206c1475J92052j5679k84011L9304J15748k4499L1047J22493m6709j81283L7324
41195d5688K4075r8534J2037j01537K29277J24811k7047N1783k25043k59273n4360
41184c69499K08018J06306J46624n0525M0279j06671O0406j0797r7036J49207
41174G6312m4240n5997J5000j52239K1839l1461n3988L5472Q9492Q5387L4431
$$ y = [30859, 155771, 155051, 180412, 125252, 132836, 33360, 4467, 74878, 85924, -1277, 153589, 178005, 99968, 246526, 163342, -2954, -13554, 67332, -202767, -135766, -97081, -133141, -91403, -66907, -126550, -120380, -83322, 17253, 137807, 216900, 119385, -22041, 129526, 47599, -48928, -64483, 95316, 15125, -88780, 93780, 110909, 60903, 66441, -142734, -31475, 160577, 144898, -139113, -99809, 15939, -8560, 22487, 144980, 98271, -83012, -45688, -21613, -120147, -108110, -209647, 19630, 144441, 117394, 169177, -55866, -315139, -369499, -161481, -55175, 91449, 40924, 81203, -25468, 34938, 24141, -72895, 76312, 32072, -23925, -8925, -161164, -139325, -170786, -224774, -189302, -99810, -14423, 20008]
41163B0008P0340l1552j60533j23257K2881L29743p2390p1120k6359o0164Q9490
41152a2913l3755J36379p8609p287m6135L6772n4351J45747O8603l5986j55159
41141c6694L4832J56709J13082j13697q9947J93023j73958j96403N8540j5355
41131f9868O8897Q2714J07308M9193o5645l35322l0190K9421J60419O456N0320
41120E3703J09893j02651r6000O1604J9661n1280j44639O4746O1742M7345k16547
41109a92423L7057K08171j34230r2553n260R0721P1421R3754L4947k3107l2110
41098E6388n8725p1022j14506O9420K62385q764k40021j54119O6348J11408q1571
41087a62779K215j51821j1520K32433J24455j9886j05802L6800J81470Q840r5747
$$ y = [20008, 90348, 58796, -101737, -224994, -202113, 127630, 55240, -15880, -42239, -102403, -12913, -46668, 89711, 11102, 3815, -42320, -5548, -59899, 85848, 154451, 118465, -36694, -1862, 154847, 267929, 154232, 64285, 257308, 83350, -113053, -54513, -69868, -971, 81743, 189051, 238244, 172599, -162723, -192913, -163492, -3073, 3383, 53703, 163596, 60945, -35055, 26549, 46210, -5070, -149709, -84963, -23221, 24124, -192423, -155366, 52805, -81425, -173978, -179238, -88517, -17096, 76658, 111605, 88498, 56388, -2337, -73359, -187865, -118445, 143940, 135176, -104845, -258964, -192616, -81208, -162779, -160564, -312385, -323905, -91472, 32983, 13097, -92705, -55905, 125565, 134405, 38658]
41076C8658N9536j15737j19494J47878J83989j27437r895n9129j83823J54248
41066c1206J9675O2060l6066l2666l5572l5473k417j468J65285K4651o8697q4610
41054e6504k3592k8320O9604J40618P7475m00932J9617n036Q5359J13350q2887
41043i1248J55558n5126J2822j64017j63067J62457J82808L0030k88521M8257
41033a70047J75594j2084l3404J13034n4342L2685L7770M815Q0165o7102L6401
41022A43485k9449J16760J58302k10359j14365j7665k6433r1622j71469Q5454
41012a57361l4543J35736Q6261m0542Q5222k54992l0188k4626L2930m3667k6135
41001b71905J52565K7651j04520k4756J17299Q1967k3360j55216J7956K03626
$$ y = [38658, 98194, -17543, -137037, 10841, 194830, 67393, 57498, -1631, -185454, -31206, -11531, 50529, 14463, -18203, -53775, -89248, -91665, -93133, 72152, 96803, 28106, -56504, -80096, -108416, -38812, 101806, 179281, -221651, -202034, -207070, -121711, -8361, -91248, 64310, 9184, 22006, -142011, -305078, -142621, 40187, 70217, -218304, -170047, 5547, -6537, -39941, 73093, 18751, 51436, 89206, 94021, 174186, 107084, 143485, 114036, 230796, 389098, 178739, 64374, 46709, 20276, -71346, -242815, -157361, -191904, -56168, 30093, -10449, 74773, -180219, -210407, -235033, -202103, -245770, -271905, -119340, -91689, -196209, -220965, -103666, -21699, -45059, -200275, -182319, 21307]
40991B1307q0174L5846L5353j51056K2646R6680j3055r0286j33202l4887K30733
40980f0095K13821j11349n2014J17389j59294K1963Q4487N1680k3603p195o0301
40969A5489r7930J17525M1910p4750N3826N9239k946k47366m8025K14857J86516
40958B18345K7444o3191Q6407j99666o4937L3193J04740q0299K03044l2515j84422
40947D8143R361K0841k5518J2004j9489j1494j22770j8249J57075j12582K35479
40936A72801r4575P504q8834R325k886J53310j15420J70480J47371k37558m6551
40925G4967N9500p8244K9320n5601J03096Q2869m2790Q9970o056j55511M5399
40914A46919j5088p7135K3717O7075j87633P554Q0070N8935N5371j6616P7037
$$ y = [21307, -58867, -23021, 12332, -138724, -116078, -19398, -32453, -122739, -255941, -290828, -60095, 153726, 42377, -9637, 107752, -51542, -29579, 54908, 106588, 82985, 75790, 15489, -82441, 35084, 76994, 2244, 56070, 115309, 112363, -135003, -183028, 31829, 218345, 245789, 182598, 269005, 69339, 4402, 37595, 142335, 62036, 265080, 232565, 48143, 57504, 78345, 52827, 64831, 45342, 33848, -88922, -107171, 49904, -62678, 172801, 78226, 85730, -3104, 6221, 3335, 156645, 41225, 211705, 359076, 121518, 74967, 134467, 56223, 85543, 29942, 133038, 215907, 173117, 263087, 257031, 101520, 146919, 131831, 54696, 78413, 145488, -42145, -34591, 45479, 104414, 159785, 143169, 220206]
40903B20206j10981O6134n0360J41743j70948j53673L3253R4953j2418o8492k49241
40892b59824N4563J88765j23001P5726P4842j54941R3991J22456j60295j11196
40882a98914Q9829k0752j15617J72960N8819r4077j31824L6436R3690K746K47232
40871A40528j0860m2092j2556j99682j83293J04352J98695R8235r7574m4546j41879
40860a90672M1258J4905M5850K49504l8474L2704n5615N1263m819l34696m2912
40849b31704L8812P8854K10406o9458N2047n4639O5698J30071k11532p0228l9075
40838a00748q6262L44o9100M5028J21356J0694J08552J45368k5234r9215K679
40827E3462j5136k467j9179J05859P0437j59475p0161K54835l17269l8347l1622
$$ y = [220206, 109225, 175359, 124999, 266742, 95794, -57879, -24626, 70327, 57909, -10583, -259824, -205261, -16496, -139497, -63771, 11071, -143870, -49879, 72577, -87718, -198914, -109085, -129837, -245454, -72494, -13675, -107752, -239576, -203140, -109450, -106704, 140528, 129668, 87576, 75020, -124662, -307955, -203603, -4908, 93327, -4247, -48793, -190672, -149414, -134509, -88659, 160845, 122371, 155075, 99460, 150723, 145904, -188792, -231704, -192892, -114038, 96368, 26910, 78957, 24318, 90016, 220087, 8555, -61673, -100748, -187010, -186666, -255766, -210738, -89382, -78688, 29864, 175232, 149998, 50783, 53462, 38326, 35859, 16680, 122539, 192976, 33501, -36660, 218175, -99094, -137441, -169063]
40816a69063R6670O3883P9716K7979r3119l3006J29255j0924j65524P4982p549
40805f700j36369k682R8074L6075l8375j1652m4898M7078k4714L0484N8983Q7065
40793I2369j8075r1298n6004N7191P7034J9068J38616J20974k53067j01875R9394
40782H4327j3712n9558j03323j324L05748M3265j87403p9275m8743J65990q7632
40771A8360j8072j1725j71207q2310K29840R328n0628j628l8189r923j49820J76379
40759i9595K56474r3396k1831O7767n6404j85245K7800P4405L6477j02281J41515
40748D5686M9716K45871j48047j52159r2566j56174J06768J92382Q2013m5q4911
40737H8534j53846Q38L2060M2108k5362K79191m2751j47728j42824j52349K28857
$$ y = [-169063, -72393, -8510, 71206, 99185, 6066, -26940, 102315, 91391, -74133, 849, -6700, -143069, -145751, -47677, -11602, -49977, -61629, -106527, -59449, -84163, -53679, 5304, 92369, 74294, -17004, -73008, -15817, 61217, 80285, 218901, 339875, 86808, -15067, 84327, 70615, 11057, -92266, -93590, 212158, 255423, 68020, -11255, -59998, 105992, 18360, 288, -11437, -182644, -264954, -35114, -25786, -76414, -78042, -116231, -126154, -275974, -99595, 156879, 63483, 41652, 109419, 53015, -132230, -104430, -30025, 6452, -95829, 45686, 95402, 341273, 193226, 41067, -51499, -207673, -100905, 91477, 173490, 173445, 88534, -65312, -64474, -32414, 9694, -15668, 263523, 220772, 73044, -69780, -222129, 6728]
40726F728Q3959j50823p3001O0064j01858j17911P3062J01345K0500J55223k4816
40715C2472j5521J67578j22563Q3734R5727K8312k9301j20252j86801j80884N3485
40704a94014L8788K5279Q1228J49959j05403o4356n1912K42530N4328j44321O1000
40693I3106j44048L6320q1745n6891q605J20361N5120n622M4258J67195P8856
40682B98305J02409l1379k92675j12161m6124K03427j1047j24958M5686J3413
40672D4896K3482j45884k8305J54442M792k33249M5463k996N0063o548K0019j29753
40660b03578j267J72484q6880K152M485J26867R5089k01306j14764J25020R4094
40649A2396q9722J09099n728o0494M4300Q7863k45345q4K10953j7055O6241n6717
$$ y = [6728, 90687, -60136, -133137, -73073, -174931, -292842, -219780, -118435, -97935, 57288, 32472, 16951, 184529, 61966, 145700, 241427, 269739, 240438, 120186, -66615, -247499, -194014, -155226, -129947, -48719, 101240, -4163, -68519, -120431, 122099, 176427, 32106, 93106, -50942, -14622, -96367, -153258, -161863, -41502, 13618, 7996, 52254, 219449, 298305, 400714, 369335, 76660, -35501, -81625, 121802, 110755, -14203, 31483, 44896, 68378, -77506, -105811, 48631, 53423, -179826, -134363, -137359, -87296, -93844, -73825, -203578, -204845, -32361, -119241, -117089, -112604, 14263, 109352, -91954, -206718, -81698, 12396, -77326, 31773, 26045, -34449, 9851, 97714, -147631, -147715, 63238, 46183, 112424, 55707]
40637E5707k489L9100j80625j6560r9360J43132L7498N2288J39193k09467m657
40626d6240J47612o9303m7017m4107m1317n1710m8316O0958K57000n4316j49822
40615h6578j6349L8890J85837q8490o0379j3130K09985m3110l8910k1929n7066
40604H771n6799J17246J29282j05154j3502N733o4522j50641K00759L41481J3393
40593D26047j43450q6106o3450r8721r4527L8507j5067O2480l7920j02983Q9279
40582b5911L3051p696J03186J48528j56532j18189j48035J09312L23767j08616
40572A52865n9208K4903Q4609J7471k60505J1567n3510j06905R8775j20391M2899
40561a67430l1138j2206L4701p1173o2443J3922R5048J1720K13334N9445l8672
$$ y = [55707, 53218, 92318, -88307, -104867, -204227, -61095, -23597, 28691, 167884, -41583, -46240, 101372, 32069, -14948, -59055, -100372, -152082, -200398, -139440, 117560, 63244, -86578, -102927, -64037, 121800, 33310, -27069, -40199, 169786, 126676, 87766, 65837, 8771, -48028, 69218, 198500, 93346, 79844, 85577, 21055, -129586, 71173, 412654, 426047, 282597, 196491, 133041, 34320, -60207, -21700, -36767, 25713, -12207, -115190, -25911, 7140, -556, 102630, 251158, 94626, -23563, -171598, -62286, 261481, 152865, 93657, 118560, 203169, 220640, -39865, -28298, -81808, -188713, -89938, -210329, -167430, -198568, -210774, -176073, -247246, -309689, -295767, -200719, -188999, 24335, 83780, 45108]
40550D5108j42753j29464N2608J60510M1383n9061M9879r4337q2649l2715L2728
40539a58763j0984j14483J49004Q8194O8166j7018N8362M9204N38Q1137J6090
40528B09447n7105p0970o5413N54J3882j47667J5220J07747Q3629K84547m3968
40517C29903l2451J761n7581k42002l9053j0960M7356r728J05402j45998M4324
40506i027J80009O9793J0864J0540J62278p5984k25754k50344k1609O4064o9850
40495a55020O4313K71192J13125p4219j45338K6347j3224r7219p880k8219o6237
40484a12379O0528R7167J31546j6665J20960r9528p7774n7486k1215l2635j2242
40473a9723j2815j97181k2614J03305K8941J17620l800l5103R5126J96895M9112
$$ y = [45108, -97645, -227109, -174501, -13991, 27392, -31669, 18210, -76127, -158776, -191491, -158763, -169747, -284230, -135226, -47032, 21134, 4116, 62478, 111682, 112220, 193357, 209447, 152342, 81372, 15959, 16513, 30395, -117272, -102052, 5695, 89324, 373871, 329903, 297452, 299213, 241632, -370, -39423, -50383, -3027, -12755, 92647, -53351, -9027, 170982, 240775, 251639, 262179, 424457, 348473, 122719, -127625, -149234, -85170, -155020, -90707, 180485, 293610, 219391, 74053, 100400, 87176, -10043, -17923, -46142, -112379, -51851, 45316, 176862, 160197, 281157, 181629, 103855, 46369, 25154, -7481, -19723, -32538, -229719, -252333, -149028, -120087, -2467, -6267, -41370, 53756, 250651, 299763]
40462B99763q3964j48804j22029P3481Q3964r9782O3200J4591o2472j58309M4327
40451i6034R7211Q5963j11136j0458n0560N0083N3059J5095J30155L4272r8571
40440I9079j76143O1359m0708p6219N5426j2812k8284j11159J07759N2135r3274
40429a62841M722J53158P2445J9592k7676j05249l7737r9389L4671p980J35228
40418b1056N2788k3154R030m8666O9977j19382p1167J33722O3285N8247l5654
40407F7970j09261k3740o6787K294O0144J78597n6125L6823j3699N471n5096j11377
40395h4786N8579j59080M810n8801J2185N4887J05603M294O0824N4118j72804
40384a20171M0974p9122J73579l2464q7643L182J15130J81383J8186l6044K4854
$$ y = [299763, 215799, 66995, -55034, 18447, 102411, 2629, 65829, 80420, 17948, -140361, -96034, 1177, 87140, -23996, -34454, -85014, -34931, 18128, 33223, 163378, 197650, 99079, -77064, -15705, -56413, -132632, -77206, -90018, -118302, -229461, -121702, -69567, -162841, -158119, -4961, 67484, 87076, 59400, -45849, -83586, -182975, -148304, -156284, -21056, 31732, 8578, 17608, -31058, 38919, -80463, -151630, -17908, 45377, 103624, 67970, -41291, -65031, -131818, -129524, -69380, 109217, 53092, 89915, 76216, 81687, 26591, -84786, -26207, -185287, -180477, -239278, -227093, -172206, -66603, -62309, -1485, 52633, -120171, -79197, -158319, 15260, -17204, -104847, -101665, 13465, 194848, 213034, 176990, 201844]
40373B01844r1983n7128O0700R949K3293p9621n3958P754j10921r6480J07743
40362g8808J95266J56446j93128o7441Q0148L7174r3157P5574M2963O4298k66052
40351d6717j23657J63176K069k3622K288K2070J33586m2139l4767J58043j71209
40340C9121j64543J38834O2935j2932q8686P8536n7894j11288p4039O92J490k1783
40328b09557O7889J55528J36173M4312n0292l04288J59155J90633j44214o7767
40318b2428J8549M2436K7705l7229m2010j5727l6425p8648J7178J12469k6158
40307d0288R0172O2806k6132j1234j4115n9501m2522K4734K44222j50910j47603
40296g0371R850J97804q3209q5478R8334J50963n5512k12284J39115N0266j27194
$$ y = [201844, 109861, 52733, 113433, 123382, 146675, 67054, 13096, 20850, -90071, -186551, -78808, 116458, 272904, 79776, 12335, 92483, 129657, 36500, 112074, 155037, 219335, -46717, -170374, -7198, -5129, -28751, -26463, -4393, 129193, 87054, 52287, 210330, 39121, -125422, 13412, 76347, 63415, -25271, 53265, -4629, -115917, -189956, -189264, -187774, -209557, -141668, 13860, 150033, 194345, 144053, -160235, -1080, 189553, 45339, -22428, -3879, 38557, 66262, 29033, -12977, -28704, -65129, -143777, -126599, -14130, -40288, 49884, 112690, 86558, 75324, 61209, 1708, -40814, -16080, 228142, 77232, -70371, -60521, 137283, 54074, -31404, 66930, 217893, 162381, -49903, 89212, 139478, 12284]
40285A2284J8663J8014j33544n1895o7942J13524L7478k2689L3436J54259j4167
40274I7421j20667K08845j1006p9646M5047j62721k14007J39425K48076R3640
40264B44407r4820j62346q0338Q6867r547M2905N4617J13323k81051j15701J50588
40253e1096K48326K1674j29178j62371j64993J0659Q3782K0714M1746J4068k6295
40242i2964L1172P009O1668J39855j24698j1014J12859o9743q1950Q7679o6585
40231f712k2822k821J87569n1214j64336J22238L0801J11283j62001j80488J4654
40220a23849Q1931Q0363L7392O6159j49312j56937r7308K23036K83000J4907p1702
40209A87680r2506n1317p4177O1098k9583j8287K2294P6704l1555l2919R4027
$$ y = [12284, 30947, 48961, -84583, -136478, -204420, -90896, -53418, -76107, -42671, 111588, 97421, -23246, 185599, 174593, 94947, 139994, -22727, -236734, -97309, 150767, 244407, 149587, -12759, -93097, -6230, -15777, 27128, 81745, 195068, -85983, -201684, -51096, 197230, 218904, 89726, -72645, -237638, -226979, -143197, -122483, -80737, -66669, -92964, -61792, -54783, 6885, 146740, 22042, 11028, 123887, 54144, -27806, 59873, -6712, -29534, -32355, 155214, 104000, -60336, 61902, 92703, 203986, 41985, -138503, -123849, -41918, 38445, 75837, 141996, -7316, -164253, -261561, -38525, 244475, 259382, 187680, 95174, 43857, -30320, 30778, 1195, -17092, 5202, 81906, 50351, 17432, 111459]
40198A11459r440k5172j64736m8622K48602j54777K9102K4321N1853J00131r81
40187A61740l03348j23792J03502K01262j7693l8495N7158J20374k32630j13778
40177a85700J36108j7220l2579k8399N2044N1373J39915K4108l721k53119n259
40166a22449L5282N9888R8920j2048j0337j42913k4109O0265Q3827P5262p5948
40155B5640k4400J1144J91889L0151k680j81690k43495P5488K93714J05283M3842
40144C24886j16425j82112l8307j1992j4212r3106j18245O4003J11737j11453
40134a85226P1644J61699J48371M1925q3659o4009r6925j38353n0531P6815J8376
40123i9873P3091P1036r4505j70409Q3510K09585J40875k33338q3985n9305Q2880
$$ y = [111459, 102019, 76847, -87889, -136511, 112091, -42686, -13584, 10737, 62590, 162721, 161740, -141608, -265400, -161898, 39364, 21671, -16824, 40334, 160708, -71922, -185700, -49592, -66812, -99391, -127790, -75746, -24373, 115542, 139650, 135929, -117190, -122449, -87167, -27279, 71641, 59593, 49256, -93657, -117766, -57501, 26326, 101588, 25640, 1240, 12384, 204273, 234424, 231744, 50054, -193441, -117953, 175761, 281044, 324886, 208461, 26349, -11958, -23950, -38162, -131268, -249513, -185510, -73773, -185226, -113582, 48117, 196488, 238413, 154754, 90745, -6180, -144533, -195064, -118249, -99873, -26782, 44254, -50251, -220660, -137150, 72435, 213310, -20028, -104013, -163318, -80438]
40112h0438Q2761J19081Q7241j37700n5066o6427N3735L6835l3861j52765j7810
40101a64414J01111j9650j84745J87756n0940k527L6987K73444N2076q3896O2115
40090B07317j93511J08950J9919q6516p7704m393J11322P3841o9503r8404Q6020
40079G7338K24909r6616l15487J9277j29212R84K77780O667j79639J52032m2249
40068d216j38880J38884Q948j25835m6724K58520R278J1279P4747m4581o0389
40057H1031J00749j00268M6524k18803J02494p8959L9776j7769J13345K27693
40047B95813K6705j74067j74235m1886m4629Q5859J35221L3139r6000J15917j75398
40036a3561k45576J16465R9332j3482J2297L3687O6756j62564o3832P454K01342
$$ y = [-80438, 2323, 121404, 208645, 70945, 15879, -50548, 3187, 40022, 6161, -146604, -164414, -63303, -82953, -267698, -79942, -130882, -133409, -96422, 177022, 229098, 145202, 207317, 13806, 122756, 142675, 56159, -21545, -25938, 85384, 159225, 89722, -8682, 77338, 302247, 205631, -109856, -90579, -219791, -218807, 58973, 65640, -113999, 38033, -4216, -143096, -4212, 4736, -121099, -167823, 90697, 99975, 111254, 186001, 141420, 81031, 181780, 81512, 128036, -90767, 11727, -67232, -27456, -45225, 68120, 295813, 322518, 148451, -25784, -67670, -112299, -26440, 108781, 141920, 45920, 161837, -13561, -259137, -142672, -43340, -56822, -44525, -10838, 55918, -106646, -170478, -163024, 38318]
40025C8318J04381R1154m0320j02878O9713j46022k16364M150N7896L5870r825
40014a13927j14384J28275O5906J5986q3452k4972J75867J30936j13301j95213
40004a28279r771o0148J37163J83853r2304m3420j1928O1103l9145j66870K59128
39993H9382J01150j23876K5755p5401k03080K8994J07801k0492L0887J17083R8724
39982A76927n6219o5250J8231J21794n7010j57780j20210J4161J10893j62806
39972a77269j13677R5731N2972l691Q5424N6084L0007L1561K1439M1584o7776
39961E2389j21941L3389M4243l5133K1431N7492j95220J18371Q9871J23656j07024
39950H1524J11001M9221j19452k45308R1935j8861m9104J9139K3540n3269K6764
$$ y = [38318, 142699, 233853, 193533, 90655, 160368, 14346, -202018, -197868, -139972, -104102, -113927, -228311, -100036, -34130, -18144, -101596, -126568, 49299, 180235, 66934, -128279, -138050, -198198, -61035, 122818, 30514, -12906, -24834, 36269, -2876, -169746, 89382, 190532, 66656, 92411, 17010, -186070, -157076, -49275, -69767, -38880, 78203, 176927, 120708, 55458, 73689, 195483, 138473, -19307, -139517, -125356, -14463, -177269, -290946, -195215, -142243, -145934, -60510, -4426, 25581, 57142, 78581, 120165, 52389, -69552, -36163, 8080, -27053, -5622, 51870, -143350, -24979, 64892, 188548, 81524, 192525, 241746, 122294, -123014, -31079, -49940, -99044, -79905, -56365, -109634, -82870]
39939h2870k0689L5616J44752L8377r743Q51M3923Q2663P1308k00471k08096J19188
39927A4809Q9606M6566K1507j82464l1809j4547J18781K4622J42101R0109l7538
39916B81743K9352l3594m8780o5058K1340R4849j26297j31593q9080o8865p0712
39905b06695J20333O705L9617J81300j8668j11879k2396J05001M6927J5550P1899
39894B27694M2510k6058j28033n3324p3550o4661M0281j7779l7432J44795n9948
39883e505K1856K63614K1144k659k01194j48084o8821K5940J2819J18823M6813
39872H4746k82442P813K66642N9484J03502Q8291l2633M5263K19484p3249j32055
39861C54846R0596k7705O4899j66264j61242K0273K2144j31023m8377J49386K3982
$$ y = [-82870, -103559, -67943, 76809, 115186, 105443, 106294, 150217, 232880, 304188, 103717, -104379, 14809, 104415, 150981, 172488, -9976, -41785, -56332, 62449, 87071, 229172, 319281, 281743, 311095, 277501, 228721, 163663, 185003, 279852, 153555, 21962, -67118, -135983, -206695, -86362, -79657, -40040, 141260, 122592, 10713, -11683, 93318, 140245, 155795, 227694, 270204, 244146, 116113, 62789, -10761, -75422, -35141, -52920, -90352, 54443, -5505, 16351, 279965, 301109, 298450, 97256, -50828, -119649, -93709, -80890, 37933, 84746, -197696, -189883, 76759, 136243, 239745, 328036, 295403, 340666, 560150, 486901, 354846, 445442, 417737, 482636, 316372, 155130, 175403, 197547, 66524, 18147, 167533, 191515]
39850A91515n8090n6286j09499M0612J75138k65972r6877N2790J23634j7062J8415
39839a682o6777m729J25680L4607J25063R0469j43915q5634n1382M0322P5347
39828A37369j5700j31140p9420J68774J7828j75644O7047K23225m0969l4812K4064
39817A60622p4232K2292j01352J02511J06834J68032n2122j43545j66627J27823
39807A50236L9769j38254j37682J3044l8681M5747J59256j14352q4879L2828J58080
39796H5112O6876j8508M6683O009j22177J6537N0856n284l8633j77905q6322L5760
39784a40996J40684j17595j51141J62862J70987J6411l8989j62815j92669K3423
39774b89838k3978J4205K06826K21179q7095j87508J02353J58462J4792m6384
$$ y = [191515, 133425, 77139, -32360, 8252, 183390, -82582, -179459, -126669, -3035, -20097, -1682, -68459, -73188, 52492, 87099, 212162, 302631, 158716, 73082, 21700, 62022, 137369, 121669, -9471, -88891, 79883, 97711, -77933, -10886, 212339, 171370, 136558, 160622, 86390, 108682, 7330, 109841, 216675, 384707, 332585, 189040, 22413, 150236, 190005, 51751, -85931, -72887, -111568, -65821, 93435, -20917, -105796, -72968, 85112, 151988, 133480, 180163, 186172, 63995, 80532, 131388, 126104, 87471, -90434, -176756, -140996, -312, -117907, -269048, -106186, 64801, 81212, 42223, -120592, -313261, -289838, -313816, -299611, -92785, 128394, 41299, -146209, -43856, 114606, 129398, 83014]
39764H3014n9148J07028K13391j0493m1391K7491j09698k06738J08261K74472
39754C86189r0148k41753j4230R165k069n6902l7060J18061J77180j52103P340
39743A03670n0212O6523Q0837N798Q3877p4859r6716j43735k6052o7895J14787
39732c977J56473j277k36456K6067o593R8339M1514j9050J8511K1547k7446o4620
39720C032J48345j1543P0255j2054L3195j34389j30919M6052N6490J06478K05967
39709C80909r8005J41313l2057j94744j24691K17102r8237l5162r8654M1025J36684
39698B35483j00824n2348J8935k9285N7195p1891m2014O7556K7297j56321p7343
39687a23560k0843O4882L8023j3030K20600j32492j12735N221k1946K9459K54459
$$ y = [83014, 23866, 130894, 344285, 333792, 292401, 319892, 210194, 3456, 111717, 386189, 296041, 54288, 40058, 49223, 47154, -9748, -46808, 71253, 248433, 96330, 103670, 53458, 119981, 200818, 206616, 290493, 215634, 118918, -24817, -50869, -118764, -3977, 152496, 151219, -85237, -59170, -65763, 32576, 74090, 55040, 73551, 95098, 67652, 3032, 151377, 139834, 210089, 198035, 231230, 96841, -34078, 11974, 68464, 174942, 380909, 282904, 424217, 392160, 197416, 72725, 289827, 191590, 156428, 57774, 98799, 235483, 134659, 82311, 101246, 71961, 129156, 57265, 15251, 82807, 110104, -46217, -123560, -144403, -79521, -41498, -54528, 166072, 33580, -79155, -73934, -95880, -66421, 188038]
39676A88038J49690j3619k2824j57547j31877l8989p4724R7206J6617n3750j09072
39665a50851R4747J1839N6454K8396r2812J40559R452L5277m4848j37841K04451
39654A54823J42343R9024p9178L6317j33660r1090K35263J20871n9941R3573j5734
39643E02611J88362K87366K11001K42016K28058K30170L34735j99235k64697l13804
39633A446583l90391k83944o0046j20609n709j63513m6334j67009l7948N2623
39623B23703j89141J52681K4250j38958j88434J70249K65762j41353j13237j02985
39613c7463J05064J87648q9551m0595P0187m9335l5735P6675m2065R680k4051
39602A30459r0816J34280j4484j64353J89858L3707r7557q352Q4173j6116j09371
$$ y = [188038, 337728, 324109, 301285, 143738, 11861, -27128, -101852, -4646, 11971, -41779, -150851, -56104, -44265, 12189, 40585, -52227, 88332, 97784, 133061, 88213, -49628, 154823, 297166, 396190, 317012, 353329, 219669, 128579, 363842, 484713, 424772, 518345, 502611, 690973, 978339, 1189340, 1431356, 1659414, 1889584, 2224319, 2025084, 1760387, 1446583, 1056192, 772248, 712202, 591593, 585884, 422371, 376037, 209028, 171080, 223703, 34562, 187243, 211493, 72535, -115899, 54350, 320112, 178759, 65522, -37463, 67601, 255249, 165698, 125103, 195290, 145955, 110220, 186895, 144830, 154510, 130459, 39643, 173923, 159439, -4914, 184944, 218651, 121094, 112742, 196915, 180799, 71428]
39591G1428M1030P6896j15050j64509j55531O1109R7681j19507o0587K14602R9304
39580D6866j36360l787J90872Q550p6613J16991o341l2545K567K911n2445N348
39568F6014Q3907Q073j29872j28707O2529N0960J26717J5919j14750J09946R4153
39557B44889p886O0298o6954j22858m4724O2542l8082O984N2020j13959j33403
39546a01133P563K8991M8401J08200k9333j10360N9785J25637r7963m3646Q533
39535D675o016J03621o6066M717q4999m7608L448l5725j14005J10033m1213J07485
39523f1653m5843O6822m5656J59649J02922n1650k53493N0855K35915K9784L7007
39512B24659j90659p1391K15412J01648j23458o0248j33711J5774R0690J21544
$$ y = [71428, 112458, 189354, 74304, -90205, -245736, -184627, -86946, -206453, -267040, -52438, 46866, -89494, -93281, 97591, 106141, 29528, 146519, 140178, 107633, 110200, 113111, 60666, 66014, 149921, 157994, 28122, -100585, -38056, 12904, 139621, 155540, 40790, 150736, 244889, 237003, 297301, 230347, 107489, 62765, 125307, 87225, 94209, 146229, 32270, -101133, -93570, -64579, -16178, 92022, 62689, -47671, 12114, 137751, 39788, -3858, 4675, -1341, 102280, 36214, 40931, -44068, -91676, -88228, -123953, -237958, -127925, -169138, -61653, -107496, -40674, -86330, 73319, 176241, 124591, -128902, -78047, 157868, 187652, 224659, 34000, -37391, 178021, 279669, 156211, 95963, -37748, -21974, 68716, 190260]
39502A90260J80925j71338k00601p7923j86468J65714Q541K6745N3489O8778N5677
39491A13799j00571P548R4712L8897N0100j73199J10241K47118J0409q6157j18538
39480A94359R2875j17034j08245k1972N633j08474m0244J46767r3916j855O7624
39469A5518J65429m8053k0367n2718k343l768J38447j57101r7186N8314n5327
39458e9155J02446K1212m4981M8248j20897J07470N6072N5052k609r1218p7275
39447e635r7757Q7543J21692N9801k44160m0221O2792M8961N7908J9072k1627
39436D8369J11001O0961J80863L1246k13333P7200j20947K7405J40182J02074
39426D45021O1299j76681j46917m0897j00035j14912L3282J48873J16848O1843
$$ y = [190260, 371185, 199847, -754, -78677, -265145, -99431, -90890, -64145, -10656, 58122, 113799, 13228, 20776, 115488, 154385, 204485, 31286, 141527, 388645, 399054, 312897, 194359, 287234, 170200, 61955, 39983, 45616, -62858, -103102, 43665, -50251, -52106, 15518, 180947, 132894, 112527, 59809, 57466, 53698, 192145, 35044, -62142, -3828, -59155, 43291, 64503, 19522, 67770, -53127, 54343, 110415, 165467, 162858, 71640, -5635, -103392, -15849, 105843, 165644, -78516, -118737, -55945, -6984, 50924, 69996, 48369, 159370, 220331, 401194, 432440, 219107, 296307, 175360, 202765, 342947, 445021, 506320, 329639, 182722, 141825, 41790, -73122, -39840, 109033, 225881, 287724]
39416B87724j0670J94696j47978L9239r431k36673n7508K2030r2800N2422J73740
39405B14791R7597k4625O3183q3484q8800J65687J7407r7567k4072J2486k0374
39394B32229j02831q3491j36754Q6338l6848L12775J66621l00719n3879J32324
39384B15765j26345k7545J09374n3940K0250o6145J02284K00616j3230r2963j29768
39373A38353P2008J60436r269o509K11302P8662l05665p2922J46517l5054j23305
39362B54554M6538o8302J02344L3023p126O7529m7547J14284j81105j22691K79
39351A91780L5506J10709J3686P811J66223n156j47573J02140K71996p906R5979
39340H35195O2168q6520L0592k04362l2088o3056j07027J64671j5730J02391J74739
$$ y = [287724, 277054, 471750, 323772, 363011, 353580, 116907, 59399, 81429, -11371, 41051, 214791, 312388, 287763, 350946, 267462, 178662, 344349, 361756, 264189, 240117, 252603, 232229, 129398, 45907, -90847, -4509, -41357, 271418, 438039, 137320, 83441, 215765, 89420, 61875, 171249, 117309, 137559, 71414, 173698, 374314, 361084, 268121, 138353, 210361, 370797, 361528, 355019, 566321, 644983, 339318, 266396, 412913, 377859, 254554, 301092, 232790, 335134, 368157, 361031, 428560, 381013, 495297, 314192, 191501, 191780, 227286, 337995, 351681, 359492, 525715, 520559, 372986, 475126, 747122, 739216, 835195, 897363, 810843, 841435, 637073, 604985, 541929, 434902, 599573, 583843, 686234, 860973]
39329H60973j37692j47207m4788j20974m9047J32685r217L1883J37930k119p7627
39318E74800O5184J7721L11190J24558L80743K34832J27573J31553k28159k59261
39308A480734l9689j81314k52785j74262o1910j9355J42362k28168q9432j7864
39298E58317n0906j24344M004m9724n053K23872J4671j68834J5869O0108r6401
39287C81579k0373K09480J29030j31555J7108J19802J71496P9954l18645j40819
39277D97057K54083N2109q385p7388M9444p5130j00242l4330j30554M1774p0240
39266C98198j11063P3039j25972J51336P8029M1131j38554K9122J53035M5279
39256E93580J82456Q9182J3219j39465j39631N8691J87322m989P9884M6980j25458
$$ y = [860973, 723281, 576074, 531286, 410312, 361265, 493950, 484733, 516616, 654546, 652427, 574800, 639984, 657705, 968895, 1093453, 1474196, 1709028, 1836601, 1968154, 1739995, 1480734, 1441045, 1259731, 1006946, 832684, 770774, 751419, 893781, 665613, 576181, 558317, 507411, 383067, 387071, 337347, 332294, 556166, 570837, 402003, 417872, 477980, 381579, 361206, 570686, 699716, 568161, 585269, 705071, 876567, 956521, 637876, 497057, 751140, 803249, 794864, 717476, 766920, 691790, 591548, 557218, 426664, 468438, 398198, 287135, 360174, 234202, 385538, 463567, 504698, 366144, 395266, 548301, 593580, 776036, 865218, 878437, 738972, 599341, 658032, 845354, 840365, 920249, 967229, 841771]
39245H41771R3169j51948Q8716J94018p373n3127L5422J0441N2001m0085R7528
39234A160533j6592Q7615R8523o3148n6341j6206j03777L6826J44144n2146q75
39223A218556J18681k1834K7848K15076j5670J8455p0801M0219O283k555J27795
39212A662053J12581q4476Q489O6251N0287J52814J02325L2810P4780R3834R4899
39201B366647k5505k8629p8660J59689J37363n219N6386Q4539J64018J11015L9978
39190B981622R7358Q3245J18906J67060J08274J97340L57953K49563K67236K38281
39180D866838L5811M83224O18001L34536M27730K42901N66976N56329L95610M86627
39170I014583Q77074P48435R41229J141985J349508J585721J512100J768531K008397
$$ y = [841771, 934940, 782992, 871708, 1065726, 1058353, 1005226, 1040648, 1051089, 1103090, 1063005, 1160533, 1143941, 1231556, 1330079, 1266931, 1210590, 1194384, 1090607, 1127433, 1271577, 1219431, 1218556, 1337237, 1315403, 1343251, 1558327, 1542657, 1561112, 1490311, 1530530, 1536813, 1534258, 1662053, 1774634, 1690158, 1698647, 1764898, 1815185, 1967999, 2070324, 2103134, 2177914, 2271748, 2366647, 2341142, 2312513, 2233853, 2393542, 2530905, 2525686, 2582072, 2666611, 2830629, 2941644, 2981622, 3078980, 3162225, 3281131, 3448191, 3556465, 3753805, 4111758, 4361321, 4628557, 4866838, 4902649, 5385873, 6003874, 6338410, 6766140, 7009041, 7576017, 8132346, 8527956, 9014583, 9891657, 10640092, 11581321, 12723306, 14072814, 15658535, 17170635, 18939166, 20947563]
39161B0947563K218056K488384L049899L772317M477399N572199P127362Q994635
39153E8647814J1361544J4873001J9346210K5246764L1856593L9190916M4548767
39146B45071609L5802829P496976j5469491k7632745m2095293m6540975l7742973
39139A18889937k6945408j8882741j3800346j0454003q056468o084434m782760
39132B9883777l975562l073502k646575k171619j920685j401168j241600r36754
39124A2516312r69067p90523n89924o39349k88720m22732o02308o21359p50238
39115F842092o58889n29460l46116m92662k62026l15491j23894j54528l16024
39106C643002o1764P4973k00711l22223j02473j75069k0205R8651k52308k04478
$$ y = [20947563, 23165619, 25654003, 28703902, 32476219, 36953618, 42525817, 49653179, 58647814, 70009358, 84882359, 104228569, 129475333, 161331926, 200522842, 245071609, 280874438, 288371414, 272901923, 245269178, 203173885, 156632910, 118889937, 91944529, 73061788, 59261442, 48807439, 40750971, 34666537, 29883777, 25908215, 22834713, 20188138, 18016519, 16095834, 14694666, 13453066, 12516312, 11547245, 10756722, 10166798, 9527449, 9238729, 8815997, 8213689, 7592330, 6842092, 6183203, 5653743, 5307627, 4814965, 4552939, 4237448, 4113554, 3959026, 3643002, 3581238, 3656211, 3455500, 3133277, 3030804, 2855735, 2835530, 2934181, 2681873, 2477395]
39096B477395k43732N1042m8957k47436p2084L2313j44765k02062L180r6308j20205
39085A388381j52217o6815l0141L21816m2552k11651J1834O607j28186k00656
39075H96420k3196N4135p1343n8323L2677m0934N664J0017L3261m2036j53767
39064F42575J73156J59348J0647o0574j50792j40426j2102J87290P5976l2462
39054H52636L0572o4342r3878P1678j40575Q311j99627K1603J64199Q8074O8627
39043H07278j18313k3061n0553L5478j09933l877K5928m2827O3262J9682l09838
39032B93226k33764l3314J38090K28830p5244j4513J84332k8923n2499Q0179O1841
39021E48241Q6201j26414j78425Q8077j63945r5956J81099k7883J9227j31838
$$ y = [2477395, 2233663, 2284705, 2235748, 1988312, 1916228, 1948541, 1803776, 1601714, 1604894, 1508586, 1388381, 1236164, 1169349, 1139208, 1461024, 1418472, 1206821, 1218655, 1225262, 1097076, 896420, 873224, 927359, 856016, 797693, 830370, 789436, 795100, 805117, 838378, 796342, 642575, 815731, 975079, 985726, 925152, 774360, 633934, 621832, 809122, 885098, 852636, 883208, 818866, 724988, 796666, 656091, 664402, 464775, 486378, 650577, 738651, 807278, 688965, 665904, 615351, 650829, 540896, 537019, 562947, 520120, 583382, 603064, 293226, 59462, 26148, 164238, 393068, 317824, 303311, 487643, 458720, 406221, 486400, 548241, 634442, 508028, 329603, 417680, 253735, 157779, 338878, 310995, 330222, 198384]
39011A98384M5391n4560j66884k4900K21432P9791k752O16r9050j9350R9090J76775
38999D53983j91655j46937l9436J23001J34573P3793j27296J27538M4877k36906
38989B15535P324l9975K29057p1036R3451j18673m0698n6627r7780J97908q4034
38978B34452K575k826k0804o900M2387J77075O4717n9873k91M7378o6852j25299
38966B85739j3934J8094m8452l6316Q3294K8799Q8311l0038k17687n8238P6953
38955A76525Q9444n265J89155n2443o5524P291L031q1104R3179j96955j15309
38944D2025M0077M9278J28343J93510N3742n2800L9266J4784j14220j07327j91525
38933I5153M424J65495J91941J61518j62561M4929J91817j5115j35378q6015K4837
$$ y = [198384, 243775, 189215, 22331, -2569, 218863, 298654, 295902, 296518, 197468, 178118, 277208, 453983, 262328, 115391, 75955, 198956, 333529, 407322, 280026, 407564, 452441, 215535, 222859, 182884, 411941, 340905, 434356, 315683, 274985, 218358, 120578, 318486, 234452, 237027, 234201, 213397, 206497, 248884, 425959, 490676, 430803, 430512, 477890, 411038, 285739, 271805, 289899, 241447, 205131, 288425, 317224, 405535, 375497, 157810, 99572, 176525, 265969, 260704, 449859, 397416, 331892, 339183, 342214, 261110, 354289, 157334, 42025, 82102, 131380, 259723, 453233, 506975, 454175, 493441, 508225, 394005, 286678, 95153, 99577, 265072, 457013, 618531, 455970, 500899, 692716, 677601, 542223, 456208, 481045]
38922D81045J59389J33019J39958O9748K47062K50390L03618P9410j83241j97697
38912A482701k78937j43457q7016m8602k40143k06539O6824K34260k31534j90968
38902C56589J7433l0877k26958K9760L10353O1033k4911O1141K0106o0094k40417
38891B73158m5607K3234l0203k8836K1666J26885l4482l6586O5485k0008j41073
38880A73633Q3271J39951j05028L9422p0855Q6770j14459Q0023N2135l5585j35898
38869A93380j42404K0690K14092o4632K3421J30062k5746q9875j01256n6975J11201
38858B11958N9184P7737r9779o464O499k0591l6419j16102J26903J1512n2980
38847A61458J19828J19072m9313r6330L9201m6602j53363j11882N2254K56997
$$ y = [481045, 640434, 773453, 913411, 983159, 1230221, 1480611, 1784229, 1863639, 1680398, 1482701, 1203764, 1060307, 973291, 924689, 684546, 478007, 544831, 779091, 547557, 356589, 374022, 343145, 116187, 145947, 456300, 517333, 492422, 553563, 573669, 513575, 273158, 227551, 250785, 220582, 191746, 213412, 340297, 305815, 269229, 334714, 314706, 173633, 256904, 396855, 291827, 331249, 260394, 347164, 232705, 312728, 364863, 329278, 193380, 50976, 71666, 285758, 221126, 244547, 374609, 348863, 258988, 157732, 100757, 211958, 271142, 348879, 249100, 242636, 249135, 228544, 192125, 76023, 202926, 214438, 161458, 281286, 400358, 351045, 254715, 293916, 247314, 93951, -17931, 34323, 291320]
38837B91320J14192q145O2122k29649l8838P5379p7598k3334m4181m4327P826
38826H4767p9220Q9802J10372j33143k09959p8797K08161k8515k6983O3526j290
38815a279J63736J665l6549k0668o5528P6265N8885o7945K05715K4704M0469q9029
38803B90441r836J26687p2048p3555K1943k2171J51561j89220k34744Q7454J41685
38792B18197J26917j15543j18294k2239o1387L038R0843j71413J11860R3477N747
38781A61203M161J56953p7614k50125n7140O4452J63658j68931N8746J13561o589
38770A62335m2681j44336J00855l1492P4389n3074p8764r577Q990R2990K24106
38759C03741p5784k8564Q9037J28883j44579M0469j07343j25738P0273r4909J36191
$$ y = [291320, 405512, 397367, 459489, 229840, 191002, 266381, 188783, 165449, 121268, 76941, 84767, 5547, 95349, 205721, 72578, -137381, -216178, -8017, -36532, -63515, 11, -1279, 162457, 164122, 127573, 106905, 41377, 117642, 176527, 108582, 314297, 339001, 379470, 290441, 280605, 407292, 335244, 261689, 283632, 261461, 413022, 223802, -10942, 76512, 218197, 345114, 229571, 111277, 89038, 27651, 30689, 121532, -49881, 61979, 155456, 161203, 165364, 322317, 244703, -5422, -62562, 1890, 165548, -3383, 55363, 168924, 162335, 119654, -24682, 76173, 44681, 119070, 65996, -12768, -22345, -13355, 79635, 303741, 227957, 199393, 288430, 417313, 272734, 313203, 205860, 80122, 150395, 55486, 191677]
38748A91677j2925j3715r3168Q3811j2756j1623M4407J44728M8729m8078r6801
38737B24286k14056P1917Q6824R7915P4421j73407J9104J10591j48253K85J82034
38726C31661n2604m322j25196n2845J5317j8248M8433j3582K1823Q5432l6461
38715A99408j20362J76611J23129n6082K8732l22421j49723K48585J72307N667
38705C05851m7815j23495N6598J18595P7064o1069k86672Q0434m4528j38218P3712
38694A0457K0521J04965J02260j68224l2735n2297l5184q7960J18674K39999O1549
38683B82025o8835j73487k4032M3932L9338N9039L6244q7063m3300J37633K7035
38672B28529j55385k07568N7357K34392m7873J3351N7443m8194j8170j79015k1774
$$ y = [191677, 178752, 165037, 71869, 155680, 142924, 131301, 175708, 320436, 369165, 321087, 224286, 10230, 82147, 168971, 266886, 341307, 167900, 187004, 297595, 149342, 149627, 331661, 279057, 274735, 149539, 96694, 112011, 93763, 142196, 128614, 150437, 235869, 199408, 79046, 255657, 378786, 322704, 351436, 29015, -120708, 127877, 300184, 305851, 258036, 134541, 191139, 309734, 386798, 325729, 39057, 119491, 74963, -63255, 10457, 30978, 135943, 238203, 69979, 37244, -15053, -50237, -138197, -19523, 220476, 282025, 213190, 39703, 15671, 59603, 98941, 157980, 194224, 107161, 63861, 201494, 228529, 73144, -134424, -77067, 157325, 109452, 122803, 180246, 132052, 113882, -65133, -86907]
38661h6907M3127J95349j03501k7718j4468J89002N92r086J93484N7155q6299
38650C50730l5957L287o5745r1204n8008o5258J6537n9418j58538N5053q4495
38639a93016K0013K64722J99758J53016r5909q056r5644j24174J68424j10788
38629A78346j61272m8933j69748l1111J89507J88677k8943m3622L2891p217j93927
38618i5352l7384J23793P1487J26799K648k05346m5720j19048N8413J70185O6154
38607A16629J56620k15362o5058N7187J32552Q9589j56170o9740K24136k05458
38597F4925j98828J02368J30685p5026m8412M9935r202J01062j8955O9243R766
38586A77561l114N4369j08899j32058J17337J50163o4367j90627N0729l3652J62603
$$ y = [-86907, -43780, 151569, 48068, 20350, 5882, 194884, 195476, 186390, 379874, 437029, 350730, 314773, 318060, 252315, 161111, 103103, 37845, 54382, -5036, -163574, -108521, -193016, -173003, 91719, 291477, 444493, 348584, 340528, 244884, 120710, 289134, 178346, 17074, -31859, -201607, -232718, -43211, 145466, 116523, 72901, 105792, 98575, -95352, -132736, -8943, 62544, 189343, 191991, -13355, -59075, -178123, -119710, 50475, 116629, 273249, 57887, -7171, 50016, 182568, 272157, 115987, 46247, 270383, 64925, -133903, -31535, 99150, 24124, -24288, 25647, 16445, 117507, 98552, 167795, 177561, 174447, 228816, 119917, -12141, 105196, 255359, 190992, 365, 51094, 17442, 180045]
38575A80045J6425P2548o6917j19179J27348M5015K5046k1657j10083M4609K16323
38564D09523J6687j90314m5471O9664j04324J11719M1149K3760o4529o6205J70547
38553C72206k27964k7751L277K7927J3451q694L3895J07615o8582j78608p0168
38542b3396K74691R6412k73790n4734J86001q1838M0641N6471K54029k5436r2642
38531C56409k08808q7676k29239J9085J48747J5657J68389O323k05464p0018J17366
38520C0771J46156k61680q643J10199k35542J04919K27072n6784M8717M789j71667
38509f1693M6609R7203J09896J03882j24007j44674n9965K9297N2864N7165j2302
38498I4275k14404R1373k8287P9488M389j7262k2468L9635K6446J42411L0943
$$ y = [180045, 196470, 269018, 202101, 82922, 210270, 255285, 280331, 258674, 148591, 193200, 409523, 426210, 235896, 190425, 260089, 155765, 267484, 308633, 332393, 267864, 201659, 372206, 144242, 116491, 119768, 147695, 161146, 152452, 186347, 293962, 225380, 46772, -23396, 251295, 347707, 73917, 19183, 205184, 123346, 163987, 220458, 474487, 449051, 356409, 147601, 59925, -169314, -150229, -1482, 14175, 182564, 188887, -16577, -86595, 30771, 176927, -84753, -93396, 16803, -218739, -113820, 113252, 56468, 105185, 109974, -61693, -15084, 82119, 192015, 295897, 171890, 27216, -32749, -3452, 49412, 106577, 94275, -120129, -28756, -57043, 22445, 26834, 9572, -12896, 26739, 53185, 195596, 226539]
38487B26539j05534r74P3267o6066M3513r7282k1577j20719K1586J2693Q4133
38476D9579j08793K4359J65155l6580k3957J8812L7598k03840p412Q7632j45367
38465a42814K95560K13732L5721k51189m3664j0128r5503P3839R6352j90179l8679
38454e6952K2417J623k80238j1278K46015M9038k4201j1703q5819O1121J80419
38443I0442m2122k3465K8126k3518j09163J35542O5610q9521j30330J40895K82479
38432C24975j3293k15015j21044k6704Q0304j4544J02391j33227P2935J35573
38422A92351r1101r2660R41j3164j63482J66009Q0697j7790P165k33666J00382
38411f4318J15462O9646R4946j20614L2238J71288K1022j6742k95402l57418M7234
$$ y = [226539, 121005, 120031, 193298, 127232, 170745, 73463, 51886, -68833, -47247, -34554, 49579, -59214, -34855, 130300, 93720, 69763, 88575, 126173, -77667, -85079, 2553, -142814, 152746, 366478, 402199, 151010, 107346, 97218, 1715, 75554, 171906, -18273, -56952, -34535, -32912, -313150, -324428, -78413, -29375, -53576, -65279, -151098, -89977, 90442, 48320, 24855, 52981, 29463, -79700, 55842, 121452, 31931, -98399, 42496, 324975, 311682, 96667, -24377, -51081, 29223, 14679, 117070, -16157, 56778, 192351, 101250, 8590, 9531, -3633, -167115, -1106, 79591, 61801, 68966, -164700, -64318, 51144, 120790, 215736, 95122, 127360, 298648, 319670, 302928, 7526, -349892, -302658]
38400c02658L1066M2734K36673L1092P5783j59816j3116M6262k8775n7695K4825
38389g3625N1915j6109J14239l9278o0484N7665k20543k4837k1484J84004J59521
38378A10984j43552r3491R1125K32742l9292n1732Q5086j72202j6416O7518L3447
38367A04217r7049M7912l2586N5842P3621J13712q7040O5363J21508j78062k16489
38356b9051J7214J52989j31617R480m2624O3815K09494L7878J6206O9057k63530
38345A09311j32878J29508j7750j72923J81479M2161j97014K69181j42833q6627
38335a8385q3540L1332O0730N2830r1519M6390J14275Q684j83978P911q8183R9668
38323d3785J68919R7746j5588j7442j93718j73122P8479L8815l6899J8304O3076
$$ y = [-302658, -271592, -228858, 7815, 38907, 114690, -45126, -58242, -11980, -40755, -98450, -73625, -21710, -37819, 76420, 37142, -23342, 34323, -186220, -211057, -232541, -48537, 110984, -32568, -126059, -34934, 197808, 158516, 106784, 191870, 19668, 3252, 70770, 104217, 7168, 55080, 22494, 78336, 151957, 265669, 178629, 243992, 365500, 187438, -29051, -11837, 141152, 9535, 19015, -23609, 40206, 249700, 287578, 303784, 372841, 109311, -23567, 105941, 88191, -84732, 96747, 138908, -58106, 211075, 68242, -18385, -101925, -70593, -9863, 42967, -48552, -2162, 112113, 120797, -63181, -55270, -143453, -43785, 125134, 222880, 207292, 189850, -3868, -176990, -98511, -59696, -96595, -78291, -15215]
38312a5215j7695O6623L2618O9948j07542N9932J17445n3064j1460L3291j30888
38301D3993Q7893o529q2495J7087o5461p0797L0698J15906o4430j48832P4286
38290f8681J09157m6369k56260R8565K02583n042J64382j41081n6300P4154o3972
38279A1136J14951j47055K25513j12187J00886J04468j16064j93830n0628K9925
38269c2885J72804O6436O6180J26011k59109j57155j45493l2026Q3280J63687
38259E1730M2985o9769j0023o2506L5690k9698J22846j8589j70252o6641n8057
38248b32284J06410J13015j8216N3448l0516o5223J83251l9750Q36r500R644J0750
38236H1865o4080q1931R563K6436j20840J27707k3740R6472q3129L7510J99977
$$ y = [-15215, -32910, 33713, 66331, 136279, 28737, 88669, 206114, 153050, 141590, 174881, 43993, 131886, 125357, 42862, 59949, -5512, -76309, -45611, 70295, 5865, -142967, -68681, 40476, -5893, -262153, -163588, 38995, 33953, 198335, 57254, 954, 75108, 11136, 126087, -20968, 204545, 92358, 193244, 297712, 181648, -12182, -62810, -32885, 139919, 206355, 272535, 398546, 139437, -17718, -163211, -195237, -111957, 51730, 94715, 24946, 14923, -47583, -11893, -41591, 81255, 62666, -107586, -174227, -232284, -125874, -12859, -31075, 22373, -8143, -73366, 109885, 70135, 70971, 61471, 71115, 81865, 17785, -64146, -54583, -28147, -148987, -21280, -45020, 51452, -31677, 5833, 205810]
38225B05810j2230N6201k90723p4728N5220M3513j39560J03697K8604l48609J59671
38214b13134J66468j01887L2532P3929J89107J17905j78189n8156q1429J777L6355
38203a4722l5534r6900R8265K16653P2844k73405r7799J5079O0374k43342J27638
38192a70849K12456M1252N4931Q099n3554n0346P7605m3843j71420r788J40896
38181C5439j49388N994r1292N3447K71215K8785p871l8127l1998j27867j77560
38170b29223J58813j6457k1064J72054J31477J6544q2071j60107o6974O5663P0492
38159C9147K532P295m7526Q0512M9771m9978R4339P4287k80014L6564R6443J7385
38147A20757J0049Q2705p2424j0026J05548j8336j22593r8873J26656m4401k43485
$$ y = [205810, 193580, 249781, -40942, -115670, -60450, -16937, -156497, -52800, -24196, -372805, -213134, -46666, -148553, -116021, -42092, 147015, 264920, 86731, 28575, -52854, -51077, -14722, -50256, -147156, -48891, 167762, 240606, -32799, -130598, -115519, -55145, -298487, -170849, 41607, 82859, 137790, 145889, 92335, 41989, 119594, 75751, -95669, -105457, 35439, -113949, -107955, -199247, -145800, 125415, 154200, 146329, 108202, 76204, -51663, -229223, -70410, -86867, -107931, 64123, 195600, 212144, 130073, -30034, -97008, -31345, 39147, 41679, 48974, 1448, 81960, 131731, 81753, 176092, 250379, -29635, 6929, 103372, 120757, 130806, 213511, 141087, 131061, 236609, 218273, 95680, -3193, 123463, 79062, -164423]
38136a64423p1806J61337J24325q2359n9345J58001M6683j10730j9640K4022Q605
38125A4670l312m7940j78245r963R901K44431j4276j78326j08969o1134J60445
38114a72718J23180K9614J00386R687k5883M166J09323o7104O860k37665j5082
38103a35236K5184K42484m6313P7401J06724m7952k23054j61672L6122K04278
38093G7966m2637j49679J30930O6507J1751K63077J22078l24948j17571p1747
38083c4273J46630N8230j13768m3668o0077R064j73085K02323j56508N4666J29467
38072A9001j44803l4617J40912J08434l9642P6385J34444p8989o6188q3106P8467
38061A10298r969o6021K7216P4738k75358j60871J34024q764L2886L0495k385
$$ y = [-164423, -236229, -74892, 49433, -32926, -92271, 65730, 112413, 1683, -17957, 6065, 14670, 11358, -36582, -214827, -224790, -214889, 29542, 15266, -163060, -272029, -333163, -172718, -49538, -19924, 80462, 90149, 64266, 68432, 177755, 110651, 117511, -120154, -135236, -110052, 132432, 86119, 163520, 270244, 222292, -762, -162434, -126312, 77966, 35329, -114350, 16580, 83087, 94838, 357915, 479993, 155045, 37474, -34273, 112357, 170587, 56819, 13151, -46926, -37862, -210947, -8624, -165132, -110466, 19001, -125802, -160419, -19507, 88927, 49285, 125670, 260114, 181125, 114937, 31831, 110298, 100329, 34308, 61524, 136262, -139096, -299967, -165943, -174707, -141821, -111326, -113711]
38050a13711J50632q3623m5144l2267R712p511O5005P0261j3066N1423R4746l6899
38038A09558j32982n806j45076j6589O0531M3624J10322L5505j0008j02653N6287
38027B713J10844M9612l6583q669l5071L7817J1188l2955J4645P6160n3754q5503
38015E0444K02048J37710j85082j19643K4374J24797K709j09582q6471k8285q3301
38004g0282k3514J14467o9150J27147j13459j08665Q796N6029J00636K0460j17579
37993g5114j73058K13616N8530l7834K3990P5414n2709r8719J57608M433J20905
37982B17062q9908r3260o6528q7138l1994J96256J59045r4912j15639m3098o6811
37971a16925O0150N2506o3012q3598R1604o4089J10851N3019J72010J70251l4567
$$ y = [-113711, 36921, -46702, -91846, -124113, -114401, -121912, -56907, 13354, 288, 51711, 146457, 109558, -23424, -29230, -174306, -190895, -130364, -86740, 23582, 59087, 49079, -53574, 2713, 113557, 163169, 126586, 117917, 82846, 120663, 131851, 98896, 113541, 189701, 135947, 50444, 252492, 390202, 205120, 85477, 109851, 234648, 237357, 127775, 41304, 13019, -70282, -93796, 20671, -48479, 78668, -34791, -143456, -134660, -78631, 22005, 42465, -75114, -248172, -34556, 23974, -13860, 10130, 85544, 32835, -65884, 91724, 96157, 217062, 127154, 33894, -32634, -119772, -151766, 44490, 203535, 108623, -7016, -50114, -116925, -56775, -4269, -67281, -150879, -59275, -123364, -12513, 40506, 212516, 382767, 348200]
37960C48200j74776k41722j04197j33693j5811K60446j5247j05978P6406M301
37950a02071L9660J29962J35494M0526l02336r1897m311J09740O7745J53602m2571
37939A33543j76644q1204K8434M6669o6685j9281o6337l7437M7895J46258R9240
37928E4451m7359J98906K3241j97247N7997q6532q0855R590k17219K02022L4625
37917d8380m1561j65182P0371K45817O7718Q1730j56968r4489J43860o9885j41454
37906a08423J60938K2084k2280n1150O4872N1819j20418L8753L9736N1526K5509
37895A52966J8433n5311j37493K9831l582o0754O1208n7725j31516j48762J18998
37884b13707J00202m89p4853K16000P9863J47695j87015j78721J63215L1372j58519
$$ y = [348200, 173424, -68298, -172495, -306188, -321999, -61553, -76800, -182778, -106372, -102071, -62411, 67551, 203045, 243571, -58765, -150662, -154973, -45233, 22512, 176114, 133543, -43101, -124305, -95871, -49202, -115887, -135168, -201505, -238942, -191047, -44789, 54451, 7092, 205998, 229239, 31992, 89989, 3457, -77398, -67808, -285027, -83005, -48380, -89941, -255123, -184752, 61065, 128783, 210513, 53545, -40944, 102916, 33031, -108423, 52515, 74599, 52319, 1169, 66041, 117860, -2558, 36195, 75931, 127457, 152966, 171399, 116088, -21405, 8426, 4844, -55910, 5298, -52427, -183943, -332705, -213707, -113505, -113994, -188847, 27153, 107016, 254711, 67696, -111025, 52190, 83562, -74957]
37873g4957M9785M3518j94286L0678J08745p8033J05688J93339N0336k34364k13389
37862b12940O1183P7124J44891j24724m3840K2610j90907n6219J75502K34287
37852H6967K6981k09814M1992N7506Q206j45896j12606p4853K4596J66667R5995
37841c4259J13995J4147j68154O356j15899K0169K68887J29879L1116k11523p7774
37830b3060k3428r2466O5103Q789p5922L1609m4009k2391q7495R8600J41211K71
37818b3188q8534J14987l8019J17993j03296L7869q700k7893q2083o4553L6424
37807a28993l7263L36156r7712M802j17203P753j63970n5418N7645J86997P9290
37796G2084m4221K27725j13080q6610K1130j4522l1376j35998j3635n3922J28086
$$ y = [-74957, -25172, 18346, -175940, -145262, -36517, -114550, -8862, 184477, 234813, 449, -212940, -151757, -74633, 70258, -54466, -98306, -75696, -266603, -322822, -147320, 86967, 113948, -95866, -53874, 3632, 11838, -134058, -246664, -321517, -296921, -130254, -34259, 79736, 93883, -74271, -67915, -183814, -163645, 105242, 235121, 266237, 54714, -23060, -46488, -138954, -73851, -65062, -140984, -109375, -153384, -175775, -263270, -164670, -23459, -23188, -111722, 3265, -34754, 83239, -20057, 17812, 9112, -18781, -100864, -165417, -128993, -166256, 169900, 72188, 76990, -40213, -32460, -196430, -251848, -194203, -7206, 72084, 27863, 255588, 142508, 55898, 77028, 62506, 31130, -104868, -118503, -172425, -44339]
37785d4339N6640Q6620j6707l4002M0715j29882j6945n3994m7956j2025J19610
37774e2265J74969o9200O0482Q6030l7646l7234K601k04016j4524M8720L5087
37763f996P9407N633M0358j75478K4212k6994R4905j6078r7854l0069r3822J56105
37751d6671N2796j35480Q0006r109p67l1884l0247J47069K17915j16613k41159
37740a14144j16825p2401J03753K8745K27429J51298m4935j17806p3608Q1911
37730E3417r2437k14643K27717J99197j4866J21274j51343k9068k1220L3194L5373
37719A46595N3060l2654J2111J48987R1299j40734k34234n8929l5230L4259L6208
37708B0738M752J8406j38140l1647k3572J49496m51q0099J1412K30862r3779j28448
$$ y = [-44339, 12301, 98921, 82214, 48212, 88927, -40955, -57900, -111894, -159850, -171875, -52265, 122704, 53504, 113986, 200016, 162370, 125136, 127737, -76279, -90803, -42083, -6996, 72411, 78044, 118402, -57076, -32864, -59858, 35047, 18969, -78885, -108954, -202776, -46671, 6125, -129355, -49349, -58458, -59225, -91109, -121356, 25713, 243628, 127015, -114144, -230969, -303370, -199617, -170872, 56557, 207855, 162920, 45114, -28494, 53417, -39020, -253663, -25946, 173251, 158385, 279659, 128316, 99248, 78028, 111222, 146595, 199655, 167001, 179112, 328099, 419398, 278664, 44430, -14499, -49729, -15470, 20738, 25490, 43896, -94244, -125891, -149463, 33, -418, -80517, -69105, 161757, 67978, -60470]
37696f0470M8507m3855k5628o331J35706j8659j2313J29804k12063L7083K16936
37685A88717P0748k64582k30180Q6070m0528J7185J14976N5946r800J11222J7684
37674A17458p550j27455L825J48014J45313r5550m3046n085k8901K32J88192m7329
37662B48118j03979J4054j2615Q4436J08019l59497l8621J06095l9743K5709k5584
37651F392o9078l9246j7779J69306o3509l0686J87940j00885r0611l8511k720
37640h9387K50852K5333J87834r7515l6576j6992q1465J14966j864L5563R6669
37629C87418q296p2692L1584l02018j92457j25818n931L2842K15565K89900r7225
37618A52872p7662M0533o3073j16525o1356J42435j00758j78147j49049J3277
$$ y = [-60470, -11963, -55818, -81446, -87777, 47929, 29270, 16957, 146761, -65302, -28219, 188717, 259465, -5117, -235297, -149227, -189755, -172570, -57594, -1648, -11448, 99774, 117458, 109908, -17547, -13722, 134292, 279605, 184055, 141009, 135924, 107023, 107255, 295447, 248118, 144139, 158193, 145578, 230014, 338033, -21464, -60085, 46010, 6267, 31976, 6392, -62686, -101932, -119711, 49595, -13914, -44600, 143340, 42455, -48156, -86667, -89387, 161465, 186798, 374632, 277117, 240541, 223549, 142084, 257050, 255186, 290749, 387418, 379122, 306430, 338014, 35996, -156461, -282279, -288210, -255368, -39803, 250097, 152872, 75210, 115743, 52670, -63855, -125211, 17224, -83534, -261681, -410730, -397453]
37608c97453N8288K4864M1020K97137J57898j01123J67096P7552k59289j45774
37598g9784P8830N6296j5947K1991O2498l7278r8467j3341k7628j46377J04727
37587i4480J78913J16922r067l47331j07817j2193P6903K22150j16896l1641J90946
37576F6409J33011J60253o7016m6439q1601j33063k7571k3914j62118J53618J59794
37565A31363j32976j3943M2799J1423n4030n1412Q1675k2781l6j66741j64020
37554c38679K48940R4508O3038K17815o7954r9385J7125O3071j73116j07157N3237
37543b8557K05009J06845k40175q7355j1785j6186j02996J7686o9529M0182M1308
37532a45553J12699O5042l803j4926j1986p107k10050R7807J50555j06966R1625
$$ y = [-397453, -339165, -314301, -273281, 23856, 181754, 80631, 247727, 325279, 65990, -79784, -954, 55342, 39395, 61386, 123884, 86606, -11861, -25202, -52830, -199207, -94480, 84433, 201355, 192288, -155043, -262860, -275053, -198150, 24000, -92896, -124537, 66409, 199420, 359673, 292657, 246218, 164617, 31554, 3983, -19931, -182049, -28431, 131363, -1613, -15556, 27243, 38666, -15364, -66776, 14899, -7882, -7918, -174659, -338679, -89739, 4769, 67807, 285622, 217668, 118283, 135408, 198479, 25363, -81794, -28557, 176452, 283297, 43122, -44233, -56018, -72204, -175200, -157514, -227043, -186861, -145553, -32854, 32188, 28385, 13459, 1473, -5634, -215684, -117877, 32678, -74288, 17337]
37521A7337q8060O1962J04692M7139k0694j0062j36309j0041j7026R4299P3637
37510A16874o480K06012L0083j69787k08387J9822l3877J76351J13218j85952
37500E7877j26513m3336K53135M5879j00354q2636j10520O7641K22841m786k16752
37489c7524k2291K5910N1992o9848q4823p4726O2150R179J55604J49959j98202
37478c2620l7141O8470L3172l9738K05846j4899l978k31945j53841k626J78025
37467c1275P5195j74778j94503J88629N2721J25484K00664O0472k53540n7602
37457h533L5011M781j4106k37870O1574L5353j168j02521O9378k1158j2092J51893
37445c9458L0317R4358O2879j61446N821l9582O3758R1405j05114j85671M0675
$$ y = [17337, -70723, -8761, 95931, 143070, 122376, 112314, -23995, -34036, -51062, 43237, 116874, 110394, 316406, 346489, 176702, -31685, -11863, -45740, 130611, 243829, 57877, -68636, -111972, 141163, 187042, 86688, 4052, -106468, -38827, 184014, 179228, -37524, -59815, -33905, 18087, -51761, -136584, -211310, -149160, -139981, 15623, 165582, -32620, -69761, -1291, 31881, -7857, 197989, 183090, 179112, -52833, -206674, -209300, -31275, 43920, -130858, -325361, -136732, -84011, 41473, 242137, 302609, 49069, -8533, 26478, 31259, 17153, -220717, -159143, -123790, -124958, -227479, -158101, -179259, -191351, -39458, -9141, 85217, 148096, -13350, -7529, -47111, 16647, 108052, 2938, -182733, -142058]
37434a42058L06820J85284J00960p9574r5956o378N177j22932j13983j08616o7777
37423a39033r5665J39049J16862r729N600L8937l7862j31498J69001L7299L0618
37412A23579K8875m7169j4910l4077r1943K2108l8787l0882L5277q1222M3478
37401h5673K32614q8076j1268M9723j19847l9854J95378N9722K1721k00739R6155
37390A09856m8650q5967q3324R0090R3974j42423K2865K07820j4574k3978j1882
37379A13807j24985M5157r0397J7188l7336l9350q831J16706P232K4729k5843
37368a923o5106N1633p5160J04178O4861N7794M3986M038q9925L1029Q6126J04107
37356C15638J09546k43382j70702J6675q9692R0973J76530R8964K7875j46257
$$ y = [-142058, 164762, 350046, 451006, 371432, 275476, 269098, 274275, 151343, 37360, -71256, -139033, -234698, -95649, 21213, 11484, 17084, 56021, 18159, -113339, 55662, 92961, 123579, 152454, 105285, 90375, 56298, -35645, -13537, -52324, -83206, -47929, -129151, -85673, 146941, 58865, 47597, 97320, -22527, -62381, 132997, 192719, 214440, 13701, 109856, 61206, -24761, -108085, -17995, 75979, -66444, -43579, 164241, 149667, 125689, 113807, -11178, 33979, -56418, -39230, -76566, -115916, -124747, -8041, -809, 23920, -1923, -67029, -15396, -90556, 13622, 78483, 136277, 180263, 184301, 94376, 125405, 211531, 315638, 425184, 181802, 11100, 27775, -61917, 29056, 205586, 304550, 332425, 186168]
37346A86168j37200M4700O0794J3966j80689p0737M6503J33636N4778J66551k87567
37335C0903j17626J05659r8109p5868J58903n3708r9284k5860K00774Q4676L5817
37324A46277J0235K3573j49217j11252j9150J70866k3638J80970r9296k1846o3711
37313D3811j2204Q7615M249k11684N452J34737N1072n0621M4374j10057Q7261
37302G4005R1496q0653Q6811O9377j29927k87236K8253J45873o2523r3631m3820
37291b01975j4880M0854J56243R9389O772Q3957j0317J0120L9914J0238K6672
37280B46987j84712p7925K69780r1152m4190r0007j4954J4181k8483l1033M2515
37269A1007M3461R825n9638j33835N3461j7007j2996K6982J5061J90051j94143
$$ y = [186168, 48968, 93668, 154462, 168428, -12261, -82998, -36495, 97141, 151919, 318470, 30903, -86723, 18936, -79173, -155041, 3862, -49846, -149130, -174990, 25784, 110460, 146277, 156512, 180085, 30868, -80384, -99534, 71332, 47694, 228664, 129368, 107522, 43811, 31607, 119222, 123471, -88213, -82761, 51976, 103048, 52427, 96801, -13256, 74005, 165501, 84848, 171659, 241036, 111109, -176127, -147874, -2001, -64524, -158155, -201975, -216855, -176001, -19758, 79631, 86403, 170360, 160043, 170163, 210077, 220315, 246987, 62275, -15650, 254130, 162978, 118788, 28781, 13827, 28008, -475, -31508, 11007, 54468, 64293, 4655, -129180, -75719, -92726, -105722, -78740, -63679, 126372, -67771]
37258f7771J49762K32703l8080m4515Q7048N4096j71580j10877j22946j52717
37248a84877Q7877j10101L8444K47980K2045p4097j20527j15528J5292J0894J22363
37237f0235J6953J36209J57178j45233j39554j5367o119j30676K0578O976J31738
37226b7552L7734k75657L3071L43326R8151q2393k55350N2554M3659N2797J6349
37215C6689J60082q2832o8309K7806N1954k4997M224l4201o9816J38603L3552
37204A72755p3292O2795p1612Q9460j14961j27425J15093J34464o4268p59J930
37193A24180o9346K1343J14166k7933j09472J4439Q6901J3188j19074q4851M0018
37182C559Q9663q9501J66871L9156k48149p9692r2811k3726J03083J12172J7813
$$ y = [-67771, 81991, 314694, 276614, 232099, 319147, 373243, 201663, 90786, -32160, -184877, -97000, -207101, -168657, 79323, 101368, 27271, -93256, -208784, -193492, -182598, -60235, -43282, 92927, 250105, 104872, -34682, -50049, -56168, -186844, -166266, -159290, -27552, 10182, -265475, -232404, 110922, 209073, 126680, -128670, -76116, -32457, 20340, 36689, 196771, 113939, 45630, 73436, 125390, 100393, 104617, 70416, 600, 139203, 172755, 99463, 162258, 90646, 180106, 65145, -62280, 52813, 187277, 123009, 122250, 124180, 54834, 76177, 190343, 162410, 52938, 67377, 154278, 167466, 48392, -36459, 3559, 93222, 3721, 170592, 209748, -38401, -118093, -210904, -234630, -131547, -19375, -1562]
37171a562l6664k47182o0738O0811o9034J07781J61988L4929l2354J65290J05973
37160A89238p9400k6237p8834o7875J31229l9699M0858j90159Q3182J28427j46259
37149e5529j38163j0315j21539J1409J97946J73841L8069P3540n2387k30240Q3481
37138b9887P6945j02365n8318k3312q2301J13438M9518q5159K783P3477R9032
37127C3851j38415N0342K8234R1812K48352K4767k33763k06925j1802J73022r8681
37116c9206j36818K09099J38585j05935m5704K3596j4862l1966J52873j00994
37106D8668j91910J07038J06130p9134j06929o4360K19866l0402j06594N8311
37096c9316q934j27468p2199Q9868J05198q6022R1818J83688r3596p1852N6703
$$ y = [-1562, -38226, -285408, -346146, -285335, -354369, -246588, -84600, -49671, -82025, 83265, 189238, 109838, 83601, 4767, -63108, 68121, 28422, 69280, -120879, -37697, 90730, -55529, -193692, -204007, -325546, -314137, -116191, 57650, 95719, 169259, 116872, -113368, -29887, 47058, -55307, -113625, -136937, -219238, -105800, -56282, -141441, -138658, -65181, 33851, -104564, -54222, -25988, 65824, 314176, 338943, 105180, -101745, -113547, 59475, -39206, -176024, 33075, 171660, 65725, 20021, 43617, 28755, -3211, 149662, 48668, -143242, -36204, 69926, -9208, -116137, -180497, 39369, 8967, -97627, -39316, -48250, -175718, -247917, -158049, -52851, -138873, -47055, 136633, 43037, -28815, 27888]
37085B7888J49455J14631M2759j29041j22819j23508j69801J84340J17078J58051
37075B49033j1313l74191j26654J87127J02870k6744L2831l1552p8783J05519
37065B8143J07050j24099N7202l2796J72293M5854m5388M289Pj16940n2895J09922
37053A52642j10697J12424M4100j41849j11718j7533J016m4663J30704j95651
37043a81225n9869M01806k2411j88449j53468L3829M7561j43773k0122K01801
37033h4320j7695O6998m6081J2120L3441K03898r252l6629K9662l4721j2043L6191
37021A41569k5122p5351j9869n070K0419j6557J62921J0441K9245j14174m7532
37010F0920o1131K7960K300j15295j32889J38698L1189J3094q046M9062o2067
$$ y = [27888, 177343, 291974, 334733, 205692, 82873, -40635, -210436, -26096, 90982, 249033, 237720, -136471, -263125, -75998, 26872, 128, 32959, 1407, -77376, 28143, 135193, 11094, 68296, 35500, 207793, 253647, 208259, 212548, 212555, 95615, 42720, 152642, 41945, 154369, 198469, 56620, -55098, -72631, -71615, -116278, 14426, -181225, -241094, 160712, 138301, -50148, -203616, -169787, -122226, -265999, -286121, -84320, -102015, -35017, -81098, -68978, -35537, 168361, 159109, 122480, 152142, 117421, 105378, 141569, 116447, 41096, 21227, 16157, 36576, 20019, 182940, 193381, 222626, 108452, 60920, -211, 27749, 30049, -85246, -218135, -79437, -48248, -35154, -43200, 5862, -56205]
36999e6205M3797n1641p3561R0580J595M7881q3200J38659L9380P7920K9328r8516
36987A06017j2543n7155l6648l7887J2667q4688R3714N5343J30025J2221o5674
36976A15392P4299j15231J515J2032j1034N4797l2987n4334Q4509r4081Q0774
36965A15651r69P275j1264p4940k32259K9540K6248n0680K9029K957J97404J22054
36953A60046m9917j0151j03893j8031J51917j19576j00369N5008J30342M6591
36943A41967o359j04000m3743k241J67199L2603k1682J9324Q3690j62195K3786
36932A28349j80871l876P4531J39710r8635m0330j11512J49133q2420j36484j5426
36921a77831J70122K0433M2111m6683L1766J70932q8100k0287m6614J3521O4208
$$ y = [-56205, -12408, -64049, -137610, -47030, -45435, 2446, -80754, 57905, 97285, 175205, 204533, 106017, 93474, 36319, -329, -38216, -25549, -110237, -16523, 38820, 168845, 181066, 115392, 189691, 74460, 75975, 88007, 76973, 131770, 98783, 44449, 128958, 34877, 115651, 114682, 121957, 110693, 35753, -196506, -166966, -140718, -191398, -162369, -159412, 37992, 160046, 110129, 99978, -3915, -21946, 129971, 10395, -89974, -34966, 95376, 141967, 135608, 31608, -12135, -14376, 152823, 185426, 163744, 183068, 266758, 104563, 128349, -52522, -56398, 18133, 157843, 59208, 18878, -92634, 56499, -25921, -162405, -177831, -7709, 12724, 54835, 8152, 39918, 210850, 122750, 102463, 55849, 69370, 133578]
36910A33578p6026r3047j18149N8999J47812J10965k78506J14192j678j01048
36900a02908n1106R4063k6732R8385J17669k0459J26828o0141k11989k4695M2963
36889a8122J06341O5444j92398j07967M9295J01428N403r1974j42090M4390P6424
36878a03826J48303M2933j47030J70605m1911L5302j4459K6761N7359r3935k8880
36867E1222N8229K9878j79505J49576P336j28541LO535r995q6594k08j55048o9782
36854c26894O6782J06833j4724j11541K30319J45668k3942n3788p642q2311M4341
36843b6899O1208q1993m8021R9371j96385J21755L1827n2617l1734R2621J55198
36832A24331J48424R7762k35496K56419p839p9347k14793r1642L1904o0812R6250
$$ y = [133578, 57552, -35495, -153644, -94645, 53167, 164132, -114374, -182, -1860, -102908, -154014, -59951, -86683, 11702, 129371, 108912, 235740, 175599, -36390, -61085, -18122, 88219, 153663, -38735, -146702, -97407, 4021, 9424, -82550, -224640, -180250, -103826, 44477, 87410, -59620, 110985, 69074, 104376, 89917, 116678, 174037, 80102, 51222, 109451, 139329, -40176, 109400, 116736, -11805, -11802, -5267, -15262, -101856, -102064, -257112, -326894, -260112, -153279, -168003, -279544, -49225, 96443, 72501, 18713, 11071, -71240, -26899, 34309, -47684, -95705, 3666, -192719, -70964, -39137, -91754, -123488, -30867, 124331, 272755, 370517, 135021, 391440, 383601, 304254, 89461, -2181, 29723, -31089, 65161]
36821F5161n2553P6259K12049n8899M0679q8628j80202j52490j24286J77098P0443
36810a5369k20550N9842R937P0137J66562J43398o3011j58288N002Q7692k8863
36799E6489J9851l4153j16390M9074Q7229o0548j90350R5910J24409K47324m1316
36788B37529o3526m4225N8021J3984j15518r2025K09214P9627n2729j49548k8306
36777E2498o1158j0876M5638j16841l03941J56490K17065r0657N4899J75499l8143
36766H0473O4887P7840M1056m1294m3180q3587j41086Q0718m0058J5576Q0114
36755I1459j49399R9761R1365j38435m4883k3150R4797J05552K02427O4775j23777
36744B70492p619j12066J11836M8262j34584j26921K2145n2566R9332k5871N0020
$$ y = [65161, 12608, 88867, 300916, 242017, 282696, 194068, 13866, -138624, -262910, -85812, -15369, -235919, -176077, -166140, -96003, 70559, 213957, 150946, -7342, -2340, 85352, 56489, 76340, 42187, -74203, -25129, 62100, 1552, -188798, -92888, 31521, 278845, 237529, 174003, 129778, 187799, 201783, 86265, -5760, 203454, 283081, 230352, 80804, 52498, -8660, -19536, 26102, -90739, -394680, -238190, -21125, -111782, -56883, 118616, 80473, 145360, 223200, 264256, 222962, 179782, 96195, -44891, 35827, -4231, 11345, 91459, -57940, 41821, 133186, -5249, -50132, -73282, 21515, 127067, 329494, 394269, 270492, 262873, 150807, 262643, 310905, 176321, 49400, 71545, 18979, 118311, 92440, 142460]
36733A42460N4651j14219l0178j14009j71255J56986O3064N1325N3398J12158
36723B04381J96337j16547k68388o8902N3822J51667J27344q7692m6944K8146
36713A73224j54967l7041J22596J9240J59r3037o0681o5795L2463j2638r4869
36702a71346R5353J09677j51321Q0892J23217P606L9658j1117N3205l1180J60376
36691C05020j57306j46762m5816M8928j1889P5991j27129L1710R5195O9745j6283
36680A21404j24845o9587k7335j86261n2384L2877P6187J29247J23389m4215n6377
36669g7900k13674J03515J40838N2689m4192L5799J21301j59900m1737k23910
36659c07171m308K26325N8222J85283q1407K9627o215K4078k1861J3179j03377
$$ y = [142460, 197111, 82892, 52714, -61295, -232550, -75564, -12500, 38825, 92223, 204381, 400718, 284171, 15783, -53119, 703, 152370, 279714, 192022, 145078, 173224, 18257, -18784, 103812, 123052, 123211, 30174, -30507, -96302, -63839, -76477, -171346, -75993, 33684, -117637, -36745, 86472, 94078, 133736, 122619, 175824, 144644, 305020, 147714, 952, -44864, 4064, -7825, 68166, -58963, -27253, 67942, 137687, 121404, -3441, -73028, -100363, -286624, -339008, -306131, -229944, -100697, 22692, -21523, -77900, -291574, -188059, -47221, 5468, -38724, -2925, 118376, -41524, -83261, -307171, -311479, -85154, -26932, 158351, 76944, 106571, 100356, 124434, 102573, 115752, 12375]
36648A2375k6424K5220J2871K0787m7498n958K1922m6266r7366k5213Q4137K10031
36636A38618K7946o5809J04149l30m5150j07347N4483j41313m289M0665l2807
36625c1184n3509N4699N6642K8025p5772m8519k25831O0111L15496j47574l3080
36614a00496Q9876j66283J55930Q9224J4413r6100K1318r8631p5967L062M6920
36603a16734J24255J56879j07438j27574p1609L7636j231K03295j24382R5359
36593F8456K30977k691j46732n5824m0351n8760j50618R5337R4176o0410r9296
36582a25736L6101J38832L5980m8581N1307k9430j49434m582J10157N3121R224
36571G6959j86r9538Q4859j91071q7161K04233r1061n6553R3662J28208l2115
$$ y = [12375, -14049, 11171, 24042, 44829, -2669, -8627, 13295, -32971, -130337, -155550, -71413, 138618, 166564, 100755, 204904, 204574, 159424, 52077, 106560, -34753, -39042, 1623, -31184, -84693, -29994, 26648, 54673, -21099, -69618, -295449, -235338, 80158, -67416, -100496, -10620, -176903, -20973, 68251, 82664, -13436, 7882, -90749, -166716, -163654, -116734, 7521, 164400, 56962, -70612, -142221, -104585, -105816, 97479, -26903, 68456, 299433, 296742, 150010, 94186, 53835, -4925, -155543, -60206, 33970, -26440, -125736, -89635, 49197, 85177, 36596, 87903, 58473, -90961, -95543, 14614, 67735, 76959, 76773, -22765, 62094, -128977, -216138, -11905, -102966, -159519, -65857, 62351, 30236]
36560C0236j14967j35144P6042N4296J37168m4986j22253L1919m2776L00O9967
36549f0198j80184J45165k2533M3351P7838P0472j3515O7134q668j87699k2829
36538i1666j03072P3301N1726J19892k16805j09753K48517K5670J0284J0511m4191
36527b5586J36861j81041j20264Q409J81218J1907r6564m4551k5006J43904P4271
36516F3558J5099J5917L0019N9257l3071j47427J2277n6937J24109J37890j24190
36505I6501p9575j12843J54567J55585p4717j51136j48467j4504K30767l0646
36495B5532P1719M5568j23354J6415N9131O372j1822j57883J23887l6892n3429
36484c4756q3415l2225J26443J28792J16887j3667r2434r1512k41002J51155m8687
$$ y = [30236, -84731, -219875, -143833, -89537, 47631, 2645, -119608, -87689, -130465, -130165, -60198, -240382, -95217, -117750, -74399, 3439, 73911, 60396, 127530, 118862, -68837, -91666, -194738, -121437, -69711, 50181, -166624, -276377, -27860, -2190, 8094, 18605, -25586, 111275, -69766, -190030, -181621, -403, 11504, -85060, -129611, -154617, -10713, 63558, 78657, 94574, 124593, 183850, 150779, 3352, 15629, -41308, 82801, 220691, 96501, 16926, -95917, 58650, 214235, 139518, -11618, -160085, -174589, 56178, 25532, 97251, 142819, 19465, 35880, 95011, 101383, 89561, -68322, 55565, 18673, -34756, -118171, -150396, -23953, 104839, 221726, 208059, 115625, 24113, -216889, -65734, -114421]
36473a14421o4806K08678q0816L5813n341O463R2714J90092m7330j29705j1543
36462G9798j29116j4600J01743j49772j0598J62436N6161R0874k4563m5238r4364
36451B2761k8393M4948n2019r8314P562L6676J40045L097K331o8438j50249o2254
36439b02247L8250J58598J10376j05692J18231j50852m8423K375J43476R7274
36429A61366p6040l7823n9288P9948k4508p663o9046k55172R203N4975P8013N8431
36417h7604j31629K07432j4559L5089J10599j4538j6084j46139M4986k2305P9660
36406D4908N5527J2765J58605J16562l58506k28280L6514J46993R7019j13896
36396c1789Q8831j06671p7108j73523J18273L7266J42682L1033N3897L8410l5296
$$ y = [-114421, -179227, 29451, -51365, -15552, -20893, -14430, 78284, 268376, 221046, 91341, 79798, -49318, -63918, 37825, -111947, -122545, 39891, 96052, 186926, 162363, 117125, 22761, -5632, 39316, -12703, -111017, -103455, -66779, 73266, 76363, 78694, 10256, -139993, -202247, -163997, -5399, 104977, -715, 117516, -33336, -81759, -79384, 64092, 161366, 85326, 47503, -11785, 68163, 43655, 35992, -33054, -288226, -279023, -224048, -146035, -87604, -219233, -11801, -26360, 8729, 119328, 104790, 88706, -57433, -12447, -34752, 44908, 100435, 113200, 271805, 388367, 29861, -198419, -161905, -14912, 82107, -31789, 57042, -49629, -126737, -300260, -181987, -144721, -2039, 28994, 82891, 121301, 86005]
36385H6005l1031k3909J09655j03757k74992K36068L5483J33334j65111k75417
36375b73672o2039K44464M9512m4141m6615L7220J41867L2866j19166j05235L8968
36364a05971R6109R9668n7760n5643K10301p9031j14269J21174J49970M3157j45915
36353A61790j11886l5882J74815l8930k06450k8421O3669o8718N2674J40252J09404
36342B12317j02639o7110m3710j39732Q1213k1958N2325N62P1536K9927r8591
36331b5860p5258L7417k5378p007K1639Q2641k26166J03657m765j44767k4983
36320b88830P3995L11104J829m4921l2624j01368K3882j05928o926R3815Q0544
36309D572j5534K9862J05625J20765j30733o6726o9364P961K5580K2259j60270
$$ y = [86005, 54974, 31065, 140720, 36963, -238029, -1961, 33522, 166856, 1745, -273672, -335711, -91247, -41735, -85876, -132491, -95271, 46596, 79462, -39704, -144939, -105971, -9862, 89806, 32046, -23597, 186704, 107673, -6596, 114578, 264548, 307705, 161790, 49904, 14022, 188837, 149907, -56543, -84964, -21295, -90013, -37339, 102913, 212317, 109678, 42568, -1142, -140874, -59661, -81619, -29294, -28732, 42804, 72731, -25860, -101118, -63701, -89079, -96086, -74447, 8194, -217972, -114315, -119080, -263847, -288830, -214835, 96269, 98098, 53177, 20553, -80815, -56933, -162861, -169787, -75972, 4572, -10962, 18900, 124525, 245290, 114557, 47831, -21533, -13572, 12008, 34267, -126003]
36298a26003J43059L820j83982o3543k05129L29074J71200k1064J07651J76248
36288C31331l1593j11419j82609k8602K73319N9255j96269q1290n5686N6230J436
36277C4103N0659q8525n2905n8211M5248J83693k01956j151J93032p5738j07392
36266g9143P2762J96558r5078j5506M2238j03528q6460N3567n8022L2876q8834
36255a28570O9083J55048J27338j2444j09919L0304J42049m6502r2037K1668j36734
36244A9284K5201n0240k11384J96845o6720M0020l50p257N3575J00625L8269j51658
36232a3790m6179q0229P5950J86195Q6526J42721r3364N750j169J08642j28383
36221B42670j14169p0286M1129J37848O4786J3744k32896k49722J71793m2835
$$ y = [-126003, 17056, 20876, -163106, -226649, -431778, -102704, 68496, 47432, 155083, 331331, 299738, 188319, 5710, -22892, 250427, 309682, 113413, 32123, -23563, 32667, 34103, 84762, -3763, -56668, -114879, -69631, 114062, -87894, -89045, 103987, 28249, -79143, -6381, 190177, 95099, 79593, 121831, 18303, -68157, -14590, -72612, -39736, -128570, -59487, 95561, 222899, 210455, 100536, 130840, 272889, 226387, 134350, 156018, 19284, 44485, -5755, -217139, -20294, -87014, -46994, -47344, -54601, -1026, 99599, 137868, -13790, -59969, -140198, -64248, 121947, 208473, 351194, 257830, 263580, 262411, 371053, 242670, 128501, 58215, 99344, 237192, 301978, 315722, 82826, -166896, 4897, -37938]
36211c7938j11996J08519J44888J60356J1399j94731j65168J38795J21502o3194
36201A12432j98j42137M4810J58114j41347n2618l233m0674J24467M1745r824
36190I1537l9793o0320k5403P4039m2816j24977M0309j5150K43059r223J20450
36179B51712j85628m0125J02910j70147J29588J1244j39460r7084R0221P0105
36169B3336r2938M2156O9075j66159l0274J9215j11323Q3540M9225Q7364m6235
36158g3018N467Q5126O3975j13421j05598L5728m6278K1012O6466m9744J085n7606
36146a66806K819J2124J03291J9947m0183K6749l2406k9040R3197j64535j67083
36135c41926M1521J318J50866o2410K28773K11737P8507m9717q1802j73505K2933
$$ y = [-37938, -149934, -41415, 103473, 263829, 275228, 80497, -84671, 54124, 175626, 112432, 112234, -29903, 14907, 173021, 31674, -20944, -24177, -64851, 59616, 101361, 91537, 51744, -8576, -33979, 40060, -2756, -127733, -87424, -102574, 140485, 131262, 251712, 66084, 25959, 128869, -41278, 88310, 99554, -39906, -136990, -46769, 23336, -69602, -27446, 41629, -124530, -154804, -135589, -246912, -163372, -114147, -26783, -73018, -67551, 17575, 81550, -31871, -137469, -101741, -148019, -127007, -60541, -110285, -109200, -166806, -163987, -151863, -48572, -28625, -68808, -42059, -74465, -103505, -10308, -174843, -341926, -300405, -299087, -148221, -210631, 18142, 229879, 308386, 258669, 176867, 3362, 26295]
36124B6295Q8320J55842j15164k70206J57903L0295o9181J5392K411J7422l1033
36113H296N9242k5879k8274J21281J28396j42732L8050L497m7321k0566O3874
36102A57864q577j75957j95645J97910N7402P1518J63532j14995o0502j39636
36092d7086l4258P8864J71670l5567j35628j4081j31505j29193J22072J47652
36082g060l4323k2882J81738l6775p7511k9539P2307J63365r9206j30023q6767
36071a06676j987q9930O5012J13153j6674K4865J21991q8983m5776J71478j08422
36060C8051j41209N6055L713L8136k13146j4998K47531M7246j22861j01457j03646
36049b66585J8028J75640J90873k60003j8837j60778J01894M6774M1039Q7J09612
$$ y = [26295, 114615, 270457, 155293, -114913, 42990, 73285, 4104, 19496, 21907, 39329, 8296, 67538, 41659, 13385, 134666, 263062, 120330, 158380, 161877, 114556, 93990, 157864, 149287, -26670, -222315, -24405, 32997, 104515, 268047, 153052, 92550, -47086, -81344, -2480, 169190, 133623, -2005, -16086, -147591, -276784, -154712, -7060, -41383, -64265, 117473, 80698, 3187, -26352, 45955, 209320, 110114, -19909, -106676, -108663, -198593, -133581, -20428, -37102, -12237, 109754, 20771, -25005, 146473, 38051, -103158, -47103, -43390, -5254, -218400, -233398, 14133, 61379, -61482, -162939, -266585, -248557, -72917, 117956, -142047, -160884, -321662, -219768, -172994, -131955, -131868, -22256]
36038b2256J38760J50691l33j31159K6317p5915k17907K5240J00577p3602q711
36027h8298J52272n2389j63563n5332J69592n5079k1704J41991k19889L0015K63344
36016A00960p9195P342M2284J12638j18388M2276n51j15667m2752j3799J78275
36005A13423k3768r7289j24789k14210J41698O4705m8628J89945K10333j31294
35995H0126p9498K38159l2043m7638J03507k2940j59546q9356k8429J32692j02166
35984g132p0050J23863r7138r0745n6517P5396J6178N5532J08473J9691J6109
35973I3660l6031r2840Q615m0637J29649m5980j7069J2129m2645j13570K5766
35962a18953N7118l2016J9274L6894J58201k6917o9019j27199m5499J07295q3824
$$ y = [-22256, 116504, 267195, 266862, 135703, 162020, 86105, -131802, -106562, -5985, -79587, -88298, 63974, 11585, -151978, -207310, -37718, -92797, -114501, 27490, -192399, -162384, 100960, 21765, 29107, 71391, 184029, 65641, 107917, 107366, -8301, -51053, -64852, 113423, 89655, -7634, -132423, -346633, -204935, -140230, -188858, 1087, 211420, 80126, 628, 238787, 206744, 159106, 262613, 239673, 80127, -9229, -37658, 95034, -7132, -77182, 46681, -50457, -141202, -197719, -122323, -106145, -50613, 57860, 77551, 93660, 57629, -35211, -26596, -67233, 62416, 16436, -633, 11496, -31149, -144719, -118953, -61835, -93851, -74577, -37683, 120518, 93601, 24582, -102617, -148116, -40821, -124645]
35951a24645R1725J99118J2418O9641J2489n0177k09670J01113Q1951O2304j5466
35940B30801o9659o5553o4884J36848J3454l9607m2820j66402q0349q3216J14680
35929a16707m7668J39115J51474n8751j75131o9640Q6459J00922L0639n589j03577
35918f8454Q3318J82298k30548k1118P801j16848m2979J31535j581N6526n0525
35907g0575l3847J66017l8665j83068o045N2858J19305L1636j3629L2663n1304
35896E346l5232o3491n1604K6696Q0161J9673j58548K81412K27625k7359r0077
$$ y = [-124645, -32920, 166198, 178616, 248257, 260746, 210569, 899, 102012, 183963, 246267, 230801, 161142, 95589, 30705, 167553, 181007, 141400, 98580, -67822, -148171, -231387, -116707, -164375, -25260, 126214, 67463, -107668, -177308, -90849, 10073, 40712, 35123, -68454, 14864, 197162, -33386, -54504, -46703, -163551, -206530, -74995, -76576, -20050, -70575, -104422, 61595, 22930, -160138, -166183, -113325, 5980, 37616, 23987, 56650, 5346, -29886, -93377, -144981, -118285, -38124, -18451, -176999, 104413, 332038, 304679, 214602]
$$ [...]
##END NTUPLES=NMR SPECTRUM
##END=
