##TITLE=19F_CA-8563-1
 CDCl3. 24 sc
 10.4.2019
##JCAMPDX= 6.0         $$ Bruker NMR JCAMP-DX V2.0
##DATA TYPE= NMR SPECTRUM
##DATA CLASS= NTUPLES
##ORIGIN= UXNMR, Bruker Analytische Messtechnik GmbH
##OWNER= root
$$ XWIN-NMR		Version 3.5
$$ Wed Apr 10 14:21:55 2019 Russian Standard Time (UT+4h)  she@DPX200
##.OBSERVE FREQUENCY= 188.290927
##.OBSERVE NUCLEUS= ^19F
##.ACQUISITION MODE= SIMULTANEOUS
##.ACQUISITION SCHEME= undefined
##.AVERAGES= 24
##.DIGITISER RES= 16
##SPECTROMETER/DATA SYSTEM= spect
##.PULSE SEQUENCE= zg
##.SOLVENT NAME= CDCl3
##.SHIFT REFERENCE= (INTERNAL, CDCl3, 0, 101.251)
##AUDIT TRAIL= $$ (NUMBER, WHEN, WHO, WHERE, WHAT)
$$ ##TITLE= Audit trail, XWIN-NMR		Version 3.5
$$ ##JCAMPDX= 5.01
$$ ##ORIGIN= Bruker BioSpin GmbH
$$ ##OWNER= she
$$ F:/spectra/data/she/nmr/f19/1/pdata/1/auditp.txt
$$ ##AUDIT TRAIL=  $$ (NUMBER, WHEN, WHO, WHERE, WHAT)
(   1,<2019-04-10 14:21:03.90 +0400>,<she>,<DPX200>,
      <created by zg, POWCHK disabled, PULCHK disabled
       configuration hash MD5:
       00 E9 B6 7A A2 85 ED C7 34 08 36 98 17 FE 4E 26
       data hash MD5: 64K
       3F EC 1A 5E A4 CB 4B 2B A8 EA E8 3A BD 92 C7 CB>)
(   2,<2019-04-10 14:21:06.12 +0400>,<she>,<DPX200>,
      <Start of raw data processing
       efp BC_mod = 2 LB = 1 FT_mod = 6 PKNL = 1 PHC0 = 902.3405 PHC1 = 622.1557 SI = 64K 
       data hash MD5: 64K
       2E 6B 34 81 87 F3 4E 5B EC 2A 61 89 15 AE 6F B7>)
(   3,<2019-04-10 14:21:20.90 +0400>,<she>,<DPX200>,
      <pk PHC0 = 28.77591 PHC1 = 0 
       data hash MD5: 64K
       24 63 69 6F 1D 29 B6 70 A4 47 B7 51 99 2F 17 74>)
(   4,<2019-04-10 14:21:24.37 +0400>,<she>,<DPX200>,
      <abs ABSG = 5 
       data hash MD5: 64K
       29 DA AA B7 14 59 63 13 B3 91 4D 75 29 A0 E5 C3>)
$$ ##END=
$$ 
$$ hash MD5
$$ 73 0D 4E E2 7F 0B 11 5D 0B A7 A0 53 D0 D1 70 25
##$RELAX= 
##$RELAX= 
##$RELAX= 
##$RELAX= 
##$RELAX= 
##$RELAX= 
##$RELAX= 
##$RELAX= 
$$ Bruker specific parameters
$$ --------------------------
##$DU= <F:/spectra>
##$EXPNO= 1
##$NAME= <f19>
##$PROCNO= 1
##$TYPE= <nmr>
##$USER= <she>
##$AMP= (0..31)
100 100 100 100 100 100 100 100 100 100 100 100 100 100 100 100 100 100 
100 100 100 100 100 100 100 100 100 100 100 100 100 100 
##$AQSEQ= 0
##$AQ_mod= 1
##$AUNM= <au_zg>
##$AUTOPOS= <>
##$BF1= 188.310428
##$BF2= 200.13
##$BF3= 200.13
##$BF4= 200.13
##$BF5= 200.13
##$BF6= 200.13
##$BF7= 200.13
##$BF8= 200.13
##$BYTORDA= 1
##$CFDGTYP= 0
##$CFRGTYP= 5
##$CHEMSTR= <none>
##$CNST= (0..31)
1 1 145 1 1 1 1 1 1 1 1 1 1 1 1 1 1 1 1 1 1 1 1 1 1 1 1 1 1 1 1 1 
##$CPDPRG= <>
##$CPDPRG1= <>
##$CPDPRG2= <>
##$CPDPRG3= <>
##$CPDPRG4= <mlev>
##$CPDPRG5= <mlev>
##$CPDPRG6= <mlev>
##$CPDPRG7= <mlev>
##$CPDPRG8= <mlev>
##$CPDPRGB= <>
##$CPDPRGT= <>
##$D= (0..31)
0 1.3 0 0 0 0 0 0 0 0 0 0 0.25 0 0 0 0 0 0 0 0 0 0 0 0 0 0 0 0 0 0 0 
##$DATE= 1554891663
##$DBL= (0..7)
120 120 120 11 120 120 24 19 
##$DBP= (0..7)
150 150 150 150 150 150 150 150 
##$DBP07= 0
##$DBPNAM0= <>
##$DBPNAM1= <>
##$DBPNAM2= <>
##$DBPNAM3= <>
##$DBPNAM4= <>
$$ [...]
##$SUBNAM3= <"">
##$SUBNAM4= <"">
##$SUBNAM5= <"">
##$SUBNAM6= <"">
##$SUBNAM7= <"">
##$SUBNAM8= <"">
##$SUBNAM9= <"">
##$SW= 251.107818259711
##$SWIBOX= (0..15)
0 1 0 0 0 0 0 0 0 0 0 0 0 0 0 0 
##$SW_h= 47281.3238770686
##$TD= 65536
##$TD0= 1
##$TE= 0
##$TE2= 300
##$TE3= 300
##$TEG= 300
##$TL= (0..7)
0 120 53 12 22 120 120 120 
##$TP= (0..7)
150 150 150 150 150 150 150 150 
##$TP07= 0
##$TPNAME0= <>
##$TPNAME1= <>
##$TPNAME2= <>
##$TPNAME3= <>
##$TPNAME4= <>
##$TPNAME5= <>
##$TPNAME6= <>
##$TPNAME7= <>
##$TPOAL= (0..7)
0.5 0.5 0.5 0.5 0.5 0.5 0.5 0.5 
##$TPOFFS= (0..7)
0 0 0 0 0 0 0 0 
##$TUNHIN= 0
##$TUNHOUT= 0
##$TUNXOUT= 0
##$USERA1= <user>
##$USERA2= <user>
##$USERA3= <user>
##$USERA4= <user>
##$USERA5= <user>
##$V9= 5
##$VALIST= <valist>
##$VCLIST= <CCCCCCCCCCCCCCC>
##$VD= 0
##$VDLIST= <DDDDDDDDDDDDDDD>
##$VPLIST= <PPPPPPPPPPPPPPP>
##$VTLIST= <TTTTTTTTTTTTTTT>
##$WBST= 1024
##$WBSW= 4
##$XGAIN= (0..3)
0 0 0 0 
##$XL= 0
##$YL= 0
##$YMAX_a= 36749
##$YMIN_a= -40668
##$ZGOPTNS= <>
##$ZL1= 120
##$ZL2= 120
##$ZL3= 120
##$ZL4= 120
##$ABSF1= 101.2514
##$ABSF2= -149.8503
##$ABSG= 5
##$ABSL= 3
##$ALPHA= 0
##$AQORDER= 0
##$ASSFAC= 0
##$ASSFACI= 0
##$ASSFACX= 0
##$ASSWID= 0
##$AUNMP= <proc_1d>
##$AZFE= 0.1
##$AZFW= 5
##$BCFW= 0
##$BC_mod= 2
##$BYTORDP= 0
##$COROFFS= 0
##$CY= -3
##$DATMOD= 1
##$DC= 0
##$DFILT= <>
##$DTYPP= 0
##$F1P= 0
##$F2P= 0
##$FCOR= 0.5
##$FTSIZE= 65536
##$FT_mod= 6
##$GAMMA= 0
##$GB= 0
##$INTBC= 1
##$INTSCL= 8.653935e-10
##$ISEN= 128
##$LB= 1
##$LEV0= 0
##$LPBIN= 0
##$MAXI= 10000
##$MC2= 0
##$MEAN= 0
##$ME_mod= 0
##$MI= 0.4277144
##$NCOEF= 0
##$NC_proc= -4
##$NLEV= 6
##$NOISF1= -61.99997
##$NOISF2= -62.99997
##$NSP= 0
##$NTH_PI= 0
##$NZP= 0
##$OFFSET= 101.2514
##$PC= 1
##$PHC0= 931.1165
##$PHC1= 622.1557
##$PH_mod= 1
##$PKNL= yes
##$PPARMOD= 0
##$PSCAL= 0
##$PSIGN= 0
##$REVERSE= no
##$SF= 188.29550247311
##$SI= 65536
##$SIGF1= -61
##$SIGF2= -65
##$SINO= 3.502647
##$SIOLD= 65536
##$SREGLST= <1H.CDCl3>
##$SSB= 0
##$STSI= 65536
##$STSR= 0
##$SW_p= 47281.3238770685
##$SYMM= 0
##$S_DEV= 0
##$TDeff= 65536
##$TDoff= 0
##$TI= <>
##$TILT= no
##$TM1= 0
##$TM2= 0
##$TOPLEV= 0
##$USERP1= <user>
##$USERP2= <user>
##$USERP3= <user>
##$USERP4= <user>
##$USERP5= <user>
##$WDW= 1
##$XDIM= 65536
##$YMAX_p= 554848615
##$YMIN_p= -1334166
$$ End of Bruker specific parameters
$$ ---------------------------------
##NTUPLES= NMR SPECTRUM
##VAR_NAME=  FREQUENCY,     SPECTRUM/REAL,   SPECTRUM/IMAG
##SYMBOL=    X,             R,               I
##VAR_TYPE=  INDEPENDENT,   DEPENDENT,       DEPENDENT
##VAR_FORM=  AFFN,          ASDF,            ASDF
##VAR_DIM=   65536,         65536,           65536
##UNITS=     HZ,            ARBITRARY UNITS, ARBITRARY UNITS
##FACTOR=    0.721466756344984, 1,           1
##FIRST=     19065.1839562469, 0,            0
##LAST=      -28216.1399208216, 0,           0
##MIN=       -28216.1399208216, -1334166,    0
##MAX=       19065.1839562469, 554848615,    0
$$ Real data points
##PAGE= N=1
##DATA TABLE= (X++(R..R)), XYDATA
$$ [...]
49968 -231511 -455503 -270167 -198360 -194395 -447473 -407555 17131 -333087 -187715 -109630
49958 -109630 156403 349759 -108913 -226972 -358226 -107657 108890 104774 -20400 341258
49948 341258 247192 -134588 -136715 -84599 -112692 -277460 -80444 -69686 -543600 -156198 202754
49937 202754 173204 -196655 -162121 -129806 14016 -1274 -90095 85703 -143549 -566221
49927 -566221 -668897 -549596 6484 -95920 172114 61419 -13277 9497 -171873 -28297
49917 -28297 240683 365783 295179 359574 203335 32878 -67569 -125789 -103614 -24207 -163083
49906 -163083 -138991 -90623 -53611 -172901 -130555 183279 -216361 199636 296588 135003
49896 135003 120331 22808 -75620 65035 383390 381839 314843 193386 449824 473751 485615
49885 485615 287037 140355 -399942 -655023 -776361 -573249 -440943 -590652 -376990 -209348
49875 -209348 -175409 -120714 -333767 -270803 34728 170057 355971 200429 -73525 2475
49865 2475 -6096 74073 62380 -228501 -176473 29385 -187 232138 -176859 -394460 -380611
49854 -380611 -388262 -294894 -131347 263752 371084 177519 -56074 -294006 -440296 -518960
49844 -518960 -131567 87272 -72492 -116502 -279865 -535741 -301791 -174175 -132318 23938
49834 23938 327328 488369 568942 292398 157523 -111206 -79542 -35439 -53856 201826
49824 201826 -465926 -284783 -313901 -473692 -171465 294478 496904 550569 678720 305799
49814 305799 -33553 -190321 -597897 -756548 -718929 -314039 -430989 -105757 184447 -95852
49804 -95852 -10888 -115518 205519 201968 -124308 -179830 -156014 -26795 -219257 -392234 156574
49793 156574 401632 197042 -145288 -65098 -10716 -42570 -92909 170218 147945 132611 506028
49782 506028 828361 472307 103934 -111467 -81982 7372 -254057 -513880 -171911 -264418
49772 -264418 -202917 -252487 -294799 -532440 -343339 -215993 -305612 -164666 -6645 184507
49762 184507 171952 -38876 -169450 -69771 -193737 -440880 -648530 -503662 -108557 -233649
49752 -233649 -231230 -288894 -569856 -155233 258972 364701 240127 93457 -18664 175486
49742 175486 226951 -123739 76060 293243 -27063 -4141 174568 63417 1399 204384
49732 204384 159665 115535 202570 190204 284783 398238 236893 10104 142211 -210525
49722 -210525 -188520 -73844 -36336 90968 506832 979861 940621 575001 140859 -316114
49712 -316114 -313394 -180196 174076 353907 92805 73369 -131551 52225 257037 405290
49702 405290 55123 -214189 -72200 1971 -115892 -175053 -116292 71026 427889 33921
49692 33921 -309990 -142097 46716 -128202 112763 211188 -136741 -133019 -211198 7591
49682 7591 -275377 -315421 38729 843 -356360 -509770 -512431 -490672 -106956 102460 188328
49671 188328 197719 163776 338951 390290 -117558 -355546 -194272 -101863 -54727 1987 476508
49660 476508 292361 125472 21087 -44456 63921 -7266 328022 -116402 -428761 -440448
49650 -440448 -307465 34787 82876 23770 -372958 -261424 -179403 -136890 60118 209217
49640 209217 238785 682135 498528 -118732 -142170 -254481 -177011 262834 -111302 -233297
49630 -233297 -246215 -160923 315305 686376 521470 443620 121353 88652 -145699 -134043
49620 -134043 -29524 15358 -192766 22853 91597 -383858 -75303 292620 288865 119124
49610 119124 182575 -283870 54238 432819 362789 139308 41854 152805 142913 80463 139993
49599 139993 245048 -209889 -527625 -445850 -454472 -132903 -84737 -186789 -22830 -53059
49589 -53059 -326655 -393286 -310083 -340355 -271781 -28805 8120 145231 -18308 -485627 -638181
49578 -638181 -510872 -505308 -537199 -423803 -359975 -186048 -421952 -660049 -295877 -105534
49568 -105534 -43244 227213 237957 100959 285779 132900 322583 -56255 -245897 -122795
49558 -122795 -94667 78118 -135881 -256437 -472753 -222864 -208528 101949 45749 -428821
49548 -428821 -195548 -77376 -4633 167123 316651 -29911 -200016 -241744 -185787 294515
49538 294515 479366 -265249 -494976 -287944 -284397 -297422 -191100 345040 541864 299097
49528 299097 144272 38439 -116090 -92239 -153349 -110783 -380960 -459501 -291753 28727
49518 28727 3696 173013 402963 106450 29724 -43719 40769 277907 54311 -154858
49508 -154858 -483713 -97585 187206 263878 40788 288484 257635 191069 231188 254554
49498 254554 -344840 -269052 -107318 -26820 37510 -157682 -88961 -17563 40564 17283 424370
49487 424370 330791 506751 -23902 -393768 -226461 -265539 -260107 -358293 -406430 -161887 -141050
49476 -141050 209316 -1735 -435852 -671153 -112951 252653 248514 102946 -19141 -99704
49466 -99704 53497 -64438 21456 87410 322854 -60886 -83857 299606 204977 303717 486149
49455 486149 558525 170267 3628 -90474 -155880 -297617 -179361 -165247 -255209 -71643
49445 -71643 87461 246400 -87321 -247391 -106343 -29950 94629 -103249 -105096 127842
49435 127842 66060 66743 -269980 -190408 168522 203736 228098 -256485 -138005 -355943 -756645
49424 -756645 -1053235 -1168422 -753932 -404410 -138036 -592509 -747213 -404411 -44860 170724
49414 170724 3923 -7613 -86875 -271631 -516678 -572086 -397183 158054 -37192 -188505
49404 -188505 4174 -24394 -24366 157590 153795 -242913 -648437 -649394 -611101 -480829 -488932 -177031
49392 -177031 -172734 -192992 -335005 -384628 -486077 -469198 -404878 -342668 -490816 -380817 -707201
49381 -707201 -587442 -322489 -275275 -84005 559518 677165 419646 22406 90513 -156230
49371 -156230 -311265 -523411 -100707 -116683 200497 -111887 -77097 -175989 -64791 -117222
49361 -117222 -44502 108346 103102 66230 380796 915944 883710 686512 359372 153173
49351 153173 -45918 -116323 -307290 -77850 -316130 -5871 -16758 46526 -202367 -150416
49341 -150416 -215529 -395862 -492545 -35251 417743 229913 -218209 -638591 -557650 -415191
49331 -415191 -485105 -376198 -559287 -365064 -144176 -109316 -422520 -160890 418372 620669
49321 620669 409305 238996 150764 -85747 -176970 65832 170848 -241697 -437256 -441028
49311 -441028 -545474 -695301 -397026 -579272 -724470 -797228 -884646 -759147 -432917 -628915
49301 -628915 -160797 -70978 -247644 -260959 -110846 100592 -291010 -461780 -755370 -335081
49291 -335081 -82242 330826 201034 96775 133427 281887 345182 233708 262866 224923
49281 224923 -293751 59594 374558 -31493 -326551 -237246 107558 436921 386482 116566
49271 116566 -350414 -522115 -414154 -287840 34180 -174371 -393436 -355437 -491824 -505916
49261 -505916 -527591 -72059 -102160 54728 -67484 -489683 -445710 -330327 -110912 -36909
49251 -36909 -111156 -22514 30941 -34410 -220445 -200756 -352390 -135916 382799 544753 400928
49240 400928 178470 207145 147998 337416 195725 -127815 -211004 -64477 -246149 -135280
49230 -135280 -124805 -609224 -549180 -373129 24985 141527 -100009 -177406 -190199 -1791
49220 -1791 72002 24850 -251347 -483690 -407106 -507676 -666226 -546760 -293399 74889
49210 74889 242054 166253 203725 -67566 -9765 193918 55329 111926 -157076 -90238 -300524
49199 -300524 -538671 -622719 -512614 -82949 -167255 -33876 230275 250716 178946 377349
49189 377349 642587 415690 -222026 -274633 -246639 -483525 -22480 381395 152179 -118509
49179 -118509 -364959 -467588 152000 299754 130950 321473 91648 257706 -81504 -238921
49169 -238921 71947 361023 431433 371821 206523 72647 -150497 -122031 -128045 132452
49159 132452 185348 -144526 -115699 -640 -376075 -301749 198677 643757 406632 414208
49149 414208 168957 -162457 -113624 -249533 -412008 -836491 -216378 286912 69561 118181
49139 118181 25679 28359 85382 231547 375381 -29256 -276053 84721 232048 -217327
49129 -217327 -295500 67984 -70695 -6531 213688 380890 389144 29070 136491 276863
49119 276863 111100 202035 590253 429020 -68430 15383 -189765 -72967 245102 421924
49109 421924 244896 145580 404986 281006 -4865 -212518 -150369 158686 340716 604613
49099 604613 537439 190261 165631 -66540 -277501 -284054 -124294 20075 156375 272255
49089 272255 128995 142087 100055 -278282 -245528 -31045 520451 540324 144545 186413
49079 186413 357170 218069 437614 412913 32090 -113053 -411674 -353116 -92967 -79552
49069 -79552 -360864 -350165 153786 539452 353675 534394 314184 495014 446560 528413
49059 528413 46692 -363516 -474174 91517 333081 446401 336038 -157310 21935 -195170
49049 -195170 -128288 -206223 -422523 -184162 159956 83179 -20086 49420 -55237 142401
49039 142401 263314 5742 -330498 -360161 -297164 -299003 212597 517298 404938 367125
49029 367125 109893 96406 -46087 -33001 386248 102569 -97294 106844 -69419 -193043
49019 -193043 -303118 -389683 -386920 -74381 78807 335028 515539 -46094 -450564 -399326
49009 -399326 -127756 137845 62770 1601 -195180 -758927 -171663 -84507 -490242 -236585
48999 -236585 -5876 -202274 -86628 127958 454771 464026 526281 431489 188780 85416
48989 85416 -87653 -94182 -84579 31397 -317891 -257328 -34494 80341 389680 463890 242228
48978 242228 57509 265329 300154 238475 63428 -278630 -300796 -532367 -628119 -38713
48968 -38713 -12592 -426628 -497818 -158640 137980 248128 97509 59936 164318 172675 150392
48957 150392 43875 139191 290010 168179 182134 269627 29227 -259332 240665 418356
48947 418356 183606 309606 208638 170897 415393 455942 11495 -42900 -57020 131268
48937 131268 113532 30862 114994 53719 150520 61503 504965 583098 439699 388328 47488
48926 47488 134536 176617 188635 259147 -87469 -437525 -459669 -284950 -294014 -19366 76595
48915 76595 68223 -2056 213331 -92890 137082 180186 128877 400209 545874 193573 -382486
48904 -382486 -75551 -86693 -190842 -329357 -26067 -219809 -277017 -20512 -9680 19401
48894 19401 199421 177865 95607 92517 218274 -59817 -215262 92335 235900 234785 386464
48883 386464 157592 43736 292426 446684 -171707 -325284 -83306 197377 -73239 93024
48873 93024 283402 19702 -8726 412445 244377 79059 457312 390958 181109 181254 37243
48862 37243 336793 581292 169409 20247 -5642 -96688 -152357 -141114 -456885 -550286 -125558
48851 -125558 -68662 -369550 -323172 -258678 -305531 -224054 -250450 -549885 -350693 21182 64587
48840 64587 126814 -43155 123774 326048 310614 -41938 -294690 -111538 -193329 -190262 -171904
48829 -171904 328776 322114 172607 316712 74070 180327 390461 269693 39443 -264989
48819 -264989 -260453 66926 182501 179065 55641 199492 203770 -252924 -403713 -346195 -52285
48808 -52285 28001 190364 32543 -315344 -270981 218950 59776 200025 136278 126701 162784
48797 162784 460039 231387 132304 -53069 -298860 -104205 -141402 -58926 55472 -234264
48787 -234264 -70722 261179 201744 -230613 -358112 181592 225017 96518 175910 387936
48777 387936 526092 781074 787029 485410 368959 282884 243509 -2801 -277859 -215357
48767 -215357 25238 86322 304610 185474 167597 281408 356191 19469 -378957 -503262
48757 -503262 -619180 -518220 -541222 -472860 -243392 -200635 -253996 -326449 -85303 72991
48747 72991 -462994 -446919 -266747 -323423 -125838 225056 247082 -311181 -430096 -431272 -399256
48736 -399256 -69333 196872 -247566 -581443 -566065 -158297 -240516 -321823 4484 -170299
48726 -170299 -171581 133974 483051 86344 -70164 245065 537050 417891 205600 244240
48716 244240 219877 -54585 -55749 292423 399720 49997 184047 243495 463466 441463
48706 441463 500151 452464 471189 472078 687173 447535 309233 7762 180828 -70865 -162733
48695 -162733 123280 264640 360791 -347318 -352513 -150572 -325247 -463840 -705316 -431480
48685 -431480 408686 528498 424992 153322 40998 23332 312653 -72591 -55880 -82348
48675 -82348 -480144 -574086 -632342 -557848 -807655 -827592 -561550 -354443 -648704 -425068
48665 -425068 -240540 16394 -137802 -142945 -263976 -109132 -143095 -206751 -101381 123801
48655 123801 -35388 73860 425000 550045 142543 -295509 -579959 -543093 -273638 -608626
48645 -608626 -252305 50784 -70772 -355179 -136791 614589 392649 -134272 -262465 -227992
48635 -227992 177298 -185188 -234987 -272777 -107929 -161792 -78353 -355666 -331153 83611
48625 83611 74651 -369210 -29552 20743 -364842 -411089 20372 106660 147326 35321 -441599
48614 -441599 -460899 -425356 -2783 -11788 83307 137507 -142442 -31617 -95010 6669 203585
48603 203585 102872 63151 -194786 29188 -11361 -215934 -248732 -132791 8660 4250
48593 4250 -59207 169 207903 107088 202238 217117 226038 94102 -202960 67305 196419
48582 196419 -103112 95310 -127626 -304861 -289077 -446211 -405813 -246957 -344505 -301663
48572 -301663 -291664 -614702 -561864 -411447 -115672 333128 515588 294143 400869 449386
48562 449386 88023 -230890 -393811 -150720 5266 -154899 -473551 -588912 -318288 -165128
48552 -165128 -292495 74063 61194 124005 284143 436408 118470 22454 86817 -170162
48542 -170162 -89025 141620 13509 -85345 -466084 -577190 -325457 -263036 19687 107840
48532 107840 141617 817529 604572 -168039 -544348 -576334 -673264 -176701 -13410 -121894
48522 -121894 93925 502034 68243 19485 253499 -51993 -175883 -485469 -559356 -382432
48512 -382432 -259733 -266166 -256512 288396 277726 -115199 -239785 -310173 99866 175771 38485
48501 38485 462625 126298 239259 72762 -398546 -649647 -461681 -124210 117943 -192392
48491 -192392 -153180 -376596 -288071 159234 107890 218325 230985 298139 258717 83232 -208304
48480 -208304 192828 367044 736980 556050 -222255 -127041 -155567 206210 -36751 107058
48470 107058 241417 393814 581795 638236 598841 389720 96833 12023 -168973 -116310
48460 -116310 -237752 -186110 55239 273432 44683 -378396 -59472 71769 -54356 349162
48450 349162 -76967 -353075 111597 -30104 240564 -65311 -121546 421123 500693 328703
48440 328703 -34027 22508 223875 -352574 -320934 -518165 -398033 -461639 -689395 -433513
48430 -433513 -233966 -174701 29548 142938 103453 114480 211107 82368 17100 -197931
48420 -197931 -174590 189950 46182 153922 -85408 67265 224037 80555 150880 138499
48410 138499 -59803 -236076 105221 469957 592824 243654 -43955 46430 -2256 47073
48400 47073 65529 -96289 108377 198293 384060 174446 372948 480030 510381 256320
48390 256320 159378 91691 34911 -92825 -26604 -243868 -100063 -203569 -308512 -33929
48380 -33929 139942 402629 488072 672942 418793 330323 -174926 1415 264963 198736
48370 198736 292376 7936 -151396 -58934 -221700 -336400 -379668 -464877 -266513 -43943
48360 -43943 -19528 -721702 -637519 -564220 -177021 13468 -60634 -171569 -218565 -218036 -257443
48349 -257443 -347346 -581882 -501301 -387639 -393948 26237 59315 -88174 -209498 -76897
48339 -76897 43154 -52247 74699 -106773 105805 440493 329225 -351472 -292903 -362733
48329 -362733 -202238 309018 19060 -87023 -219870 -139174 2186 -13825 -21740 -323319
48319 -323319 -540545 -479022 -566520 -543383 -413315 -310755 -139875 39655 162393 5835
48309 5835 -81439 -501909 -701825 -725634 -462908 -195658 -49755 -7473 -593420 -300481
48299 -300481 -307868 10383 332638 160297 -445377 -513136 -251917 -244098 -206979 -198458 15100
48288 15100 -214951 -425121 -471952 -87867 -70846 233271 379128 615907 209253 163370
48278 163370 249739 210604 363195 40325 -158630 161416 76489 -142204 -283945 -10236
48268 -10236 -223990 -130662 -326220 -578201 -483815 -588863 -184915 175566 305556 -147841
48258 -147841 -139348 46438 -204717 -461651 -489338 -248568 -125428 195222 298429 -75644
48248 -75644 -273621 -17611 110820 -131849 -67253 -520685 -307168 -71473 -410665 -731822
48238 -731822 -719819 -625958 -327780 -556277 -492957 407617 104297 -362324 -381455 78097
48228 78097 224547 -388201 -857678 -450697 -102948 145111 -130858 -115526 -133373 53903
48218 53903 35514 -146908 -323643 -303655 -256163 -263415 -382771 -589158 -513859 -118930 13144
48207 13144 -131672 -257141 -245563 120322 -91400 -97075 -13862 -299950 -55910 315458
48197 315458 303824 251549 104801 -95887 -418241 -291695 -260821 -112210 -239466 235566
48187 235566 89510 -259227 -103605 10618 320458 64424 194352 208988 131908 493797
48177 493797 588395 395735 -288549 -333728 -587914 -817058 -721280 -565738 -423603 -291331
48167 -291331 25867 199151 -66001 -303779 -227167 34300 305587 101165 -52681 -280130
48157 -280130 -247965 12758 151802 -99427 152549 562674 880988 596022 -22759 -218101
48147 -218101 -116858 26216 164113 -111948 -546404 -57552 328294 108385 -112649 149807
48137 149807 207365 340293 553914 460505 430293 342028 -51790 -123822 -98578 -296044 -398782
48126 -398782 -382988 -194092 -313893 -23358 112078 83974 56937 -142481 130762 123192
48116 123192 -346515 -608827 -307805 167644 150034 221194 216402 368898 225564 -138264
48106 -138264 13079 349484 515731 748115 682473 -19362 -201702 -36209 100439 -301758
48096 -301758 -458454 -96094 -259284 -540755 -920154 -896996 -295207 -330191 -596795 -568755
48086 -568755 -455941 -182077 98912 196141 -226609 -42282 206116 75385 -104488 136435
48076 136435 252826 588513 403290 139474 261418 469025 198623 235156 238545 285424
48066 285424 37192 76733 221047 -165454 123839 271541 210862 -269831 -215331 -152041
48056 -152041 -67927 113443 -143055 28268 275011 406688 23739 -139421 -117896 -587851
48046 -587851 -448198 -324662 -170277 -424778 -374306 -333725 -725952 -605198 -494173 -165785
48036 -165785 229862 55299 52469 10567 -217239 -493878 -489643 3442 371382 -83648
48026 -83648 41510 73551 -84791 393418 53264 -340958 -369179 -173459 -269992 -372000
48016 -372000 -18064 302812 -38129 93164 157171 -23939 -424389 -365441 -381052 -217491
48006 -217491 -166785 128962 374079 314054 -67883 -162435 -236195 -344702 -295367 -347361 58933
47995 58933 -166940 -140938 -79583 -77144 -204878 -218499 -342077 -188104 -163541 -212506 -27225
47984 -27225 85002 -117724 -414937 -568956 -518904 -211291 -167400 177459 171920 -230082
47974 -230082 182737 143698 573872 594810 197575 165476 -10442 -285464 -259532 112352
47964 112352 -7410 -212513 -218615 -306782 -4913 178212 217593 387659 155421 -180946
47954 -180946 -66310 -273243 -116857 -96342 -384782 -306906 -129513 -240328 -489404 -683068
47944 -683068 -278423 91534 113972 87903 71247 361488 23591 -215699 -178035 -197856
47934 -197856 231162 190519 -394506 -659952 -530346 -371151 -157711 -350093 -100900 -226149
47924 -226149 -14297 257651 163537 2786 -14872 -164095 -113738 -262164 -429987 76543
47914 76543 253015 217104 47819 -109625 -7481 43942 114732 63106 -371388 -131189
47904 -131189 155882 211623 380771 189244 108992 -135946 -369625 -204652 -78029 34173
47894 34173 -266774 -425781 -94143 -145355 -199670 116449 364050 481717 301114 242576
47884 242576 151879 -196243 540794 478518 -231094 -231502 -556435 -244319 403627 544878
47874 544878 420256 25904 -143189 -125198 -469341 -316725 35318 361999 718239 413212
47864 413212 503497 410961 -5997 -397892 -364014 -621910 -830686 -716859 -679673 316599
47854 316599 719324 660791 377493 -104909 -291347 -57024 457149 309542 204653 149044
47844 149044 189197 106136 -7496 -194756 -234922 -16462 -4444 160549 344164 266289
47834 266289 -1574 -218389 -384713 -446132 -9009 170372 -97662 -182036 -44319 -226280
47824 -226280 -209056 -28518 55937 -55690 40296 -107155 -59562 -131683 -117963 -126577 -441667
47813 -441667 -588353 -52475 131887 108758 -96377 -194780 -144007 -165289 460751 462621 -76533
47802 -76533 -248986 -26113 -135795 -1202 270444 432156 394690 234681 262001 118883
47792 118883 449530 352900 154739 204046 727154 208177 323 -249564 -436442 -260947
47782 -260947 -180685 6691 -63902 -341485 -486671 -106532 -243417 -417364 -109741 19437
47772 19437 192766 35364 -347289 -433722 -36279 196664 240493 553601 833911 694758
47762 694758 382566 -85172 -335773 -303100 -644370 -124579 -97930 -533402 -483172 -345342
47752 -345342 -30771 84688 -48765 102600 372392 288201 -213728 -281505 -209260 -133748
47742 -133748 -488951 -211776 -72885 -1979 -289355 -78530 64974 180832 157228 -69551
47732 -69551 -88882 -311793 -463022 -747946 -777731 -237742 143507 -123362 -534092 -616785
47722 -616785 -205280 -163839 -721211 -962281 -450057 -303552 -157864 108999 -16020 -482410
47712 -482410 -425122 -394194 -359627 -268113 -138983 -99130 -168576 -265589 -700892 -729984 -896184
47701 -896184 -554717 20893 -134339 -42001 100376 291318 252515 8758 142202 -232258
47691 -232258 -147684 -214052 -199045 -166229 1511 120546 -5123 59779 -92524 -536082
47681 -536082 -587755 -483124 -389090 17421 -66545 -419062 -266245 -377885 -698761 -174299
47671 -174299 107497 164454 -95606 -163438 -357076 -188688 -298708 -187876 -310032 -206970
47661 -206970 -151682 -102815 -316293 -86605 311186 163352 75636 13324 580397 260238
47651 260238 69639 438395 332014 256338 -216267 5910 4240 -138696 339492 -72257
47641 -72257 -342719 -224183 -305725 -165609 -346018 -13715 237043 398907 384309 88
47631 88 196116 147869 76669 127993 219355 230268 127216 53523 -355719 -657529 -656274 -541667
47619 -541667 -248672 -165519 -89675 212049 87284 -8044 -120937 353335 682437 171671
47609 171671 166090 487414 397281 122734 263916 199137 -132153 -289026 219273 584132
47599 584132 179937 -286326 -34605 -61705 43101 -177146 -610511 -28730 205092 -144188
47589 -144188 -195249 -315834 -584346 -284767 102663 275074 309820 130854 -176576 -2331
47579 -2331 416159 321230 -174388 -170183 -22575 -335738 -388397 -363319 -67130 52859 -303918
47568 -303918 -430804 -494038 -447107 -110259 102499 -132170 -182337 -242757 57171 52477 -44758
47557 -44758 -118880 -183924 -55680 114410 80932 -62496 159058 107437 281171 122517
47547 122517 -370701 -531901 -450262 -183847 126516 118720 223640 182566 -187923 -336655
47537 -336655 -281426 276640 454323 -40289 -257852 -361953 -200010 1197 -175257 -183874
47527 -183874 -82220 194261 258456 335221 140580 338071 565141 409846 205119 1353
47517 1353 62854 -556411 -566693 31352 400733 304007 245788 -16600 -16830 318408 110542
47506 110542 141654 -48954 137377 297606 18008 -251118 -224805 81679 378573 28849
47496 28849 91762 216093 27635 115881 -314339 -439577 -322873 -348097 -338116 -230847 83165
47485 83165 284023 118793 150549 404620 178606 -181752 -282773 122794 109327 -79570
47475 -79570 -43180 -376280 -375365 -385358 -464540 180838 20896 107528 44077 21901 106237 214896
47463 214896 182319 39946 57000 121262 -202708 -444928 -426534 -310845 -1867 -95471
47453 -95471 -230147 317776 72462 -213862 -267629 -228870 6156 196282 46328 -54711
47443 -54711 -116330 -361929 -116947 3581 162532 218520 316267 201091 -29545 -195544
47433 -195544 -135941 -385928 -472819 -181726 -20282 38569 -226088 10612 293706 388719
47423 388719 124377 -205922 -85326 -17845 -60400 23704 97448 32529 198894 164148 382448
47412 382448 417526 522948 319757 20287 -170699 -12088 435136 517177 430768 696703
47402 696703 604370 515232 349714 46039 80235 362082 273780 -228054 -352244 -319125
47392 -319125 -184793 -231974 102858 354206 -281574 -1071056 -871638 -210291 6769 298300
47382 298300 282560 257383 56615 82701 -9152 49945 -84461 -51437 3911 -422781 -761458
47371 -761458 -412622 261629 -112452 -323161 -102667 278421 19178 -230245 -183005 -352901
47361 -352901 231911 119352 98803 153103 -6553 156388 263871 71195 25217 104428
47351 104428 158934 -63034 -271904 -122301 -94514 219162 151833 110899 248589 40601
47341 40601 88687 281291 340071 39254 -252858 -691567 -881233 -594303 -279860 125733
47331 125733 201965 201387 320554 59901 24672 -47168 -200284 269020 124293 258356 126459
47320 126459 126976 -73492 89559 194820 166452 409498 413695 259150 -8268 160317 219978
47309 219978 -200662 -85149 -222734 277058 499728 229107 118203 -166386 -99514 217541
47299 217541 -10220 -312082 -423296 -158592 632265 417844 -214614 -644123 1284 13913
47289 13913 214449 261826 349451 14747 -258570 -412902 -410122 -6814 47040 -33497 -220828
47278 -220828 -164871 99906 134565 92529 376777 12052 -493287 -619480 -108631 305908
47268 305908 361351 101993 316683 320035 -49054 61493 -1437 -318304 -352189 334715
47258 334715 298537 158518 290703 159794 -396373 -178738 -352922 -692235 -656402 -528172
47248 -528172 -168173 79496 63538 188739 431778 334022 263915 760190 593386 -66749
47238 -66749 239245 230088 -314200 -209885 -298258 -383926 -348559 -354075 -556218 -421516 266643
47227 266643 403575 270269 85058 191565 310503 -19234 -502782 -533553 -143291 -99934
47217 -99934 -42239 331191 145555 64986 3334 -61702 -130903 81637 -35334 -120606 -383566
47206 -383566 -133620 -241972 -425575 -427129 -355835 -188441 269302 230504 101004 194656
47196 194656 262461 -41326 -355148 -192779 -307291 -6177 -31026 -246871 -100364 31465
47186 31465 -213457 -258753 -182427 -281041 -530447 -472770 -622398 -730241 -554859 -578697 -736605
47175 -736605 -555643 -503433 -452083 -631664 -349715 92097 243985 -8707 -357238 -281919
47165 -281919 -158004 -213002 -350284 -276866 -69797 -321351 245113 229334 554620 308917
47155 308917 -130914 -149326 -111080 -7357 136127 206086 301499 81460 141133 95332 202934
47144 202934 -196113 -670416 -630967 -162608 -70279 -283068 -157425 260144 571086 605780
47134 605780 618134 -31142 156929 -39633 -183941 -203111 -589228 -766382 -223288 -205154
47124 -205154 -200587 -47386 -545651 -348832 351332 618233 718725 363986 113736 226538
47114 226538 -283575 -433257 -247091 -661275 -399923 -217987 -325692 -149474 -121915 -231097
47104 -231097 -150455 -383493 -315051 84151 49770 -235880 120488 144037 -37623 65428
47094 65428 128788 116048 267750 -16626 -15535 -134683 -179578 -226536 -190458 -215778 -269269
47083 -269269 -138081 -218094 140684 310009 401431 290408 -55326 -449888 -464135 -476321
47073 -476321 -251893 -315148 -511196 -456511 -238171 255374 -29089 -257669 -131214 131165
47063 131165 85763 403214 267227 -19957 -36194 159961 242034 -367678 -788402 -326061
47053 -326061 -43910 144356 206248 -544266 -779695 -504874 -261245 -122696 -371854 -322249
47043 -322249 76391 325201 183237 -108121 -420354 -628165 -665764 -681969 -250736 -319047
47033 -319047 -292743 105291 182376 -229653 -343726 -188476 -173501 -146412 17472 639706
47023 639706 897583 239084 -43918 -16218 -126066 -184450 -288537 -327542 28406 -174207
47013 -174207 -197534 -94822 55444 329563 341440 63245 -275371 -78346 75094 269496
47003 269496 403003 172160 643319 799874 64725 -133913 -68161 -250944 -339820 -286407
46993 -286407 -65912 -128538 220800 133105 111132 141170 -28291 -56231 -244004 -80791
46983 -80791 322245 132368 199955 22012 297797 572238 109164 118055 52976 -170708
46973 -170708 -389869 -447428 -212698 -328646 -498045 -40837 316498 49499 158682 230304
46963 230304 136423 189989 -142128 145958 83193 -179178 -59752 -132932 267704 320524
46953 320524 536797 225312 71036 -4340 -180001 -364720 -218278 394000 177081 -175291
46943 -175291 39968 15373 12794 -90283 -226272 -611664 -482327 -146403 64538 191799
46933 191799 199563 280885 280431 135620 206942 344773 313809 339820 300021 123588 -465364
46922 -465364 -376112 -440351 -575015 -541381 -476190 -164148 -8610 -390763 -88470 -10329
46912 -10329 124938 396756 169288 -274036 2210 255002 431595 213521 -6929 33335
46902 33335 -113173 -48314 24394 -43234 217496 368078 384182 477360 109914 53768 228295
46891 228295 308608 400745 833263 721567 34162 118006 105732 42011 -182236 -256961 -34156
46880 -34156 -156098 -180626 9222 -166248 200635 344541 388381 349471 239226 197712
46870 197712 247186 242195 208740 362954 365585 866608 798128 372850 259054 52679 108132
46859 108132 236136 15537 100154 260062 -127999 -394784 -338825 -611912 -63357 63518
46849 63518 -297206 -400359 -282042 -181143 -231392 69005 -9998 -41251 214400 343185
46839 343185 581891 349811 122794 367919 535962 222050 3993 129 389381 280511
46829 280511 158321 1449 -177785 319039 241703 -392402 -662902 -593058 99654 -48929
46819 -48929 -117256 -334999 -180636 -116764 -91170 -304427 -401836 -436459 -432948 -270926 136169
46808 136169 175951 178601 48149 62318 -261828 79370 -63326 -343155 -351519 -225582 -222279
46797 -222279 -353747 -142531 -21946 125336 501887 255769 193286 131037 141149 199249
46787 199249 -112562 145921 289106 -55122 -383902 -170544 167533 -61050 -125289 -314712
46777 -314712 -199151 -68335 299594 241813 282565 60434 128740 22567 214 119098
46767 119098 37677 180487 -97771 -114495 27876 458071 589440 565668 270175 -13883
46757 -13883 179619 38197 50618 362739 479976 168389 355598 449252 253924 1261
46747 1261 -298119 -556853 -417608 -291741 -369241 -173108 86155 133092 -210612 -252946
46737 -252946 234318 120157 -336278 9581 116623 61083 113752 229573 221219 22422
46727 22422 -109790 -362643 -444372 -375096 -589478 -457220 -371232 -390605 -45017 205768
46717 205768 -27172 -331177 41978 258934 448364 432481 49480 354864 375957 -177421
46707 -177421 -97314 -33659 -236543 202671 235277 -5615 377098 477729 912474 708269
46697 708269 498967 -49217 25655 45025 -117073 162444 -149899 -145480 -84460 -43941 -72913
46686 -72913 -193992 -40024 303162 193197 -281327 247088 432164 37248 316966 450682
46676 450682 463765 420435 326060 -120203 -515804 -491657 -505269 -260653 67369 -264191
46666 -264191 -19408 -196814 -398895 -303229 -221011 -30535 187080 -220256 -259077 46238
46656 46238 104 -398198 -623932 -303140 -356658 -143014 -62949 -156755 178669 220556 224028
46645 224028 -50904 -82028 109944 48852 -175059 -129050 -95672 -124818 140118 -14793
46635 -14793 -39262 78747 -195003 -37778 -53733 -32354 247205 408640 -79236 -182207
46625 -182207 555839 555413 411746 516236 473422 281362 42334 -107358 -137021 -94083 -191456
46614 -191456 -164229 94215 371758 8712 -225251 -347309 -164414 -210539 -437065 -432774
46604 -432774 -94528 171228 117365 489099 309042 -11686 -41562 601 199879 191434
46594 191434 -229687 -568689 -505407 -620014 -585712 -640276 -386867 -192430 -63614 99579
46584 99579 -196838 -369962 -391607 -241010 -139520 -42301 344912 312076 640838 137615
46574 137615 -3879 -54107 58413 349108 172944 164334 196172 380501 -32001 -232463
46564 -232463 -73715 -317992 -152400 118064 122894 105557 8992 53124 157848 200608 479525
46553 479525 207538 -130455 -75428 185541 52418 -67182 84763 233208 414219 562728
46543 562728 506516 323429 129658 -193583 -215686 298730 210937 24633 -116120 -54715
46533 -54715 342050 180013 15179 195654 -33333 -96620 -190499 -444881 -304977 59154
46523 59154 401670 213182 -90131 -353328 75277 452110 436974 -28808 156222 -223703
46513 -223703 -368785 29467 255994 428278 64343 15072 -136438 105151 68150 100767
46503 100767 -11744 -306996 -385236 -233974 -211137 -166926 82942 380000 454766 54695
46493 54695 105338 333190 722571 527115 -133847 -529933 -521778 -432997 -194897 -378997
46483 -378997 -519855 -107206 270056 513644 299071 -210991 -197249 121657 149610 174679
46473 174679 50337 -362609 -398266 92077 216708 287029 -38480 417512 39630 -336503
46463 -336503 -209266 -148839 -170778 7027 10505 49898 116116 -49197 202349 69783 76511
46452 76511 136474 316744 322439 230263 231671 414360 147214 -109519 -51169 33902 -93841
46441 -93841 -199387 -189310 4770 206434 362843 -227821 -335029 -198111 -130272 -49102
46431 -49102 -117915 57272 308574 276484 -186155 -179209 325138 648223 400149 -70390
46421 -70390 -146370 22116 -50529 -143091 -409969 -198716 -298847 -501090 -632335 -333541
46411 -333541 -230402 -363400 -168090 -409940 -457269 -105805 -144386 125022 -15326 46540
46401 46540 330134 336320 -74926 -49009 12774 -74347 43692 -130345 -204920 100266 53106
46390 53106 -70253 -236842 -319422 -356392 -518533 -722886 -505115 214649 544843 390595
46380 390595 180511 -296027 -33426 101049 29667 -301527 -253248 158211 169872 57238
46370 57238 131530 -422312 -524272 -604265 -636287 -559191 -129642 -64980 284874 192919 112239
46359 112239 101247 7785 -52104 18036 -37862 399921 57122 82959 224223 586876 120076
46348 120076 -43921 -135836 -345775 -359830 -319836 -270816 -216764 -224497 -26012 50846 296143
46337 296143 372041 55994 -95647 64001 407120 230566 290311 240231 -102770 171307
46327 171307 282575 91873 -42489 56513 301188 -59438 56002 127409 350529 229118
46317 229118 77663 -498535 -482702 -164528 245314 359546 163859 199261 304450 370835
46307 370835 -21598 -117636 -74595 -456573 -113663 29445 -423048 -348795 -430233 -198157
46297 -198157 136191 -136243 -263192 -221296 -88207 -40618 387443 100862 -94819 -389210
46287 -389210 -505788 -179939 118708 468197 407624 664945 407701 -22773 58461 61422
46277 61422 480232 705418 676237 393698 399498 595 -167699 63757 114046 -12348
46267 -12348 -44378 -191971 -259928 -504871 -414654 -338932 -724919 -341624 267125 -186711
46257 -186711 -232320 72586 299543 94533 22346 293338 428502 192533 85604 170611
46247 170611 97470 79153 -240338 -290239 -338569 -22319 -160897 -467161 -198250 -163277
46237 -163277 -371378 181569 355209 107782 -308763 -484530 -690206 -700998 -607081 -583549
46227 -583549 -546657 -313882 -98259 164991 107966 -58467 -133406 151633 284349 223340
46217 223340 270595 503573 327365 198233 401138 227706 351978 480285 278149 470225
46207 470225 689133 141814 -36830 -181571 -212360 -53758 42104 289357 -117891 -680344
46197 -680344 -58922 57054 329490 229701 -52252 -274650 164644 243573 61657 192878
46187 192878 386208 356126 606245 339227 446682 147669 -263973 560 -278468 -46446
46177 -46446 387882 468302 279340 133053 29360 -195244 156305 276570 198205 159669
46167 159669 -18009 -63335 181090 -35195 -69916 -59085 240048 235830 74123 326314
46157 326314 218930 -150116 -119721 278985 225872 36431 -19782 -178504 -502700 -90689
46147 -90689 -76326 157787 89597 40458 142944 127886 196009 49268 64455 198303 156351
46136 156351 39197 117570 230030 19917 -128653 -40192 -507863 -753410 -659971 -42066
46126 -42066 40632 -170154 -183621 -78572 -208275 -175517 -368676 -410403 -388946 5449 243553
46115 243553 201571 -293837 -666677 -532421 -691106 -705407 -523828 -292181 -247543 -92503
46105 -92503 164286 118687 110163 110282 331809 484902 656188 484761 56591 353064 76128
46094 76128 172051 -61292 106465 68822 -403795 -268221 -331145 -350750 -143033 -431471
46084 -431471 -204558 -108066 24377 -439919 -561290 -242631 -452316 47351 267780 178740
46074 178740 -88462 -75247 -74817 -219079 -154898 387506 -168216 -342209 -312535 -319655 -208291
46063 -208291 15921 205548 -49384 -118160 -271491 -138579 281224 86302 247916 482384
46053 482384 310483 10962 -435051 -278890 -227774 -276736 -12626 -112705 -405034 -170330
46043 -170330 -391918 -55161 175847 63778 -256216 -294555 33503 73770 -45615 -95251
46033 -95251 84644 -69377 -244531 -142634 231241 -116351 -220577 -366679 -114066 46611
46023 46611 -106949 -9803 117222 -131820 -113098 -127824 -176808 154053 383713 297662 -292440
46012 -292440 -529137 -193690 68842 189448 16812 -509837 -778548 -328072 -247646 -278531
46002 -278531 -228531 -394478 -157440 -213497 -23249 -83298 -205808 120591 -410740 -690858
45992 -690858 -546229 -327851 -67725 -339613 -582666 -514282 -41239 -131420 -229433 -243058
45982 -243058 -360419 -307626 -340809 84996 -27645 -131247 161034 -90035 -201449 -170442
45972 -170442 -157495 -429300 -225104 162218 -29151 -160974 -148659 -32510 121863 185081
45962 185081 320132 28430 -64895 -338845 -15519 315792 563700 590649 -14194 -372718
45952 -372718 36505 338698 361587 252351 307701 516709 789995 599042 169477 -23695
45942 -23695 -7644 415287 176262 131496 -92597 15292 154286 343953 222681 -11433
45932 -11433 22355 -410443 -164586 -33362 -14537 -284318 -64924 -195765 -457271 -192623
45922 -192623 189272 513294 443125 63132 -294228 -697979 -667796 -277940 -152214 -120855
45912 -120855 -323126 -427394 -434948 -142228 -262250 -269954 34562 45703 20328 -14428 157973
45901 157973 264257 254946 205413 428309 113530 264895 376154 157339 -130539 -73811
45891 -73811 482352 708154 504769 144879 -65748 -116471 -150985 -8319 177570 -24945
45881 -24945 -206552 -470861 -154885 38749 107619 235039 271978 15990 -212720 28866
45871 28866 -37995 134074 -225520 332959 678807 382070 168058 214316 30136 55693
45861 55693 439752 242593 -254716 -20020 247921 406721 -140218 -247471 155828 55257
45851 55257 -241577 -61506 34678 -29260 -135150 -395501 -637936 -225997 130716 -274914
45841 -274914 -194476 50919 -63595 177967 169081 237454 67675 225017 510632 423916
45831 423916 303241 128833 206288 -44046 -18703 36953 402826 788481 696314 955449
45821 955449 525615 273970 89319 -253938 -32034 -136254 -201856 -352331 -308174 -316224
45811 -316224 -176807 124235 719231 526261 339069 305255 352422 587206 440039 215890
45801 215890 163519 -107112 -212898 -321050 -295329 -440408 -177812 111891 148500 130897
45791 130897 -287509 -248761 -8620 260235 870188 430866 213709 118861 152413 207289
45781 207289 -215598 -513007 -337002 -117805 -382 -51334 85642 -11735 -143154 -342113
45771 -342113 -353340 -126685 -152291 -228636 -325902 -212471 -159641 222537 -15751 -249513
45761 -249513 -341263 -272368 -110648 1916 70278 17916 39265 49723 83118 532021 241231
45750 241231 -314383 233791 218671 194277 105894 109268 41981 5946 -331702 -392703 -386869
45739 -386869 -467866 -684220 -530073 -347188 -25072 -124653 -552364 -414388 -35640 499582
45729 499582 547899 467037 463694 -8353 -400790 -440955 -37740 -299023 -467269 -330027
45719 -330027 -237972 -44631 -142929 -117981 30983 -391521 -463047 -266868 -35409 -186820
45709 -186820 -839812 -1125709 -641313 -12553 59751 -18144 19724 371570 234807 -59928
45699 -59928 -85053 273855 324817 197805 365387 586878 234236 437298 288674 7429
45689 7429 -145372 -326399 -305503 -6603 -243992 -522527 -431734 110507 417788 406138
45679 406138 145757 43774 17587 -69487 -53139 416344 172819 239613 -95791 -89231 104626
45668 104626 291753 521112 211062 136900 272523 166382 -416552 -356238 222662 43720
45658 43720 125702 281679 549800 263030 396063 179065 245807 300790 631283 575350
45648 575350 223188 32742 53316 -81324 -25447 39464 112603 171457 -255066 -257507 30218
45637 30218 185635 225631 222083 329811 172986 8729 324061 193690 137961 128598 -145142
45626 -145142 -110027 262401 268088 453757 317113 262494 252330 -120093 -305525 94143
45616 94143 29690 281404 245129 -66298 -68082 -269624 -243704 -187691 143740 -188879 -396078
45605 -396078 194238 420684 592167 38103 -381797 -154984 202177 147820 55210 -142151
45595 -142151 -265891 -480177 -201802 47179 263746 170141 380862 724844 730325 174933
45585 174933 159510 294077 341070 -93015 -219045 -198880 -435088 -241873 201526 69135
45575 69135 150132 27694 -354004 -394240 -259929 -168390 -384440 -164088 -230969 83784
45565 83784 -244008 -584510 -491193 -343664 -291599 -308766 -410457 -100501 -42827 59188
45555 59188 233604 159469 155090 342035 74004 -290200 -170714 2715 309804 233842
45545 233842 248269 113532 -135250 -123489 491470 161875 166317 39585 -58433 76408
45535 76408 -9781 157518 294436 169720 -292615 -356745 89879 45384 18733 -92910
45525 -92910 338835 355408 -263176 -332760 -210101 -73534 130150 195869 242742 377224
45515 377224 283347 338124 302884 268000 223732 283169 243968 233071 301921 101594 -244200
45504 -244200 -433782 -391755 -203490 -228465 -210806 -114727 -9128 -432765 -404873 -43570
45494 -43570 269657 277062 31387 486520 204790 -210924 167040 566083 -58359 -128617
45484 -128617 -210550 39472 -21091 -74674 -120972 -111046 100329 289453 131380 119850 2454
45473 2454 -28392 24141 -174489 -84243 -83646 482375 162348 106676 451540 312346 38236
45462 38236 -138473 -268398 -132512 -48654 -12061 21594 -45573 -107504 -447153 -151761 -118933
45451 -118933 -104117 -174372 -453607 -420808 -205539 -355674 -539725 -466539 -619943 -739981
45441 -739981 -97453 -1200 75329 269118 436135 170839 -20931 80005 -298526 -279063
45431 -279063 -397433 -306119 -322380 -286205 177137 105715 -107680 78950 337188 564481
45421 564481 484248 627316 322463 166170 -9200 52302 433691 119553 255540 583833
45411 583833 624466 372356 146558 -253415 -469953 -773207 -695614 -372690 -210776 -145785
45401 -145785 -156560 -260484 -112699 -203796 -422429 -209420 -299999 -188475 -134092 218146
45391 218146 -7626 -36647 116615 18358 80123 49520 -114991 -212156 -103574 -62428 -272651
45380 -272651 -149031 -94365 146984 8755 255002 -2409 -358324 -30270 305919 337247
45370 337247 289951 283525 -152202 -334692 -257811 195818 -8662 15441 226352 615932
45360 615932 406544 -183026 -56245 -205181 18854 142890 370459 349883 289555 184719
45350 184719 289797 377032 735753 710068 182467 -227812 -471617 -96520 -38056 -155066
45340 -155066 -289979 42046 252559 544136 533413 399289 94888 162467 -23857 -107889
45330 -107889 -404974 -586807 -313075 -442541 -392212 -382420 -271328 -200894 -63300 129224
45320 129224 250014 390538 374817 311221 -278423 136592 491080 54567 -175518 -279552
45310 -279552 -11589 364636 468667 678113 615514 980980 832901 302103 393398 308196
45300 308196 106991 81371 -14152 -19806 112486 157782 50588 231084 174787 293250 431374
45289 431374 371241 603015 456512 207740 231091 425505 505455 464838 189252 -390992
45279 -390992 -751080 -624994 -383546 -18749 161991 249072 31791 -71530 93784 205429
45269 205429 -96445 -66525 143130 174758 78930 289804 411960 -27693 145016 654849
45259 654849 352949 -78916 -244899 -321037 66154 528089 209628 70901 323153 362086
45249 362086 201259 -24450 -140996 -164889 -40490 403128 420687 313348 606329 480580
45239 480580 58239 265628 134478 -29644 -4652 -135278 -454904 -482270 -128471 -122953
45229 -122953 -242704 -547236 -538490 -172608 -133951 -370124 -387493 -250522 -30058 60123
45219 60123 94593 242568 471814 639369 613317 847800 784055 246884 94335 57916
45209 57916 -119530 21622 -121777 -860 -228550 -362755 -347139 -262254 -76239 269737
45199 269737 191174 -89576 -388817 -257000 80040 129495 66294 42096 112785 -214407
45189 -214407 6178 429600 337329 155300 439823 208787 176107 216968 65098 291511
45179 291511 522015 241297 140362 400009 364138 352257 57759 -385180 -99935 -198685
45169 -198685 -360753 -145508 162173 547867 627032 581351 397528 161365 223534 -400599
45159 -400599 -387499 -232261 -94843 139819 423648 112809 -53526 -201103 -436522 -560060
45149 -560060 -202049 154941 210067 181861 323472 125188 329861 134913 -26758 370637
45139 370637 307514 -100889 106847 62900 335861 768226 419891 736032 733643 334357
45129 334357 162874 57058 22610 -115915 221 98905 368618 224167 197613 77778
45119 77778 -18705 -13807 169949 75062 23850 215381 446612 112593 -230130 -85570 24900
45108 24900 72079 336798 679558 426522 -37699 -210057 176754 605647 288047 -13136
45098 -13136 174637 15479 194299 -53020 -283894 130128 270144 205362 352019 96871
45088 96871 -106335 -115757 127429 -86058 -420554 -142595 266371 24044 -94379 -209560
45078 -209560 -378088 -584528 -157277 162194 96114 -39533 -141812 -151424 -211830 97232
45068 97232 -226665 -38453 349649 199029 155286 1646 46824 302096 504668 401252
45058 401252 332952 29105 -79502 -168999 27663 -94661 -317038 33167 -74419 180765
45048 180765 551867 402852 271382 -187611 -133694 -60318 192965 332685 -63790 153851
45038 153851 233324 269230 319036 361406 307810 341219 519882 466578 335074 311343 -186146
45027 -186146 -626303 -476252 -53931 -83460 -82538 117628 25795 -82426 259494 474937
45017 474937 378334 243953 45187 -222690 -367572 -454579 -372325 -346283 -419278 -134336
45007 -134336 332729 608707 276106 -286889 78772 22740 -160828 -160066 195823 127872
44997 127872 289698 575449 604840 239886 116896 86449 -150881 -11981 298018 281752
44987 281752 344939 401690 362759 -166593 436689 499965 100682 330104 138876 116238
44977 116238 61309 35272 86869 7687 309098 515825 230574 177135 636475 492060
44967 492060 68940 145992 -47317 -17707 185009 280589 -112172 -59617 139909 295055
44957 295055 306634 554479 184252 -105269 117771 -122993 -398037 -595952 -381560 -254407
44947 -254407 -326996 -329356 -54153 -130776 -369013 -149511 5956 126582 -134604 -194899
44937 -194899 -187127 -80966 371790 479433 398905 448669 37192 -369831 -380174 -259157
44927 -259157 -123799 315591 154261 129739 -4772 229810 26014 252879 320014 313619
44917 313619 438645 590068 599800 353131 219664 231047 182370 331630 373712 372093 226668
44906 226668 -139158 -410768 -44677 394833 478555 164513 111378 366715 -2932 -79816
44896 -79816 270524 209394 628883 561138 411909 549309 320563 263524 264262 215943 373607
44885 373607 268012 16393 100034 370032 519825 352979 176483 -144295 -117571 233059
44875 233059 456690 553488 375571 301470 146637 -190371 -410618 -506748 -90996 543577
44865 543577 675648 444176 303074 165008 640120 818769 473269 323273 638606 921431
44855 921431 950695 836426 605168 315535 528794 331510 194513 150459 -89081 24501
44845 24501 86787 453584 135213 -17430 -26571 231159 334782 239949 401876 113236
44835 113236 101885 140463 358003 531730 355283 312483 138675 158883 35124 110232
44825 110232 -212324 -113987 432824 910284 846898 1186550 915448 342235 -8487 -49808
44815 -49808 86012 124929 227941 219120 417437 585889 618101 775746 894630 719783
44805 719783 583861 616016 326553 409309 451289 615708 443485 543538 927444 780003
44795 780003 433730 228020 416157 578523 696518 660332 730266 665772 575598 582048 655727
44784 655727 511584 394838 472897 494590 743538 800461 771048 844620 760814 336302 390709
44773 390709 431995 492024 557103 496559 241377 -67280 433959 430950 446342 440151 260016
44762 260016 255465 457120 478485 251581 867926 1095822 1013621 1155421 872311 873169 613323
44751 613323 592282 717228 1049220 744825 305451 541922 599776 367874 256288 773856
44741 773856 1132801 1032948 687021 384848 361555 175097 503315 1056536 1447535 863325
44731 863325 577800 399672 477091 333509 736102 1155365 1120797 1191838 1028369 799053
44721 799053 469631 793800 1029877 949624 524230 514442 810476 873663 740583 713228
44711 713228 977960 1273211 1657267 1375182 1118670 817250 936653 806578 1204664 1321407
44701 1321407 977381 1013611 1180259 1201787 1279497 1367032 1361639 1125516 1310710 1349087 1486048
44690 1486048 1695916 1993575 2157588 1871702 1833766 1774796 1785060 1580040 1444770 1867160
44680 1867160 1592651 1419007 1653067 1739717 1600725 1763661 1917628 1409747 1527567 1593235
44670 1593235 1753476 1956984 2230029 2207931 2144726 2232498 2562331 2952361 2676332 2142946
44660 2142946 1691016 1872439 1881957 2124913 2673672 2579104 2762923 3023788 2859555 2939045
44650 2939045 2662141 2710107 3063504 3241291 3581372 3639443 3973286 3852486 3941333 4780767
44640 4780767 5677808 6029212 6260037 5540079 5014992 4846768 4741532 4783258 4558538 4486040
44630 4486040 4943678 5369216 5243487 4985727 4674415 4617346 5160989 5706261 5734494 6100596
44620 6100596 6327265 6694539 6964091 7374178 7905241 9020320 10533927 11993043 13528273
44611 13528273 13597902 13547826 14990916 17844146 20559993 20511351 16912024 13046090 10962140
44602 10962140 10078133 9833125 9713435 9567922 9156632 8635309 8546137 9244310 9788687
44593 9788687 10709297 12615421 14291770 14092104 11923219 10001156 8911724 8151557 7653872
44584 7653872 7272806 6954190 6613927 6690226 6570077 6346271 6335994 6377485 6295275 6347231
44574 6347231 6763042 6587601 6030574 5813733 5821836 6070623 5893684 5799805 6634362 6932823
44564 6932823 6939746 7124997 7393948 7361872 7788315 8288489 8522254 8767290 9115117 9853731
44554 9853731 10533033 10307510 9843545 9017787 8931897 9336716 9820785 10466716 11458409 12302675
44544 12302675 12274122 12416841 12309009 12175429 12225327 12828457 13901328 15191180 15974297
44535 15974297 16743532 17940656 17560951 16374974 14996998 14322292 14254104 14167086 14126073
44526 14126073 14649787 15036308 14970426 15007540 15566925 16173809 16466494 17350013 18413645
44517 18413645 19022771 19687993 20887886 22340785 23622374 24589712 25938287 27634271
44509 27634271 29558231 31613046 34668417 38535838 42471820 47666326 53808927 61330932
44501 61330932 70484216 81014155 94388013 112531192 136293609 167375097 212206613
44494 212206613 287198236 406554607 532462947 554848615 449408752 321663615
44488 321663615 232381544 173967839 132091656 102720172 83060837 69591144 59545543
44481 59545543 49937991 41295261 34472222 30084143 26272365 23415744 21226181 19196460
44473 19196460 17668988 15939387 14076463 12934398 12025571 11067488 10423570 10224472 9850700
44464 9850700 9154101 9411025 9963263 10301403 11314990 12935175 15141492 15127107 13069900
44455 13069900 10667695 8761937 7342042 6519876 6137736 5537548 4899710 4154327 4217717
44446 4217717 4459350 4234902 4097322 3731639 3304245 3292729 2923654 2719463 2792476 3118801
44436 3118801 3003935 2858171 3007274 2865121 2300193 1944497 2071392 2108978 1916523 1700440
44426 1700440 1816173 2198647 1790744 1572358 1534320 1112385 1263164 1265291 1165929 1423412
44416 1423412 1416992 1187501 1204370 1384049 1233429 1267207 717870 664617 528164 652274
44406 652274 1192082 1240833 1085635 1244364 1311132 999362 723126 697411 877737 1116886
44396 1116886 1089410 1169119 2043290 2335841 2375231 2340712 2099444 1794099 1597460 1759923
44386 1759923 2187141 2328389 2448937 2293000 2177219 1525816 904786 882486 755448 906443
44376 906443 775246 311837 622626 798512 314426 164474 611141 782464 473995 413094
44366 413094 429640 493802 356902 141581 -71217 85526 437994 536122 328793 407119
44356 407119 569494 649580 391240 291538 459122 659527 650331 373248 198413 225399
44346 225399 123491 169464 348487 536696 616555 64414 341027 468884 430907 453575
44336 453575 374365 573844 531084 490271 426995 594406 672086 417294 372076 206545 112142
44325 112142 -106658 -173009 -175252 -143797 -134378 93656 281723 31791 -23517 68036 374549
44314 374549 69883 281303 226633 166568 485446 222600 325914 481673 432717 87813
44304 87813 196095 125075 187130 537781 413393 486259 309167 428042 127185 295468
44294 295468 473302 106644 344847 650176 1055752 781845 592314 858274 1385356 2006380
44284 2006380 2679632 2663362 2505116 1889217 1490308 1225752 609954 339226 260574 244117
44274 244117 251129 174460 -1200 113686 229848 296618 305244 352413 259954 -72699 -345220
44263 -345220 88716 247355 218556 79515 267939 406804 303837 -23694 -208861 -272186
44253 -272186 251827 328092 99543 68387 -209269 -185642 184925 -9445 118188 393234
44243 393234 225948 -10160 -158243 105632 226376 479593 164560 153634 -185712 -378335
44233 -378335 -454547 -98611 55175 -65241 42931 388594 284013 263376 239209 47074
44223 47074 53801 317657 234419 466136 246568 310356 372070 318656 213686 98399 98149
44212 98149 18984 284420 394194 274038 -44997 -444557 -302848 -272223 -264704 -207200 5297
44201 5297 85945 -80464 -88324 -69769 -127062 -753056 -632787 -544963 -199734 341866 239406
44190 239406 181873 160275 -34955 -49927 388298 412041 529859 347729 -132393 -545539
44180 -545539 -445086 -380838 -241672 -231936 -411647 -58123 -102500 -318246 -442126 -261086
44170 -261086 -423354 -194592 -215867 -35704 145086 -24537 -302764 -172940 212007 62387
44160 62387 -34458 53530 -79424 -215158 40243 219371 367015 -203902 -508530 -448916
44150 -448916 145236 147220 -86383 -23709 -42057 -133131 -240635 -302655 -346122 50434 38537
44139 38537 -121420 232701 417007 159469 -209899 -305919 -113196 311795 -53958 136604
44129 136604 377542 651259 508922 286718 709981 569135 255020 317956 143021 226608
44119 226608 568236 437448 171748 25674 99641 172021 -38496 -34947 318895 34183
44109 34183 34379 223196 -71767 -107506 43707 121838 391070 667062 674616 508246 265940
44098 265940 340722 -65193 -264185 -324441 -157244 -808 -23920 7165 -37865 -93892 -398307
44087 -398307 -374579 -123016 -263889 -445027 -822971 -482910 -279331 -320652 -390952 -361413
44077 -361413 -293546 -62387 265895 115379 223188 442707 645354 394884 254670 -109475
44067 -109475 -108499 -185188 -120794 43246 103378 226405 253456 -61383 -203791 40014 -238918
44056 -238918 -551299 -800745 -668964 63161 -230377 -234006 -396283 -174112 24475 136987
44046 136987 44457 -249780 -378463 -319068 114235 -29707 -450481 -190277 172154 -87214
44036 -87214 -187453 -251263 -238034 -306748 66920 541797 302467 162539 -54706 4353
44026 4353 47190 167253 125143 26955 1652 -39205 148922 108811 103919 -334369 -196992
44015 -196992 -170783 -334297 -200709 -224323 -101373 203846 304024 617154 646804 196643
44005 196643 76678 48114 4455 41082 -138070 -96946 -257765 -266928 309601 250854 310493
43994 310493 280968 43764 -62036 105878 198118 -54202 -2340 312831 -132100 -570732
43984 -570732 -519345 -204874 303460 380141 -45303 115207 122977 244131 51426 21033
43974 21033 227987 -94764 53252 -8088 60030 144779 41058 27125 73334 238485 310292
43963 310292 444025 385002 224647 -9841 -173847 510487 405651 21971 -229180 -465856
43953 -465856 -560025 -731656 -115093 -41359 -463662 -543507 -476865 89997 390391 110810
43943 110810 -75699 -170196 -244305 62140 -88743 -248109 -6721 -133817 -596544 -827630
43933 -827630 -519049 -236781 150614 298964 140862 -368275 -362531 52491 237474 423603
43923 423603 304957 38140 460692 423380 -60817 -388404 -374774 -200082 6404 130474
43913 130474 708836 1069768 647466 170282 198 122863 371957 483895 330267 387132
43903 387132 154454 286795 28906 -349638 -229208 -174653 -238813 284076 448493 31648
43893 31648 -273851 -390507 -414685 82567 -188178 188336 205754 -177549 -377670 -609119
43883 -609119 -97139 -89195 -310237 -24907 154663 -247611 -266155 -126936 -68347 -53598
43873 -53598 -139310 -199355 -191823 87747 -415402 -695118 -610739 -578091 -177138 287398 381437
43862 381437 752576 698758 -123367 -552277 -526893 -418597 -106996 -344348 -181872 -73693
43852 -73693 -93663 85291 -167058 -577901 -620720 -470126 -61687 -350853 -484191 -88149
43842 -88149 2251 -145299 -33661 9151 -219965 -73415 403340 539314 426661 284342
43832 284342 140636 163715 -71588 -134280 -188231 -239173 -72677 -306891 -144276 -210052
43822 -210052 -181881 -63287 84805 -176714 -112649 -138058 -366032 -407093 -341644 -409748 -337153
43811 -337153 -203204 -44525 324088 642690 685555 377549 374650 192081 -3720 -217368
43801 -217368 -191954 169093 305538 464036 222185 -196531 -39444 193737 -765 -515949
43791 -515949 -136902 -207933 4072 400611 203868 -14738 227744 113443 -145122 42354
43781 42354 173218 -212753 -125186 -270331 100546 340128 257549 -148087 -67236 -80320
43771 -80320 15904 44523 -813 -434003 -269810 412928 722071 382673 96417 119590
43761 119590 70810 -106479 -745869 -501936 -175169 -37183 227105 -158539 -363236 -28163
43751 -28163 -26710 -153850 -45827 -254064 40047 415168 -31098 -413946 -639425 -236901
43741 -236901 -214190 -165997 158076 -124527 -118185 -244045 -475359 -387542 -443059 -258097 -528068
43730 -528068 -862238 -488273 -650425 -318426 -226045 -49920 173823 193514 76005 -48453
43720 -48453 249962 220679 161650 245817 91688 -54953 -372719 -281762 31540 204281
43710 204281 70014 -364665 -206841 502753 556146 754462 443431 79837 -356636 -518683
43700 -518683 -440687 -226380 12636 -88729 -212918 72530 153832 -127944 -337972 -496858
43690 -496858 -515321 -433832 -560826 -576739 -468210 -255301 9971 173078 399958 365847
43680 365847 110845 15313 410583 542222 428674 385207 187482 -42582 -323811 -466353
43670 -466353 -425342 -161325 -236974 393 181411 228466 -41363 -222665 -155916 -314142
43660 -314142 -348702 -180553 -142956 -262577 -264484 -305013 -138586 498143 542897 42507 169925
43649 169925 -100266 55699 -55407 -372713 -37520 -96987 -421612 -722354 -548855 150571
43639 150571 400268 494182 588134 420016 326384 224378 -44417 -94505 209702 80255
43629 80255 100400 13235 -163422 -196493 -733415 -334723 121864 292606 308297 272684 -204495
43618 -204495 -240058 369331 179601 -309693 -499193 107311 160401 -17915 31718 525754
43608 525754 263066 -13906 -289367 328654 341743 181914 -445286 -311335 53119 -36195
43598 -36195 -339260 -455898 -256145 -326577 -84234 152844 -246142 -431948 -538660 -301725
43588 -301725 -209980 -126547 -122356 -174764 -321112 -5013 638616 128300 -99758 174648
43578 174648 -10726 -256905 38118 64424 187350 217873 147773 -76201 -239002 -296459
43568 -296459 -140885 -81775 -88966 -397107 -625415 14434 473411 260715 223473 461894
43558 461894 629969 352538 22023 -194959 -350431 100534 -9158 181505 85631 -281609
43548 -281609 -108049 -141779 -225333 -202161 -314693 -373928 -577579 -192912 104165 202918
43538 202918 95376 36304 -206592 -564571 -132407 -24877 -55674 157434 -152469 -571167
43528 -571167 -493419 -488714 -79333 37544 -188153 -225626 -292664 -405454 -196932 57948
43518 57948 375217 439146 420867 366965 -48010 -40636 -193356 -104835 98108 217421 174071
43507 174071 210877 -142550 -146797 -184730 243124 419844 216008 -162656 -258189 -103949
43497 -103949 38066 308796 495829 357920 222010 -81652 -454417 -6686 615510 510964
43487 510964 470774 377032 386638 395045 304554 -59938 -148545 -14750 163304 472587 83088
43476 83088 -121613 156442 317619 294500 325449 195543 428259 118820 -169162 -66029
43466 -66029 -105273 -130263 -104994 -9305 75938 114733 240509 381013 130328 68753 -106071
43455 -106071 412289 282861 -185869 26695 62305 -92440 -63072 50767 -141412 -151730
43445 -151730 -107385 -49069 153615 71666 -413565 -550036 -256053 -47808 -148378 -367456
43435 -367456 -274092 216457 164045 -266988 -140435 -92384 -236181 -182955 -85028 -59812 122651
43424 122651 -174897 -283889 -12575 522128 509822 321149 651590 430660 346119 -153211
43414 -153211 69469 283527 163531 181687 60229 165508 312258 250405 -88865 -130991
43404 -130991 -326582 -419009 -257970 -161811 -285733 -231855 71959 -26910 -408795 -621565
43394 -621565 -608104 -209933 -90967 4349 -118944 -274988 190127 282207 235169 153339
43384 153339 272561 635509 233858 -249483 149009 -10709 -137545 42116 -139604 -4033
43374 -4033 31556 -144774 -189354 -409139 -255799 143267 398088 667992 35385 31014 322765
43363 322765 566242 558998 70168 450623 918680 804466 455266 -1804 -107790 354180
43353 354180 616835 636777 184144 -311330 -156271 -98330 -289220 -476890 -349277 -90064
43343 -90064 26294 102100 344005 271675 -161212 -300821 -197105 139650 342562 6486
43333 6486 -224712 -225607 -540474 -321762 -184314 235525 305503 -18710 -552071 -295046 -338483
43322 -338483 126191 438948 121211 -14350 -259871 -363957 114410 247876 329066 194369
43312 194369 607445 808997 403270 -166213 -141412 -597308 -594477 233243 322322 424101
43302 424101 574430 535930 359368 -92971 -44133 123009 64502 -49436 -272898 -530331
43292 -530331 -481624 -271086 -228692 -326534 -69586 -298205 -251489 -377678 -112331 67397
43282 67397 -131923 -681546 -981316 -663883 -448313 -271234 -403420 -143355 36966 137519
43272 137519 539999 541056 670725 305731 -67205 301210 331602 -106277 393241 577445
43262 577445 266061 649128 593328 560381 315651 197981 -15454 207966 307430 31057
43252 31057 97120 42654 94129 499246 274968 155867 193852 479097 660684 276938
43242 276938 73745 -168157 -77184 -42185 -186549 277304 226674 -184527 -22533 284897
43232 284897 662079 380566 255525 237678 126279 14977 -10638 327910 -173044 -252764
43222 -252764 440708 203859 353977 547296 381753 167403 302156 608689 683089 638772
43212 638772 676212 633520 813665 641375 276795 278163 241825 250189 443737 198282 55630
43201 55630 3928 -410916 -694632 -544619 -441473 -105922 261638 88153 201175 65483
43191 65483 -167207 -111711 57795 -185843 -343252 -574072 -409421 -398135 -418281 -185705
43181 -185705 190836 551602 561819 173213 -91894 -292462 -423283 -489766 31792 323253
43171 323253 213889 382858 -151037 161110 196230 -57043 19299 51093 -330676 -753170
43161 -753170 -529477 -92708 -81393 -235979 -115852 174114 68677 -3657 -252545 -509837
43151 -509837 -61204 61929 -212664 -194004 -285738 -225821 25555 27323 173278 -305141
43141 -305141 -273890 182001 290448 171351 -43325 -240300 -345677 -185484 -164708 -116865
43131 -116865 -558907 -361466 -195628 288872 390755 127802 -518012 -559428 -667016 -421080
43121 -421080 -109563 270776 193915 44361 180933 -141284 -241513 -159017 -63132 -384863
43111 -384863 -135819 -106343 -146942 -159916 142515 513233 382775 -47296 -107667 175126
43101 175126 243017 542179 747272 469316 -92676 -54141 63477 258050 23946 132426
43091 132426 561477 332878 272669 260966 -72214 -328837 -172885 -221345 -592892 -560891
43081 -560891 -168521 67595 529948 444421 462686 187088 -159570 -158685 41573 98741 82122
43070 82122 433740 567237 220842 -24289 266253 201044 -296752 -227570 -407719 -149762
43060 -149762 -195099 -814490 -740325 -262020 -367319 -223263 29437 230991 233146 208280
43050 208280 444920 482014 223951 136192 -118459 -166830 -128190 -346661 -502175 -444618
43040 -444618 139144 305058 619549 487637 -51964 -562673 -341524 161636 560461 75303
43030 75303 -332593 -150312 -4471 257610 165128 -172868 -64868 201937 763936 884966
43020 884966 578355 343656 56260 -201486 17034 -20821 288354 244154 -285290 -259553
43010 -259553 83380 -58150 93315 78292 20726 -66926 -64246 111351 172287 18390 -23540
42999 -23540 -160680 -245723 -397566 -150683 295729 269138 200093 -96286 -443606 -690850
42989 -690850 -453905 -486901 -593954 -234344 208777 231876 157385 150047 100424 -128549 -199566
42978 -199566 -28009 33778 27482 231886 332215 471078 378882 157865 125976 198034 -139440
42967 -139440 -518818 -795977 -437748 -59891 186403 250326 -9463 -312137 -637623 -324026
42957 -324026 100834 139059 530896 294066 463019 607325 674278 219955 -212507 -268672
42947 -268672 -300633 299422 169771 -23941 113158 -219483 -240076 -189994 -350695 63119
42937 63119 -112875 -123528 23868 -184361 -118746 -206227 -114596 265279 335471 261523 137415
42926 137415 -90038 -63124 107424 -8695 282236 410369 -3493 312802 424434 503083
42916 503083 281302 -225081 -223522 231343 293718 340224 612020 589585 388763 236096
42906 236096 -98240 -16347 -455193 -866544 -497681 -159076 36910 202854 201381 81575
42896 81575 -18676 -358829 -376877 -122595 176208 493614 530611 535599 250928 -234671
42886 -234671 -153279 -276070 -375811 -319492 -201251 -184155 13524 -323632 -374333 -300912 -117877
42875 -117877 83947 89436 52084 -34069 -304559 -220400 -175998 -213468 -106756 -288104 -145959
42864 -145959 440728 335852 489026 441289 275623 152932 46995 -285841 -574117 -154376
42854 -154376 332892 141268 -153193 -194 321115 155951 64895 48562 389515 381035
42844 381035 408682 377970 -65029 18862 165981 245908 -46375 -10158 114408 -109398
42834 -109398 26090 151863 249799 240565 -61370 -483543 -540760 -330614 -151270 152359
42824 152359 209599 33746 7024 -166828 -272742 -257192 -206855 -208784 -505401 -434494 -508929
42813 -508929 -562674 -143268 -78005 31580 -131117 -184435 -51889 -228658 -354506 -247565
42803 -247565 717 20179 5953 -317355 -431301 -227381 -14657 -122904 530841 375892
42793 375892 -376361 -620659 -87188 -5942 -91786 -309218 74905 55669 -82939 5504
42783 5504 -129158 -123304 -469245 -675114 -206374 55264 334929 90449 83955 59571 -11376
42772 -11376 -60164 97973 30905 -392329 -229126 -23335 199527 351939 125005 -441262
42762 -441262 -626347 -350680 -362602 -469977 -148794 -290442 -169393 -197890 -437921 -340334
42752 -340334 -79378 93735 221597 -122328 52554 -93594 -151661 268315 42361 38838
42742 38838 183171 507631 694354 531422 280195 61009 -12205 179516 15728 -221014
42732 -221014 -149672 -45602 139412 559867 133333 -183307 114512 266193 -2184 -327062
42722 -327062 -248511 70344 47134 -19549 264610 165637 -93525 41956 145147 57567
42712 57567 274812 175739 -17322 -279669 138129 -181050 -107431 236172 419434 432076
42702 432076 299870 217343 -22385 -33103 310623 268789 264398 -22985 -378968 28027
42692 28027 189546 -130041 131140 380454 750713 159456 -140424 -121706 -228284 -140492
42682 -140492 -396942 -561214 14849 66666 122866 65501 -164191 -40154 196384 527019
42672 527019 283803 337785 -7608 -601397 -660431 -251621 38569 -200389 -458834 30376
42662 30376 -127962 275817 566806 760840 311621 306786 370449 547788 521214 424399 574409
42651 574409 179692 167328 127138 142780 790123 640288 201118 -254879 -292413 -303638
42641 -303638 -46813 115727 -170192 -558648 -208782 -23050 -386690 -610329 -777914 -465748
42631 -465748 -155106 9733 192922 360960 370692 180002 -75808 4907 184739 193867
42621 193867 208737 -359486 -143125 -178663 -294562 -236987 273223 126020 9671 292122
42611 292122 97291 232966 411145 242020 84073 -17524 -99872 62484 31637 182162
42601 182162 159378 -91124 74822 6105 109380 126729 172239 342975 294518 -78218
42591 -78218 -70540 255039 -14660 -381695 -144160 175938 202874 346271 -89451 -53741
42581 -53741 -122539 -114527 -359931 -122314 -124776 205224 404810 142342 -310093 -402706 -289853
42570 -289853 -91142 175897 66923 -5331 -66478 -137705 2622 -177871 -456293 -747272
42560 -747272 -682532 -621993 -556948 -357829 -339190 -148178 81302 60942 300667 365463 452676
42549 452676 392256 -20416 -47437 411917 324391 398137 567188 245812 47039 72025
42539 72025 208712 168228 -48461 28634 523008 477186 186187 -56026 -25910 84129
42529 84129 -93660 -29393 68513 57837 -32620 281489 250243 202228 178401 394168 22529
42518 22529 -451065 -476047 -543744 -285184 -28800 -212818 -449609 -362646 30812 -106218
42508 -106218 89697 -28458 30735 -16591 -293067 -81421 -129080 -23259 266667 594827
42498 594827 358465 182931 174596 -154040 -151928 300025 100210 220874 95145 -202576
42488 -202576 -184636 314747 317389 66481 -37026 169367 325190 194399 260269 75463
42478 75463 -102723 -65538 36100 255217 352927 122181 -425341 -379311 -79794 69638
42468 69638 74367 -301407 -385192 -68325 39054 -113243 -321703 -273490 -91503 16435
42458 16435 303078 377148 297532 163235 79691 -44716 -191246 157954 263655 278622
42448 278622 102946 -78859 -21504 -443823 -590248 -496753 -638690 -313888 287912 183463
42438 183463 312159 313057 245528 189390 349330 464142 262022 39196 45202 506487 404197
42427 404197 -82566 -102433 -138284 -23519 -60549 -284 236668 -186034 -232728 -196550 -243326
42416 -243326 -200112 -488387 -405844 -52969 90410 -169649 -705662 -470539 -305284 -255755
42406 -255755 -224287 105401 544097 415841 210703 77006 452234 204207 17768 -81685
42396 -81685 -758 -282019 -263432 98294 326281 481274 -71143 106915 163735 72079
42386 72079 85257 -283532 -265916 -208353 -244543 -391661 -48622 -46163 -299911 -619394 -834492
42375 -834492 -436265 -419271 94555 87062 -176787 -164365 87566 277676 170973 484598
42365 484598 253230 98024 405018 415946 184300 28922 -223112 -185674 -92829 -91437
42355 -91437 -267267 -292131 -244843 -232521 292630 544009 62976 -339557 -261985 26155
42345 26155 -69791 -62747 210906 -126567 -108477 175892 183147 224407 12728 -144735 -248753
42334 -248753 -736967 -592061 -182434 -53502 84611 120174 159870 -175360 -303752 123635
42324 123635 102243 -194710 -156502 -107241 -159650 45528 47586 168331 -352856 -432226 -38672
42313 -38672 106386 361678 141022 -117723 -52786 358926 774021 623694 371250 99426
42303 99426 72449 134243 -15073 -85916 175932 -96147 -652398 -307173 23691 23409 -8132
42292 -8132 -68138 125982 245272 48756 140058 293183 -31199 -263029 73665 111094
42282 111094 -261399 198082 418195 -26812 -79477 5450 18676 395427 423136 169770
42272 169770 220629 346887 142479 292646 -318283 201108 318922 332249 12608 199630
42262 199630 370075 257505 354730 91795 10493 -238734 -73448 -85331 -139096 -18436
42252 -18436 151598 -213509 -26974 -332567 -212841 67756 -28473 -5893 118545 209135
42242 209135 393878 667591 749669 159891 -71770 -100011 132700 245957 196547 -96324
42232 -96324 -57905 -127183 85717 55189 292050 437958 451899 131804 -87840 -71539 -149277
42221 -149277 200529 25843 385418 452689 216986 449495 259444 177628 105780 -270307
42211 -270307 -173546 107125 -22011 -156900 411540 59435 -108264 -197601 104261 -26017
42201 -26017 -75090 -365167 68597 162475 42497 59845 -188558 -583676 -514417 -244643
42191 -244643 56093 160117 80931 -95683 -195 2297 292761 475992 333059 -133323
42181 -133323 -637523 -410860 -16545 257006 34374 -145104 -266219 -384181 -186368 -378247
42171 -378247 -348648 -298476 -142365 -240102 -120758 184332 525548 276566 -67910 82980
42161 82980 -346382 -428346 -444997 -404850 -313194 -193277 -246257 171762 155904 -27843 248627
42150 248627 82923 -6479 220007 11341 -168750 -7856 -327968 -144002 19364 382581
42140 382581 480050 598393 628803 107318 -239272 -759219 -508851 -411139 -448703 -440563 -429204
42129 -429204 -83461 162027 210362 282351 399892 247291 -184953 -354527 -336038 -216141
42119 -216141 -433208 -373612 -326224 -302610 108739 217007 -39107 -155279 -24719 -4988
42109 -4988 83321 125854 -529066 -264521 -65809 210162 50115 -52222 95775 -74296
42099 -74296 -87700 -209371 -106645 286715 158748 47207 97487 61533 -119239 -493032
42089 -493032 -290038 -328995 -520685 -92562 -130581 70937 40074 -163244 -361245 -408172
42079 -408172 -376389 -365440 -476424 -166699 -148706 -180972 69549 191993 143485 220060 111757
42068 111757 15307 29227 341136 494167 151590 -133282 16 -5625 194931 97377
42058 97377 -11419 299991 -45963 -93121 21222 150859 16215 122297 203867 100388
42048 100388 -282229 -198244 89933 -157313 -45769 115647 -275049 -201397 155355 412215
42038 412215 427249 376409 -108901 -288164 -543084 -491789 128288 29764 308443 667344
42028 667344 326951 -159855 -396149 -79615 32179 143585 -509658 -290604 -325065 -365735
42018 -365735 -102416 223982 393958 54541 218827 329184 -108926 -173081 -32851 48128
42008 48128 -226972 -132673 13550 -445026 -739985 -597258 -190443 -6298 37215 -107008
41998 -107008 78959 126357 78294 -76436 -187925 -8652 442661 156691 -322367 -292236
41988 -292236 -66876 174744 260879 -124661 -108022 -299994 -25070 -21538 -71607 -323704
41978 -323704 -334023 203194 328671 -102483 -161094 211248 321982 36927 -86414 -117396
41968 -117396 138665 290596 20113 -181699 188002 325886 88100 111579 -153842 -392254
41958 -392254 -276308 -119880 -147329 32141 -63023 -234730 -181827 296213 627724 317892
41948 317892 252506 475056 74648 101608 34064 374970 549473 43655 -115183 -504289
41938 -504289 -701307 -298369 -400813 -296401 -75057 -107210 -256781 -597574 -548388 -431771
41928 -431771 -227479 -55986 -476327 -273106 109040 -167929 -193327 -77749 303697 90628
41918 90628 -43696 -40397 45125 98950 16181 -22625 -171392 -270767 -542646 -321567 54069
41907 54069 302073 358740 336430 764910 870039 377630 166806 627777 336834 76163
41897 76163 179251 305585 210487 -19184 -438074 -143844 14316 -112944 -395023 -77974
41887 -77974 163232 365189 423027 743420 834921 656526 553649 481278 578863 342157
41877 342157 113869 16828 344673 493934 281098 307427 266815 660693 329793 134960
41867 134960 25470 -97653 -147314 -104816 96432 126190 -227855 -97334 -246466 42085
41857 42085 110970 129759 15375 -155388 -46115 -143358 115137 177444 336444 123682
41847 123682 -346971 -281692 -267346 -311317 -267876 -17872 102854 -157259 -303570 -502101
41837 -502101 -224173 138286 227242 -40965 -23024 -195630 -234988 -320033 63177 571556
41827 571556 681081 361121 392023 -269597 -639877 -19880 -599 152558 65840 66490 330342
41816 330342 -52473 -62676 -121435 -446494 -353670 -240126 -374020 -317053 -345684 -41612
41806 -41612 -95880 -256957 -347274 -126979 46604 -521204 -554698 -54472 342917 390193
41796 390193 524562 165255 -68829 267166 39063 123710 241120 379176 324129 204709
41786 204709 -216880 -359123 -31883 -245185 -594846 -496494 -175548 125383 312850 132142
41776 132142 506559 438362 348985 -16178 -122713 47736 62517 325328 215503 127329
41766 127329 78444 298279 323590 403414 247391 48397 89961 347763 308694 31072
41756 31072 -68438 195642 319123 120411 163593 -91048 -282364 251012 -116753 -505941
41746 -505941 -567349 -191495 -252471 -80564 38245 -138889 -492785 -153221 -175530 -268925
41736 -268925 -361230 162434 339285 249294 -109828 -263192 -307490 -161890 -206946 -378200
41726 -378200 -195309 40528 -198085 -61048 117940 -114031 -172892 -38166 -150279 -453949
41716 -453949 -444635 -509911 -226532 -202214 146969 317015 51266 215417 531957 545005
41706 545005 -62843 -88835 283695 210445 -298502 -706235 -482587 -28632 -46101 -180686
41696 -180686 -261167 -584650 -555829 -396977 -321803 2492 -141896 -209802 -49852 -195657
41686 -195657 -176389 -42397 -276162 -397234 -418454 -337836 -256370 397381 307518 408354
41676 408354 358301 269572 336834 143694 -69288 -105278 91635 117243 21668 87780 130474
41665 130474 400332 303458 95854 -112586 106816 298358 122546 -145729 -328453 -149913
41655 -149913 312826 126804 -184274 2229 239604 506401 111051 -244959 -158211 -204583
41645 -204583 -513058 -86750 -311981 -381944 -68061 -398565 -376144 -125171 -184660 -370553
41635 -370553 -8837 -158173 -479817 -434006 -531626 -365174 -189293 -323348 -451637 -73256
41625 -73256 -63016 3346 39315 116165 128485 -62378 -90183 -75492 11168 205659 -155684
41614 -155684 179983 3368 12443 -25579 -423710 -195183 -46852 -70926 -270269 -50330
41604 -50330 44378 7492 -18258 81832 181879 353082 139842 30196 -21425 22463 40082
41593 40082 -57475 -441548 -494497 -573588 -212340 -134843 8276 -50709 -398151 -437036 -464756
41582 -464756 -366821 -275211 213996 366356 60659 55333 278054 354108 132088 -478368
41572 -478368 -698303 -812180 -519913 341184 580727 333301 198 -166472 -100334 159952
41562 159952 -190765 -197731 -249088 -145751 -138408 -224295 -75381 269364 683271 486204 416989
41551 416989 270347 280274 105257 161086 164966 100506 -117679 -31712 249172 179823 -211919
41540 -211919 -267317 -344018 -170533 171259 216308 44021 -135628 -424633 -573868 4684
41530 4684 296870 187712 358906 171742 146655 405998 154222 27883 461001 360712
41520 360712 -347810 -154454 357804 401662 -68689 -321546 -110759 99095 311999 538674
41510 538674 919159 776180 606242 197362 66234 156705 207836 568400 480046 251707
41500 251707 331619 -38751 -295547 -154199 -169213 -87454 -20990 29721 307221 450401
41490 450401 369816 225871 -377185 -535765 -575648 -388697 -217654 -326435 -107461 -122844
41480 -122844 -161682 -98653 -358441 -852419 -602809 -254475 -238500 -217131 -226320 -144272 -624
41469 -624 -257555 -261693 266815 434226 48477 -86070 63824 55023 -229546 -130552 30122
41458 30122 204470 97320 198009 443170 312621 77090 191723 -155718 -374777 -256390
41448 -256390 65869 134664 -242350 -450839 -435549 47914 28639 -355296 -364297 -137971
41438 -137971 -300608 -311816 -198108 67436 -184845 -493561 -427528 -495595 -836605 -850809
41428 -850809 -457674 -151538 -193352 -326125 -177565 -219157 -339684 -493600 -125805 -318820
41418 -318820 -472945 136502 357362 57446 291143 434673 274155 303129 583658 34470
41408 34470 -134753 126370 -311254 -397412 266878 424532 -62481 79138 -242622 -231064
41398 -231064 -396751 -148467 -45820 -71753 -164893 -202494 -163797 -242895 189299 377406
41388 377406 257666 216616 -72300 124132 -310925 -666483 -317407 -177542 -105143 202109
41378 202109 -52929 -201971 -333051 -526395 -287501 151509 161640 -242292 -215932 -172173
41368 -172173 116104 -226488 -544924 -349191 -259953 -294414 -107065 50826 -14300 -101342
41358 -101342 -486439 -6662 123071 211317 453793 196513 378118 250658 383672 288285
41348 288285 48028 -88687 -68001 41406 68712 53848 -84007 4174 -247988 -343871
41338 -343871 -104660 -30823 412403 237766 178483 -321096 -146917 -304034 -101679 -246430
41328 -246430 -211792 -292176 -406609 -101563 48337 -47328 -129900 -350192 422278 241224
41318 241224 269410 -9124 -92593 -201311 -389566 -307312 289442 538134 427377 851906
41308 851906 683966 633961 517092 -1569 -195830 -303053 97541 354364 270892 125350
41298 125350 178071 238850 269096 7757 168768 251585 273476 257007 143422 126067 228091
41287 228091 525884 384759 -110121 -5657 15679 -69841 -137086 -60098 204512 -19581
41277 -19581 154787 189854 228975 223697 80439 -168987 15227 630 -297900 -317176 -329827
41266 -329827 -295800 -411687 -133772 266081 -124341 117331 -19797 162064 394655 166784
41256 166784 -85534 33437 11823 -342075 -444160 -441767 55533 504016 408570 185786
41246 185786 -176784 -388429 -396518 -474048 -316634 -141444 -34024 55603 235615 112047
41236 112047 293897 318040 -413905 -703479 -406253 79958 -188576 -391515 241022 -53568
41226 -53568 -243162 -341817 -334281 -200426 -347656 -130199 -394369 -79091 -134873 -427505
41216 -427505 -353841 -429189 -184523 68913 97543 244312 667966 256694 243633 56341
41206 56341 -193736 -203332 -468680 -165505 -122741 -228077 -14288 112099 172877 173709 145935
41195 145935 271905 -41251 186421 307919 152563 -164281 -378113 -131085 16338 -872
41185 -872 -300176 31769 203259 -132598 -205089 -301062 -60714 -258269 -86234 527404
41175 527404 457246 466820 258367 -379074 -173992 -22064 -358496 -404010 -187210 -330481
41165 -330481 -368789 -519371 -317782 -137112 -286397 -225707 -209073 -121250 -197112 -266214 -13261
41154 -13261 -59990 -454691 -306682 -124420 68270 196922 158048 -263639 -417486 -46337
41144 -46337 140169 10723 -9237 366922 397689 383856 368386 175972 322497 195898
41134 195898 359693 143946 4265 -378055 -179329 -135862 91761 498177 463064 133047
41124 133047 287212 208021 385806 395062 37537 -3087 -81453 -38711 -301040 -114619 -165498
41113 -165498 -24646 -209241 -359031 -84695 38393 -124385 -172315 -91575 207772 100935
41103 100935 129252 237600 126975 24202 252028 -122230 -326932 -61081 -222404 -135169
41093 -135169 224362 -114770 -125318 -218416 -333108 -126240 -255062 -247001 -273556 -572270
41083 -572270 -151154 455 -77793 223576 412073 239036 -282111 -686041 -634118 -520187
41073 -520187 -601340 -676462 -428519 256164 697467 195308 -33988 -199102 -395369 -141656
41063 -141656 -327106 -88142 113187 184421 16838 -104602 123241 -33171 -348321 -236106
41053 -236106 -99994 -117456 -285864 -411795 -539231 -709529 -580107 -464070 -684826 -690683
41043 -690683 -735691 -548711 -206126 -220522 -254696 -201165 -175755 -557518 -282145 -109182
41033 -109182 -399811 -608901 -254562 -98142 -83712 -294139 47517 46033 108024 180136
41023 180136 89195 278929 132948 41601 308798 -292287 -402459 -68563 101269 -207322
41013 -207322 -101603 49238 -13126 54870 -171120 -191585 28417 127846 220520 -39626
41003 -39626 124936 389787 106563 50610 187707 184266 76179 452352 664520 497587
40993 497587 34297 267984 194056 235504 264839 18946 77279 263298 44005 -244891
40983 -244891 -202322 -222789 -297484 -58306 -26991 -141163 -547131 -452785 -326204 -560123
40973 -560123 -437380 -257443 -208673 145089 18336 14735 -11870 -535506 -468203 -278183
40963 -278183 -396029 -213186 -281446 -359345 -642979 -324069 -242628 -267966 64872 352054
40953 352054 232459 -482317 -159067 -123777 -448519 -269774 -143624 -274989 41735 114716
40943 114716 -50522 102784 -126221 -446187 -641704 -526719 -209623 151309 327052 -196596
40933 -196596 -451748 -133920 -12476 30698 -408105 -222326 -81462 -61495 78387 254949
40923 254949 12444 -47388 -43785 -320321 -379753 -314038 -267361 -141641 -102007 -132067 -326723
40912 -326723 -20711 316163 -10931 -265615 -163421 -159533 -135318 470014 712108 447783
40902 447783 219409 40132 -212912 -104475 165626 251899 215071 103659 70183 -94578
40892 -94578 -550770 -260893 -543696 -530377 -259741 263385 527693 515567 370968 -41446
40882 -41446 -262831 -422774 -87045 93841 18993 -36669 -168009 5022 28778 -81747
40872 -81747 -449084 -699492 -560184 -481545 -324223 -125671 -119574 -260213 -82790 -485780
40862 -485780 -585290 -214682 284671 -53721 56518 1444 37144 -17481 -31768 28631 -185107
40851 -185107 -139210 111573 -122676 -181011 -56443 19461 -54697 -276614 138310 176331
40841 176331 -299112 -155728 208008 494449 403043 124267 -147350 -343819 89515 -239359
40831 -239359 -429880 -773957 -800354 -348905 -313728 -113693 66388 -122265 -219507 184857
40821 184857 96980 18002 181529 451242 71285 -127009 -334993 -646341 -424494 -107420
40811 -107420 60377 -257244 -107556 4749 64840 54695 -264848 -255059 -339640 -521907
40801 -521907 -155934 116132 199480 32944 -73110 -209851 -37248 -7792 -15232 -17922 23779
40790 23779 180417 242106 499039 324787 -366874 -418690 -216823 8431 191465 -254205
40780 -254205 -638411 -532211 -220158 -278481 -144819 -32074 -305667 22978 93488 22311
40770 22311 -253943 -163400 223311 106069 148043 -141825 -236862 107715 89090 -428416
40760 -428416 -674367 -572795 -677842 -709765 -591061 -551458 -531122 -644893 -387419 -180951
40750 -180951 -273338 -137495 329840 258435 6291 -29156 -72787 -47406 -179483 117201
40740 117201 435117 -1517 -356860 -418088 122599 365784 25603 -429519 -251909 -50401
40730 -50401 -99096 -326736 -514931 -370314 -309057 -281113 -64642 59919 -95299 -355294
40720 -355294 -66379 288443 -57462 -44334 381629 165921 -32255 -421845 -413950 120810
40710 120810 91245 -251653 -342755 -232197 -352480 -414709 -279513 -321984 -149560 -283082
40700 -283082 -182289 195841 426118 402983 267649 119112 -247519 -62187 -140339 -75337
40690 -75337 378040 273369 369892 318944 589074 563258 548638 881885 596444 426390
40680 426390 549297 214907 -83410 -89416 191307 82332 38903 -123477 96733 150709
40670 150709 -88182 391041 95354 -108388 -132444 -76514 -187234 -389818 -295159 -79175
40660 -79175 36640 317118 268401 144022 164822 63222 258529 557178 479462 163420
40650 163420 -161894 -255859 -667187 -566112 -536864 -331410 -190501 -414372 -525152 -393709
40640 -393709 -63950 248400 203614 -83634 -215678 -157729 -218816 -160212 -199933 -411863
40630 -411863 -468596 -850184 -511070 -198833 -225674 -401445 -376430 -445776 -224862 -308761
40620 -308761 -266242 -117260 -668298 -286647 206038 274772 229080 134026 60054 346615
40610 346615 323812 90047 112790 -110885 -97349 37402 -90308 -494017 -265819 -76979
40600 -76979 -344046 -364526 -469075 -344556 -479526 -240895 268748 440578 356200 -176257
40590 -176257 -468785 -433453 -627437 -371005 -651064 -618307 -128472 -82194 -120062 137087
40580 137087 102604 -72285 9079 -249717 -505540 -811842 -711206 -529134 -152937 281886
40570 281886 388508 465616 457029 115716 179314 100559 88191 -71054 -434362 -453006 -218732
40559 -218732 -361622 202079 248445 227031 417368 496478 67899 -75921 23182 -23892
40549 -23892 -118774 329597 136579 182476 -129472 -97145 48629 -44736 -246026 -99011
40539 -99011 -94618 -314814 -236093 -160086 -169444 -486143 -706472 -410353 -319787 -591784 27026
40528 27026 -290998 -442348 -220373 -86225 129278 -8618 -70854 -149732 -73328 -211768
40518 -211768 -559041 -158232 -230789 -308159 -337835 -417807 -780141 -58692 73662 -102103
40508 -102103 -167362 -91552 -175627 -485657 -632153 -374256 -211433 4381 -163427 221523
40498 221523 280193 -51402 208032 164249 -259050 -384466 -319222 46347 101598 -90545
40488 -90545 -112919 -71278 -357091 -423756 -360942 -381759 -269702 -208499 -229637 -165634 -344611
40477 -344611 265885 115070 -532715 -426868 -142275 -365625 -561891 -269576 98580 340155
40467 340155 163493 -20099 145378 242601 257401 346620 126919 -222322 -123203 72232
40457 72232 -93412 -296964 11209 75529 439057 163087 168695 94958 191519 440454 326690
40446 326690 177287 -128208 -79930 -269720 -227049 -323436 -509071 101733 383019 479005
40436 479005 231114 51009 147517 -200718 -498836 -328743 -360652 44439 344201 279271
40426 279271 417516 276636 134730 394691 393677 391387 508719 18416 -126906 -93265
40416 -93265 -98033 -177840 -435202 -250659 -279062 -339085 -208619 -462842 -890002 -810369 -804370
40405 -804370 -522859 -22902 202883 393378 618933 254730 207808 343590 374811 500089
40395 500089 276678 228538 64657 -63815 -175672 211699 445857 449492 433190 465378
40385 465378 147055 -36998 181582 84200 369005 532386 200825 128250 112319 -298616
40375 -298616 -343411 -283111 -286031 -172217 -73624 256579 287581 143632 -379052 -332356 216533
40364 216533 -138598 39337 250741 290415 -55626 -402843 -147518 364097 125442 -109344
40354 -109344 73611 -82054 -257181 -250118 39570 247752 -72147 -234047 -278745 -300126
40344 -300126 -96686 -80045 -134395 153247 374679 418687 50486 -617138 -285984 -150580
40334 -150580 -377657 -349316 -228888 -166338 -515250 -201646 242463 97978 -28112 -458635
40324 -458635 -285938 42478 100160 -147593 -190695 -263562 -364164 -260425 68105 154190
40314 154190 3954 -152206 -384504 -558390 9958 342850 197726 -25919 -428413 -327099
40304 -327099 -5263 45225 -364790 105917 457729 135731 -10850 185637 8347 128056
40294 128056 61542 57049 93838 351000 269346 553530 246413 101609 -80052 -65591 250667
40283 250667 335842 639151 458053 -5443 303459 72823 -190151 -139299 -312540 -183846
40273 -183846 -152981 -259050 44941 77303 -531550 -660387 -424768 -188477 -386068 -93271
40263 -93271 31693 -220868 22053 290724 -58822 -395004 -276928 56284 268561 -270773
40253 -270773 -16529 84325 -382272 -55417 366435 302890 54432 33521 -100947 79789
40243 79789 154457 47842 43020 -43741 -248513 -469506 -472915 -377614 -184142 -42824 -328606
40232 -328606 -292792 -120353 102561 -60228 -501492 -543321 -182070 -161911 -331134 -11986
40222 -11986 148900 -94397 316540 520811 502355 324562 237084 -147539 -293695 -289168
40212 -289168 -231769 -260632 201167 311889 148233 -303310 383 92863 63 179989
40202 179989 -25663 -61844 -127942 -149535 -151632 -305155 -53004 102259 -195284 -108433 324831
40191 324831 136130 -61853 -119450 -14557 345474 -26317 92403 68582 -6797 102721
40181 102721 387600 233668 30641 333868 -277325 -317738 58766 -12972 -166071 24359
40171 24359 66147 -177402 47637 303171 -89235 -246974 -131660 48071 135397 -311254
40161 -311254 -293542 -110063 -35811 -10153 -437587 -393592 -2377 -11892 194215 179919 227169
40150 227169 281640 483966 257838 172606 355075 -346 -65651 242275 491940 632140
40140 632140 638967 498690 99789 -427054 -181418 62280 -157933 -18353 -73744 -15887
40130 -15887 -137523 -333755 -298138 -511871 -361684 -470499 -420854 -96686 150325 -104392
40120 -104392 -172612 -52890 -175678 -245401 -188427 -233853 364770 504481 -26241 -303714
40110 -303714 30812 -22274 48775 126273 -33486 330509 412894 286302 125850 -285119
40100 -285119 -173792 -391017 -737740 -887773 -882632 -726320 -371413 -323078 -298717 -147199
40090 -147199 -131460 172779 -53773 -218955 -102659 36883 19892 -353497 -252133 156472
40080 156472 379771 261247 -29253 -133113 -20462 -72947 -264532 -539124 -669854 -439918
40070 -439918 -88102 261604 -204000 -434529 -112406 -31431 18171 -195667 -413914 -245210
40060 -245210 -480225 -230401 266643 335336 142985 71591 -161396 -9692 506379 567046
40050 567046 124721 555898 216404 224149 -32743 -133344 33359 76255 212606 398549
40040 398549 -91597 -211174 -131146 -334245 -123214 -121435 94795 259356 496985 34336
40030 34336 54382 208642 73728 155364 574476 115655 -245258 -348166 228607 273697
40020 273697 -77761 -71675 -52797 68970 102181 -366330 -500145 -142317 -135959 136338 180830
40009 180830 37686 -162943 230982 143343 159378 274721 117258 128872 200258 9331
39999 9331 -223531 -199450 -397436 -611853 -193798 393157 38480 -112527 -89834 31560
39989 31560 -80950 -158243 -362878 -195246 -42491 -222126 -222741 -350344 59846 -98916
39979 -98916 -202366 -10307 -377740 -47921 136085 88063 60634 22635 506988 587827
39969 587827 806021 898951 505473 252786 99084 35006 31892 234473 -56753 -37592
39959 -37592 -175774 -462646 -132629 206144 399186 316605 317148 -274090 -187977 -77156 -8926
39948 -8926 23055 -1458 -186705 -352931 -289027 -168804 -103827 151890 470087 3651 -30426
39937 -30426 365178 539518 637983 -2112 -542644 -756812 -339942 16828 -85715 -126554
39927 -126554 -75316 158485 -42990 263657 267930 166824 115206 444063 636201 201846
39917 201846 366374 236129 85214 119989 -9341 -177429 181847 459117 758970 442077
39907 442077 370918 589450 359346 56167 -31962 -14147 -123016 -54927 181826 221301
39897 221301 492505 172616 -87631 -158686 -288565 -142473 205474 -112295 257600 407168
39887 407168 298635 219447 -44049 -31298 -200912 -59968 -162744 -293502 -113430 341695
39877 341695 555684 151659 -72698 -150975 310059 99808 -174950 -11531 131965 156460
39867 156460 -168783 44913 127219 -92089 92536 181663 140203 523688 259070 138891
39857 138891 359480 129367 39067 303638 449310 672574 251350 65190 58275 -54786
39847 -54786 -352329 53461 636307 646881 569682 349269 -44476 -403889 -112595 256992
39837 256992 271294 325835 196842 -257258 -65941 183076 -159963 -367005 -144821 217520
39827 217520 507842 377983 186455 -71542 -52242 223090 579832 639936 135892 -9127
39817 -9127 85316 25512 -263243 -278009 -142428 200248 301777 190954 -133967 -30985
39807 -30985 147235 -61183 -237354 -517113 -660119 -687362 144767 236932 328177 172382
39797 172382 361567 157643 515896 609358 643739 539158 -15891 -131748 -301536 -144600
39787 -144600 47566 276108 271963 432688 439427 96155 17781 508 41722 160314 95701
39776 95701 139923 -81418 61587 256610 324527 13217 101216 36540 -272234 74831
39766 74831 -184427 -106035 425092 402334 251119 232197 620741 616137 61269 40810 70436
39755 70436 224215 343490 48479 53169 98231 -94568 -294495 -143707 -126346 -31547 113102
39744 113102 -52562 -182144 103681 171558 -186219 -100463 -29265 268490 208058 357384
39734 357384 188906 -8953 150006 304141 308769 157711 59758 -48094 72559 -145772
39724 -145772 -428841 -255771 -294393 -535119 92252 145301 164017 289273 237543 -198962
39714 -198962 -80822 -117713 -358039 63813 310227 62823 204672 609627 480426 253215
39704 253215 102117 166890 35915 -606427 -558253 -361848 -195226 182989 161969 -95825
39694 -95825 -244643 -203288 152362 67966 126998 351983 226890 283365 400651 208849
39684 208849 205468 -5652 -123090 79693 246703 336986 239042 185316 230743 2592 65300
39673 65300 17191 31674 -148267 -166716 -143875 -101195 -96833 165291 206795 -319325 -521882
39662 -521882 -335940 56262 345412 28381 -301815 -119577 -117329 -255866 -150139 -91317
39652 -91317 -234575 -270825 -334550 -514923 -219524 -70598 256305 404697 84937 -3318
39642 -3318 -75490 274967 77747 -235499 -114315 270227 213657 372070 529574 533861 438784
39631 438784 120182 -86085 -33757 -537 107687 21781 -281015 -307328 -251842 -199139 -73019
39620 -73019 -214281 -481701 -274385 302136 197322 515197 553109 346716 267531 327598
39610 327598 -219652 -50787 -125830 -377635 193016 162412 62466 56525 479239 322961
39600 322961 280448 68541 -177855 -48584 445046 358440 49731 -108932 61335 -227654
39590 -227654 96455 338545 456293 13901 -167933 -116398 116963 253840 -104522 -38762
39580 -38762 140289 176347 -21353 -579846 -737885 -359065 29861 66684 -110080 -161805
39570 -161805 -69112 150007 -52257 -91365 -7713 -354117 -480120 -346534 -320960 213844
39560 213844 311534 143807 156752 255686 276163 -126351 -505792 -418467 -329803 -289668 58502
39549 58502 -405878 -466321 -455310 -385149 208692 591693 702564 660820 410639 168354
39539 168354 184588 -40970 -283208 -409460 -424422 -184357 -119253 172784 -77345 -209002
39529 -209002 -124223 298556 108416 129502 -325973 133303 -279412 -525646 -338060 -208577
39519 -208577 115511 88838 53305 115790 -35744 6461 152208 -12517 -59457 362081
39509 362081 238729 -206880 47387 86676 -52826 457146 702124 919829 422366 -24146
39499 -24146 95745 262652 75618 -574028 -461683 128374 405394 114237 -151085 -144798
39489 -144798 -170070 -340280 -135879 -177574 -91554 -67081 -190609 -81553 335615 394114
39479 394114 56890 -79350 527606 585963 53176 -138649 -114994 -239255 -164881 -75595
39469 -75595 -25435 97725 -133266 332732 563137 243836 392350 383448 521260 655019
39459 655019 443761 243020 190983 -59513 -191913 -244411 -307650 -28481 286765 466480
39449 466480 32279 -112722 -60475 -48134 -204024 -396252 -213362 179281 676155 647278
39439 647278 264547 251182 289127 -176125 -262044 -175163 -97455 -190799 -509431 -215358 -2995
39428 -2995 68104 29299 -258656 -326690 -427381 -350627 -172236 191689 -180480 -172178 90822
39417 90822 -36721 -86197 -151569 -91372 -34106 -369327 -194853 -18355 100919 165164 -258272
39406 -258272 -198774 -209094 -390799 -12544 366326 374307 57752 -97214 -255626 -117679
39396 -117679 62169 -138777 -88143 -87725 -419152 -790227 -227908 343215 609931 421555
39386 421555 313799 383933 -56345 108828 400802 408723 286543 -435431 -614382 -50119
39376 -50119 52224 40268 240221 64807 -218701 -63280 170386 66695 -56965 132257
39366 132257 121958 324673 -235104 -417480 -173402 -295114 -485706 -691011 -500814 -249960
39356 -249960 137244 56146 125741 320076 498985 509535 572787 109762 112117 -62988 -181598
39345 -181598 187790 231797 84056 -142671 101543 262318 550061 348046 186369 275319
39335 275319 -7125 143544 18993 21726 130841 -55760 97403 81821 151098 193920
39325 193920 -231457 -484907 -752496 -755218 -729997 -412258 -234412 -110856 160754 -58712
39315 -58712 -355875 -294725 -450955 -570373 -205622 342102 465212 452301 190587 214397
39305 214397 167017 -86943 46264 254716 297810 197188 173422 -11956 -255845 188365
39295 188365 544745 130740 -277777 -498301 -574545 -353893 -113423 26701 -45899 -291717
39285 -291717 -250230 -384018 -631426 -385224 -440913 -360133 -62884 69156 105585 -192840
39275 -192840 14809 -328339 -638190 -368520 -223218 -383810 -441000 -270005 -120114 -164583
39265 -164583 209783 524061 482532 -9396 -47084 -21950 334386 283974 222119 53919
39255 53919 -125279 160657 2730 161073 206725 1723 -200655 -163496 -48261 63175
39245 63175 170999 -185681 -88617 -67949 31079 22865 70987 164231 28149 514682 225697
39234 225697 213521 -15491 -398760 -519051 -367335 -475516 -72032 487608 625191 -45787
39224 -45787 -97553 83079 173259 113459 -55953 -141320 166492 105068 123602 35727 -247160
39213 -247160 -234493 -261283 -452768 -412385 85156 581696 454919 132348 387881 230377
39203 230377 449127 380991 191914 569499 541900 157633 195626 -38996 -239299 -108662
39193 -108662 -129172 -44814 -101087 -58366 65672 129505 159081 264841 -48722 -112429 28347
39182 28347 73729 14747 -23093 -18300 -306972 -123062 -39767 -225477 -174943 -266744 -146108
39171 -146108 202512 -97739 -159375 -576 163612 72752 109845 -48691 -350782 -349681
39161 -349681 -23906 -96350 68881 -15563 158064 115472 321908 649747 167443 -139246
39151 -139246 6333 244990 72963 -291513 270638 309391 -126187 -195470 -323532 -332669
39141 -332669 -313118 213662 408353 406714 6032 62477 41928 111754 -71493 -104263 106779
39130 106779 183043 89231 233960 293303 -313653 -342295 -517257 -570708 -413328 -104993
39120 -104993 272353 336765 411040 243809 104154 264008 380075 165070 -91000 -437340
39110 -437340 -531808 -383716 -416862 -673607 -610548 -515513 -79990 -34218 211577 576435
39100 576435 83901 -486506 -280162 -429824 -369811 -220672 -84592 84326 133978 -258616
39090 -258616 -23725 232457 179088 -15661 80267 134405 243935 554594 -109700 -159996
39080 -159996 132965 226196 143304 14295 -59908 -26404 214254 708164 311105 -56696
39070 -56696 -242830 -326959 -624762 -535173 -318350 -67146 -86211 14768 253527 308911
39060 308911 282372 52621 394562 240403 235130 -125173 -250318 -34848 -414789 -705036
39050 -705036 -364344 14324 1592 182554 93775 132520 -87789 24746 281846 40619
39040 40619 -330083 -81634 84538 -62242 125488 744156 603759 -9711 -72050 6870
39030 6870 -9003 -42815 276258 509882 242101 122578 -81686 -196690 -125369 135890
39020 135890 112088 375272 180662 -192738 -348204 -23506 -83914 -247636 -107625 293040
39010 293040 441420 156708 -391473 -251835 -525750 22379 369874 230612 297381 96239
39000 96239 -17402 86344 -387544 -317634 -14632 215578 -121150 -175035 204966 -39722
$$ [...]
##END NTUPLES=NMR SPECTRUM
##END=
