##TITLE=19F_CA-8562-1
 CDCl3. 24 sc
 10.4.2019
##JCAMPDX= 6.0         $$ Bruker NMR JCAMP-DX V2.0
##DATA TYPE= NMR SPECTRUM
##DATA CLASS= NTUPLES
##ORIGIN= UXNMR, Bruker Analytische Messtechnik GmbH
##OWNER= root
$$ XWIN-NMR		Version 3.5
$$ Wed Apr 10 14:30:02 2019 Russian Standard Time (UT+4h)  she@DPX200
##.OBSERVE FREQUENCY= 188.290927
##.OBSERVE NUCLEUS= ^19F
##.ACQUISITION MODE= SIMULTANEOUS
##.ACQUISITION SCHEME= undefined
##.AVERAGES= 24
##.DIGITISER RES= 16
##SPECTROMETER/DATA SYSTEM= spect
##.PULSE SEQUENCE= zg
##.SOLVENT NAME= CDCl3
##.SHIFT REFERENCE= (INTERNAL, CDCl3, 0, 101.251)
##AUDIT TRAIL= $$ (NUMBER, WHEN, WHO, WHERE, WHAT)
$$ ##TITLE= Audit trail, XWIN-NMR		Version 3.5
$$ ##JCAMPDX= 5.01
$$ ##ORIGIN= Bruker BioSpin GmbH
$$ ##OWNER= she
$$ F:/spectra/data/she/nmr/f19/1/pdata/1/auditp.txt
$$ ##AUDIT TRAIL=  $$ (NUMBER, WHEN, WHO, WHERE, WHAT)
(   1,<2019-04-10 14:29:05.54 +0400>,<she>,<DPX200>,
      <created by zg, POWCHK disabled, PULCHK disabled
       configuration hash MD5:
       00 E9 B6 7A A2 85 ED C7 34 08 36 98 17 FE 4E 26
       data hash MD5: 64K
       84 DD ED F6 45 42 31 F1 49 E7 EC 03 A6 63 C2 CC>)
(   2,<2019-04-10 14:29:11.56 +0400>,<she>,<DPX200>,
      <Start of raw data processing
       efp BC_mod = 2 LB = 1 FT_mod = 6 PKNL = 1 PHC0 = 931.1164 PHC1 = 622.1557 SI = 64K 
       data hash MD5: 64K
       29 6F D1 A0 59 9E B8 3E 4D 3E 59 9F FD F1 76 10>)
(   3,<2019-04-10 14:29:25.46 +0400>,<she>,<DPX200>,
      <pk PHC0 = -2.044937 PHC1 = 0 
       data hash MD5: 64K
       8B 92 4D 4D E5 AF 56 AE 04 F2 B3 9F AD 84 1D 66>)
(   4,<2019-04-10 14:29:28.75 +0400>,<she>,<DPX200>,
      <abs ABSG = 5 
       data hash MD5: 64K
       86 C8 E3 FC FF 08 DB C1 0B 21 8B DE 4B E0 94 58>)
$$ ##END=
$$ 
$$ hash MD5
$$ 78 D5 6C 24 53 95 04 9A CF D8 C4 5C 57 33 5F 8C
##$RELAX= 
##$RELAX= 
##$RELAX= 
##$RELAX= 
##$RELAX= 
##$RELAX= 
##$RELAX= 
##$RELAX= 
$$ Bruker specific parameters
$$ --------------------------
##$DU= <F:/spectra>
##$EXPNO= 1
##$NAME= <f19>
##$PROCNO= 1
##$TYPE= <nmr>
##$USER= <she>
##$AMP= (0..31)
100 100 100 100 100 100 100 100 100 100 100 100 100 100 100 100 100 100 
100 100 100 100 100 100 100 100 100 100 100 100 100 100 
##$AQSEQ= 0
##$AQ_mod= 1
##$AUNM= <au_zg>
##$AUTOPOS= <>
##$BF1= 188.310428
##$BF2= 200.13
##$BF3= 200.13
##$BF4= 200.13
##$BF5= 200.13
##$BF6= 200.13
##$BF7= 200.13
##$BF8= 200.13
##$BYTORDA= 1
##$CFDGTYP= 0
##$CFRGTYP= 5
##$CHEMSTR= <none>
##$CNST= (0..31)
1 1 145 1 1 1 1 1 1 1 1 1 1 1 1 1 1 1 1 1 1 1 1 1 1 1 1 1 1 1 1 1 
##$CPDPRG= <>
##$CPDPRG1= <>
##$CPDPRG2= <>
##$CPDPRG3= <>
##$CPDPRG4= <mlev>
##$CPDPRG5= <mlev>
##$CPDPRG6= <mlev>
##$CPDPRG7= <mlev>
##$CPDPRG8= <mlev>
##$CPDPRGB= <>
##$CPDPRGT= <>
##$D= (0..31)
0 1.3 0 0 0 0 0 0 0 0 0 0 0.25 0 0 0 0 0 0 0 0 0 0 0 0 0 0 0 0 0 0 0 
##$DATE= 1554892144
##$DBL= (0..7)
120 120 120 11 120 120 24 19 
##$DBP= (0..7)
150 150 150 150 150 150 150 150 
##$DBP07= 0
##$DBPNAM0= <>
##$DBPNAM1= <>
##$DBPNAM2= <>
##$DBPNAM3= <>
##$DBPNAM4= <>
$$ [...]
##$SUBNAM3= <"">
##$SUBNAM4= <"">
##$SUBNAM5= <"">
##$SUBNAM6= <"">
##$SUBNAM7= <"">
##$SUBNAM8= <"">
##$SUBNAM9= <"">
##$SW= 251.107818259711
##$SWIBOX= (0..15)
0 1 0 0 0 0 0 0 0 0 0 0 0 0 0 0 
##$SW_h= 47281.3238770686
##$TD= 65536
##$TD0= 1
##$TE= 0
##$TE2= 300
##$TE3= 300
##$TEG= 300
##$TL= (0..7)
0 120 53 12 22 120 120 120 
##$TP= (0..7)
150 150 150 150 150 150 150 150 
##$TP07= 0
##$TPNAME0= <>
##$TPNAME1= <>
##$TPNAME2= <>
##$TPNAME3= <>
##$TPNAME4= <>
##$TPNAME5= <>
##$TPNAME6= <>
##$TPNAME7= <>
##$TPOAL= (0..7)
0.5 0.5 0.5 0.5 0.5 0.5 0.5 0.5 
##$TPOFFS= (0..7)
0 0 0 0 0 0 0 0 
##$TUNHIN= 0
##$TUNHOUT= 0
##$TUNXOUT= 0
##$USERA1= <user>
##$USERA2= <user>
##$USERA3= <user>
##$USERA4= <user>
##$USERA5= <user>
##$V9= 5
##$VALIST= <valist>
##$VCLIST= <CCCCCCCCCCCCCCC>
##$VD= 0
##$VDLIST= <DDDDDDDDDDDDDDD>
##$VPLIST= <PPPPPPPPPPPPPPP>
##$VTLIST= <TTTTTTTTTTTTTTT>
##$WBST= 1024
##$WBSW= 4
##$XGAIN= (0..3)
0 0 0 0 
##$XL= 0
##$YL= 0
##$YMAX_a= 98735
##$YMIN_a= -82238
##$ZGOPTNS= <>
##$ZL1= 120
##$ZL2= 120
##$ZL3= 120
##$ZL4= 120
##$ABSF1= 101.2514
##$ABSF2= -149.8503
##$ABSG= 5
##$ABSL= 3
##$ALPHA= 0
##$AQORDER= 0
##$ASSFAC= 0
##$ASSFACI= 0
##$ASSFACX= 0
##$ASSWID= 0
##$AUNMP= <proc_1d>
##$AZFE= 0.1
##$AZFW= 5
##$BCFW= 0
##$BC_mod= 2
##$BYTORDP= 0
##$COROFFS= 0
##$CY= -3
##$DATMOD= 1
##$DC= 0
##$DFILT= <>
##$DTYPP= 0
##$F1P= 0
##$F2P= 0
##$FCOR= 0.5
##$FTSIZE= 65536
##$FT_mod= 6
##$GAMMA= 0
##$GB= 0
##$INTBC= 1
##$INTSCL= 8.653935e-10
##$ISEN= 128
##$LB= 1
##$LEV0= 0
##$LPBIN= 0
##$MAXI= 10000
##$MC2= 0
##$MEAN= 0
##$ME_mod= 0
##$MI= 0.4277144
##$NCOEF= 0
##$NC_proc= -1
##$NLEV= 6
##$NOISF1= -61.99997
##$NOISF2= -62.99997
##$NSP= 0
##$NTH_PI= 0
##$NZP= 0
##$OFFSET= 101.2514
##$PC= 1
##$PHC0= 929.0715
##$PHC1= 622.1557
##$PH_mod= 1
##$PKNL= yes
##$PPARMOD= 0
##$PSCAL= 0
##$PSIGN= 0
##$REVERSE= no
##$SF= 188.29550247311
##$SI= 65536
##$SIGF1= -61
##$SIGF2= -65
##$SINO= 3.502647
##$SIOLD= 65536
##$SREGLST= <1H.CDCl3>
##$SSB= 0
##$STSI= 65536
##$STSR= 0
##$SW_p= 47281.3238770685
##$SYMM= 0
##$S_DEV= 0
##$TDeff= 65536
##$TDoff= 0
##$TI= <>
##$TILT= no
##$TM1= 0
##$TM2= 0
##$TOPLEV= 0
##$USERP1= <user>
##$USERP2= <user>
##$USERP3= <user>
##$USERP4= <user>
##$USERP5= <user>
##$WDW= 1
##$XDIM= 65536
##$YMAX_p= 427881757
##$YMIN_p= -333653
$$ End of Bruker specific parameters
$$ ---------------------------------
##NTUPLES= NMR SPECTRUM
##VAR_NAME=  FREQUENCY,     SPECTRUM/REAL,   SPECTRUM/IMAG
##SYMBOL=    X,             R,               I
##VAR_TYPE=  INDEPENDENT,   DEPENDENT,       DEPENDENT
##VAR_FORM=  AFFN,          ASDF,            ASDF
##VAR_DIM=   65536,         65536,           65536
##UNITS=     HZ,            ARBITRARY UNITS, ARBITRARY UNITS
##FACTOR=    0.721466756344984, 1,           1
##FIRST=     19065.1839562469, 0,            0
##LAST=      -28216.1399208216, 0,           0
##MIN=       -28216.1399208216, -333653,     0
##MAX=       19065.1839562469, 427881757,    0
$$ Real data points
##PAGE= N=1
##DATA TABLE= (X++(R..R)), XYDATA
$$ [...]
50851 -68041 -97710 -27897 -5978 -18610 -11747 5665 19625 22015 33132 4790 37642 25994
50839 25994 43664 52032 65844 43822 -17685 16172 -7207 -6699 -20033 -7930 18854 15731
50827 15731 -21183 -15155 -40275 -6586 4065 40922 5773 -25753 -1647 30187 63642 36941
50815 36941 -13728 22255 42778 31523 -8898 -23908 -7592 -27450 -36939 -24376 -35029 -47669
50803 -47669 -20231 -4892 2259 -4495 61850 50008 16371 -99281 -93418 -34857 18627 20237
50791 20237 7280 43871 35536 12236 -4765 50769 77022 38946 4329 21646 -81 -27635
50779 -27635 -10602 -39091 -50107 -9101 -8958 -10121 -6604 -4501 3570 -13684 -12713 -19486 -6949
50766 -6949 12314 -15739 3024 30700 8308 -38351 -53776 4479 36878 -9041 9352 29957
50754 29957 28554 36299 26808 16964 18376 75005 33817 16872 16985 40940 33008 -16457 -2292
50741 -2292 -48590 -31594 24429 57335 71765 18428 6621 21724 7263 -15935 -37994 -64842
50729 -64842 -97410 -37890 -9708 -31109 15502 -8964 -12242 -39820 6144 34092 34475 41062
50717 41062 35357 26130 29534 17034 3767 -10264 -220 994 -27378 -22987 -12231 -8780 24868
50704 24868 15375 -12926 -37453 -27873 -16982 -40779 -16283 -15033 -32038 -3967 -38477 -30210
50692 -30210 13178 -252 44486 22885 -20170 -4386 -22427 -38740 40398 38112 84234 87400
50680 87400 55756 -7326 -5782 -7001 -29060 -16169 -2928 3544 33116 1311 9007 -17789
50668 -17789 -24131 -20086 -29720 -27364 -43616 1515 85 4440 2169 -10388 9116 -3384 14034
50655 14034 36894 102240 85332 15950 3451 -52508 -24712 -4689 -32501 979 365 -8027
50643 -8027 12349 -11173 -31563 -17666 14692 -2566 -30698 -34927 15468 -13376 -33712 -21369
50631 -21369 -20820 -11196 -42724 -33467 6476 19337 19994 39406 57605 18091 -51830 -76250 -65109
50618 -65109 -25009 -34353 -12324 -3288 -46774 -34864 -42144 -6169 -18657 4362 31374 25141
50606 25141 -2520 4167 15807 25662 9937 26355 9588 -14120 4784 -5887 20142 51541
50594 51541 34400 58890 7796 13133 7862 47634 6807 -24513 -7037 -58811 -61241 -46206
50582 -46206 -11922 -9462 10906 -41972 -56256 9131 2415 -2589 -12931 -10731 6303 -3600 -9005
50569 -9005 20922 30544 10281 -32454 -13818 20020 17261 -5510 -15122 -53637 -44394 -23517 -7987
50556 -7987 2912 4110 40700 21018 52085 39643 26459 25609 22901 65337 75311 117638 98767
50543 98767 38236 -8136 -24409 -3139 -43172 -31515 26679 17377 -17997 -61238 -85538 -29706
50531 -29706 -10748 -29454 -22294 -2980 9629 52818 40134 8461 45452 67297 38168 -12062
50519 -12062 -58444 -29653 -4184 26759 41658 65726 23316 18202 59945 45573 67070 35518
50507 35518 -26658 -3590 53479 29182 -24514 -8387 17855 42710 -31919 -63784 -73819 -64749
50495 -64749 -24207 18093 -32880 -29417 -14627 -7287 -190 -40985 -47759 -54960 -48643 -18668 29649
50482 29649 -13491 -9430 1849 -27417 -25151 -17061 -38570 -5823 27279 27883 4944 49835 31123
50469 31123 16269 45641 31997 -44858 -32037 -19140 -190 32874 2650 -1967 33324 38648
50457 38648 37114 5264 -44744 21265 54495 10952 18266 -38214 -25541 45674 -1550 -60465
50445 -60465 -7823 31205 12992 16897 2558 -35150 7841 27070 52350 75700 53787 25753
50433 25753 35600 -3929 43146 61176 20684 -1875 24334 51467 40386 19273 -12532 -7526
50421 -7526 25985 45998 42352 7028 -15691 2132 -4959 -60227 -28180 -6838 29848 65792
50409 65792 41518 -7860 15202 2114 52797 63370 -16824 -21911 -32808 -921 13517 -24252
50397 -24252 9528 80917 76902 -1606 12553 -3567 -4881 40967 51351 77364 78838 45405
50385 45405 49643 37405 -11901 -39635 -10041 63365 27150 39987 7004 -11666 -7571 -21288
50373 -21288 -37821 6700 17693 6885 55809 66381 55638 43389 -4872 -29492 -43369 -52302
50361 -52302 -25746 14552 27013 17393 -14845 -74698 -102289 -93358 -50776 -45193 -87607 -99648
50349 -99648 -49877 -46650 -22597 -440 15672 9771 -11775 -37550 -51029 -30167 -2140 -11125
50337 -11125 7321 2289 42503 59114 29164 -36087 -74048 -93970 -109621 -57384 11517 -3381
50325 -3381 26070 8158 -29268 -16750 -10592 -12852 -71963 -104324 -124601 -93922 -82623 -82672 -41477
50312 -41477 -26575 -2765 5252 -40714 -9785 -32613 -48847 -51097 -45015 -70401 -56174 -20296
50300 -20296 -19529 -15864 -10955 -40116 -64416 -7068 23530 -1418 -57967 -56826 -56780 -56938 -40132 -35058
50286 -35058 10420 -42887 -40224 26239 18150 28154 37097 37446 63439 -12071 -45514 -37192 -34587
50273 -34587 -43417 -33068 -12922 2470 51477 48771 35622 20556 -5829 36259 5549 -14458
50261 -14458 41822 -62 4704 -21400 -23307 -9759 -6547 -9618 -33280 -3830 8341 -32184
50249 -32184 -100551 -93504 -70061 23811 -7315 17750 -26400 -15221 2702 -9995 -28180 -5654
50237 -5654 31319 -25895 -62634 -35549 -25523 9841 12990 -35699 -105739 -71674 -21530 -6239
50225 -6239 20250 66688 46728 12132 -18940 -14982 8160 24862 14932 35658 33407 12696
50213 12696 7079 -40016 27942 19686 -45647 -40984 -29674 -31003 -6836 2110 -28912 -51346 -14936
50200 -14936 -53046 -30122 -38172 -36956 -28156 -19187 5388 183 4218 16588 -6074 -21993 -11621
50187 -11621 -26614 -6435 26950 19397 -10779 -27580 -5100 45273 26258 -13099 -41718 -6243
50175 -6243 50547 13731 -68528 -16061 22006 29923 -1158 19826 -9696 -60035 -33200 5104
50163 5104 -13122 -14540 37729 -5050 -12888 -2881 -455 -16066 -27008 2669 30396 -47019
50151 -47019 -56005 -39372 -64256 -70974 -12919 8089 27387 11901 39467 9035 421 -8473
50139 -8473 10285 16240 -3722 -27118 -49116 -4546 24088 -5540 308 5505 -12364 -54864
50127 -54864 -40332 15379 -7822 -8682 -21418 -28441 8186 -2285 16511 91997 64387 -19542
50115 -19542 -33980 -32864 -6228 -11617 -12173 31509 -17243 4948 6945 -19685 -26511 -76903 -50791
50102 -50791 -69550 -42306 -54535 -58295 -19808 51055 51978 1592 25364 85105 63998 85840
50090 85840 69264 66078 35601 26274 34183 21947 -19752 -7236 10416 -26681 -3743 24046
50078 24046 15361 24338 44189 383 -38049 753 7636 -6680 -5908 -23919 -61686 -73617 -1331
50065 -1331 10062 12278 -583 19277 23439 5695 -53417 -105649 -100166 -77114 -25649 25997
50053 25997 29668 -26988 -41997 9516 11665 -13571 23610 109098 93152 24059 -13717 -43060
50041 -43060 -8156 -2453 4054 7824 48288 18769 -22420 -6416 -5603 -8862 -64379 -26461 -8043
50028 -8043 -18724 25240 58742 38349 4495 19223 31696 -6143 -910 -156 -82434 -105522
50016 -105522 -42820 -42098 -39114 -34028 24535 36770 36696 19638 26438 -8316 -5651 -12831 5876
50003 5876 21669 47409 29821 27075 8115 -26402 -38986 -20020 -17 -6847 -34506 -22020
49991 -22020 -41880 -38308 -40308 -46273 -53869 -20984 -7291 -30728 -7814 -13944 -6613 2433 -13143
49978 -13143 9387 15596 55677 22065 4163 -56259 -28748 12223 36787 8839 -35936 9232
49966 9232 -13567 -41051 -52312 -30348 -2801 -16836 -46842 -14466 -17330 -14987 20896 7820
49954 7820 -4650 5173 -24880 -43093 -45656 -50752 -16327 -13887 -28595 -6869 -14695 -7366 -9067
49941 -9067 -36232 -49536 -44303 -26374 2280 -8360 -44435 -27244 -18026 -74237 -100321 -22983
49929 -22983 -25170 -64984 -75801 -49192 -54110 -12104 -23344 2659 -20579 9885 -16506 -52929
49917 -52929 -17221 -71154 -78353 -49342 -35493 -34030 24710 20620 -5653 -768 33192 21735
49905 21735 -22462 -24869 14161 16365 -4323 32154 11671 525 -27478 -5244 26975 11099
49893 11099 10988 23972 22098 7325 -3535 5155 67094 50986 18123 -4902 26152 86191
49881 86191 77682 49120 68424 24419 -11998 1662 39303 38818 3065 7945 41149 19521
49869 19521 990 -16750 -28658 -31379 7514 49967 52455 -4227 -2794 -49408 -13958 56526
49857 56526 39674 26530 -16787 -28491 -41598 -13102 28063 22398 11925 -27717 -41417 -58293
49845 -58293 -39008 -50229 -66946 -42658 -59103 -55126 -35095 -71110 -24450 32963 -1109 -24161
49833 -24161 18284 27816 -9987 -67922 -45797 -2446 32964 32526 16975 9943 -3011 -6848 7202
49820 7202 -13323 32542 46235 -15814 -20483 -38394 -48650 -40385 -47227 -58537 -45527 -46831 -21666
49807 -21666 18148 85076 76014 76130 62313 20187 22337 4513 -14459 4017 21209 20057 16110
49794 16110 -31521 -39438 -75191 -58854 -42667 -23758 5858 -30864 -61365 -59455 -39593 -51337
49782 -51337 -2906 49649 -3342 17426 13688 -18777 -40004 -18850 20230 7737 -10946 2524
49770 2524 -21753 -56518 -48316 16779 5174 14991 -18036 -62621 -32739 -23121 -6403 -41351
49758 -41351 -39296 22437 -4420 16493 38005 40329 26007 48786 21308 14740 18149 5756
49746 5756 17136 142 -40369 -39240 -12695 2728 -17430 -8579 4790 -5253 -60656 -64456
49734 -64456 -48600 -38800 16161 -12886 -60803 -51170 -13410 -667 -6154 -24689 -589 1924
49722 1924 -16413 -46405 -21376 -4764 -34259 -35247 -11953 -17025 3922 -16184 -17904 10520 49683
49709 49683 42188 12107 -48620 -51123 -14566 3651 56160 20077 -38092 -22554 -18820 23241
49697 23241 28338 -24781 -6514 50543 28616 -35142 -24879 -5568 -27598 -43104 -18713 -17443
49685 -17443 -33780 -67212 25409 4084 5563 22900 20636 -17532 16331 -3197 2446 59870
49673 59870 -3502 -34826 41935 81336 37433 52982 25826 67216 16185 -15433 22449 49898
49661 49898 33709 70949 14333 -28871 -35925 -19144 -22282 -45661 -29797 -54207 -73629 -28643
49649 -28643 -27011 16126 24670 33664 2498 -26760 -59141 -104647 -94225 -42081 -49252 -57328 -14201
49636 -14201 35290 -14205 7457 27949 -17584 -54509 -73980 -25074 -22991 -26858 14281 -15203
49624 -15203 -42013 1279 45105 -11426 -5151 8155 22176 17262 -11518 -39153 -62359 -25490
49612 -25490 26368 -11622 21676 53767 15823 -48008 -34329 24778 34397 83580 74480 -497
49600 -497 19469 62985 31141 -6209 -15802 -47627 -81829 -74718 -28734 6114 33771 14779
49588 14779 -8972 -59636 -69269 -21134 12475 17227 -58915 -77819 -22594 12822 18907 -9861
49576 -9861 4450 -12139 -53825 -67429 -53634 -38495 6407 -17739 1765 4828 12985 4850
49564 4850 -38433 17299 -23383 -45594 -25368 -48344 -49324 -38516 -27800 -15676 -37731 -2792
49552 -2792 24169 9870 -1485 50425 70003 47721 13987 29254 70022 76996 52033 12741
49540 12741 -24392 -41528 -66644 -29400 9507 -35927 -20178 26120 49519 -16916 -39317 -12508
49528 -12508 -27425 -24967 -23310 -38563 -43091 -7655 57187 50385 28637 20320 44483 8969 -36194
49515 -36194 -13920 17728 -31996 33922 22391 -25874 -52164 -4576 -9114 -39521 -6133 -11973
49503 -11973 -8740 5646 -13417 -18643 241 -7110 -20763 -11571 15964 34440 7511 2299 -26129
49490 -26129 -20223 -12632 4748 23268 -10681 1583 -28940 -18890 32141 40720 -41818 -51644
49478 -51644 -19158 -25878 18192 45892 20159 25859 55030 65823 78382 54202 53234 58746 44096
49465 44096 30431 12240 39250 10098 27097 47666 15584 -1360 32427 80259 33649 608
49453 608 57067 -11911 -51473 -27822 60972 32571 21811 5696 10356 22360 15883 18583 28309
49440 28309 51614 24464 6743 16719 7918 -30790 -18838 15969 37000 -2612 -21846 -17597
49428 -17597 5599 8689 -20540 -33724 6881 15441 -41636 -121431 -108586 -67486 -91049 -43161
49416 -43161 -50648 -55027 -68084 -40451 -33526 -6261 41486 18896 -18705 -25862 -14227 -3136
49404 -3136 23461 -23315 -335 7543 13662 50264 1328 10981 37704 9662 -15592 -12810 -7055
49391 -7055 30153 10716 -11247 -60301 -78147 -50883 -41219 -24426 -76228 -78710 -72740 -17732
49379 -17732 -11142 13468 -11929 -50618 -20621 -6966 36142 33737 30995 30655 -1776 -7920 -22451
49366 -22451 -25245 -13741 13428 33796 21140 -55638 -53602 9540 3218 23950 66166 70401
49354 70401 5542 13645 22914 69757 40176 48401 5097 18142 20942 -76158 -34868 -39691 -58530
49341 -58530 -3947 14035 241 -14659 -9432 -58357 -34794 -54103 -43953 -43676 -65610 -38215
49329 -38215 -38640 -25709 -8631 -31502 9973 55882 75246 1651 -41101 -51928 -86977 -59255
49317 -59255 -1886 26151 70155 62667 58838 38006 17172 2136 -10871 13033 23420 247
49305 247 -20895 -17938 -4340 -6458 -36708 -76978 -77505 -14881 -30538 -61557 -50266 -34276 -66675
49292 -66675 -11556 66609 50699 34301 2944 -12216 -27035 -20782 -40607 -7929 -6695 7774
49280 7774 -7974 -15946 12455 1266 -34933 -41287 -27661 -12863 -63900 -51316 -20880 -37186
49268 -37186 -45286 -51490 -21827 -32604 -2869 -12036 -53184 -66964 -79858 -43336 3989 30534
49256 30534 -5137 -1099 -24752 9760 59240 5538 -12524 35325 37185 -41480 1609 27424
49244 27424 35402 -20239 -7915 -1894 -1345 -51897 3993 33306 27475 -7079 -8982 -33257 -51794
49231 -51794 -62215 -39923 -33997 -29909 -34055 -43524 -33604 -58975 -33349 -40389 -32924 -22188 -24329
49218 -24329 -17677 32656 20511 27888 -28942 -47054 -7941 -32985 -25249 -26794 -35036 22050 45006
49205 45006 11630 8882 56659 47848 49555 -24904 -23603 -35873 -68722 -46742 -27186 -35098 -41784
49192 -41784 -22222 -26715 -71409 -65661 -73120 -68796 -36779 -39192 -65090 -47213 -9719 -22896 -20301
49179 -20301 -30627 -53493 -30515 2532 24323 -11379 4594 -187 2254 22639 18846 -14098
49167 -14098 13258 -10443 2766 -28368 -85840 -66318 -6943 34803 23646 41833 42730 -16026
49155 -16026 -26809 -12842 -1015 5355 -13720 -58009 -72599 -50699 -57900 -7578 -6454 -53930
49143 -53930 -19632 -30083 -57662 -51723 -7838 -24251 -25381 -26952 -41946 -34390 -54695 -25796
49131 -25796 -10703 -5428 -15115 -25265 -18337 -36610 -12877 -42521 -39659 29196 49619 -1289
49119 -1289 -22581 26444 56864 17813 -39196 -48602 -57574 -24999 -25359 -9918 -13959 -78478 -48120
49106 -48120 -13550 36351 70480 6276 -60158 -66146 -38553 4140 -11953 -21357 -27034 -4843
49094 -4843 -26525 -5446 -15183 -21480 -40520 -39973 -33965 -25719 -18267 -7601 18000 4529 -18773
49081 -18773 -29918 -27784 -39276 -636 41038 31420 40921 18083 -33242 -21600 -17893 -61156
49069 -61156 -70531 -55232 -61333 -41763 -31571 -16592 23398 35498 -13876 -8547 -9729 -39941
49057 -39941 -28725 -960 -21418 -32227 -42919 -54181 -12544 -21106 -25177 -10043 24811 9572
49045 9572 24861 37320 50849 82784 49729 55463 50503 39126 29010 -64696 -114873 -104394
49033 -104394 -95579 -18030 -12646 -29286 -22369 -30216 -61050 -47620 -51300 -21576 24770 58747
49021 58747 47676 58642 4282 -1082 -6534 14701 -5528 -18611 -39276 -52540 -50704 -33223
49009 -33223 12612 24469 13649 12938 13221 1670 -28194 -10385 -27207 -56427 -48206 -58780 -6462
48996 -6462 49646 29099 -47666 -34547 -34818 -67457 -62115 -51475 -39254 -67477 -73441 -40572 -40708
48983 -40708 -18129 -46722 -73977 -20318 -38510 -8883 -12044 -18895 -12603 14207 -27533 24504
48971 24504 64448 14718 48460 37827 18892 -19800 -57085 -39235 -9611 -2411 28580 -28725
48959 -28725 -2573 18858 19296 22939 13048 20939 -9247 6267 26993 61450 -2847 -59130 -74448
48946 -74448 -61373 2806 -27523 -49915 -36774 -29501 -19194 11823 9493 19135 21936 12184 764
48933 764 -27144 33498 -628 -12292 -28220 -59010 -6558 31504 14595 -21526 -27433 -41556
48921 -41556 -60936 -60662 -50650 -30515 -8660 -13874 40224 56465 14134 46772 51229 20736
48909 20736 34948 71438 62494 20182 10411 -26690 -11332 10716 -21191 -24636 -46703 -13505
48897 -13505 6712 34431 35803 16560 -2907 -40157 -67305 -26364 -54933 -16767 12476 -7588
48885 -7588 -87040 -129356 -108154 -74288 -89072 -67039 -63025 -28513 -13563 -44157 -15115 782
48873 782 -14113 12210 6390 21050 -22835 1607 -22944 -47719 -82081 -56072 -7851 41621
48861 41621 32553 29002 23546 6501 33323 24130 33926 23342 -21810 -8942 19424 4292 -16532
48848 -16532 31056 11334 14631 25503 36131 47066 11039 -15519 12538 45325 34280 52737
48836 52737 -12903 1613 -26676 -23543 -10020 -47701 -25312 -3369 -26376 4066 15002 -2180
48824 -2180 -21814 -17799 -9780 -19593 -59202 -45092 -18188 -80458 -60167 -72447 -72880 -48774 -43388
48811 -43388 -26753 6676 22810 49226 4814 -54234 13336 -4805 -68081 -61264 -51682 -51150
48799 -51150 -27670 19300 -20418 -33652 37162 6491 36403 76473 15550 7893 -22937 -44600
48787 -44600 -14667 -51393 -55404 -71371 -14300 34910 47994 -27028 -94691 -52094 -51090 -70319
48775 -70319 -71615 -39022 -15510 -2235 16484 9073 13165 -30848 -69905 -45950 -2567 -10424
48763 -10424 -6075 -2028 33409 54662 68853 86865 60292 34927 30547 42293 40655 28296
48751 28296 29668 28932 26317 9116 54255 78385 43770 2763 -38542 -55269 20132 4276
48739 4276 -42386 -26191 -23969 -24727 -19177 26641 32291 -23065 -24036 -51965 -47179 10603 -10305
48726 -10305 -19864 -23865 9256 -6373 -60344 -64649 -57229 -56237 9270 24950 14613 22620 9804
48713 9804 -6136 19204 -10901 -6619 -41 -6910 21070 7373 -41472 -33783 -923 -23622 -65496
48700 -65496 -58236 -51157 -49713 -68895 -28884 -48902 -71631 -3391 -10910 -65364 -6918 -428 -6556
48687 -6556 -15491 -2283 49170 48309 56423 48012 12238 -23411 -7388 -13361 -2729 428 -34059
48674 -34059 15943 14453 -12643 -20910 -53099 -31756 -17061 -19989 -7622 -3062 -45708 -50323 -34295
48661 -34295 -8455 -22422 -19558 -12310 -22283 -52190 -45517 -3621 -32244 -31297 -38576 -8157 -9943
48648 -9943 10785 -2775 6898 -56916 -32474 -8236 -9731 3563 25520 17337 -8672 -72317
48636 -72317 -92236 -48785 -44599 3373 25783 7241 -10053 -38747 -17640 13497 -16539 -26182
48624 -26182 -12401 -31637 -38358 -50416 -58257 -38593 4132 23679 -68600 -85741 -31986 -35204
48612 -35204 -62913 -94987 -65433 -8185 -48381 -46791 -45115 -60181 -68300 -65988 -65807 -42102 -20582
48599 -20582 -39646 -42669 -47451 10377 19107 12040 -31382 -53074 -51602 -27481 -23629 -22191 2236
48586 2236 -10608 4597 33141 22645 26821 30876 44239 23864 -35905 -57508 -56897 -40440 -23523
48573 -23523 -7950 -5224 -28790 -24802 2474 -2656 -2882 -8318 -11629 -38291 -11221 70731 101287
48560 101287 41866 -34797 -51034 -42689 -59413 -61746 -51353 -38632 -15923 18 -21961 -96042
48548 -96042 -92897 -79492 -48253 -24557 -25718 -21560 -18530 -7696 -2310 -51116 -12207 78390 38087
48535 38087 -48520 -11348 -13210 -36681 44592 70621 47062 -46189 -14767 8105 -10172 3046
48523 3046 -5982 -3771 -35510 -32212 -32027 -45782 -2966 35055 14799 6630 -11695 -8792 -12803
48510 -12803 -42994 -68411 -91632 -39242 -49606 -35421 -32224 1652 9557 14447 12228 -5741
48498 -5741 -42831 -43590 -540 4441 -33741 -41387 37343 79571 41800 33176 47530 43298 17017
48485 17017 20286 -6375 -8140 28921 12788 -43368 -61254 -22710 -6141 -21152 12234 29578
48473 29578 2195 8082 -56850 -35737 -32873 -35196 -50809 -40394 -12676 -13889 -12954 -18767 -23067
48460 -23067 -36508 -14151 18514 20156 -33697 -6581 -14517 -36808 -5869 -2088 -41955 -18867
48448 -18867 -57210 -41742 -5905 18373 10178 -14916 -17573 -21511 -25578 -54771 -22745 -9427
48436 -9427 -38496 -23377 -19047 -57343 -87373 -97403 -101612 -81533 -21072 -5664 -33533 -21714
48424 -21714 -16483 -2072 -14391 -9611 -12756 19671 58667 34897 -12344 -41248 -75063 -69151
48412 -69151 -44131 8875 -7289 -68127 -89003 -45325 -29789 -7342 -15658 -5352 -3293 -13596
48400 -13596 -30489 -7782 29431 6277 35699 52901 45296 59282 30891 -24818 -56227 -22474
48388 -22474 14618 18298 21017 25556 6100 41442 55823 56804 37396 40921 44421 29098 -20702
48375 -20702 -33038 -5391 23856 13259 -38429 -41261 -39508 -26167 -43736 -77580 -74532 -35814
48363 -35814 -176 -34308 -13024 -36855 -49662 -60405 2729 4818 -62818 -43016 -33626 -37113
48351 -37113 7368 46782 49025 -968 -46680 -35828 -15987 -15047 -43284 -36746 -33339 -21346 4588
48338 4588 -2584 1483 -17009 -42384 -50552 -77477 -50959 -34570 -28479 -7171 4741 32863 55411
48325 55411 11409 50694 45779 4965 28203 10565 30567 61970 55645 62332 37569 -9921
48313 -9921 -5561 -25992 7354 10429 -1955 10742 -45442 24781 -4985 4260 735 10563 -20648
48300 -20648 -58715 -32529 -26059 7089 -33271 -18574 14418 31850 25652 -23217 -5134 16231
48288 16231 1701 -22007 1698 27218 20208 30436 -2871 -5387 -26443 -24432 -34710 -31003
48276 -31003 -5325 25215 12737 48430 91566 127007 71522 1909 10883 11584 -2754 -56521
48264 -56521 -91865 -126328 -98389 -66185 -25070 23513 -10311 13569 -18282 -48188 -19696 23832
48252 23832 36059 11387 12976 -16617 -39978 5705 -21290 -16616 -41219 -15615 -27785 -18049
48240 -18049 -14643 -191 10965 -11913 23078 45860 44408 11138 34937 -34378 -74610 -43213
48228 -43213 -68327 -12033 52810 39680 -4159 -18683 -19555 -30868 -42527 -68422 -8156 3801
48216 3801 13850 -9582 -59854 -10248 16996 41727 5664 -35878 -24224 -9949 -26614 -50073
48204 -50073 -34688 -31709 26684 76325 2396 -14871 42402 16630 -28288 -39071 -48541 -43547
48192 -43547 -24241 -15234 -56333 -39123 -31722 -74546 -14525 -33518 -74292 -51087 -50704 -72356
48180 -72356 -77780 -57807 -18528 35898 1473 -10022 13444 2506 -35946 -53057 -24174 -47569
48168 -47569 -31618 -8211 -33073 -34966 -49727 -36582 -25182 -58948 -47480 -71793 -54387 -48553
48156 -48553 -44834 -49140 -25334 1706 27567 47584 -4642 20780 -32587 -65346 -28465 26719
48144 26719 6794 -14788 -21851 -47339 -64270 -81487 -60639 -13982 -47652 -63653 -72756 -44018
48132 -44018 -27496 -27735 -17917 28104 53324 5351 -47385 -54552 -83093 -7868 21837 -36996
48120 -36996 -23676 10877 -10100 -47080 -28441 -17211 -23553 -40567 -36493 -57453 -39530 -25798
48108 -25798 -26670 -27103 7314 12041 3525 22735 31572 -15120 -10791 10841 -19600 -9842 14128
48095 14128 21988 56828 -4824 -29592 9762 -5521 -17461 -17351 -23632 6746 25603 26997 10608
48082 10608 -39751 -51621 -47531 -61829 -48075 -17893 -3434 3659 -31313 -56049 -24997 -54584
48070 -54584 -28798 -12227 -18859 -15403 -453 23674 -5339 27859 -2519 -18921 8995 -5393
48058 -5393 -51776 -30055 -7249 -7066 -21466 4282 6123 -2252 19147 25564 -22887 1380 24391
48045 24391 1383 1600 13847 12907 13417 -56135 -50926 -18950 7857 10238 -11960 -41070 -29599
48032 -29599 -13757 -13281 -32404 -26020 -23607 -33465 -75520 7494 1774 -6924 -42719 -80625 -93067
48019 -93067 -48609 18780 -653 -4850 -16867 27431 3571 -23966 -46164 -23572 -30647 -13501
48007 -13501 9204 28731 66975 124031 80443 35480 -653 5934 -13467 5883 -1974 -6462
47995 -6462 -15140 -21695 31230 -4735 10514 20015 21821 -42287 -76809 -62760 -5004 11213 14559
47982 14559 20786 2032 4246 1961 14250 -12047 -15948 -6929 -11451 25616 5786 8187 37381
47969 37381 8636 -69780 -69607 -25139 -42028 -58447 -41780 -1447 -1874 28316 4460 -3076 47456
47956 47456 91850 30721 -11760 -18094 -14741 -36836 -27036 -2980 -65709 -77848 -35100 -51131
47944 -51131 -80797 -63296 -17729 9583 -17126 -18352 -26207 -57641 -13581 19628 8987 5761
47932 5761 30058 -13080 -45513 -53629 498 19831 23545 -33890 -70656 -40371 -4485 11591
47920 11591 -44802 -39049 -22042 -15997 -4589 -12779 -71124 -87824 -71825 -66205 -48568 4538
47908 4538 19054 -19619 -39740 -79635 -41809 -20153 -19353 -9009 -24878 -78008 -106044 -91411
47896 -91411 -66297 -7661 -12648 -71200 -69875 -42031 1148 -1133 -406 -12575 11930 2465 16227
47883 16227 15149 23434 22177 -32603 -47644 -54067 -53148 -54369 -71750 -91791 -60871 -38236 -52795
47870 -52795 -12756 19600 -12655 -9153 -3832 36825 31234 -13813 15648 40589 10567 -33580
47858 -33580 -30272 -23383 -32954 -11432 8898 -17445 -28616 -21802 22275 -529 -17140 21142
47846 21142 16251 16360 -1763 -23053 5207 -625 -828 -31035 -39885 -9153 -93475 -90847 -51685
47833 -51685 -38072 -306 1837 -21717 -13154 -5983 5325 1957 1703 8761 -21764 -34572 12912
47820 12912 43447 -4617 10438 -24293 -67799 -69031 -10087 -7233 -46967 -48476 -34617 -16880
47808 -16880 -8158 -33833 -30617 -18210 -26630 -47166 -2061 -5175 -39458 36890 14004 -26563
47796 -26563 -12134 3910 11068 15005 -3648 -49491 -24239 -1602 -17531 -10316 11187 31516
47784 31516 8371 -11165 9380 10918 -19291 -34579 4183 55870 -1082 23167 49920 1945
47772 1945 -25531 -3738 4162 -37618 -19785 -1758 15534 -28426 -53011 -48969 -63977 -10884
47760 -10884 19662 6563 19670 10658 29300 44524 75218 111228 40708 25062 9167 27873
47748 27873 60314 44719 -582 -41321 -31452 -36532 -52640 -15368 28182 7185 6555 -41992
47736 -41992 -61949 -48779 -22201 290 -35976 -46553 11192 37331 7094 2914 -20280 -55972
47724 -55972 -51492 -6091 -27980 -16821 12668 32078 20097 -13244 49732 54570 17546 40089
47712 40089 44406 46110 25241 -9142 -21519 -53282 -54407 -74098 -64240 -25120 -13997 -56439
47700 -56439 -42018 -11036 -7031 10731 5496 3574 20194 34471 -33248 -29374 -31083 -36233 -44374
47687 -44374 -37031 844 -4254 36676 30006 -31318 10433 50498 4864 -20188 3971 -24165
47675 -24165 -56445 -46537 -51007 -63236 -30006 10660 42298 42786 28891 38368 52294 32996 16833
47662 16833 -20887 -43502 -29760 -95209 -45845 17489 6231 -38241 -1309 -1897 -13395 -13220
47650 -13220 -15303 -35892 -12315 11410 -4288 -19014 -39742 -12268 -22352 -37623 36278 35827
47638 35827 -13703 -80931 -84764 -54552 -45404 -2176 40198 -3756 -43784 -5348 4224 -25300
47626 -25300 -11572 17960 17811 -11471 6373 39187 15240 -8984 15963 -26703 -22633 -33249
47614 -33249 -3982 -30537 -61712 -62548 -31258 -39957 -42766 -70877 -72544 -64058 -23790 20746 59430
47601 59430 14611 -3873 -25273 -42613 -29120 -20272 -16253 -8290 -9238 -5274 27881 42879 20091
47588 20091 -81592 -76379 -56992 -47109 -13864 -27910 -66717 -65341 -43143 -19131 -7 -20976
47576 -20976 -43779 2330 62319 57371 5972 -37260 -18272 -14167 -74744 -47511 8366 -1758
47564 -1758 -20135 -13661 -19863 -34845 20106 -675 -22221 1050 50308 23423 41069 18461
47552 18461 -6870 19709 5595 46822 63867 30510 -7467 -42807 -5384 20327 62539 3350
47540 3350 -41695 9597 26526 -11563 -38695 -22982 5076 -12923 2479 -544 -20717 -98909
47528 -98909 -62580 -44503 -17480 -49718 -1835 97979 39227 9675 -24955 -84527 -85465 -39402
47516 -39402 -32007 -27777 11282 15021 -24638 -38721 -15487 -38152 -55613 -28947 -24062 -10642
47504 -10642 -19296 3745 -7436 3824 -26565 -3119 -2504 -547 8658 -31088 -55942 -53614 -72408
47491 -72408 -62915 3446 -20737 -26870 -21792 -15663 -28657 -27136 -41748 -92735 -36873 36411 38942
47478 38942 -6996 -64381 -15016 -2971 14817 -40142 -31865 -50692 -51140 -85686 -82952 -62724
47466 -62724 -41523 26310 60623 76552 27157 25905 -12914 -52540 -71146 -73222 -43750 -638
47454 -638 42476 35696 -10210 18207 -14682 -73367 -97372 -41130 -65230 -85822 -34351 -28226
47442 -28226 -43784 -28213 -48224 -28342 -43767 -79910 -63340 -14525 -20857 -48828 -63118 -58211
47430 -58211 -7863 -23680 -8284 14755 -19592 -74905 -71682 -26330 283 53213 91293 33221
47418 33221 36046 19752 -8693 -48152 -16277 13315 -10756 -42160 4838 51748 8059 -62041
47406 -62041 -9207 52745 12005 11367 48275 52075 -10186 -14471 -10815 7371 -40716 -114824 -69736
47393 -69736 -52115 -40300 -24140 -22346 1643 -20831 -35987 -49169 16987 -12663 -42704 -86829
47381 -86829 -74405 -47764 -92057 -58544 -45742 -47306 -24593 8395 33406 2647 -40067 -26607
47369 -26607 -46054 -36660 -16939 -16288 -19267 -7570 -28566 -38968 -37956 -78378 -44574 -29544 -55600
47356 -55600 -25695 3907 5656 45218 5676 -40898 -21733 -10583 -43790 -70073 -69563 -22067
47344 -22067 24269 8787 838 -27723 -11579 43812 -7045 -53526 -8233 29179 -1458 -35978
47332 -35978 11445 19040 35440 -3794 -35518 -16342 -61210 -77255 -31054 10224 -10391 14274
47320 14274 31978 20368 -31276 -27331 38115 7558 -2038 17981 -29283 27354 54605 8339
47308 8339 -1446 6863 -6573 -23168 -45626 -8888 9658 177 -320 11336 -44476 -54388 -10232
47295 -10232 -97 39594 88567 89473 70449 18544 -25303 4307 -6811 -57340 -51888 -19126
47283 -19126 -64813 -18515 26683 55190 28506 -4084 -28965 -26337 11145 -21239 -13005 -45230
47271 -45230 -14783 -36017 -21424 -34643 -6762 16548 -1361 -8338 -16757 29 -670 -42525
47259 -42525 -31868 29297 45417 38277 19124 11014 6352 -7255 -39537 -13100 29941 10252
47247 10252 3476 17862 79587 95247 37912 5052 -16670 -39259 -60005 -9628 -54466 -53026
47235 -53026 -26852 -27561 -103684 -61446 -20377 -64812 -77004 -51965 -48927 -79429 -78963 -35668 -74733
47222 -74733 -99259 -36098 -402 901 -27967 753 9551 9287 56114 35525 17365 -40997
47210 -40997 -95421 -94989 -112405 -2461 -7483 840 -15184 -2418 11217 -17380 -42665 -53841
47198 -53841 -53271 -8550 -5648 -3798 4544 10529 34248 3458 -2236 -10352 -11439 -20067 -53100 -64450
47184 -64450 -84963 -77748 -41210 -15833 -55510 -59362 -49002 -41271 -61192 2758 49147 17729
47172 17729 20176 28587 -36152 -28122 -43039 -83179 -62895 -51057 -91309 -42236 -15820 1688
47160 1688 9155 1057 -5502 -2675 -24510 -8789 -9762 27280 18975 -4141 1628 -15478 -11831 -29405
47146 -29405 9729 -8884 -21577 -15438 -12958 12170 32075 23628 -6301 -12828 36724 43629 29270
47133 29270 24647 -21404 -42471 -14162 -29793 -8124 -4867 -14262 9856 -21607 -52958 -44538
47121 -44538 13689 3279 -42330 -60122 -15395 -41768 -60641 -67845 -63945 -36787 -66503 -81506
47109 -81506 -63281 -40715 -57740 -86864 -78268 -76147 -111602 -116451 -82767 -11237 32916 56367
47097 56367 31337 7465 31943 -12143 -20363 39805 -2536 -1060 -5778 8069 18603 -6799
47085 -6799 -13978 -47972 -32530 5585 22316 -63413 -39269 -29029 23137 12320 13873 3702
47073 3702 -56569 -35697 -33366 6940 10086 -2995 -4958 -30126 7474 -26294 -45577 -63940
47061 -63940 -24211 -959 -4530 5463 2500 -45861 -68358 -60330 -70787 -51583 -52873 -53307 2060
47048 2060 8789 -29389 -72728 -72662 -98397 -112600 -80325 -31201 -31808 -69573 13576 108606 122171
47035 122171 89639 19412 57030 51675 -24566 -14571 -45953 -41497 -45938 -35905 -17720 -34687
47023 -34687 -30324 -41983 -9768 -9478 -14034 -16256 -35792 -60570 -67710 -45476 -19793 6159 18890
47010 18890 -4464 -41214 -18652 -59252 -47461 -63905 -69815 -36528 4091 49622 10976 9592
46998 9592 42674 8099 -27128 -55617 -30133 3857 5067 16041 11341 -5035 -1973 -10458 -19000
46985 -19000 -27490 -36348 -76269 -19169 -12064 -18479 -23250 -18683 -17277 -34228 14674 32820 7572
46972 7572 -39674 -43652 -39558 -56181 -66045 -53259 -32166 11903 -6729 -14249 24630 -1775 -62832
46959 -62832 -47643 -40390 -4870 -29313 -37123 -10443 -11122 -47427 -21719 -9969 -14279 -38680 -31518
46946 -31518 -71291 -114318 -106855 -89065 -80839 -58217 -9650 20660 15275 47088 38436 9260
46934 9260 -31617 -27810 3506 3806 -33497 -21631 -8630 -36784 -70465 -13720 28131 -5778
46922 -5778 -23937 4504 28091 24667 -447 -33682 -67667 -101147 -80322 -33505 -27968 7610
46910 7610 14689 -33948 -67717 -52692 -51184 -3395 -10319 -22019 -25574 812 12543 -4001 -3080
46897 -3080 5456 -52295 -57923 -38858 -25384 22577 20717 -26326 -29829 -22708 -7767 -41417 -84311
46884 -84311 -82855 -75309 -50900 -42416 -36520 -38712 -71841 -71227 -91899 -89594 -42368 29270 54610
46871 54610 25991 -28356 -10823 5766 -25894 -48726 -43518 -58019 -70054 -10493 -48642 -27673
46859 -27673 -26473 39136 53889 63120 51661 -6834 -57306 -66842 -62896 39435 4326 2646
46847 2646 -14081 2052 22653 52864 63263 46838 21838 -25028 4101 19836 -12289 -1918
46835 -1918 24748 -8459 -10292 -49679 -62892 -57456 -68195 -19814 -28398 -11631 23255 39622
46823 39622 -8645 -35380 -11183 -14532 1030 11217 -27659 -66393 -69401 -57267 -21172 -36174
46811 -36174 -70710 -41656 -18891 -25002 -43464 -55519 -34551 17283 18520 30386 2716 -18348
46799 -18348 15210 3971 27024 -1922 -24135 10983 52217 46495 16201 34154 21790 -17699
46787 -17699 -61939 -64312 -46473 -33095 -40788 -4537 -3690 -15389 -4703 -15739 -36106 -32257 -63278
46774 -63278 -88172 -45850 -10211 -73700 -93609 -57230 -18197 -1825 32742 -11798 -47000 5926
46762 5926 11689 -41449 -29592 21372 1409 -1790 34367 -309 -16477 -3166 -43224 -2438
46750 -2438 15187 -8768 -12052 -6772 11891 6935 -2883 1923 2636 6610 50204 73994 26584
46737 26584 4180 -19130 -29451 -17352 -50302 -115789 -107799 -98470 -86852 -37756 -31783 -11343
46725 -11343 -55864 -20489 6328 -16359 -23232 7912 55333 29460 -22167 5984 722 21952
46713 21952 33352 23334 5914 1893 -12557 -53616 -69960 -45086 -48099 -60489 -37264 -53197
46701 -53197 -72388 -23539 -24685 -73260 -30995 -12729 -21321 -31239 16012 44639 11473 -22388
46689 -22388 1706 52815 29292 5399 -39142 -60636 -6028 27855 39195 6909 -11459 44607
46677 44607 223 -15575 49589 1210 -69616 -70299 -57352 -28382 -17039 -50131 -31411 -612
46665 -612 25699 18359 -8211 2085 -40481 -21457 54616 69329 29157 6256 11404 57152
46653 57152 74692 74144 44281 16428 -43241 -44061 -55312 -59039 -16189 -7685 -14692 19825 77800
46640 77800 74191 15826 -15235 -8788 -18941 17890 21885 23151 13750 16916 57291 60469 11017
46627 11017 -18344 -40388 -37308 -21682 -23561 -71926 -70843 -40109 -70081 -53956 -11888 14159
46615 14159 41829 2666 -15967 -35904 16652 106519 107622 55049 5287 -33177 -22661 -27833
46603 -27833 9920 58830 13306 -1638 32871 49738 80469 46237 30969 4219 -26373 2791
46591 2791 9157 -18890 -57050 -46164 -18244 -41553 -33670 -42535 -69122 -63929 -88926 -130302 -119054
46578 -119054 -82384 -45132 14676 -9880 -48407 -43636 -82108 -49835 -80546 -55760 -25806 -6605
46566 -6605 -38316 -32092 -26312 -1946 -34338 -18586 -11966 4854 -11326 950 41456 27853
46554 27853 -4678 24751 -3834 -35196 -25511 -41337 -30056 -59077 -69365 -28483 -26073 -30559
46542 -30559 24343 16885 -3169 -43816 -48649 -62554 -15384 35236 39573 -9692 -15469 -88768
46530 -88768 -67260 -46710 -47572 -75973 -102214 -101259 -94944 -58473 -63439 -79270 -39261 -16266 -20182
46517 -20182 11217 38309 23498 -11395 2587 30848 20925 5490 20467 -32112 97 17599
46505 17599 4399 -23785 -67374 4903 57550 45553 61630 28457 3124 -30389 -36916 -840
46493 -840 -10128 -15394 -30318 -34568 -99961 -83534 -42044 -16439 36342 33115 29798 3353 3525
46480 3525 -3254 -36020 -23764 11126 18456 19980 -6762 -41583 -53291 -59221 -72892 -87750 -6183
46467 -6183 17899 -24137 -29510 -37413 -26190 23152 19271 -5350 -24743 -4055 -42086 -35954 -44879
46454 -44879 -61402 -38289 -27920 -4473 9056 34648 83061 63230 19666 -40662 -5125 11299
46442 11299 20525 -6610 -41748 -5421 31220 -16361 -40981 -68085 -56177 -14696 11220 25770
46430 25770 50929 39399 22663 738 -38909 6811 5309 -31378 -28535 526 -26041 -35769
46418 -35769 -49380 -75379 -33675 -16999 -52336 -66824 -58315 -56425 -56239 -27954 -44523 -23877
46406 -23877 11459 -5912 -27499 -23211 -56785 -22407 -15148 -3337 14911 -21655 -74913 -111112
46394 -111112 -101490 -62652 -56957 -34002 -57974 -10588 -4226 18636 26493 -19548 -316 61878
46382 61878 49343 4616 31368 -9255 -12260 28397 19740 -5219 -24896 -52135 -64222 -52046
46370 -52046 -36980 7491 -20808 -47012 -18930 -33630 -49142 -73172 -86868 -37497 4845 51197
46358 51197 44619 -6231 -40136 -94677 -70947 -69890 -57028 -14214 85 12815 -4935 6526
46346 6526 64284 32837 140 10800 14679 9312 21216 27137 -6968 -8944 -51632 -95320 -87661
46333 -87661 -67541 -52492 -84790 -83865 -71065 -89093 -69424 -64411 -68486 -62901 -29288 -10932 -16085
46320 -16085 -77570 -99747 -98053 -86066 -54462 -45339 -3099 -4730 -25290 4665 -6865 -10568
46308 -10568 15244 -490 11009 40366 27638 6581 -6264 -8329 -24344 -4725 7615 -1911
46296 -1911 15360 -19478 -75076 -120540 -65301 -6278 -19261 -12689 -53753 -101420 -29682 -13430
46284 -13430 -11834 11370 63886 22362 38255 90026 105580 13861 -26031 -29326 -23874 -10444
46272 -10444 -13561 -7864 -10096 -22906 -18138 -74675 -60166 -12769 -24934 -66732 -45912 -6186
46260 -6186 6562 -45773 -73850 -61093 -40611 -40587 -22821 -28627 -38502 -48756 -82563 -99070 -47339
46247 -47339 -35389 -16132 -32999 -69070 -109736 -48075 -41081 -23372 -41009 -66354 -29431 -39765
46235 -39765 -103218 -86242 -40548 -27760 -57466 -27456 19623 -52245 -44548 -10999 -12835 -8250
46223 -8250 -37581 -58934 -40440 -48328 11031 -50074 -46186 -20678 -11454 -37610 -19360 -30166
46211 -30166 -22018 -4323 -29333 -29610 -26846 -47806 41594 76175 10764 14015 39940 22832 -7578
46198 -7578 19635 46982 59801 44639 25752 29707 46309 33391 -7258 1153 -18194 10629
46186 10629 57080 82814 54083 2589 -3192 26615 16682 -21783 -31702 -25918 -16030 -33689 3554
46173 3554 -569 -30405 -53514 -61112 -35249 -423 3528 -23335 -17575 -5429 3001 -8775 -34099
46160 -34099 -57286 -26249 -11629 -80658 -41879 -38507 -64398 -1556 68752 11778 -39976 -67554
46148 -67554 -53939 -54786 -97456 -98049 -75701 -81409 -108874 -78772 -24042 -17568 -34067 -135 68591
46135 68591 27196 -34407 -58988 -30411 19230 3182 -42714 -35445 -155 34942 57570 -20642
46123 -20642 -18172 -54693 -7911 -15841 -54570 -45691 -61227 -22304 -56642 -49224 -44473 -43780 -62357
46110 -62357 -1030 34118 11741 41366 61118 48368 -15857 -47771 -50153 -35837 -27915 3245
46098 3245 14545 -44544 -42583 -13850 -15632 -17946 -643 12125 -34422 -52827 -63002 -54976 -13041
46085 -13041 -37363 -58713 -73346 -44673 -19528 -35394 -39765 -42044 -35656 -34326 -71099 -109252
46073 -109252 -79111 -5553 1522 2385 -8855 -85054 -82700 -66552 -14548 -21157 -18654 -29920 -11983
46060 -11983 13339 37190 13562 -39619 -16935 -15837 -75588 -55973 -35004 -29780 -42348 -89264
46048 -89264 -46990 -21919 -21987 -37117 -34901 -23781 9361 -3063 -12513 -15424 -1311 -24893 -42295
46035 -42295 622 43559 21285 14463 -9408 -16644 -44578 -45749 -68057 -63091 -53025 -33327
46023 -33327 42780 96537 54227 -11349 -47510 -72308 -68553 -57516 -36975 -29558 -24560 -40086
46011 -40086 -23482 -27252 -64107 -51660 -49566 -70198 -122433 -80519 -24246 -50476 -46400 -25520
45999 -25520 -22427 -1171 17015 -369 22915 11168 5517 33377 45308 52048 46868 334
45987 334 -54288 -30895 -14743 -32038 -35772 -63876 -74663 -34792 -14757 -50176 -43751 -20803
45975 -20803 -78671 -74417 -68815 -91048 -55921 -52568 -54011 -2109 9878 -12010 -13813 -27802 -90570
45962 -90570 -107229 -32834 -50756 -21032 9288 8325 -5234 -15775 -7604 16544 -16467 -59384
45950 -59384 -48331 -73828 -121515 -139233 -92257 -18893 -9119 -21268 -15720 -3745 -19283 -20747
45938 -20747 46623 -4333 -64599 -49705 33719 94000 22178 -2285 9880 -10510 516 -37167
45926 -37167 -59167 -63203 -28403 -18408 -5980 19723 9785 4183 31317 19500 84128 77926 47993
45913 47993 2877 41829 35162 6532 12119 11893 -32229 -47182 -52301 -21475 35388 39507 52057
45900 52057 47314 -11756 -30655 -8333 -44551 -98323 -70922 -20372 -46259 -46416 -41656 -21768
45888 -21768 -3657 42906 74803 53868 17456 11858 -280 -7121 -19796 -20282 -13632 -20121 -5211
45875 -5211 -43483 -76661 -55587 -51815 -40839 -42302 -44644 -7631 -15446 -51822 -16727 -57388 -56775
45862 -56775 -26848 20010 3526 -11356 9567 65024 55532 10160 6333 -10991 -29310 -41902
45850 -41902 -70930 -20976 34592 29949 12176 -28322 -31694 -77500 -89400 -29197 -30182 -44122
45838 -44122 -28407 482 -41803 -39302 -11696 -18020 -38053 -6205 16996 -882 16955 8049
45826 8049 -57849 -29727 7012 -24894 8875 -7334 19917 30512 -11625 15573 -15040 -51407
45814 -51407 -42514 -19986 4439 -5409 -15451 -1031 13482 -10413 -15166 1268 -16596 7640
45802 7640 41220 25065 -20588 55418 81850 42596 -2574 -15752 5459 14808 53376 59340
45790 59340 31687 1269 -30885 -37403 -34522 -19357 -45849 -31277 -28755 -59593 -49229 -53404
45778 -53404 -29861 7565 30222 -21703 11934 25563 -2555 -10109 -6553 -23301 5361 9469
45766 9469 -19395 -23936 5386 56835 33276 -3536 -8963 28565 33322 1572 -53744 -51733 -29012
45753 -29012 -12806 23450 6158 -18638 17430 44121 30532 18626 1757 46355 57659 72280
45741 72280 61185 32486 38154 -384 -4592 -35134 -20147 31775 60092 43848 4348 -2849
45729 -2849 -14162 -30839 -45207 -26695 46221 16246 7172 -23227 -17691 -29786 3779 41209
45717 41209 10266 -8504 11735 42687 31048 28263 4830 -17126 22952 43368 38671 67143
45705 67143 32100 17900 52189 41599 42563 7191 37547 65327 27413 77 23265 51229
45693 51229 72295 46041 26116 35741 15711 50169 55251 6836 23816 21379 6409 18469
45681 18469 2298 8143 -13174 -63080 -78413 -94909 -58397 -41938 -39698 -51677 -21200 -10930
45669 -10930 -46026 -31997 -31800 -14316 -8436 -14540 15491 24378 15346 -25934 -5341 -6764 -7989
45656 -7989 -18563 -16508 -61645 -34079 31124 54971 15752 43207 60196 58584 60986 -10425
45644 -10425 -14527 38816 22956 44173 59629 52518 37446 -8899 -32724 -4116 25226 31903
45632 31903 37524 21407 37111 57550 43466 28885 73735 51408 50017 13126 13401 44904
45620 44904 30853 19996 36192 13827 21910 11145 25945 63665 49509 16984 -22472 13206
45608 13206 14389 4965 5936 7125 44958 44407 39260 38704 52175 23000 -14534 33104 18768 13230
45594 13230 25255 33565 77968 78054 65521 54597 -4036 -24352 -3587 -35895 -764 39963
45582 39963 21230 -14520 7617 21134 16816 31113 37963 20291 32414 12782 -53684 -24341
45570 -24341 14983 52168 37144 51578 51819 31185 24773 3983 26479 68966 50286 -4153
45558 -4153 16984 -19941 -48996 961 -32925 -15213 48306 20531 10160 23928 60890 47475
45546 47475 47914 59871 31376 27526 19552 17836 5036 622 -9989 30204 107066 90002 76787
45533 76787 45889 45830 -3690 42383 11715 35223 33815 -13366 14676 53974 73587 89363
45521 89363 35010 67202 42647 274 27074 38706 64229 55050 82588 51407 39156 -23570
45509 -23570 -19200 -8906 -47760 -29220 -4256 14008 36856 15353 37685 55001 36344 55032
45497 55032 83844 79206 60272 25712 69867 111179 58177 21900 29109 -5397 -21204 -40279
45485 -40279 -2497 25441 51810 29712 6321 12693 -22542 -38200 -30257 698 -10789 12930
45473 12930 18043 -17122 -20357 5257 26648 2155 -6709 -8554 -13771 -3806 -23333 -31771 1074
45460 1074 29464 64854 36474 47840 -7794 -21039 -23396 16290 15829 7849 56540 93331 112476
45447 112476 88543 18025 83287 79854 -1387 -14021 15387 1366 2408 35917 54541 28694
45435 28694 41973 65673 82205 62307 -6314 -11265 -16613 -35376 -13565 10126 7332 -16741
45423 -16741 -34227 14191 53894 66476 62067 87225 105474 74470 54379 54775 40516 -7334
45411 -7334 -18565 13872 -2117 300 31014 38726 31756 57969 55374 62585 40406 33306 66146
45398 66146 27167 -1369 -15331 -6707 6935 324 -16613 16016 20222 -46916 -51744 -7244
45386 -7244 29391 44853 13458 -7807 -16969 32353 70798 44427 42664 34193 52789 24404
45374 24404 52307 66360 52347 68765 72668 62861 37604 10305 -11321 -7813 15780 58500
45362 58500 90903 33276 17841 -14590 -34902 56075 27681 52799 67189 34540 -8912 -21484
45350 -21484 25327 78899 89066 30377 56908 75541 64050 -15134 7558 57047 24329 -26419
45338 -26419 -43675 -2219 53888 63586 4019 -35159 14380 36390 1077 10875 37579 20377
45326 20377 21705 -2240 20091 19524 53429 19640 -18419 -27224 -4142 18937 -7421 -6819 -60782
45313 -60782 -54853 -20247 24856 18720 -8796 -4078 4119 73598 39045 -7280 -21179 14935
45301 14935 -1260 29955 -800 -13375 14040 48861 43245 28383 22236 31642 7937 -59175
45289 -59175 -4512 35068 27374 15878 -5858 11094 71398 68699 62291 47416 26227 34117
45277 34117 26161 13733 43470 -6038 1034 39980 61549 65510 86787 111835 90082 59986
45265 59986 71216 87611 103859 90158 50778 59790 79558 55797 71141 166858 137182 26940
45253 26940 191 30971 40563 3281 7522 4743 15199 23350 59242 73925 59975 17716
45241 17716 -10416 30680 13218 61512 59700 55708 78126 91235 73096 30074 17335 53202
45229 53202 101624 76052 76869 68759 36158 10826 31276 70905 85954 64902 29212 38510
45217 38510 27066 22464 72189 58580 59096 19592 34002 59794 28867 470 14540 -24868
45205 -24868 -3638 12443 -24556 28917 49134 39513 17415 23167 52999 55679 69144 17438
45193 17438 -36437 -20276 48628 59833 46814 11531 53123 86081 72351 6532 1600 14524
45181 14524 -84203 -104536 -45211 12554 3335 -15306 -33981 -39301 14706 76440 50454 -10383
45169 -10383 -2104 -23073 -42317 6611 29325 38931 -7532 -42708 -2402 -20165 -3553 52017
45157 52017 44589 53408 32291 7610 7899 12199 -4236 30903 27088 46903 8192 282 33194
45144 33194 25651 13239 16260 19829 16622 -21062 -30317 -17867 -10444 -8466 -60491 -11680 33307
45131 33307 44999 30338 38331 14357 -957 -38189 27795 31565 28675 81240 82586 51782
45119 51782 57162 74148 81801 108241 57942 32919 12415 -3829 -2983 61300 68010 33082 46215
45106 46215 84930 3912 -24412 -23537 -29525 -1058 26340 41852 91731 104310 95450 74152
45094 74152 66386 50160 51270 33666 -6705 -34242 15462 -12978 4438 20887 31856 15374
45082 15374 -29454 -20212 -20153 -17313 15355 4246 -33385 -6030 -9563 -29433 -39604 -9657 55489
45069 55489 84822 76530 35153 2762 17215 22223 2365 10494 34005 62507 23977 45645
45057 45645 89870 28158 2895 36723 33431 42539 61568 56091 67476 79707 60566 52543
45045 52543 52242 66543 100692 85085 53204 98448 62972 81556 127268 137508 104322 58534
45033 58534 61401 90122 111946 161317 146561 89910 84846 21750 32323 16807 9436 50936
45021 50936 80582 142708 99489 61801 90044 45673 606 15083 35757 36988 -7199 -5039
45009 -5039 24573 20609 63922 31224 49824 88230 40836 49431 45753 30560 61049 57003 25890
44996 25890 32075 36388 2307 19345 42786 26079 23465 45342 36937 69915 20873 63874
44984 63874 71509 12583 21909 23528 32750 31975 50070 37983 35410 51143 40297 68675 97841
44971 97841 54074 12074 22089 2513 15298 65900 20521 12604 13473 34206 43322 55968
44959 55968 88646 74797 23453 37600 46676 32984 57045 47879 56845 83921 87540 84085 145291
44946 145291 77306 39630 64364 36778 36271 81741 63877 45332 65066 83754 98777 103295
44934 103295 49228 59536 78460 50619 68110 61036 35722 31330 41456 26058 63089 68993
44922 68993 77454 109567 59860 65217 57485 45147 34647 64067 63194 34091 304 -3456 68450
44909 68450 131657 120233 119932 124081 113463 120940 122039 70942 47792 26093 41263 100970 112690
44896 112690 72509 91952 76076 33096 86569 119516 57600 40204 44153 72709 109251 103905
44884 103905 82618 84299 67820 64188 129224 143331 39016 63716 125291 101525 79732 71092
44872 71092 73979 78950 119003 203544 221139 184367 136108 96415 101123 117674 79120 69608
44860 69608 86314 86500 109661 142751 146853 106829 119663 115864 78429 65982 72378 98665 90619
44847 90619 74376 99749 138421 157009 153531 143337 154739 83905 101176 108078 78923 81567
44835 81567 100402 139717 153913 191883 174344 154686 127593 106447 136277 155191 137483 180747
44823 180747 165653 125945 146474 159137 125824 150044 147779 95002 97470 173110 189797 186348
44811 186348 162676 111270 138738 149194 143304 166545 158267 149805 150602 125878 120897 167691 181744
44798 181744 179441 166971 201674 205055 177388 194924 192532 198910 229121 239344 224431 204116
44786 204116 219788 226081 211776 228222 221443 216677 228653 217231 172600 161898 189130 188251
44774 188251 206201 268499 218940 248543 278290 245236 219781 275587 267519 209540 212607 222007
44762 222007 233619 224575 225812 253326 232886 185880 184799 148646 117553 153899 224541 252474
44750 252474 280736 284067 247864 279081 233673 207935 247638 261974 295339 297823 262517 262739
44738 262739 248519 243762 247162 236710 226192 230655 206333 191418 216401 257024 301540 274215
44726 274215 227723 242520 248856 249041 206274 258795 275766 229354 256999 270120 256136 271821
44714 271821 260475 247326 292407 288282 228475 243771 290808 321938 283302 255160 297926 323500
44702 323500 273875 290122 292398 318536 316271 328263 338721 318454 378670 374600 325251 280923
44690 280923 318946 355219 362339 382304 407281 434533 425161 400739 423214 413443 388160 435908
44678 435908 435172 404154 407965 430917 414182 402389 444433 468580 463909 437465 419387 454060
44666 454060 525313 501456 429033 486775 508900 553398 557329 567278 588158 622142 619356 577676
44654 577676 612047 663203 704551 696775 676682 671344 688267 681241 680318 699111 723590 752811
44642 752811 776616 852669 948809 962788 1126630 1303170 1590793 1920212 2326709 2732069
44632 2732069 3037995 3037418 2732854 2356193 1986441 1668131 1464832 1316168 1216001 1174827
44622 1174827 1138728 1164409 1194660 1222978 1180431 1162102 1208852 1213769 1230822 1234400 1259484 1241903
44610 1241903 1242437 1306678 1342389 1373381 1411043 1460646 1505221 1534906 1572191 1559871 1586299 1624730
44598 1624730 1719901 1748505 1752364 1770381 1856047 1868580 1958848 2002526 2028997 2128781 2200795
44587 2200795 2346389 2489815 2575179 2722800 2910608 3077247 3208770 3292491 3386849 3465974
44577 3465974 3497110 3422040 3304837 3213731 3151830 3037835 2956764 2952907 2975407 2958330 2879430
44566 2879430 2917061 2941234 3022506 3059091 3110789 3146974 3143711 3212274 3314552 3396454 3393747
44555 3393747 3360697 3361920 3390283 3413183 3398328 3408884 3403651 3404120 3449080 3550277 3605214 3729182
44543 3729182 3923583 4080055 4199114 4318571 4407517 4504357 4667206 4966568 5250012 5612631
44533 5612631 6001428 6333287 6666271 7014050 7397706 7773903 8133505 8487494 8800015
44524 8800015 9081064 9218541 9246992 9227648 9245107 9337429 9577943 9808233 10103557 10514024
44514 10514024 10962115 11363234 11641329 11824168 12016029 12206277 12502403 12979137 13639590
44505 13639590 14461826 15499558 16731833 18333647 20343920 22879308 25987659 29580614
44497 29580614 33827339 39162290 45714154 54005067 64459150 78012334 96163885 121576968
44489 121576968 157676751 209155726 278197762 357287314 418473858 427881757 377945072
44482 377945072 298713763 224485611 167934549 127664187 99099558 78523536 63547592
44475 63547592 52740831 44763421 38701123 33726436 29655883 26326819 23613711 21404490
44467 21404490 19649624 18160849 16896343 15708514 14540826 13622782 13000751 12519958
44459 12519958 12189942 11881175 11600939 11342550 11043487 10752729 10513518 10305409 10066665
44450 10066665 9552825 8880094 8146861 7458729 6710225 6030727 5521330 5132160 4800547
44441 4800547 4539304 4351445 4206634 4009817 3732962 3515908 3387054 3271341 3197004 3048317
44431 3048317 2937609 2774887 2575281 2397099 2329786 2320245 2279001 2302183 2269829 2229391 2198833
44420 2198833 2085439 2002738 1893437 1818894 1742237 1593228 1441514 1375513 1321213 1254740
44410 1254740 1167414 1161957 1162171 1094136 1081603 1051546 1013753 1005170 988544 942245 915587 915942
44398 915942 893461 848200 752839 786982 832841 833377 853915 937937 930758 943173 958331 1045388
44386 1045388 1142249 1289735 1418579 1722519 2174819 2670747 3123147 3301900 3040029 2508760
44376 2508760 1991300 1600141 1346437 1166706 1004343 925927 893528 890566 862979 832126
44366 832126 725940 667220 688538 699760 677420 666693 701269 720743 722445 794696 885023
44355 885023 1025062 1231253 1542087 1952418 2145273 2026833 1768461 1401292 1124054 891064
44345 891064 827866 756780 623279 540779 501233 454424 422065 423639 425795 448047 413129 311922
44333 311922 296194 293479 330204 369735 347816 293801 312647 373175 400148 368379 333490 283718
44321 283718 292856 287700 305193 363224 378646 338191 370291 330831 309566 316043 298634 312195
44309 312195 287717 300383 276038 236551 289843 287673 219146 194977 211798 189397 223921 219950
44297 219950 234116 234563 263428 221335 246849 290746 277132 238209 269810 248699 262856 335116
44285 335116 377820 460547 538860 605995 781953 994132 1365037 1831491 2203226 2457961
44275 2457961 2341013 1971091 1542201 1195656 901092 680027 573534 495154 447666 368117
44265 368117 306523 327282 351558 329123 287007 281709 289637 255073 291458 286855 244764 220226
44253 220226 206857 198928 196965 187524 166122 155291 159127 160716 141668 203209 224421 194661
44241 194661 195293 194422 134745 110140 80317 94145 116998 129079 131174 136325 81030 135332 159785
44228 159785 143539 149252 169894 178468 149707 156136 167025 169268 139659 73155 81552 95329
44216 95329 90664 114119 43727 22549 76988 116270 115656 105352 101835 90453 66059 64458 99071
44203 99071 117454 63420 27414 77902 122830 71245 75636 70543 117645 149306 99736 44681
44191 44681 66860 135372 150986 141624 109523 85236 24493 57091 48571 68424 47953 11006
44179 11006 51173 67325 58154 113807 148597 134517 155020 161632 85327 38571 39031 52892
44167 52892 51093 62880 114022 109109 78647 66856 74890 86593 80420 39269 18595 11265 67992
44154 67992 56431 64764 139893 125536 65487 20549 52903 75608 87577 105408 93562 101500
44142 101500 107975 52016 17830 4843 43609 85856 84735 56752 72246 108268 61948 61103
44130 61103 28430 99801 90511 55846 85817 74186 85905 62506 -1231 22595 49507 83985
44118 83985 51543 20379 34158 46731 37501 29799 62400 79712 66986 74300 80834 71883 75872
44105 75872 93554 77544 62131 33916 78315 91631 124033 158585 138265 29639 8974
44094 8974 43457 83247 83809 70346 33362 44256 41074 64838 50771 61444 73591 64554 73699
44081 73699 92688 81414 89101 132177 126693 137020 139926 102483 21537 52032 47234 31904
44069 31904 57711 77098 87698 35374 19973 7131 24700 17800 -26680 -7589 68097 130466
44057 130466 143450 143776 132281 109310 83652 82739 63564 46445 72606 40713 80745 38249
44045 38249 25536 35326 -779 10334 46328 58041 37114 53399 67456 48790 947 7309
44033 7309 33147 64937 72142 47898 1560 -20178 13292 9532 7044 -11571 4552 42245
44021 42245 29167 29829 20155 55488 78630 50435 77780 97111 78467 38428 5708 82425
44009 82425 72562 61109 121431 152337 98603 80064 82677 59624 45157 6213 -10013 11179
43997 11179 -23907 -21193 -11092 -37848 -15683 18271 27738 45635 56954 64184 57984 12141
43985 12141 86995 89279 89002 66416 13192 19502 36502 -5705 -1354 -24356 -46891 -16475 38154
43972 38154 71285 40218 59156 62111 72006 82811 106275 71916 63807 77625 61409 53370
43960 53370 63885 42049 53741 43554 22012 43612 9546 -39792 -67693 -3102 35019 18757
43948 18757 33663 47426 46528 12321 -8789 25934 48557 63213 45973 95719 89472 10902
43936 10902 13825 5023 16592 47886 61136 47442 22215 32990 -5689 -27729 -38790 -2212
43924 -2212 54852 55266 49102 31361 61299 58204 19890 -17353 9887 5980 -41685 -57893 -37084
43911 -37084 4191 28403 -6996 3902 52090 87705 92037 87592 82786 82330 68760 69743 65352
43898 65352 53190 28556 27429 33752 49408 12668 -11629 -35673 -26252 7743 26483 -25112
43886 -25112 -16121 -1847 32033 85567 75828 78383 71380 44221 5893 20511 25075 -13087 14669
43873 14669 16988 45544 17688 -19587 24409 26517 39410 17818 59955 98894 106025 103894
43861 103894 82073 45601 -6817 -35076 34852 87735 93575 68470 33847 75639 57584 61229
43849 61229 44966 45130 57886 30140 23521 10239 33747 105726 74986 60027 18423 39409
43837 39409 40693 2183 -6265 46367 69866 -21640 -47561 -5478 -32461 -24397 1540 -25538
43825 -25538 -33042 -42163 -5795 6996 -16970 16345 92635 87621 58014 39993 14655 7814
43813 7814 7375 11451 -25038 16742 8440 -34971 -5552 -12732 -31244 -17372 -30489 -15913 -8812
43800 -8812 12281 -26191 -4779 16543 55935 67224 30671 -9605 -16213 -30765 -22630 10579
43788 10579 -3571 -35518 -56437 -56115 10998 33351 17051 14792 -585 -16152 5652 32886
43776 32886 34359 -4031 36030 101917 71099 78577 78053 54567 22760 -25066 -22070 -11 6435
43763 6435 38699 56349 89483 76089 69996 63753 53063 47629 60763 99418 69056 21110
43751 21110 21314 61560 75478 44919 37463 64618 -13459 -11059 19194 20157 -7440 -16727 -21806
43738 -21806 27655 50014 62095 52535 61386 47862 58620 62314 25895 -1758 11521 53100
43726 53100 57101 15753 -24918 -30046 -25817 27762 -7017 6108 -21679 -31840 -22305 15218
43714 15218 38625 24662 49938 53150 11712 -8106 2982 -3254 -13738 6488 -36932 -66634
43702 -66634 -67078 -3598 25738 43602 93987 66065 35070 35637 -2009 -27832 -39225 30020
43690 30020 -15160 -29095 -46743 -46152 -16193 36963 1043 22843 28569 19957 6592 -13193
43678 -13193 -35215 -56100 -40637 -51231 -26417 -59161 -87156 -53307 -11965 -46860 -29247 11407
43666 11407 18494 -14419 -3946 -6206 290 -27443 -12464 -17048 2365 -6562 -4505 -38353 -64510
43653 -64510 -36559 39835 64792 98525 88879 -8740 -21107 -6976 -15435 -6262 54383 60197
43641 60197 31526 5115 20331 33364 17160 31088 -2166 -588 61276 71782 56427 22063
43629 22063 8885 44586 50638 72017 34563 29302 27706 47701 43617 5112 31463 66923
43617 66923 60949 86191 84559 74570 29317 15493 9484 -8548 47835 72757 30477 15433
43605 15433 57552 68471 21060 35352 27260 34371 38275 30590 52805 28028 5868 1878 7439
43592 7439 -4607 -45916 -30828 -5803 25225 48817 38193 77011 33082 10271 36776 36739
43580 36739 25338 7803 26819 73592 60296 41242 31600 21666 46701 22975 50645 49328
43568 49328 2333 -5697 24908 60028 58994 96453 87207 53928 13874 7576 -3068 -18943
43556 -18943 -59238 -39419 -32478 3774 -12334 -22711 -2373 4738 -6161 -10805 27009 22414
43544 22414 52046 60912 14198 -10590 -2732 -8280 -30837 -109 -7644 19295 -2754 -46012
43532 -46012 -2761 40396 64008 -3178 -25014 3340 16799 -14583 -23962 -23169 6797 32589
43520 32589 6601 -29099 -27191 -5354 -34348 -36670 -19300 -10830 -27466 10567 58633 80627
43508 80627 20780 8633 51489 30899 -26253 -2430 11083 22858 48821 24637 36520 -12769
43496 -12769 4805 10298 -9113 63030 50133 38832 19234 22423 -9471 -25796 9814 16613
43484 16613 28629 37777 -8513 -60341 -22466 41535 55699 30346 10390 30881 58677 76804
43472 76804 56011 49028 45372 16291 3305 30884 44047 46369 12935 6040 -1332 -21612 -239
43459 -239 -11464 -38277 -57119 -20432 -12904 -3653 -20232 12870 82397 84218 67136 85654 116434
43446 116434 72069 16640 -20891 33704 52892 16629 7722 46621 66577 44838 54408 -3100
43434 -3100 30485 25248 4536 -10007 32904 64710 32151 18604 33716 -35763 -13349 -8015
43422 -8015 29648 26208 37564 32130 62544 67225 71202 60330 57479 56658 31618 -13713 -21991
43409 -21991 -10812 25646 56024 47821 18828 -11567 -2931 11586 -6228 -1500 39844 8096
43397 8096 8506 51253 17041 22100 -17816 -47934 -49785 -32888 5862 -9613 22237 60029 35341
43384 35341 5678 32770 22170 48567 54065 48360 -2460 -8323 45101 118646 105879 82614
43372 82614 93269 74028 31884 40562 9622 -3999 7509 -17111 -15273 18809 18279 -26122
43360 -26122 -35975 -35991 2268 16484 20823 10576 -34222 4504 29098 42548 54506 58552 39658
43347 39658 -17238 -17146 18275 53129 23014 -24698 -12634 13353 -43100 -2904 36796 -8490
43335 -8490 9058 -14292 -21360 -26774 -39994 -8778 34035 48309 33865 -1009 11997 71325
43323 71325 52182 32699 35439 21384 34075 56744 24907 -11688 -3449 51818 4550 -42266
43311 -42266 -29522 15057 -431 32810 76861 51476 15940 25072 11831 -19392 -2234 9469
43299 9469 -20336 -40001 38925 60453 14995 25366 43098 19886 31893 -6412 11794 28103
43287 28103 17243 16665 52409 16694 -4608 24400 11292 658 -30426 -50771 -78764 -46186
43275 -46186 -3423 -8546 -18663 -16005 24795 33405 19666 2450 31544 10733 -19515 -17584
43263 -17584 17309 32612 37559 21855 30181 90162 47683 13811 35949 9548 -19860 -4665
43251 -4665 6938 26036 -12446 -26073 15365 54680 94242 67535 17997 -8883 -30474 -38293
43239 -38293 -24069 28990 17495 17241 45997 33324 15682 -7324 -62792 -29094 68309 34530
43227 34530 41842 -33 -21309 -35248 -46641 -25346 9243 23636 41335 43799 37358 42695
43215 42695 26503 29528 50429 32831 29149 17424 12528 5843 22506 12272 -5051 19982
43203 19982 27814 53862 82241 93169 60471 15251 32005 57184 56306 22157 22683 20516 19227
43190 19227 9956 24209 49529 37562 -43358 -20989 -25433 -27969 -18085 472 45576 48514 -21889
43177 -21889 -56191 -66348 -59021 1248 4727 27501 5502 22709 -2716 -8363 -23388 38907
43165 38907 54719 25300 8767 40762 88856 66820 23802 45425 21656 30161 -5839 -44985
43153 -44985 -41784 -24066 -32631 38116 51495 20993 9413 -9223 43477 44108 56286 36714
43141 36714 1884 27570 10079 27654 43843 7013 23421 39350 18718 18198 -4806 10822
43129 10822 27119 30482 5243 12321 61604 109898 95377 38993 18439 -15080 -37150 -28504
43117 -28504 -38141 -39020 -32546 23700 56662 31624 40963 20953 52516 -32427 -5200 29021 13307
43104 13307 17817 18314 44850 33608 18924 45343 38444 -6460 -7617 3585 195 -2278 -13819
43091 -13819 15782 37407 7365 5422 -20953 -12954 50971 86204 92192 103486 64361 39565
43079 39565 65493 42603 13481 -6207 42097 48473 28068 -42365 -29941 -30971 -40766 29549
43067 29549 6735 -3761 -5319 32940 16142 13181 20698 10124 -19317 7625 43425 14268
43055 14268 -4678 -16590 -15913 1101 -12923 -15105 2773 -9467 -10573 -8952 -5410 -28052 25553
43042 25553 51671 67079 -6361 18998 6402 -11498 -18220 -44684 -52610 -5587 34665 46574
43030 46574 36864 48886 41350 -10470 -23816 13076 -2462 -21787 -7487 6042 22477 -2933
43018 -2933 -6970 1032 -12669 7837 25417 39085 58527 67260 30223 19067 20210 16679 1454
43005 1454 -10392 11677 8035 -7109 30972 53530 27274 18655 44387 35599 51987 58688 52929
42992 52929 30078 24789 -12622 -23130 -9599 -33067 -25030 81798 78287 31296 52186 6304
42980 6304 -22675 9998 41708 26377 -8028 17760 23085 -6867 19496 86792 44713 36503
42968 36503 31532 -3139 -29688 39380 58787 15942 5691 -25168 28755 -1461 -32991 -1483
42956 -1483 3416 -9232 -25849 -16943 12573 -22476 -60746 -20746 26002 50941 65014 15325
42944 15325 24966 13073 32019 56465 60150 61596 35764 -9558 -73412 -62712 1470 8816
42932 8816 16854 14824 30079 45562 30781 32913 62810 41482 10715 23078 12623 40565
42920 40565 -2835 -19019 -28639 14252 57144 83297 38814 -7802 27934 60499 23959 -12958
42908 -12958 -29017 -1541 41058 39983 15921 -10062 -9636 -25974 -43306 -37833 -8308 15454
42896 15454 37831 16753 -18405 -55748 -23175 -9851 -24807 -48716 23931 23104 21758 16092
42884 16092 48288 -833 -10222 -1290 1464 11763 3361 21652 -53503 -83668 -44174 -15832
42872 -15832 28492 47992 23267 2761 1740 -2366 -26381 8755 22504 18235 30044 37916
42860 37916 9936 7223 -3818 -7515 29369 3454 -5594 -481 27768 42384 72594 77009 47651
42847 47651 19675 69534 47700 80015 46421 4746 20485 48375 21161 -2787 1009 21444
42835 21444 10604 20039 42178 55931 44938 22168 21609 3819 -407 31729 51282 25297
42823 25297 19408 -26088 -32086 6328 77594 53141 10701 -16461 -89278 -82359 -74984 -36650
42811 -36650 -22889 -23363 -1005 30178 9773 -25426 -18074 -15692 -3960 -34659 -36108 -6808 14160
42798 14160 46012 24562 20628 49450 43091 64642 59423 26231 24563 19849 463 -14773 5840
42785 5840 16968 -13225 -27915 -13668 -16792 -35316 23265 93051 100131 74643 -6459 -52635
42773 -52635 14277 58809 9713 -34226 -7357 31799 36732 45204 7122 -26200 20725 4936
42761 4936 -27347 -21579 27903 85959 76336 50186 50129 2920 25010 4315 11678 19268 13757
42748 13757 47698 67503 32213 16384 -8266 -20695 8120 39637 25965 -4205 -3951 12164
42736 12164 29423 72691 78374 38929 44458 79398 67399 29108 42690 26906 29438 6372
42724 6372 -40369 -21454 -1365 32740 46551 51962 29235 -14862 -5559 -28833 -18437 -18747 -57884
42711 -57884 -63195 -54306 -42165 -43227 -20742 -45794 -13005 56302 22739 -22769 2456 -31179
42699 -31179 -51082 -36168 -28430 -36123 -13159 -41715 -42654 -48752 -45878 -17212 -13277 -7668 39476
42686 39476 53599 25631 9134 -18526 -15330 8910 -23423 -18247 -47396 -79389 -21334 -15431
42674 -15431 -14528 -27557 14009 -10343 -62498 -14905 12404 26023 -17179 -32630 18876 28616
42662 28616 -19204 33961 69525 14545 -21213 745 -6824 -21942 8252 -19895 -65566 -57354
42650 -57354 4626 1814 -5830 -5560 24437 31657 -20896 -8232 -15863 -8935 39194 26176 24254
42637 24254 46292 16478 -2196 20045 18312 1920 30978 35159 26501 -20159 -53707 -52519
42625 -52519 -8249 -475 -20725 -11239 -5613 22945 16496 23672 37277 29161 62063 46822 46415
42612 46415 47156 33811 13050 -2167 14949 42861 55389 5545 15002 61812 93036 34669
42600 34669 -13908 -27341 -69077 -86534 -53311 -18953 -4109 65587 48319 -5276 -3614 -13002
42588 -13002 27 -2107 11093 27708 8214 3682 -5531 9697 15413 14610 24038 12610 24698
42575 24698 -4485 -7774 -16757 -35395 -20733 -5595 -20607 -18011 2245 -28760 -40269 -4173
42563 -4173 -12034 5115 -7183 -52369 -20262 -15399 12503 -10473 -60141 -45701 -40498 -58917
42551 -58917 -72922 -33955 -62310 -34502 53397 39295 -12447 772 13194 10563 -56925 -27697
42539 -27697 38474 73667 51564 -54900 -29772 -4665 -2475 -3669 -28016 -42076 -31440 -48951
42527 -48951 -26563 -36511 -561 -22552 -29205 -20481 74777 100354 45123 35188 -16364 -7451 -4186
42514 -4186 35965 40783 29300 9991 41893 21211 -13779 -58312 -61693 -22627 5745 1723
42502 1723 -2042 -12659 15688 29756 12215 -14887 5356 31620 19149 27656 74485 46114
42490 46114 28598 24989 64952 41187 59300 32779 -19580 4627 6324 -17053 -24083 -17515
42478 -17515 13064 -19266 -73327 -106157 -79313 9051 -322 5643 15232 15320 10155 31746 9802
42465 9802 -27829 -1841 -23102 12352 32537 50994 49817 41059 19774 -35915 -26952 4089
42453 4089 17899 2317 -2413 -29058 -21202 -17789 37622 46407 49838 11308 -14999 9605 -22159
42440 -22159 -38480 -23424 -14286 -67319 -87848 -61134 -23857 -24351 -47034 5147 5607 -34664 -25645
42427 -25645 -2562 -26769 1405 -32474 -28774 27762 13910 25183 6526 7191 41053 59161
42415 59161 15695 40750 62549 -26041 -69726 20395 57000 48439 6841 -17462 21729 65097
42403 65097 64245 55215 -31951 -84864 -65338 -68518 -5968 61260 69332 14588 7588 43757 -2995
42390 -2995 390 11046 23993 21625 44416 104927 81726 37441 -6345 26917 81549 75436
42378 75436 22088 -18922 23992 31558 22015 43160 22915 17574 -39465 -61627 -61885 -56035 -34364
42365 -34364 -13778 -89279 -92503 -17555 44159 49788 11658 5227 -5368 4520 -19525 5777
42353 5777 19877 62995 4121 -60329 -44356 -76405 -50892 -25288 -49043 -78830 -51489 -11856
42341 -11856 -15578 -15057 -23561 -60308 -48818 -4850 42764 29055 -48794 -44688 19280 13462 5909
42328 5909 -953 -28717 -41659 28765 32295 20401 16891 22790 55276 7258 -4228 -29370 -55417
42315 -55417 -13946 41167 60589 34333 21936 -18161 -14541 -1586 -956 7400 71693 34025
42303 34025 -5338 9263 37666 -11991 -10690 -16300 -34912 -1722 12371 -25768 -71129 16713
42291 16713 58409 -28755 -9516 25712 -37825 -25125 10511 18895 19449 29222 75649 50940
42279 50940 12280 21255 39069 56440 40877 55738 44652 17353 -16266 21048 32240 -4768
42267 -4768 -16960 9136 20083 28746 44766 47512 15975 -23958 9406 2567 31982 11407
42255 11407 3222 -16295 37491 71358 -1541 25394 74225 107572 65001 -1435 -8809 36019
42243 36019 9439 -33782 -35022 -8215 -4170 -29855 35081 69109 80043 47438 40930 15515
42231 15515 6744 -21615 -2363 33243 -8197 -1788 1604 6396 30946 46819 53811 -464 -76557
42218 -76557 -45776 -62840 -28433 32629 18150 15545 -28662 6496 49408 5467 27362 29275
42206 29275 46074 62915 65628 40088 -20547 2511 -15145 -40699 -55870 -8452 -5343 -40054
42194 -40054 -2564 17567 10630 31567 45134 26605 30832 53714 60430 71921 51992 51401 5476
42181 5476 -11104 29352 24498 11313 -9021 -4043 -30647 -27557 24726 41381 10473 30874
42169 30874 15601 -10231 -8741 -18864 -26802 -4678 43825 40167 16053 40336 36582 41875 19951
42156 19951 -22716 -10241 9560 12364 11889 -396 -3079 3225 26296 11839 -46696 -22279 30792
42143 30792 -3515 -6517 -30372 3433 -22953 -6060 -3126 -17016 24731 -2413 -31429 -34106
42131 -34106 -4899 31554 71063 41596 51791 60722 39048 59143 13695 30688 56694 99459
42119 99459 43889 39576 66309 27138 31085 52137 17370 33521 19460 -3377 -21336 7545
42107 7545 24485 36833 31351 73046 107006 81277 39266 103984 113355 67085 39446 59093
42095 59093 15882 48509 -812 -3960 26368 66517 52771 -17884 5370 13773 37008 -23578
42083 -23578 -38087 -25802 -57158 -34429 3460 29634 -11210 26015 61053 47603 48937 56740
42071 56740 9897 14126 23560 25457 42289 45009 33040 28777 10054 22342 20754 -11398 -11475
42058 -11475 -12230 -18410 -65495 -51606 -36058 -55793 -36288 -29182 23821 43059 18364 27123 20056
42045 20056 43019 -43324 -41430 -27661 -41260 -1046 32013 16106 -18102 -57540 -23226 -33920
42033 -33920 -44433 9380 18604 49636 35251 11917 1839 -994 -14125 -24569 -5873 31136
42021 31136 25527 48278 46052 45394 69425 104036 72995 76477 96621 93426 94546 120708 113798
42008 113798 74524 86085 118666 120902 67244 65223 43735 54523 53241 44292 106913 77205
41996 77205 26459 21877 6237 21033 17985 24927 51693 72076 74013 80105 63542 106827 110014
41983 110014 75238 37368 11189 40219 76285 53761 19154 -967 12604 31154 13080
41972 13080 11484 7991 180 -12472 6742 30503 27805 -1509 9107 22888 -33519 10805
41960 10805 21598 45839 32972 -892 -3059 -12024 8651 7982 12031 43687 30912 16263 8690
41947 8690 -22449 -42567 -26856 -20928 -58812 -24208 -15550 -4504 -4204 -25436 -61209 -23958 -807
41934 -807 23023 16042 -4603 -54379 -29410 -14585 16404 8725 -16946 54021 45555 34892 61970
41921 61970 37308 26422 347 6438 -13594 -47416 -74544 -28372 -22356 -47642 -21135 47005
41909 47005 26627 40675 30825 2686 -24802 12769 30235 10964 32312 10444 14607 23948
41897 23948 36342 40908 32210 5101 56528 72232 54918 26645 26727 19333 3354 35228 30007
41884 30007 10280 30104 31058 11949 -23611 7207 16943 20793 19897 26584 56066 19704 59010
41871 59010 23662 -65177 -56576 -31741 -45563 -50891 -57017 -87865 -81059 -27551 54576 25162
41859 25162 8028 -5001 -21569 -43043 -32569 -20889 28661 41065 37993 -14831 -36603 -24696
41847 -24696 17749 102767 117191 53585 2884 -51548 -30083 -14327 -63094 -30819 -33642 11526
41835 11526 36680 40210 -2688 -52563 -45414 -7758 18776 6399 -19893 -49937 8280 43751
41823 43751 91661 112495 89034 33271 42680 43253 25853 -35426 -57608 -27077 2866 -46562
41811 -46562 -62129 -20659 18843 24889 8161 11380 44452 21881 13955 31702 32316 37123 11750
41798 11750 -19097 -35490 -54959 -12239 52770 46795 -12652 -32755 -3791 -6751 2959 19927
41786 19927 56941 29172 25847 29138 575 -3795 -45190 -7318 22705 81163 65032 28093
41774 28093 38203 23945 14210 20400 -6938 -2139 17688 37318 4242 33349 47214 14432
41762 14432 26469 70138 88578 59331 -6251 48698 43833 46217 10459 -4354 10650 -17011
41750 -17011 -24786 13858 47209 66658 51457 56239 57905 36946 22885 -4548 2421 39759
41738 39759 39236 37199 21931 47768 1558 14809 -17183 -41056 -15796 -48833 -16401 -26523
41726 -26523 -56083 -7473 13428 26764 2691 -44572 28636 19601 -19827 -19163 29758 37523
41714 37523 19 10712 38320 48276 45410 53040 82084 45072 21844 55701 33942 -5505
41702 -5505 4000 34541 59511 23514 19740 8107 14696 12086 -5091 -644 -21518 -33169 -22980
41689 -22980 -3792 9653 37582 15924 22484 -3142 -4759 -5757 -26554 -37695 -6215 -6544 -10483
41676 -10483 19060 36793 61923 47422 4993 -7140 -10410 -3495 -23505 37960 61660 24740
41664 24740 -21592 -68319 -59724 -89291 -31464 -19053 -52886 -79619 -33132 -29207 -45908 -21126
41652 -21126 9015 -110 17905 18994 20105 25290 52600 79640 30731 11901 31078 46460
41640 46460 45041 30293 -47244 -49698 -11047 24374 36670 9976 -45488 -60593 -29561 4974
41628 4974 40024 36818 10105 5901 4410 -20244 -44404 -59170 -52933 -5199 7673 19039 30444
41615 30444 -44756 -31449 -20937 -8440 -369 -6642 -9996 -14284 25883 33011 20011 76295 51432
41602 51432 22261 -3062 -13202 43485 26395 33951 35088 39810 14525 -20929 -30331 -44084
41590 -44084 -14770 -11617 -43678 2143 36714 28304 61461 59072 8347 16944 -19166 -2653
41578 -2653 43925 17650 32943 -1922 -14252 -26494 -22672 7659 60576 54951 48952 40341 35539
41565 35539 6747 -28223 -21443 27079 -6916 -40323 -56163 -49097 16483 33590 18373 11439
41553 11439 14563 23376 14306 -10245 -25283 -7304 6057 -6430 -10373 3365 -2062 -31693 -15136
41540 -15136 -46397 -67992 -31992 -49648 -63858 -34422 -2143 -2744 32561 65591 16027 -41247
41528 -41247 4046 31055 19763 23436 6185 7824 -28325 -55405 -67038 40672 81834 46978
41516 46978 22555 26380 -23817 -31432 -8683 15484 43404 14854 2741 -23562 -56948 4051
41504 4051 34407 -23381 -56298 11372 31358 23471 -22994 -24462 -26056 -7920 11929 17435 8274
41491 8274 23115 28617 25952 -9887 -31352 -11220 -15356 -27085 -31160 -14566 -37094 -18870 -32546
41478 -32546 -3821 -12576 36641 22215 12001 13995 -38155 -34535 -2663 29634 9381 -1791
41466 -1791 1518 2032 47453 62031 65682 24649 5853 -16493 -51013 -29730 -10292 -5892 -13387
41453 -13387 19753 55949 -6768 -51451 -16097 -22832 -7999 18820 -36292 -77651 -51531 -12189
41441 -12189 5798 63471 29574 26143 30085 17699 1606 20453 41415 21514 34803 22594
41429 22594 22733 -15823 5112 -37654 -63024 32928 60391 20497 28618 -13578 2409 -37787
41417 -37787 -24596 -13788 -35786 -35371 7312 -33120 -15210 -34201 -16011 10429 -57695 -67414
41405 -67414 -20407 5238 15815 33480 34070 20125 40738 48226 34419 24681 -6248 1122 13365
41392 13365 -37731 -55426 -39569 -34087 -52063 -12288 -15139 -38271 -64061 -80671 -40825 -45951
41380 -45951 -78356 -78310 -85995 -12699 46721 29414 -18625 -24648 -4177 4489 16048 55993 62260
41367 62260 52263 29983 8350 23611 -15403 6393 35403 -4565 -2991 -31812 -70456 -23721
41355 -23721 -8198 17163 25826 18730 38237 21984 -20652 9178 1316 44112 20429 9547
41343 9547 955 -19223 -61198 -50069 -68802 -32356 -19228 -18439 -39844 -47411 -53900 -41839 11883
41330 11883 -10747 -36892 17272 19558 23788 38305 -16500 -36326 20742 2663 21341 -1343
41318 -1343 21714 -9962 -74 19102 11647 -15693 -65142 -93996 -118478 -95524 -70409 -84433
41306 -84433 -40295 44771 12087 18284 51338 51153 21042 -15140 8108 54487 17307 3828
41294 3828 16098 34775 -14690 -67935 -31984 -26540 -42009 -23564 -16422 8698 37148 8156
41282 8156 -14765 4011 -12261 -41646 -32607 -13459 13402 10892 -18500 17252 51732 4099
41270 4099 -40736 -33625 -2553 15920 11350 15567 16950 57479 25012 -19592 -40779 -33239 -3129
41257 -3129 -19247 -7223 13374 3884 363 -6532 45484 37787 15929 -21317 -21321 -64797 -48470
41244 -48470 -22833 -17094 -13922 7987 -26237 -14365 -45516 -28224 27649 16265 20106 43853
41232 43853 42152 31762 3692 -23359 -10722 -19564 -29186 46704 79911 10217 1619 6976 -2218
41219 -2218 13538 10054 23694 41896 36172 15022 17135 42610 60740 80632 84270 99180 96122
41206 96122 90699 44090 27837 59476 46421 48320 42760 18073 47942 42777 -8257 -48082
41194 -48082 -41785 -51402 -36434 -56448 -19358 -27998 -987 21979 -19669 -28255 -4271 16817
41182 16817 -18846 -10297 10827 -22465 13974 27803 -23671 41637 32344 -14456 -28171 -14717
41170 -14717 -23779 -17970 528 -368 7118 35959 34520 -59423 -63328 -58861 -37553 -14011 8072
41157 8072 4981 634 19406 62841 76492 79636 71532 69432 36472 -9899 -59928 -75266 -91477
41144 -91477 -59605 -8013 -29636 -41760 -24444 -27137 16779 26261 5180 19144 42359 15649
41132 15649 15668 -12920 -38637 -53429 -50777 -30571 -28067 36897 48683 29501 12664 -5859 9573
41119 9573 11351 38041 34296 5485 34074 44359 -19333 -64388 -47743 -47015 -339 44499 -5563
41106 -5563 -8533 -18542 -38657 -3168 -11126 2699 -24715 -28021 -14656 -67177 -85462 -94139 -100558
41093 -100558 -51103 -24244 16150 -37579 -38191 -10312 -22277 -65015 -80393 -49999 -3838 -10262
41081 -10262 -3844 21202 34125 27208 -22921 -49111 -59402 9822 24044 -5201 21107 9028
41069 9028 37911 47129 56785 40080 44413 37888 32480 50878 -1499 -1023 -6379 15289 23575 10235
41055 10235 -3945 -41645 -14013 15139 4821 -37739 -11993 -6502 -26866 -12258 6145 19295
41043 19295 28882 30049 -11334 -24945 -4559 -600 17767 11563 23064 26883 23474 44561 43332
41030 43332 34411 14206 26818 36906 88723 84091 46747 43693 33079 39166 14471 15898 -8836
41017 -8836 -24625 28783 86992 60015 34411 37954 14962 40020 24150 -24769 -19989 -40959
41005 -40959 -36572 21378 63247 21414 31788 55815 11970 -1669 -5393 -47601 -32968 11983
40993 11983 -15880 46184 12163 -30059 -31391 -34938 -81632 -102590 -39741 -42134 -34232 -4203
40981 -4203 -21209 -10277 -36921 7042 31306 20073 18197 10970 1132 -7006 11302 17542 51217
40968 51217 32533 -15819 -30247 -21056 -6616 -52060 -58687 -23520 -2704 -2702 9987 22069 -9534
40955 -9534 -36643 -40629 -60009 -17373 37140 19558 7438 5456 32438 46174 66886 34019
40943 34019 37084 45548 20255 -51100 -147021 -147099 -131872 -75681 -15463 43023 2756 31424 50422
40930 50422 17262 33603 43236 10970 -28307 -17550 11194 -2705 43930 33268 15017 -24522
40918 -24522 -17406 880 -46877 -30868 43330 10762 30942 92153 63979 31594 4237 -15397
40906 -15397 34253 65671 968 -65097 -38988 19185 78367 106305 36835 -13783 -14386 17919
40894 17919 8558 -16942 -33952 -46636 -19779 32621 -728 -4803 11986 9204 10255 -21247
40882 -21247 -4355 30739 65987 83720 92645 52856 54377 86396 54021 32981 52990 74717
40870 74717 37912 40849 54910 24837 78133 77121 59703 37973 13526 1187 58391 24024
40858 24024 -13651 33909 11302 -5062 6525 -53028 -72979 -81324 -65722 -36637 -11629 6296
40846 6296 2876 -23501 -77275 -68027 -49524 -60038 -29460 36897 47023 -20058 -78074 -81690
40834 -81690 -27851 -30474 -2215 19404 -14872 -53957 -37704 -9641 -19832 18975 80556 66055
40822 66055 -21280 -2701 19634 -17095 -26795 -44605 -50929 -52567 -74195 -92340 -38209 -52531
40810 -52531 -47862 -41886 -7931 29428 45279 -2573 -13039 -27864 -50345 -30853 -22439 12630
40798 12630 64721 34705 26155 -6435 21878 53757 68411 69144 68317 47194 1455 -36372 -6995
40785 -6995 29842 47834 45295 16458 64645 73172 -5422 -38332 -19517 -16733 -25612 57922 78481
40772 78481 1126 -1284 -44588 6523 12191 -63668 -46503 -38236 -96879 -62737 -78598 -105004
40760 -105004 -70341 -103743 -79699 -30706 -18728 -13506 -1906 21919 39780 4607 5751 5273
40748 5273 -33903 18173 56861 24983 42233 66705 65507 72121 34251 9035 2412 -32544
40736 -32544 -9419 30967 65483 33501 -29898 -39540 17347 12005 -1902 26684 14763 39445
40724 39445 46493 59573 69610 55456 73610 66516 102970 58674 23115 11066 14830 -35644
40712 -35644 -34225 -29650 -44484 -10680 9632 22430 33418 49216 -1940 -35698 -27894 -27169 -15446
40699 -15446 -22244 22804 53495 9765 -63186 -75599 -52394 -59278 -23611 -62179 -5195 29539
40687 29539 29876 19653 -11292 -5759 -4125 -25308 -28880 -19110 -6973 37080 28374 30087 10521
40674 10521 -4619 -23955 -37512 -41711 -57185 -28942 -37816 -47659 -50524 -44114 -14290 2201 -2708
40661 -2708 -5913 -48195 -46075 -27601 -17724 -36900 -46136 -42587 -31910 6109 -7508 -29569 6012
40648 6012 33195 44972 -13751 -39704 5075 102 -20203 -3695 26044 46469 54384 26945
40636 26945 62652 32121 -28242 -4913 -11472 2427 29447 -157 -16113 -9599 -14358 6447
40624 6447 1960 -6922 -24657 -11289 22552 25473 17548 17171 3721 17498 40311 3321 -6886
40611 -6886 32804 13924 -28747 -26117 -16865 -29868 5861 21047 -1519 -20280 -1344 4657
40599 4657 4339 26488 -35903 -61674 -4489 14031 -11446 -25207 -12296 -49932 -37883 -19748
40587 -19748 -6393 -12122 -26534 35603 38408 21154 57942 21157 -39257 -9170 16136 5283
40575 5283 24104 -2009 -47511 -54785 -56644 -69834 -48610 -41463 11527 11780 -4195 -35211 -26871
40562 -26871 -2862 20137 -17550 -48880 45415 63361 33658 49020 73502 77828 62962 49480
40550 49480 47977 16477 -23267 -25948 -4360 -15353 1613 37140 45543 39775 24204 -4965
40538 -4965 44311 80900 13679 -14805 -39540 -32304 -76411 -30091 -12015 69954 45628 -8161
40526 -8161 -36648 -51690 -74711 -53182 -28230 6975 82095 99067 105581 61710 36266 14492
40514 14492 -7904 16775 4007 28982 11317 24458 -1365 -3791 14738 13608 16793 18475
40502 18475 6179 -18817 -44846 -34886 -39577 1126 26985 -17393 -52922 -13435 -13864 30016
40490 30016 38989 -5655 -15869 -16691 -28358 -11374 14639 -184 5510 24512 8424 14782 10307
40477 10307 -24589 -17532 1405 725 -4059 -47951 -97776 -74439 8111 47231 24564 17467 31272
40464 31272 21560 -561 10976 10736 -22461 -21034 -21220 -13165 -23359 -41148 -32342 15411 69078
40451 69078 45615 50849 35083 41034 52357 25830 50505 64570 17703 -11038 -37828 -4059
40439 -4059 -17315 -38693 -49382 -25319 -49580 9890 42959 -6093 -24208 -34769 -29497 -44853
40427 -44853 -26172 17203 6059 -10370 670 26640 37240 85459 44683 10360 -25606 -42223
40415 -42223 -73955 -32693 55876 21030 10315 23241 -25257 -41723 21295 39549 2470 -7486
40403 -7486 -1721 -37244 -65388 -78303 -72123 -55893 -38525 -65213 -43782 -45461 -22338 -56139
40391 -56139 -71875 -15411 -12770 18401 14698 53597 17910 -17814 -42461 -11311 32909 40419
40379 40419 -13956 -27374 16975 38765 -2231 -49915 -27055 -5870 35358 9233 1724 -171
40367 -171 35278 31632 -1490 -13224 5264 -12386 26013 23529 39323 44181 33201 16912 -4940
40354 -4940 33972 42563 67479 47688 27343 23311 26262 27986 35922 10173 -41260 -39816 -53465
40341 -53465 -55693 -66507 -20659 -52836 -19302 -37693 -13736 11648 -3580 15315 45886 61972
40329 61972 66277 33511 -8926 12231 25541 53277 24983 59024 117650 30365 -10150 -36490
40317 -36490 9515 4510 14887 1010 -20972 18570 66974 46094 61881 100224 70934 35119
40305 35119 27392 33402 -114 -4492 28610 47876 58911 59323 45838 11059 -252 7455 30665
40292 30665 -7613 -21491 -4638 9888 15249 7512 -15246 15882 -10492 36085 -1422 -49234
40280 -49234 -57365 -13626 21305 9561 5079 19415 8996 14972 3536 91272 41852 6404
40268 6404 19651 -333 -4568 -23674 -3298 2751 7211 62051 22784 -14990 -15094 -21186 -11833
40255 -11833 -41301 -12401 -36734 -22363 -66094 -42848 22030 28223 -13907 38524 60504 27825
40243 27825 -34040 -5717 46308 11311 31632 -44287 -79660 -43335 -34523 -7644 -36384 -43519
40231 -43519 -8674 -13302 -37322 -28013 -26668 -33000 -21173 -13264 34986 -2781 -21240 -34552 5714
40218 5714 45626 46399 4031 -57157 -64371 13361 31723 63944 45571 58884 31484 -31445
40206 -31445 -45850 -82868 -40130 -25062 21314 56098 65665 36036 13544 -23742 -68206 -56484
40194 -56484 26404 -6749 11700 16330 -21622 6466 32114 -10900 -2199 -28808 -4971 49708
40182 49708 84567 84972 52461 13272 9079 -9466 -40574 -11173 36309 89578 101910 82877
40170 82877 89110 134214 88432 -36523 -23515 -4574 -14177 -12179 -26622 4814 60692 59129
40158 59129 29939 -10048 4940 -29860 -89183 -107545 -77492 55521 52720 -31868 -52823 12324
40146 12324 2411 35257 66279 49674 -20261 -45681 -14964 -2032 70737 32169 3431 -12351
40134 -12351 -20714 -28963 -60290 -85198 -39744 3673 41728 41327 31637 -11994 -7342 -7067 13109
40121 13109 15830 6144 25643 -1920 -29076 -41465 -49339 -18905 16118 7409 22732 20655 25479
40108 25479 30327 11230 13624 -15296 -17212 -31618 4577 63283 68658 1607 -39719 -34880 -32985
40095 -32985 9261 80861 15037 -47988 -3584 22447 9906 48889 26594 -57475 -68956 -98786
40083 -98786 -67515 -51601 -23616 -20479 -26600 6187 22526 21272 -4395 -35834 -30281 9959
40071 9959 9337 -9897 -10987 -18192 -76875 -9380 333 -14117 -23641 -40957 -53698 -38138 -5852
40058 -5852 -3495 -37233 -38088 -54267 -28295 2287 35285 37063 35560 21238 -1054 -18744 14716
40045 14716 25416 73249 96101 37195 -5170 -14679 -21650 -22507 -35008 -6712 -2300 6428 26117
40032 26117 44298 18625 -4816 -24644 -28950 -73290 -50035 -20730 -15283 -7476 -68128 -62794
40020 -62794 -38953 -73250 -53036 -39381 -35548 -28189 31148 -8683 3854 71016 32945 -5008
40008 -5008 2067 -35191 -3188 -43102 -46934 -20891 26021 20191 -38415 -26855 26410 19106 -40484
39995 -40484 -42734 5997 -18287 -4668 18785 55759 17607 -6923 22567 -21803 1872 4915
39983 4915 29103 27593 46550 70845 8887 -7379 -9845 -33441 -16684 -28743 -61912 -46940
39971 -46940 -12405 12904 8577 19939 36111 -36999 -1780 -14982 -17823 25505 59302 83794
39959 83794 104433 81609 39221 35051 25162 24099 -10933 -68188 -48202 -28303 -15068 10102
39947 10102 -28902 -38358 -18667 -60319 -43834 -12263 27034 23500 -8435 -19257 -20757 -9206
39935 -9206 -13343 24869 14600 36819 3896 -15527 -35911 -19210 -19409 -5230 18758 7744
39923 7744 -24815 -36882 -9253 -17965 -10453 -20462 10852 -548 -47911 -25874 -6723 12040
39911 12040 27944 29483 79549 15451 -29171 -35643 -29266 20892 -13913 9936 -25251 -29569
39899 -29569 -50544 -19098 10987 29248 -14323 -19308 -13937 -4459 -9670 -24272 -49920 -45030 -4218
39886 -4218 -18295 37242 73022 61611 53962 42795 6380 -24822 -15931 -301 -32721 -41457
39874 -41457 -659 -29114 -20386 609 13930 20234 388 -3767 -2993 -14866 -21911 -24798 6958
39861 6958 36058 33388 28902 367 20014 7829 -29043 -14374 -3957 20037 1925 -52483
39849 -52483 -58925 -26778 -23429 -8841 49622 60505 18832 -16499 -13558 -50002 5776 42074
39837 42074 56396 29069 39985 3355 -4143 -810 -22019 -34477 -3178 -25314 15278 -10529
39825 -10529 -71210 -94239 -38038 -10321 -9881 -2923 4349 26506 40390 2437 11525 -4028 23785
39812 23785 50684 27105 11682 8396 -7461 -24662 9694 20392 -5517 31454 62385 73146
39800 73146 66465 43061 35334 22272 16268 -4201 -11314 17149 -22067 10954 25921 -34852
39788 -34852 -42450 -63302 -62809 -31851 -28976 15247 -11033 -23607 -27789 -13903 -23526 -53187 -67932
39775 -67932 -90525 -45842 -8623 -50805 -52056 -46226 -31955 30350 37445 45885 12842 -16289
39763 -16289 -11030 22593 23259 -2641 -38436 -68893 -92875 -125318 -96642 -62497 -73979 -63315
39751 -63315 -63233 25229 96978 38652 -23378 -18824 17416 27190 28459 33849 29851 -14225 4628
39738 4628 -31423 -39242 12927 7011 -37287 -35361 -39938 -28333 3717 -19967 -27763 17078 -41747
39725 -41747 -13663 23252 41288 3071 -15421 -9801 23938 45985 8008 -3984 -5391 -50617
39713 -50617 -42313 -8701 -7083 881 55620 40728 20025 17354 14071 1418 -17083 -21459 -52474
39700 -52474 -50204 -50132 -22202 3077 -38952 -51773 43971 55693 19887 34651 21750 -18277
39688 -18277 6049 4820 1907 31108 32185 29489 -21285 -9815 4781 -30380 -8038 21308
39676 21308 19476 4620 -5446 -28274 20446 -23973 -47306 -14427 51621 90427 72193 58759
39664 58759 75434 -15911 -22743 14653 -5608 -6682 8928 -23873 9407 8822 -28202 -55783
39652 -55783 -15912 51031 35410 58400 49867 9684 75424 66979 -16574 -5675 -25553 -36201
39640 -36201 -64176 -86633 -20753 -19356 -7527 -4410 -22317 -28005 -28903 10238 26057 40935 59976
39627 59976 49603 53377 35625 -12982 -6513 37742 177 11945 -43898 -56429 -34970 -49998
39615 -49998 -47124 24927 41231 39723 31764 49842 46087 22493 3013 38359 67247 30946
39603 30946 -26689 11386 -5514 -41675 -21058 18110 88097 62725 53531 36420 49587 64854
39591 64854 59029 53182 -16289 -8881 658 19025 15320 -3358 23918 -3661 5056 26845 9602
39578 9602 50269 23983 -1348 -1000 -2456 9739 -1592 15277 1331 38049 41955 18182 -11264
39565 -11264 -17310 -34253 -11566 -13220 -38508 -25878 -4557 -58894 -31885 -7480 -32080 -55306
39553 -55306 -38226 -18331 -58658 -156052 -92091 -34093 -18644 8354 20564 53821 16189 29166
39541 29166 62845 66560 21145 -33447 -92318 -65627 -11065 -28659 -25055 20959 38541 46661
39529 46661 10795 -31819 -9016 886 -20724 -23993 -7513 -17442 -7690 -20986 -17770 7754 -8749
39516 -8749 56044 119661 82769 78415 47469 5887 -9853 -33646 -44574 -21161 4966 47293
39504 47293 -105 16628 29574 50608 44789 41841 -11367 -88543 -66410 -18236 37478 25151
39492 25151 41679 7259 31358 61603 62501 -3053 -2151 48920 -9051 -65375 4778 119737
39480 119737 102285 39446 -29544 -66046 -75202 -11952 30936 39167 -702 -3089 -17001 21088
39468 21088 39500 -20065 -18310 -3850 32075 46440 6992 6628 12516 5018 4665 -5978 23805
39455 23805 22353 19566 -6419 -41329 -37467 -2468 7261 -3407 30888 30905 44711 46568 12266
39442 12266 22573 6264 -3721 2821 -8166 8647 -115 -35954 5787 -11047 -38202 -47439
39430 -47439 -75925 -75313 -33823 -12870 11528 13313 23199 34051 36510 28144 5155 15879 30343
39417 30343 2696 32416 -23304 -13064 -1988 32501 17884 41274 29364 -13631 -78966 -130071
39405 -130071 -75598 -9999 13509 38831 13086 -35339 -28808 8882 41691 38749 27041 18476
39393 18476 9576 -6081 -32506 -45337 -59319 -25749 17257 -14350 -76984 -44006 -6761 10088
39381 10088 28291 23579 30040 -6412 -35407 -36189 -19847 -37016 -7150 38759 -2701 -7169 465
39368 465 9660 -10125 -37947 -17202 -24018 -51976 -40561 8392 19106 -35112 -44276 -16510 1490
39355 1490 465 17992 45627 10964 -17287 14213 11509 8422 -13975 7450 -21898 -26287 -3661
39342 -3661 129 21763 -27676 -21077 -7527 -15653 -38383 -25016 -86590 -82060 -51215 -53980 -63887
39329 -63887 -58729 -80918 -67965 -36454 -17830 31672 44887 23803 41451 24501 22428 19026
39317 19026 31954 14889 -10695 -10930 21739 45824 16053 21618 -54233 -51694 -54940 -37396 -9638
39304 -9638 26400 52259 64747 44866 4199 54015 36395 30978 51083 42790 19253 10954
39292 10954 -2475 35164 34858 10750 26762 25097 63969 101660 84614 29441 15637 -267
39280 -267 -11154 -24321 -17715 -4827 5538 -28400 -27518 -9093 -47258 -13042 72131 46594 13134
39267 13134 20112 17974 4055 -12334 -454 -49506 -37941 10958 27534 46307 92866 109534
39255 109534 75504 40896 59151 70487 97576 38934 -10622 12226 42218 42333 36023 -18844
39243 -18844 -29395 -19526 -28274 -27724 10849 28422 29416 22622 -641 16724 34422 22956 31086
39230 31086 49260 91596 38705 -2802 2876 2128 -6333 -18266 -67172 -65112 -43139 -45336 -7098
39217 -7098 6109 -14539 15970 -20501 31523 68060 58440 -2949 -29256 -23360 -7164 53423
39205 53423 34674 -5207 -21679 18141 -4418 -7310 24269 77253 55035 32279 56695 17420
39193 17420 -16378 -16810 29942 35526 49882 12482 -7124 55905 78149 36857 4393 -5350
39181 -5350 -10508 69436 57246 79495 76678 65284 37361 -25439 -39051 -41454 -21411 -15954 -24794
39168 -24794 -24977 28141 6787 22856 4479 -26841 -4482 16327 13931 30970 25905 -18053
39156 -18053 -13982 13119 46018 35394 -8774 -8285 -27631 -35652 -25249 20146 33209 65566
39144 65566 75287 22424 -22681 -41724 -13266 -3630 -23844 -23892 -31487 -60721 -38927 -1839 29021
39131 29021 35419 -25980 -35529 -8966 -14032 -30387 346 -130 -24861 -10549 -51013 -35260 6884
39118 6884 45623 33581 -19107 7417 33651 -13800 1829 60064 71577 61062 42283 55487
39106 55487 77259 64543 57806 4420 -12821 -2319 5904 21542 42999 4526 206 38467
39094 38467 19888 11917 -13799 34470 57539 65006 36825 16974 -396 -10186 -33133 -51075
39082 -51075 -56301 -2795 59956 73658 45016 439 924 -31970 -55985 -17831 8001 -38584
39070 -38584 -16857 -11480 5777 39732 21300 15715 41184 15979 -19174 -68718 -82637 -61215
39058 -61215 -72479 -18411 -34463 -9476 16572 34323 54526 46356 12398 -21523 -31016 -13269
39046 -13269 8168 9990 -2330 -48715 -90475 -80990 -59251 -72138 -17960 35410 28520 19765
39034 19765 55850 44153 13592 42831 64046 23833 57333 63105 -11 -72080 -95866 -79315
39022 -79315 -83800 -38742 54236 81880 22898 2893 8339 12471 6851 4604 36313 51474 30339
39009 30339 2825 -19506 10316 29505 -11264 16824 35792 37195 72542 55079 29830 62463
38997 62463 47774 -23460 2554 8096 -11461 9129 3343 -10379 6746 -20980 -32779 1087
38985 1087 9852 28465 9898 -42424 -42361 -45859 -35502 -33481 -32086 12620 18579 47526 48271 10321
38971 10321 -19063 -36933 -61030 -39610 -15070 -61781 -15674 -19250 -31182 47604 47237 51795
38959 51795 34944 56510 34924 -16204 3750 57639 71738 60549 23055 19647 7212 55958
38947 55958 64540 9238 -48673 -33947 -49550 -24987 32913 6246 -48655 -55693 15711 26083
38935 26083 -18041 -68904 11693 37046 33324 -12960 24358 51181 -1914 12923 8795 -29087
38923 -29087 -47672 -5113 488 -49540 -90 7090 -12460 -2548 538 -41916 -25453 8710
38911 8710 16325 11802 4344 9605 20181 -19378 -7123 13995 -41437 -47489 1432 44459 52370
38898 52370 53995 38777 11280 13693 -2524 -56962 -48981 14057 41683 -28883 -49638 -16407
38886 -16407 7033 25929 -19457 -27088 2212 -12634 -42805 -15716 31216 -18983 213 27402
38874 27402 23619 -16713 -9880 -59049 -59634 -30839 8749 60628 59414 45540 -22781 -8111 42625
38861 42625 61099 17954 3608 -1534 18237 42202 10095 -5062 15659 24748 29799 23879
38849 23879 20766 16710 35122 -13039 -64129 -19607 -28990 -47336 -32559 -7257 -5208 -5247 -16060
38836 -16060 26311 49451 30043 -77 -18825 -32821 -15858 57992 37631 -17130 26758 94739
38824 94739 25419 -33018 -20574 -23390 5640 10917 6654 40150 -14318 19441 55661 30366
38812 30366 -4485 -13993 -56479 -6213 59953 38914 2964 24009 14196 -15778 1665 -22019
38800 -22019 -46055 -35285 -34670 -60195 -60909 -35306 -25504 -37637 -14310 8260 9227 -17851 1680
38787 1680 6273 31744 41555 33787 5510 -22624 -60270 -51371 -17335 -1824 -59155 -46963 -38602
38774 -38602 -18420 3498 -7436 -21328 -17480 -48345 -48211 49681 48046 -3216 -21297 -38003
38762 -38003 -26510 -14181 -12266 12520 19909 12937 -8059 -37536 -17989 46838 70978 42459
38750 42459 -10533 -10758 21355 8212 -3359 -16211 -23436 -63412 -96546 -60307 6636 -9660
38738 -9660 -45103 -61435 -51329 -36957 1916 2281 -35074 -4946 22105 66349 78227 73902
38726 73902 54545 25641 34861 43133 59174 58582 22994 22598 1022 -56055 -49952 -22044 19875
38713 19875 19244 20910 10696 -2823 -66092 -49628 22140 43824 38390 54094 76220 68566 47023
38700 47023 47731 72233 63451 -6352 -19481 -5167 -36620 -15986 -56798 -65236 -63139 -23807 -23486
38687 -23486 -72390 -100331 -84867 -80289 -27340 9783 31286 -289 4878 -17768 -41408 -22324
38675 -22324 -45146 -45107 -45145 -5786 -28669 -46521 -30006 -5917 2208 -11938 -12085 23842 12781
38662 12781 -12297 -31563 -47118 -6778 15752 -52045 -77270 -41860 -41555 -31416 14956 31643
38650 31643 24845 -136 11547 27626 2443 34054 8623 30993 64077 40910 32341 45405
38638 45405 46308 60691 34055 -19776 -18564 27672 32872 -18002 -36388 -44705 -34266 -17742 -14994
38625 -14994 7001 -9694 -5566 22653 -14895 -30627 -28337 10337 -2170 31230 38671 31167
38613 31167 8516 15736 6951 -1603 42974 64882 52962 53252 38523 12447 29363 55719 19722
38600 19722 3856 -2609 41459 4964 -31760 -13059 34069 54766 20457 12440 13305 44724
38588 44724 58643 73733 35206 28976 -4673 -11535 -16039 19607 33191 26315 -369 33204
38576 33204 66425 67727 76947 45700 37363 8662 -22756 8829 46455 45041 52191 16484 1856
38563 1856 -13318 -10973 -21698 -33901 -84833 -64994 13587 46300 16117 -11399 49261 61633
38551 61633 50415 2492 17899 40667 9266 12816 9441 28162 -16411 17280 65093 26040
38539 26040 31366 73297 72181 65971 41605 10539 -36949 -74212 -35109 -12662 -15512 -9681 487
38526 487 -442 -17380 -13113 2764 -6945 -7744 -42226 -80036 -73507 15708 23764 4130 -596 -33544
38512 -33544 -26012 -28959 -3485 2097 -20893 10014 9024 -28124 -45618 6100 -15288 -70002 -52497
38499 -52497 -4069 -11579 -32134 7495 26071 -11201 -3330 -16559 14927 17693 33365 52136
38487 52136 1691 -24416 -20856 -33343 15239 24491 11936 -5246 7359 15596 37485 -11456
38475 -11456 -16563 -27231 3631 331 5337 12302 -7116 51138 62037 12337 519 -53627
38463 -53627 -48362 18401 24500 12645 -30330 -3058 63507 56415 1079 -29730 -20339 -7308
38451 -7308 29001 13998 -18839 -11669 -32613 -53820 -82108 -82378 -65251 -49107 1409 7577 40367
38438 40367 53429 41881 32906 -13277 -53109 2126 -2206 4813 47566 33438 36357 17794
38426 17794 -3312 -38592 -32565 -39492 -43529 -30114 16885 10847 -15068 30285 43759 -1168
38414 -1168 -7034 -29229 5727 40298 38580 29191 36162 49833 -10670 -24879 16418 41348 78005
38401 78005 19320 -16985 -21094 -35566 19704 57223 37166 62253 60425 33652 -39409 -27921
38389 -27921 42367 55222 49603 -19408 6467 5411 -14625 13107 49897 36075 31446 -4640
38377 -4640 12183 23014 -31043 -23707 -15147 6656 -1331 -2901 5847 6902 17604 32328 36540
38364 36540 27152 -8581 -17171 -38559 -1557 -17218 41971 86052 113454 65682 19145 -1130
38352 -1130 19026 9375 -29975 -30174 -28859 -64894 -118260 -51744 1926 48140 24259 43019 70060
38339 70060 78671 33883 5494 29244 18140 914 -20646 -63930 -40212 5710 28096 24913
38327 24913 -5592 10751 21574 19290 35539 38598 62080 43687 45812 28136 3357 70093
38315 70093 103898 102162 42348 36061 54375 13046 -4733 16145 17172 34510 53935 7041
38303 7041 -48454 -13648 49392 57721 68217 43330 47075 58476 3786 3343 16105 29651 12796
38290 12796 -26414 -22321 27208 27969 10990 18203 12150 -13836 -54975 -75858 1634 13050 -41259
38277 -41259 -28864 -19113 -14804 -29634 61 9581 -22721 -29867 33608 22688 -5773 27128
38265 27128 22801 -11122 26499 55030 39068 20797 -14519 13004 -9443 20898 -6827 -9233
38253 -9233 25959 32907 -7426 -22582 4824 -14480 -25518 15818 13432 18597 76605 54416
38241 54416 35121 31733 -6949 -39672 -59860 -86101 -101348 -90066 -35758 44988 26622 -50568
38229 -50568 -970 -38952 -89452 -73382 -31919 -37249 -46250 -64241 -64276 -4672 -15697 10965 -1018
38216 -1018 -24206 -16979 -35054 -21619 1902 -2599 -28592 -37795 -34848 -36405 -62277 -54362 -96486
38203 -96486 -84255 -57290 -38452 -7380 -13834 -18228 25066 38569 30217 -32200 -78553 -93737
38191 -93737 -55086 -37075 -25005 -23156 4302 30776 244 28392 29678 52117 26132 27195
38179 27195 -26926 -67590 -42933 -62627 -56208 -25941 -7594 -11155 -28584 -62171 -35133 -27957
38167 -27957 -10379 29089 15814 44423 39008 -3813 -47013 -29530 -34477 -19252 -16141 20891
38155 20891 -9872 -5701 22111 38813 5756 -94186 -66252 20173 26517 21615 26524 55165
38143 55165 52225 69206 88198 70476 23467 20471 26199 9609 14865 29908 30025 33805 50239
38130 50239 30918 44913 21541 30646 -33982 -2120 40432 24575 39982 58441 30861 24576
38118 24576 33637 -7683 -29023 -56703 -65829 -58731 -39546 5302 29389 39746 29724 31203
38106 31203 -2530 12598 -775 -13720 -33719 -6176 16446 1527 -5928 28048 10932 5700
$$ [...]
##END NTUPLES=NMR SPECTRUM
##END=
