##TITLE=19F_CA-8525-2-2
 CDCl3. 24 sc
 9.1.2019
##JCAMPDX= 6.0         $$ Bruker NMR JCAMP-DX V2.0
##DATA TYPE= NMR SPECTRUM
##DATA CLASS= NTUPLES
##ORIGIN= UXNMR, Bruker Analytische Messtechnik GmbH
##OWNER= root
$$ XWIN-NMR		Version 3.5
$$ Wed Jan  9 15:59:38 2019 Russian Standard Time (UT+4h)  she@DPX200
##.OBSERVE FREQUENCY= 188.290927
##.OBSERVE NUCLEUS= ^19F
##.ACQUISITION MODE= SIMULTANEOUS
##.ACQUISITION SCHEME= undefined
##.AVERAGES= 24
##.DIGITISER RES= 16
##SPECTROMETER/DATA SYSTEM= spect
##.PULSE SEQUENCE= zg
##.SOLVENT NAME= DMSO
##.SHIFT REFERENCE= (INTERNAL, DMSO, 0, 98.3737)
##AUDIT TRAIL= $$ (NUMBER, WHEN, WHO, WHERE, WHAT)
$$ ##TITLE= Audit trail, XWIN-NMR		Version 3.5
$$ ##JCAMPDX= 5.01
$$ ##ORIGIN= Bruker BioSpin GmbH
$$ ##OWNER= she
$$ F:/spectra/data/she/nmr/f19/1/pdata/1/auditp.txt
$$ ##AUDIT TRAIL=  $$ (NUMBER, WHEN, WHO, WHERE, WHAT)
(   1,<2019-01-09 15:58:18.48 +0400>,<she>,<DPX200>,
      <created by zg, POWCHK disabled, PULCHK disabled
       configuration hash MD5:
       00 E9 B6 7A A2 85 ED C7 34 08 36 98 17 FE 4E 26
       data hash MD5: 64K
       13 9C 4D 66 E8 8A 33 A4 72 88 3E 17 07 3F CD 95>)
(   2,<2019-01-09 15:58:30.67 +0400>,<she>,<DPX200>,
      <Start of raw data processing
       efp BC_mod = 2 LB = 1 FT_mod = 6 PKNL = 1 PHC0 = 1665.264 PHC1 = 41.75593 SI = 64K 
       data hash MD5: 64K
       77 AD 6D D3 F9 CF 17 0D 82 AF 9B 08 3E 70 DD E6>)
(   3,<2019-01-09 15:58:53.98 +0400>,<she>,<DPX200>,
      <pk PHC0 = 28.63525 PHC1 = 0 
       data hash MD5: 64K
       EB 66 D0 92 3F 27 6A C1 61 D5 26 6A 52 0C D2 C1>)
(   4,<2019-01-09 15:58:58.07 +0400>,<she>,<DPX200>,
      <abs ABSG = 5 
       data hash MD5: 64K
       6E C1 20 8A 32 09 5A 49 A5 2F 5B 62 45 9C B2 2A>)
$$ ##END=
$$ 
$$ hash MD5
$$ 8C BD 5F 82 97 BB 97 A2 AA F4 CF F3 3F 1A 4A 19
##$RELAX= 
##$RELAX= 
##$RELAX= 
##$RELAX= 
##$RELAX= 
##$RELAX= 
##$RELAX= 
##$RELAX= 
$$ Bruker specific parameters
$$ --------------------------
##$DU= <F:/spectra>
##$EXPNO= 1
##$NAME= <f19>
##$PROCNO= 1
##$TYPE= <nmr>
##$USER= <she>
##$AMP= (0..31)
100 100 100 100 100 100 100 100 100 100 100 100 100 100 100 100 100 100 
100 100 100 100 100 100 100 100 100 100 100 100 100 100 
##$AQSEQ= 0
##$AQ_mod= 1
##$AUNM= <au_zg>
##$AUTOPOS= <>
##$BF1= 188.310428
##$BF2= 200.13
##$BF3= 200.13
##$BF4= 200.13
##$BF5= 200.13
##$BF6= 200.13
##$BF7= 200.13
##$BF8= 200.13
##$BYTORDA= 1
##$CFDGTYP= 0
##$CFRGTYP= 5
##$CHEMSTR= <none>
##$CNST= (0..31)
1 1 145 1 1 1 1 1 1 1 1 1 1 1 1 1 1 1 1 1 1 1 1 1 1 1 1 1 1 1 1 1 
##$CPDPRG= <>
##$CPDPRG1= <>
##$CPDPRG2= <>
##$CPDPRG3= <>
##$CPDPRG4= <mlev>
##$CPDPRG5= <mlev>
##$CPDPRG6= <mlev>
##$CPDPRG7= <mlev>
##$CPDPRG8= <mlev>
##$CPDPRGB= <>
##$CPDPRGT= <>
##$D= (0..31)
0 1.3 0 0 0 0 0 0 0 0 0 0 0.25 0 0 0 0 0 0 0 0 0 0 0 0 0 0 0 0 0 0 0 
##$DATE= 1547035097
##$DBL= (0..7)
120 120 120 11 120 120 24 19 
##$DBP= (0..7)
150 150 150 150 150 150 150 150 
##$DBP07= 0
##$DBPNAM0= <>
##$DBPNAM1= <>
##$DBPNAM2= <>
##$DBPNAM3= <>
##$DBPNAM4= <>
$$ [...]
##$SUBNAM3= <"">
##$SUBNAM4= <"">
##$SUBNAM5= <"">
##$SUBNAM6= <"">
##$SUBNAM7= <"">
##$SUBNAM8= <"">
##$SUBNAM9= <"">
##$SW= 251.107818259711
##$SWIBOX= (0..15)
0 1 0 0 0 0 0 0 0 0 0 0 0 0 0 0 
##$SW_h= 47281.3238770686
##$TD= 65536
##$TD0= 1
##$TE= 0
##$TE2= 300
##$TE3= 300
##$TEG= 300
##$TL= (0..7)
0 120 53 12 22 120 120 120 
##$TP= (0..7)
150 150 150 150 150 150 150 150 
##$TP07= 0
##$TPNAME0= <>
##$TPNAME1= <>
##$TPNAME2= <>
##$TPNAME3= <>
##$TPNAME4= <>
##$TPNAME5= <>
##$TPNAME6= <>
##$TPNAME7= <>
##$TPOAL= (0..7)
0.5 0.5 0.5 0.5 0.5 0.5 0.5 0.5 
##$TPOFFS= (0..7)
0 0 0 0 0 0 0 0 
##$TUNHIN= 0
##$TUNHOUT= 0
##$TUNXOUT= 0
##$USERA1= <user>
##$USERA2= <user>
##$USERA3= <user>
##$USERA4= <user>
##$USERA5= <user>
##$V9= 5
##$VALIST= <valist>
##$VCLIST= <CCCCCCCCCCCCCCC>
##$VD= 0
##$VDLIST= <DDDDDDDDDDDDDDD>
##$VPLIST= <PPPPPPPPPPPPPPP>
##$VTLIST= <TTTTTTTTTTTTTTT>
##$WBST= 1024
##$WBSW= 4
##$XGAIN= (0..3)
0 0 0 0 
##$XL= 0
##$YL= 0
##$YMAX_a= 51371
##$YMIN_a= -39834
##$ZGOPTNS= <>
##$ZL1= 120
##$ZL2= 120
##$ZL3= 120
##$ZL4= 120
##$ABSF1= 98.37372
##$ABSF2= -152.7273
##$ABSG= 5
##$ABSL= 3
##$ALPHA= 0
##$AQORDER= 0
##$ASSFAC= 0
##$ASSFACI= 0
##$ASSFACX= 0
##$ASSWID= 0
##$AUNMP= <proc_1d>
##$AZFE= 0.1
##$AZFW= 5
##$BCFW= 0
##$BC_mod= 2
##$BYTORDP= 0
##$COROFFS= 0
##$CY= -3
##$DATMOD= 1
##$DC= 0
##$DFILT= <>
##$DTYPP= 0
##$F1P= 0
##$F2P= 0
##$FCOR= 0.5
##$FTSIZE= 65536
##$FT_mod= 6
##$GAMMA= 0
##$GB= 0
##$INTBC= 1
##$INTSCL= 8.653935e-10
##$ISEN= 128
##$LB= 1
##$LEV0= 0
##$LPBIN= 0
##$MAXI= 10000
##$MC2= 0
##$MEAN= 0
##$ME_mod= 0
##$MI= 0.4277144
##$NCOEF= 0
##$NC_proc= -3
##$NLEV= 6
##$NOISF1= -61.99997
##$NOISF2= -62.99997
##$NSP= 0
##$NTH_PI= 0
##$NZP= 0
##$OFFSET= 98.37372
##$PC= 1
##$PHC0= 1693.899
##$PHC1= 41.75593
##$PH_mod= 1
##$PKNL= yes
##$PPARMOD= 0
##$PSCAL= 0
##$PSIGN= 0
##$REVERSE= no
##$SF= 188.296044280273
##$SI= 65536
##$SIGF1= -61
##$SIGF2= -65
##$SINO= 3.502647
##$SIOLD= 65536
##$SREGLST= <1H.CDCl3>
##$SSB= 0
##$STSI= 65536
##$STSR= 0
##$SW_p= 47281.3238770685
##$SYMM= 0
##$S_DEV= 0
##$TDeff= 65536
##$TDoff= 0
##$TI= <>
##$TILT= no
##$TM1= 0
##$TM2= 0
##$TOPLEV= 0
##$USERP1= <user>
##$USERP2= <user>
##$USERP3= <user>
##$USERP4= <user>
##$USERP5= <user>
##$WDW= 1
##$XDIM= 65536
##$YMAX_p= 526000261
##$YMIN_p= -742873
$$ End of Bruker specific parameters
$$ ---------------------------------
##NTUPLES= NMR SPECTRUM
##VAR_NAME=  FREQUENCY,     SPECTRUM/REAL,   SPECTRUM/IMAG
##SYMBOL=    X,             R,               I
##VAR_TYPE=  INDEPENDENT,   DEPENDENT,       DEPENDENT
##VAR_FORM=  AFFN,          ASDF,            ASDF
##VAR_DIM=   65536,         65536,           65536
##UNITS=     HZ,            ARBITRARY UNITS, ARBITRARY UNITS
##FACTOR=    0.721466756344984, 1,           1
##FIRST=     18523.3820098237, 0,            0
##LAST=      -28757.9418672448, 0,           0
##MIN=       -28757.9418672448, -742873,     0
##MAX=       18523.3820098237, 526000261,    0
$$ Real data points
##PAGE= N=1
##DATA TABLE= (X++(R..R)), XYDATA
$$ [...]
47722a23363O7031o791j40073K7726J15230M4638j8291j72349J87724L1755r88
47711A2249j4434j29372j65540R4846J04924J53596n8589J58458n9643q9252M9947
47700E7190J32915l5104j35224m5077O1140O4009l4116j61336k02834L54671J20456
47689A76690k28835K6894P1714j35471J2877M1670K02053j48683j27598n5103
47679a63792J05748K8888J0367N0454J16675o1922l1697m8324j18953M1382o080
47668g7254J9589K0518N368Q6116n9503j06343N0954J04637O5000J4107j42428
47657a9239M7263o3337M0970K2401o7649J02421j10149n4859r921R0920N2686
47646C1507K0736j5630p8580m1147K65512j81901q9916j65299J29130J50511j50688
$$ plain form
47722 -123363 -56332 -63123 -203196 -175470 -60240 -15602 -33893 -206242 -18518 13237 12249
47711 12249 -2185 -131557 -297097 -202251 -97327 56269 -2320 156138 96495 7243 57190
47700 57190 190105 155001 19777 -25300 35840 99849 65733 -95603 -298437 56234 176690
47689 176690 -52145 -25251 46463 -89008 -76131 -34461 167592 18909 -108689 -163792
47679 -163792 -58044 -29156 -18789 31665 148340 86418 54721 6397 -112556 -71174 -77254
47668 -77254 -57665 -37147 -31779 54337 -5166 -111509 -60555 44082 109082 123189 -19239
47657 -19239 28024 -35313 5657 28058 -39591 62830 -47319 -102178 -112099 -21179 31507
47646 31507 52243 36613 -41967 -83114 182398 497 -89419 -254718 -125588 24923 -125765
47635a25765M4812N239j84579j12995J58252J63158K01989j03451n9006J13418
47625A01072J80853L8456j94219j14843M9165R8847M8365L8715Q2441r0409m1594
47614A96849q2083L7379M399J1147j56206j84088P9417M775k959l0365J35225
47603A3490j4944k5572L4985K1457j01557M7754P2262P3853O8628k59J7711j08964
47591I8844J3804J58303k08356q4675O4569O8722R2061R113j19526j94747o4422
47580a66310K00173n416j7014j82283O281K42164l297J6677k4398p3666K0522
47569A3433K0318J30813k1675m8726j04462j5507k0978M1636J92178N9004r655
47558B36379j59929l4402m2645J75959J06474q2426j59494P0803K20975k21567
$$ plain form
47635 -125765 -80953 -75714 -260293 -373288 -215036 -51878 150111 46660 -12346 101072
47625 101072 281925 320381 126162 11319 60484 159331 207696 246411 328852 238443 196849
47614 196849 114766 152145 156544 167691 11485 -172603 -93186 -88411 -91370 -121735 13490
47603 13490 -1454 -27026 7959 29416 -72141 -24387 47875 121728 190356 190097 207808 98844
47591 98844 112648 270951 62595 -22080 42489 111211 203272 212385 92859 -101888 -166310
47580 -166310 33863 28447 11433 -170850 -164569 77595 74298 90975 66577 -7089 13433
47569 13433 33751 164564 142889 94163 -10299 -25806 -46784 -5148 187030 246034 236379
47558 236379 76450 42048 -597 175362 281836 199410 39916 110719 331694 110127
47548A10127j64612n8024J1066m7533m730R8989K7519k05395k6866J49216J54196
47537D3953N1572n1875m9702j43269J67180N8396j79581k4107n5890L1995P9630
47526g1698q487n0767m5803J29397N1276j03858J55206J04011j0730J31081N394
47515B85022j37948j32355J41733K5638k3693L5741k1392J39132J80966k12029
47505B80815n5354K5079p8332K0310K4227j92658k637J6988q1272R4904j33550
47494h1480l7534L03951m9807k07612J50942L0621l8948j60723K00395n8704p0699
47483a9598J29623k8993j89855r2438J01414K0903l5079K16727R8386o2253o2895
47472G5942J03349O0495r7678j05115o1556j79745L6992J25647p1318q0312k4479
$$ plain form
47548 110127 -54485 -112509 -101443 -148976 -153706 -54717 -27198 -232593 -259459 -110243 43953
47537 43953 95525 43650 -6052 -149321 17859 76255 -103326 -127433 -183323 -151328 -71698
47526 -71698 -80185 -130952 -176755 -47358 3918 -99940 55266 159277 148547 279628 285022
47515 285022 147074 14719 156452 182090 158397 194138 172746 311878 492844 280815
47505 280815 225461 250540 172208 192518 216745 24087 21450 38438 -42834 52070 -81480
47494 -81480 -119014 184937 135130 -72482 78460 109081 70133 -90590 109805 51101 -19598
47483 -19598 110025 81032 -108823 -201261 -99847 -78944 -114023 102704 201090 138837 75942
47472 75942 179291 239786 142108 36993 -24563 -204308 -167316 -41669 -112987 -193299 -217778
47461b17778o1307J40430N3088L4617J58341K0356j70135j2802N6592m2796p5311
47450a16705j30281L0691P2555j95873R3194K70750q7564j01013K794k38J7890
47439a43800o5563o67J3889R6784J13269p6516r4740J39390J26575m1421J14027
47428A81227J26903L7155L1693q0196l87255k3923J27901M2865J7393j54144p2196
47417a52577m9092k8827M5821R7454j61274R2322K46122L4193N9554M0619j65884
47406E8431N5545J50115j11740m2018j19068J17817k5084p1633K4032N0435J73449
47395B60281j8384n4621j29578N202J64486r991K4646q1210L8927o628k61585
47384f8455r4901J23770J77223m5163m5419p1065J21058j40600k25301J07444
$$ plain form
47461 -217778 -279085 -138655 -85567 -50950 107391 127747 -42388 -55190 1402 -41394 -116705
47450 -116705 -246986 -216295 -143740 -339613 -246419 24331 -63233 -164246 -161452 -161690 -143800
47439 -143800 -209363 -210030 -196141 -99357 13912 -62604 -157344 -17954 108621 67200 181227
47428 181227 308130 345285 376978 296782 -90473 -114396 13505 56370 73763 -80381 -152577
47417 -152577 -201669 -230496 -184675 -87221 -248495 -156173 89949 124142 183696 224315 58431
47406 58431 113976 264091 152351 110333 -8735 109082 83998 12365 36397 86832 260281
47395 260281 241897 187276 57698 62900 227386 217395 242041 160831 199758 193130 -68455
47384 -68455 -163356 -39586 137637 92474 47055 -24010 97048 -43552 -268853 -161409
47374a61409M367P9037J80981J33943R744m0042j97645o5563L8910J13177R1494
47363A86994m4423R5870j72493j40953J35763K4250p1085P4927J2006k20575q2622
47352b02341P997N7932O2764K07726J96716n0924M9245j21242l43099n6681J91051
47341h56R5279n9393N5433k4258o4852Q8996R6031j5889k09501L1397L2724j75050
47329a49939k92371K53600J32903J88544K59102j98170j80392K079Q1703q0711
47319A6348p1309M2095m0287M1312N0897j23072j01347J58036P7239J69524p8270
47308A41166n9499j70753j00400N5608m3721J71313L2146m7198M1286L0977o328
47297D4597L1543p0896k4928J62751l4750j83381N2778Q1581P3950M3916J10804
$$ plain form
47374 -161409 -157042 -78005 102976 236919 246663 206621 8976 -56587 -17677 95500 186994
47363 186994 142571 238441 65948 -75005 60758 85008 13923 88850 100856 -119719 -202341
47352 -202341 -194344 -136412 -73648 134078 330794 279870 329115 207873 -135226 -191907 -856
47341 -856 94423 35030 90463 66205 1353 90349 186380 170491 -39010 -7613 25111 -149939
47329 -149939 -442310 -188710 -55807 132737 391839 193669 13277 15356 97059 16348
47319 16348 -54961 -12866 -53153 -11841 39056 -84016 -185363 -27327 49912 219436 141166
47308 141166 81667 -89086 -189486 -133878 -177599 -6286 25860 -21338 19948 50925 44597
47297 44597 76140 5244 -19684 143067 108317 -75064 -22286 59295 133245 177161 287965
47286B87965j72967l7457J10714j05578k28686O3075L9165J5403J13990N6542
47276A42166q6625l786M9152N9204L3506j68793m4448j6303J01146j34999N2358
47265a7422j2620J4435J55612j10360j49244r5210K63539J40007l22041J52507
47255A9203j418N0166J64176O4404j38959K2406Q5104l71670k18481M8705L75230
47244I8866L06303m2093j29688j04500J78845J28099l47306k8631J9128k29615
47234a50592R7626P1473M1952j25420M4266l0266j01264J35498K051k7506K2160
47223b0022P779r0814J51212l670j01178M6003L1881K42405j37350k22629P8621
47212a7762O6281k3181J8390o5065J8792p1360P9626O7952j39341J18417O7800
$$ plain form
47286 287965 114998 77541 188255 82677 -146009 -82934 -43769 -28366 85624 142166
47276 142166 55541 51755 100907 160111 193617 24824 -19624 -35927 65219 -69780 -17422
47265 -17422 -30042 -15607 140005 29645 -119599 -214809 48730 188737 -133304 19203
47255 19203 17785 67951 232127 296531 157572 179978 265082 -106588 -325069 -276364 98866
47244 98866 405169 363076 233388 128888 307733 435832 88526 59895 79023 -150592
47234 -150592 -52966 18507 60459 -64961 -20695 -50961 -152225 -16727 -14676 -42182 -20022
47223 -20022 -12243 -103057 48155 44485 -56693 -10690 21191 263596 126246 -96383 -17762
47212 -17762 48519 25338 43728 -21337 -2545 -73905 5721 73673 -65668 52749 120549
47201A20549j185J06455p2148k30358J9848n4038O9002O6344J49067j20219j35404
47190h2087J22690j89206l2916L8114J19105J79130j02222j3356J32636r3233
47180G8655j41629r6394J33905m7443j43252J6951j7190J41355N8953j43979J37873
47169b2195j9757o0038N6470M2156K13802K688j3141Q5313o5941j88360r7591
47158f6594K01327N1052j23246j87927J82655K00395k71166r8307L2888N7771
47148b1152K94565n14085r3612J88422k2004L6244o003J35535N3876O2099L442
47137A17327j51661k22983k6538K84084n2480n9581O2920P4343l42240K9610J66529
47126a20670J05253J32928P8883j46293p8255J03481m4426L0634j446p3402J74514
$$ plain form
47201 120549 119364 225819 153671 -76687 -56839 -110877 -41875 24469 173536 53317 -82087
47190 -82087 40603 -148603 -181519 -143405 -24300 154830 52608 39252 171888 78655
47180 78655 -62974 -159368 -25463 -72906 -216158 -199207 -216397 -75042 -16089 -160068 -22195
47169 -22195 -41952 -101990 -45520 -3364 210438 213126 199985 285298 219357 30997 -66594
47158 -66594 134733 185785 62539 -125388 57267 257662 -13504 -111811 -78923 -21152
47148 -21152 273413 -240672 -334284 -145862 -167866 -131622 -137625 -2090 51786 113885 117327
47137 117327 -34334 -257317 -283855 229 -52251 -111832 -48912 25431 -316809 -287199 -120670
47126 -120670 -15417 117511 196394 50101 -28154 75327 30901 61535 60089 -13313 161201
47115A61201l6099j22739K2028J05369j10315J62116J8264n5118k73016j19082
47105b47391J11679J6490l4272l4105J00525N1931J37220o0713k3828J3898k0016
47094A1418j53301l9084P296r0936J3833M7257M27479K77975k71211j68242O5599
47083A28083p1549q6998J66552n0083j92313J7198J48830J00818k17677K6922
47073c0217L759j5533K52847J20139j69151r7822J3822N1878K4902j13639j82823
47062a41838M067k1855J10329Q8679l0805j39887P5763o0263J09248Q0036M1490
47051A14964j2951k9377Q0245j50323j00312J3146R3835j36096l7259J40740J72549
47040A49161j16230Q468j0259n5898l3147j10214l6581J87965J38124p2209m3823
$$ plain form
47115 161201 125102 2363 24391 129760 19445 181561 199825 144707 -128309 -247391
47105 -247391 -135712 -119222 -153494 -187599 -87074 -35143 102077 41364 17536 31434 11418
47094 11418 -141883 -180967 -173671 -264607 -250774 -203517 223962 501937 230726 62484 128083
47083 128083 56534 -30464 136088 86005 -106308 -89110 59720 160538 -57139 -30217
47073 -30217 -26458 -41991 210856 330995 161844 64022 77844 129722 154624 40985 -141838
47062 -141838 -137771 -159626 -49297 39382 8577 -131310 -55547 -115810 -6562 73474 114964
47051 114964 102013 72636 152881 2558 -97754 -84608 9227 -126869 -164128 -23388 149161
47040 149161 32931 41399 31140 -24758 -57905 -168119 -204700 -16735 121389 49180 5357
47029E357J27116j37221n1213m5625j56078L3305K03585O1031j04811j53342J95721
47018b2175P1457j38006j1054K23020l0299j73389j24138K270O3455j20337k3321
47007b82517J50790M243J27949o1250R3297j0164k37339K43569j0746j10040J5373
46996g6835J1881j35589K17043Q4660o6040l7130J17076J63800m5676j31839q8743
46985A2608L9289j84152j02948K41545J88926l2391j0384j08q7476r5489R4503
46974F3923j43685J18668m1911j03801L0428K17475o9042k78933J48696k3772
46964h1954R3347j9725r139J53457K48694K4911k54997j06157N7725K6649J82010
46953C14821j16038k33070O1102J24605k24031M3235N9790o4745K0875j02450
$$ plain form
47029 5357 132473 -4748 -55961 -101586 -257664 -224359 -20774 40257 -64554 -217896 -22175
47018 -22175 49282 -88724 -99778 123242 92943 -80446 -204584 -202314 -138859 -259196 -282517
47007 -282517 -131727 -127484 465 -60785 32512 22348 -214991 28578 17832 -92208 -76835
46996 -76835 -64954 -200543 16500 101160 35120 -2010 115066 278866 233190 101351 12608
46985 12608 51897 -132255 -235203 6342 195268 162877 152493 152385 64909 -30580 63923
46974 63923 -79762 38906 -3005 -106806 -76378 141097 72055 -206878 -58182 -81954
46964 -81954 11393 -8332 -17471 135986 384680 409591 154594 48437 106162 132811 314821
46953 314821 198783 -34287 26815 151420 -72611 -29376 30414 -34331 -13456 -115906
46943a15906J41312j19742q8868m2048K11421K1567k3888R9606J40261j9961o2068
46932A41686n8267P5164L2598M9813k02609j36210J60471K4040p8770r4118J04458
46921A8256Q5432J43653K0206l57112L8502L2455j12129O2027J8882j3413j23704
46910a86945J14032M3144j20045O4524J95727M6943j04219K0479j46661O3721
46900i300K93962k7489o8643j22165M2890o113o2294j280J09578q8374o7394q9922
46888i6544P6576q4458m7160l3596K03888k015r4031N4637j60147O2338m7578
46877a68090O9225O9729k1813N0994R2096K7355r2836K3342j36680M5849o3787
46866a04616K40972k3132R9991Q0333q3322j01189l36753O4100J90253n815L8219
$$ plain form
46943 -115906 25406 -94336 -183204 -225252 -13831 7736 -16152 83454 223715 203754 141686
46932 141686 83419 158583 191181 240994 38385 -97825 62646 86686 7916 -86202 18256
46921 18256 103688 247341 267547 -89565 -51063 -18608 -130737 -68710 -49828 -63241 -186945
46910 -186945 -72913 -29769 -149814 -85290 110437 157380 53161 73640 -73021 -9300
46900 -9300 284662 257173 188530 66365 109255 103142 40848 39568 149146 60772 -6622 -96544
46888 -96544 -19968 -104426 -151586 -185182 18706 16691 -77340 -22703 -182850 -120512 -168090
46877 -168090 -98865 -29136 -50949 45 92141 119496 26660 50002 -86678 -40829 -104616
46866 -104616 136356 113224 213215 293548 210226 109037 -227716 -163616 26637 20822 59041
46855E9041J1351j3162N5050R636n0474p390r2510j70855n6701M04111q0876k26196
46843a58975K7928J35039J22944J57156J23289m05059j28006J03365N5404j1461
46833B1624J18002M8152j01377r2135j80789L10547K08017j75987J44358M753
46823C05165p3471m5609L0551j8286p6858M0677k51707K9343J29762M4191n7911
46812E5847k16775K8075r2344J27895N8905j07905j90617L9080J57354O2006O4750
46801a3729Q6536r094k1271J24323k14763N3755J87998j38697O2159L0338j43424
46790D131N2047k9406j02170M9426K40K32812l4664j51074j01794n2124J76630
46779D4054L6279j78226O8303N9747N1811k03278Q5256J32231j77397k0081m9849
$$ plain form
46855 59041 70392 57230 112280 121916 71442 64052 -28458 -199313 -256014 148097 67221 -158975
46843 -158975 -131047 3992 126936 284092 407381 2322 -125684 -22319 33085 21624
46833 21624 139626 187778 86401 -5734 -186523 124024 332041 156054 300412 305165
46823 305165 231694 186085 216636 198350 121492 162169 -89538 -60195 69567 113758 55847
46812 55847 -160928 -132853 -225197 -97302 -38397 -146302 -336919 -297839 -140485 -78479 -13729
46801 -13729 72807 63713 42442 166765 -47998 5757 193755 55058 117217 147555 4131
46790 4131 56178 26772 -75398 -25972 -25732 207080 172416 21342 -80452 -132576 44054
46779 44054 80333 -97893 -29590 30157 81968 -121310 -36054 96177 -81220 -101301 -151150
46768a51150m1906m3050J9721J36261K00877j9676j66946k01026k345K7029M2426
46757a99785J4290o1024K08178J79787j11810J2562q4626j45092K12498J901N4299
46746H1178Q1112J04899j50768n5287k8676m9177K3905J9767M3449R2046J91241
46735C53689m7710L8106m963j79540L5352r7719R9399j73076K02110K30361j17238
46724C38771J4499l6845k23493j17363q918K41376k42118J0539O6991n7195k1433
46713c5189K15244Q5440n2749J2165m9204q2641m7608k1361K29398J01412r0453
46702B64454l3037p2097l8850k39717j64269L04672j5274m2884L6848J7588j435
46691A5999J67091J54688o3756j36642q0340M6520J36024J5477M5550P2692r5835
$$ plain form
46768 -151150 -193056 -236106 -216385 -80124 120753 101077 -65869 -266895 -269240 -242211 -199785
46757 -199785 -185495 -246519 -38341 141446 29636 42198 -42428 -187520 24978 26879 81178
46746 81178 162290 267189 116421 61134 32458 -16719 7186 26953 70402 162448 353689
46735 353689 305979 344085 339122 159582 194934 97215 196614 23538 225648 456009 338771
46724 338771 353270 316425 92932 -24431 -33349 208027 -34091 -23552 43439 -13756 -35189
46713 -35189 180055 265495 212746 224911 175707 93066 45458 24097 253495 354907 264454
46702 264454 231417 159320 120470 -119247 -283516 21156 5882 -37002 -154 17434 15999
46691 15999 183090 337778 274022 137380 57040 103560 239584 255061 300611 373303 277468
46680B77468q3832M1835K7794q8347j28060P4485P4644r2926q6918n6639J10668
46669G0172m2840j378K58564O5833j89658j26677q4159L08864N0267j46864j48
46658A61976P5249n6722M6334r6135j73948Q176q0279j4620j13668J14990j7965
46647a46612n7022j1839K48663j01027j33485J2947J2152J70656J33407m1931
46637H5909K569P4933j4402j36074O6503O4004n5472j04881J32259J93830K1915
46626C31093q4902N3616p5180k03920J25597r2391k06800p5500O2000K8913L6123
46615a01351J61568M3443O4668k40279N2396J08011l7161j99939Q387J73704j304
46604C2143M2312q3962R866J29289l3137o713Q0569j14029L6055Q9342m741k13403
$$ plain form
46680 277468 193636 235471 263265 174918 46858 121343 195987 103061 16143 -40496 70172
46669 70172 27332 25954 284518 350351 160693 34016 -50143 258721 308988 162124 161976
46658 161976 237225 180503 226837 130702 -43246 -35070 -115349 -129969 -243637 -128647 -146612
46647 -146612 -203634 -215473 33190 -67837 -201322 -188375 -176223 -5567 127840 85909
46637 85909 88478 163411 149009 12935 79438 143442 87970 -16911 115348 309178 331093
46626 331093 246191 299807 224627 20707 146304 53913 -152887 -228387 -166387 -137474 -101351
46615 -101351 60217 103660 168328 -71951 -19555 88456 51295 -148644 -140257 33447 32143
46604 32143 74455 -9507 359 129648 96511 89798 170367 56338 92393 181735 176994 -36409
46592c6409m2208R4705O5982P9698j38159J21352J5265j04684j55030J07132L01036
46581C08680p3509l27184j81109K3801m1425J28443k871q4933Q7649L5735m288
46570a31011m1385L5361K06830M3084j17601J0448R0392J18648k7745p1665p2205
46559D3151j42300j17632l9710K25875r8522K25624j07669j29283J80154N358
46549D5046M1663M6205j40240j2038M7108K4380n3203k7977j41154L1643R7109
46538d1458R4421o6970k69516L25701k37162Q7784K07456r4056p1578j8782J93560
46527A09400P1203m2084k00560j40283K32314q421P7537p6189J17729N8578K0594
46516B19818k4977M408M7866j61527m5799J62162l2757m2952O3119J31108l9031
$$ plain form
46592 -36409 -78617 16088 82070 161768 23609 144961 160226 55542 -99488 7644 308680
46581 308680 235171 -92013 -273122 -249321 -290746 -162303 -165174 -250107 -162458 -126723 -131011
46570 -131011 -172396 -137035 69795 112879 -4722 5726 96118 214766 187021 115356 43151
46559 43151 -99149 -216781 -256491 -30616 -129138 96486 -11183 -140466 39688 45046
46549 45046 86709 132914 -7326 -19364 27744 52124 -1079 -29056 -170210 -138567 -41458
46538 -41458 52963 -14007 -283523 42178 -194984 -107200 100256 6200 -65378 -84160 109400
46527 109400 180603 138519 -62041 -202324 29990 21569 99106 22917 140646 199224 219818
46516 219818 194841 199249 247115 85588 39789 201951 169194 126242 189361 320469 281438
46505B81438l49314k76131J97371J93829j28664J15537J31925P9742j72287k0296
46495E3150J44214j9355n0994Q6744q6445j47198n669K7358O5426K62694l13420
46484A6505l33938P9421J68521R9213j24382N4421J60337j40783j35070L5717
46474a20038J40611J35889l7924Q9837j43153j77536l0056P9399J39883J54318
46464B31230p6634l4319j54251K0099R8804j75753n2508J51521j5488j970J19030
46453A09761o4611K8114P3580r3827k2112m4080j6189K552J89302k04625r8413
46442a40548M5391J81703J6610O9290k3751j45365j20517K5024n2140L1965J89672
46431G7334p857K6939R9889k8293k00483Q7371J75836l7097p1930n3717J1141
$$ plain form
46505 281438 -67876 -344007 -146636 47193 -81471 34066 165991 245733 73446 53150
46495 53150 197364 178009 127015 213759 127314 -19884 -25553 1805 67231 329925 16505
46484 16505 -317433 -238012 -69491 29722 -94660 -40239 120098 -20685 -155755 -120038
46474 -120038 20573 156462 118538 208375 65222 -112314 -142370 -62971 76912 231230
46464 231230 154596 120277 -33974 -13875 84929 -90824 -143332 8189 -7299 -9269 109761
46453 109761 45150 73264 146844 53017 30905 -13175 -29364 -26812 162490 -42135 -140548
46442 -140548 -95157 86546 103156 172446 148695 3330 -117187 -92163 -144303 -112338 77334
46431 77334 69477 96416 196305 168012 -32471 54900 230736 193639 121709 67992 79133
46420G9133Q6922j52485L05192J1996r9613n9196k32711O0108J40409p9029l6552
46409B4174J02298r875L6758M2434j00919j40628J82192K42549o0012k00657K4395
46398A42709j7494k05030j1034J22475j24674j52304Q1392K2207L7878M9678Q2530
46387B8333Q2135N937j34948j32501J15405R5570j57265O7087N7313P8538k4820
46376H0784o3940J41720P5441N8092k07011j47603K15139K13726j77019p8806
46366A10523J6008l06J13855J68990J15384q1541r2708j7987k00418l5619J6444
46355A12625K06198l0209j69591J05614k2100m9728j38675J6210j49218j00748
46345b19622N9675J55824O3257j18965m309J68209O4103j32326R4470k6767j04650
$$ plain form
46420 79133 166055 13570 318762 330758 231145 171949 -60762 -654 139755 60726 24174
46409 24174 126472 116597 153355 195789 94870 -45758 136434 378983 318971 118314 142709
46398 142709 125215 -79815 -90849 31626 -93048 -245352 -163960 -141753 -103875 -54197 28333
46387 28333 110468 116405 -18543 -151044 -35639 59931 -97334 -30247 27066 105604 80784
46376 80784 16844 158564 234005 292097 85086 -62517 152622 366348 189329 110523
46366 110523 126531 126225 240080 409070 524454 442913 350205 332218 131800 96181 112625
46355 112625 318823 288614 119023 224637 202537 152809 14134 30344 -118874 -219622
46345 -219622 -159947 -4123 59134 -59831 -64140 104069 168172 35846 130316 103549 -1101
46334a101J15890J65668k2606j33626k09935p450K0385r5873J50461K6515M9095
46323E7423p9475N3796r1734M139J34847N4564K4542o5466O7621J25104J10951
46312C96312j76860q0641j33521j58438J17203K84497m0994k63638j5409m3667
46302a15156k7867r130K09837O4316R5485m0565N441q6140j39783Q8526N8068
46291A03032p5387j29091Q1065J12744O8905m8207J9868K31431L5652k93231j10807
46280d026r1016j069o3781K52807J22228Q9222q8634j309j45344j9141P5581o9288
46268E6230l3323p4233J6193j52956J34368J09080J38002K6530k62989N3347j70292
46257a60043j2632J95701p5606k3875o8706o5878K46874J35517k77070J38625
$$ plain form
46334 -1101 114789 280457 257851 124225 -85710 -93160 -72775 -168648 -18187 8328 57423
46323 57423 -22052 31744 -59990 -55851 78996 133560 158102 92636 160257 285361 396312
46312 396312 219452 138811 5290 -153148 -35945 248552 207558 -56080 -71489 -115156
46302 -115156 -143023 -152153 57684 122000 217485 176920 182361 96221 -43562 44964 103032
46291 103032 27645 -101446 -20381 92363 161268 113061 132929 364360 400012 106781 -4026
46280 -4026 -95042 -96111 -159892 92915 215143 304365 215731 214422 69078 49937 125518 56230
46268 56230 22907 -51326 -35133 -188089 -53721 55359 193361 219891 -43098 10249 -160043
46257 -160043 -172675 23026 -52580 -76455 -145161 -211039 35835 171352 -105718 32907
46247C2907l6897J6130J49981J3999j49553J02511r9479j17854Q4010K34895j21737
46236A08913q706M8398J7771r852j95251O5427J53157N4906r6098j11597m6235
46225a9167k59087J56437J41322p6315K409J04897K02635o0548j32136j65329
46215a04882N5878R7867j00726r472M8649J68230L1416J7599J553Q2811j57337
46204A31586p9939Q0349m2202l7722O7985j03934M7211R1379l1868k51531O1798
46193f6888m7767Q705M1144k58384J51359J07498r323k25225M6512R3845J73754
46182A5230L4386o3716k1916P3870K02407l9776k57455r3769K08179N476L7747
46171A00663m9800j57828P5065J25908R1978j27574l5758j00318K5978o4185J2287
$$ plain form
46247 32907 -3990 12140 162121 176120 26567 129078 29599 -88255 -4245 230650 108913
46236 108913 100207 148605 166376 156524 -38727 26700 179857 234763 138665 27068 -19167
46225 -19167 -278254 -121817 19505 -56810 -54401 50496 253131 192583 60447 -104882
46215 -104882 -49004 48863 -51863 -61335 -12686 155544 186960 204559 206112 288923 131586
46204 131586 51647 131996 89794 52072 120057 16123 63334 154713 122845 -128686 -66888
46193 -66888 -114655 -105950 -64806 -323190 -171831 -64333 -73656 -298881 -252369 -158524 15230
46182 15230 49616 -14100 -36016 37854 240261 200485 -56970 -150739 57440 62916 100663
46171 100663 50863 -106965 -31900 94008 185986 58412 22654 -77664 -51686 -115871 -103584
46160a03584j3185J13577m7095o7797q9495P4733n6356P7747J17025r186j28056
46149a31672j6819K38610o7456j62406Q4458K75480L7919J44769m7564l01894
46139E3425J28672L3846m06161j44069j716N4980J48849N2918j1791k7713j5676
46128a34436J27208O7941P6644k80219J13923J29223J16249j79649p9007N0875
46118H752m0305J6298L1647L7332j65709K1258O0099k135p8102R784P2070Q4889
46106E5878Q7763k4700k29829L4003J57946j72847j56136j2589r2970P2175j0301
46095b91607R330L11178k42265j8717K39450R4405n0446k06641J20157Q2777N652
46084E3273k3287p5620J26568k7926j79679L4635O717J2728J42215N7247k3272
$$ plain form
46160 -103584 -116769 -3192 -50287 -118084 -207579 -132846 -189202 -111455 5570 -3616 -131672
46149 -131672 -148491 90119 22663 -139743 -55285 220195 258114 402883 355319 53425
46139 53425 182097 215943 -190218 -334287 -336003 -281023 -132174 -79256 -91047 -118760 -134436
46128 -134436 -7228 60713 137357 -142862 -28939 100284 216533 36884 -42123 8752
46118 8752 -31553 -15255 16392 53724 -111985 -90727 -30628 -32763 -110865 -101081 -29011 55878
46106 55878 143641 118941 -110888 -76885 81061 -91786 -247922 -260511 -353481 -281306 -291607
46095 -291607 -282277 28901 -213364 -232081 7369 101774 51328 -155313 -35156 47621 53273
46084 53273 29986 -45634 80934 53008 -126671 -92036 -85319 -72591 69624 126871 103599
46073A03599j29079K244j711R0727Q6211p7566j99566l2716J17345L3476j08450
46062a15486J41088J38856l6673o3428p2674o645j1365l2479j14609J42081o5137
46051i6471n7576M5545n3435p6838N1930Q4930J63096n7779j06409q2362j3604
46040a98973K35808M044L4307n2671J544j22308J02362J4530K4482k50240J85591
46029b1524Q1592m1445k3407K28845j42018m65k8412K921j40893n0360J2600m4788
46017a67354J54052J22111J8987j20186j14613J20729J66600L0292J92016j95356
46007B07278l30614j909J46872K102P9565k37205j71715K43125K7789m5592J94033
45996A13729r986J3192L9731r0319J2279J00789J07359J0328o3513p5736k6717
$$ plain form
46073 103599 -25480 -23236 -24947 65780 151991 74425 -125141 -157857 -40512 -7036 -115486
46062 -115486 25602 164458 127785 64357 -8317 -14962 -26327 -58806 -173415 -31334 -96471
46051 -96471 -154047 -108502 -161937 -238775 -186845 -101915 61181 3402 -103007 -185369 -198973
46040 -198973 36835 40879 75186 22515 24059 -98249 4113 18643 43125 -207115 -21524
46029 -21524 60068 18623 -4784 224061 82043 81578 53166 56087 -84806 -135166 -122566 -167354
46017 -167354 -13302 108809 127796 7610 -107003 13726 180326 210618 402634 207278
46007 207278 -123336 -125245 21627 23729 103294 -133911 -305626 -62501 -34712 -80304 113729
45996 113729 103743 116935 156666 66347 78626 179415 286774 297102 233589 157853 131136
45985A31136J32629k59884J92595P12q6499l718k03666L2584J29661K41805m1788
45974B65567m5529M9768J2563j07235o620j95969M9701N913Q1823K81499j56837
45963B34644j79185j93208J49571N8324l9850j46925r3466p3812j30031L22583
45953i1355M3158j94080J57764J7104n9141P6294J13275k71578J0970J80752P95
45942a6042J29519o6378k4467j1244m478J49355J25484J91k38342r0417j01336
45931a48155L7939K00995J8609j90967R5828q3910j2753P3099k11325Q1014J57231
45920A7605k2049M4823j39243N8355J53722J07662M3169l19439n6790m4765J75874
45909A8924J75221k99055J89664J28237K0432k09416j29664k2845o72j34117N6096
$$ plain form
45985 131136 263765 3881 196476 197188 110689 106971 -96695 -64111 65550 307355 265567
45974 265567 220038 269806 282369 175134 168514 -27455 22246 28159 109982 391481 234644
45963 234644 55459 -137749 11822 70146 30296 -116629 -210095 -283907 -413938 -91355
45953 -91355 -48197 -242277 -84513 -67409 -126550 -50256 63019 -208559 -197589 -16837 -16042
45942 -16042 113477 47099 22632 11388 6910 156265 281749 281940 43598 -46819 -148155
45931 -148155 -110216 90779 109388 -81579 14249 -69661 -82414 -9315 -220640 -139626 17605
45920 17605 -4444 40379 -98864 -40509 113213 220875 264044 -55395 -112185 -156950 18924
45909 18924 194145 -104910 84754 212991 233423 24007 -105657 -128502 -129174 -263291 -207195
45898b07195N1047j65255K53921J06659j40058j60299O5626j08068Q4214l6113
45888b55521P2561k1016J8578K23016J17899q8766J12591j6110j5058r5809M9436
45877A01801j62051L264Q4728o0936J55342o6265j25378j14466R6330J12904J1650
45866C6923r6232p4181J53818J55101O4157O1531J8716j98346L1028l2926p3309
45855D6280j24923j7728j7158r4415J38231K12699J29875J5928N4624j63933O2469
45844B41949o9730k27510O5688O1766k147k23715P781M7546o916j43604j24512
45833c73404M4993L05613j1490q2368q495L6571J07302J1450N6522k0513J2955
45822G9136J45183l0378r4322o8234k07258K0077N6843K45567n6879r8583q3317
$$ plain form
45898 -207195 -156148 -321403 -67482 39177 -100881 -261180 -195554 -303622 -219408 -255521
45888 -255521 -182960 -203976 -185398 37618 155517 66751 179342 163232 148174 52365 101801
45877 101801 -60250 -56986 27742 -33194 122148 55883 -69495 -183961 -87631 25273 36923
45866 36923 -59309 -133490 20328 175429 239586 301117 319833 121487 152515 119589 46280
45855 46280 -78643 -96371 -113529 -207944 -69713 142986 272861 288789 343413 179480 241949
45844 241949 172219 -55291 10397 72163 70016 -153699 -145918 -98372 -105288 -248892 -373404
45833 -373404 -328411 -22798 -34288 -116656 -125151 -88580 18722 30172 86694 66181 79136
45822 79136 224319 193941 99619 31385 -175873 -155796 -98953 146614 89735 -8848 -92165
45811i2165Q7166p636n6757K04637J53473k89777J6081O032k47237K46581J6772
45800C7170J46138m8591j76966J20335L3465J47780k4773j07449Q3242q8487j20926
45789I38K572J13570L8473j68419l5149J12627J6272l0703j37593K2549J55493
45778I0630J02932j11748O0068R9248n7188j1289n2610k4376j3292j21058o1867
45767a00550R913J4374R9847P784P2490L0742j92268J35563j09624R2321K68394
45756C28986J78088J7774k55000j88976k207J35089M9514l1152r9109J2027j71793
45745b6759p0993l6322j02600P6959J18922P8701J15234j4946l0093M4335J59143
45734C11581M8477M2510q779j93837k88222j11044Q1990J10925r5116P3697k6640
$$ plain form
45811 -92165 -4999 -12635 -69392 135245 288718 -1059 15022 21054 -226183 20398 37170
45800 37170 183308 134717 -42249 78086 111551 259331 234558 127109 210351 121864 938
45789 938 3510 117080 155553 -12866 -48015 64612 80884 50181 -87412 -64863 90630
45778 90630 193562 81814 141882 241130 183942 172653 120043 95667 82375 -38683 -100550
45767 -100550 -90637 -76263 23584 31368 103858 134600 -57668 77895 -31729 60592 328986
45756 328986 507074 524848 269848 80872 78665 213754 263268 232116 133007 145034 -26759
45745 -26759 -97752 -134074 -236674 -159715 -40793 37908 153142 138196 108103 152438 311581
45734 311581 360058 402568 393789 199952 -88270 -199314 -117324 -6399 -101515 -27818 -54458
45723e4458k80182R2994N3257Q7639J31659J87375q7173j09608J52363o9282j5699
45712H8885j65940j79051J88844K12174j3065J27613j4984R0134j23010k3919
45702A87681j96611j38017Q1446P2946n5157n5669J00619J16769n2641O061P3726
45691A41153J43234K9302K5271j06440j13382r0690L4430Q4478M992j11812j5531
45680B5005r4418o9020L28486J50128j53419l0737j33355j54336N3617j2404N9423
45669c1030m6131J14758J82486k5110m4146j4951N6441q8381j33261j59918q248
45658a97491K58641m6448J50800j09195j18126j6927J74758j65977j85590J34556
45648a20999K18811P03q4624P2431m1162Q5068J32143q8933P5334O5679N3009
$$ plain form
45723 -54458 -334640 -241646 -188389 -100750 30909 218284 131111 21503 173866 104584 88885
45712 88885 -77055 -256106 -67262 144912 131847 259460 244476 334610 211600 187681
45702 187681 -8930 -146947 -65501 7445 -47712 -103381 -2762 114007 61366 67427 141153
45691 141153 284387 313689 338960 232520 119138 28448 62878 147356 152348 40536 25005
45680 25005 -69413 -138433 190053 340181 186762 156025 22670 -131666 -78049 -90453 -31030
45669 -31030 -77161 37597 220083 194973 150827 135876 192317 103936 -29325 -189243 -197491
45658 -197491 61150 14702 165502 56307 -61819 -78746 96012 -69965 -255555 -120999
45648 -120999 97812 98515 13891 86322 45160 130228 262371 173438 248772 314451 367460
45637C67460j96679j40932J5629K30658O3414k10373N7529r967O0342j51891n0960
45626C4230J6844J91878j77822j50186J97323O1923o06o1176j24299J60680q2200
45615F6589M1506l3068k23690K55397O6008o6666k9068p212j35049O4161K7131
45604B6039q4500J07516J28592j31629J848J48181l9957j71987P2285m9108L3215
45593D0495n2785J46986j2828r3753O3514o6175R0405N9996o0280j36606M0861
45582A9830J3126k859j6678L786O679r2386n0548J25891K87694Q548j15114J60909
45570C48878j01310o5556j727j735J86286j46231j23620J24089j44064j76102
45560a01092J12447M9509j33966L3314J03844l6064N353Q5314n5137k9662J01124
$$ plain form
45637 367460 170781 29849 45478 276136 339550 129177 186706 176739 237081 85190 34230
45626 34230 51074 242952 65130 -85056 112267 174190 173584 112408 -11891 148789 66589
45615 66589 108095 75027 -148663 106734 172742 106076 77008 69796 -65253 -1092 26039
45604 26039 -58461 49055 177647 46018 47866 196047 156090 -15897 56388 7280 40495
45593 40495 -12290 134696 121868 28115 91629 25454 115859 175855 115575 -21031 19830
45582 19830 32956 30097 13419 17205 23884 -68502 -119050 6841 294535 303083 187969 348878
45570 348878 247568 182012 180285 178550 364836 218605 94985 219074 75010 -101092
45560 -101092 11355 60864 -73102 -39788 64056 27992 33345 118659 63522 33860 134984
45549A34984k0293j21671n1112P7602N5718J23718j43528p5615O5630J15551j74122
45538a3138k17300R1472J59572l7202k79350Q1938J91645k8918j51315P8941j4997
45527a38652J85791L457j15526j19968J18643J21689l0998L0096j1089j64552
45517a21109k894K85963q7791p782j3972j38470P2994K8918J06144J21027j4638
45506B28390O7800j09023N2804j09917j65020J1675J15383j96229n2022J60925
45496D766J82121Q0479L2517k3709J04372L5654k42474r7348R9679q6719k03914
45485a14576J81315K4669M6269m2146J23921k3085N2150o1650o1068J06238m882
45474B27155N8504k1109m9165J3108j46302j33322K47242J01880j09240q2665
$$ plain form
45549 134984 114691 -6980 -58092 19510 75228 198946 55418 -20197 45433 160984 -13138
45538 -13138 -230438 -138966 20606 -16596 -295946 -214008 -22363 -51281 -202596 -123655 -138652
45527 -138652 47139 50596 -64930 -184898 -66255 55434 24436 54532 43443 -121109
45517 -121109 -124003 161960 74169 66387 52415 -86055 -13061 15857 122001 243028 228390
45506 228390 296190 187167 239971 130054 -34966 -23291 92092 -104137 -156159 4766
45496 4766 186887 267366 299883 276174 380546 416200 173726 76378 176057 89338 -114576
45485 -114576 66739 91408 137677 95531 219452 196367 248517 186867 125799 232037 227155
45474 227155 285659 264550 215385 228493 82191 -51131 196111 297991 188751 106086
45464A06086j08728j31421K78310J38935k35161k01688Q4867J74565o7200K5498
45454F4063n4854Q1427o3533j47227L08604K011j66015o2068J51009r5700j42952
45443a25235R7068J75514O7148N736J51950j17310l9485j46188o5874l1089J03069
45432G5304o4458O9967J16450j33549Q1680P6725j45269j253L441j50247N600
45421f5609J61833J20475j26617m8972K0813Q9351j3062l24171p2987J04818K03220
45410D9092J93130j3603k00828k54995n1526M43789L03357j2005k79944l3317
45400A43150n8439j76934p0231J63035K2668Q6090J15033L2012l0161q125j64931
45389E3167l4048r2146L3749K06790J17947L1990r3914k7961j25600m2308J21946
$$ plain form
45464 106086 -2642 -134063 144247 283182 48021 -153667 -68800 105765 38565 64063
45454 64063 9209 90636 27103 -120124 188480 190491 24476 -37592 113417 17717 -125235
45443 -125235 -28167 147347 214495 220231 372181 254871 215386 69198 3324 -27765 75304
45432 75304 10846 80813 197263 63714 145394 222119 76850 75597 79038 -71209 -65609
45421 -65609 96224 216699 90082 41110 61923 151274 138212 -185959 -258946 -154128 49092
45410 49092 242222 228619 27791 -227204 -278730 165059 468416 456411 176467 143150
45400 143150 84711 -92223 -162454 581 23249 109339 224372 256384 226223 218098 53167
45389 53167 19119 -73027 -39278 167512 285459 317449 223535 195574 69974 27666 149612
45378A49612L6369n2578J14644j9115j92004L8661q2238P324o4145K47440K52828
45367D36798k47122j77687J12208J2613Q5764k2195L5869j89096K7151Q1152K4937
45356A80392k3114r725j53478p820O5743n0225K0948l2143P233J93852N3446j04664
45344A40445n3889J4338k00093J10064K29843P0314k06059R167O6870J1806j28181
45333F4625M0442j5684n5978K2044J48854n0268L4639N4259j16687J85545m2605
45322B69186j91673L503L8455n2829o8018j50643K53398M750l2318Q6557o6564
45311I3804l11168J02611j82689m2146K89380K20311O2421L6415j76537J35494
45301B27896J96204Q767m4736k15293R010n5298o6341R365J67641M2181J11727
$$ plain form
45378 149612 185981 133403 248047 228932 36928 75589 -6649 675 -63470 183970 436798
45367 436798 189676 11989 124197 136810 222574 200379 236248 47152 74303 155455 180392
45356 180392 157278 147553 -5925 -13745 51998 1773 22721 -9422 -2189 191663 245109 140445
45344 140445 86556 100894 -99199 10865 240708 311022 104963 114130 181000 192806 64625
45333 64625 105067 89383 33405 55449 204303 154035 188674 242933 126246 311791 269186
45322 269186 77513 81016 119471 66642 -1376 -152019 101379 106129 73811 160368 93804
45311 93804 -217364 -114753 -297442 -339588 -50208 170103 232524 268939 92402 227896
45301 227896 424100 432867 388131 172838 181848 126550 60209 69574 237215 279396 391123
45290C91123O7029j24839J28483k00261j45669Q5103J0383o1878m5268O7186q5409
45279H5983J77598k47299P2341j6356P9774P016l4465K450p1209m9565l1833k599
45267b8164r1216k6494o3219R636R9670P8164q8344J5682J59154J07569p8953
45256I3485r6597L4705j67554p6256J71752m4778J00444o6101j44573k6600R8084
45245a23989j509J61389J47902p4433j59208Q9215J68785m2998q639R5973l1033
45234B21455p9719j53439k2811J42778J08586j04009j76684J60965K06302j0734
45224B92690j83076j08594K6726j06979R9648J44066j2289j19137p0339k18858
45214b56142K55700P2897j22040N1062Q0293q4598O4841J6979m5348Q4310J22257
$$ plain form
45290 391123 458152 333313 461796 261535 115866 200969 211352 149474 104206 171392 85983
45279 85983 263581 16282 88623 72267 152041 159057 124592 127042 55833 6268 -25565 -28164
45267 -28164 -119380 -145874 -209093 -199457 -99787 -21623 -109967 -94285 64869 172438 93485
45256 93485 -3112 31593 -135961 -212217 -40465 -85243 15201 -50900 -195473 -222073 -123989
45245 -123989 -125498 35891 183793 109360 -49848 39367 208152 165154 156515 252488 221455
45234 221455 141736 -11703 -34514 108264 216850 112841 -63843 97122 303424 292690
45224 292690 109614 1020 27746 -79233 20415 164481 152192 33055 -37284 -256142
45214 -256142 -442 72455 -49585 1477 81770 -2828 62013 78992 33644 117954 240211
45203B40211r0326j54521N9033Q1393J7674o2173K8669L6314r5494J67808j70415
45192E8173R8394j161r8522J12766j76227m6851n6853J39103J12133j39311L637
45181E281M5304J93014k2106Q330j62522j0414J58049j27692J05289P3316R2821
45170C58670P0311N6752K02527j04943j24677k70624n6255M0230J90579N4204
45160D16774j41738j4435j30394j04937J22723Q5177k39687P2721Q0886Q5805
45150B32895L5314r2518k1484M0277j06519k49238J8353O2400J21292r2968P3897
45139B1701j42037Q1373J46009J8892N770L8784J37124k5729n634R894r9203m3378
45127A43566J3607l3663j07391j33465J57126M4802j20741m1852q722m7104j1558
$$ plain form
45203 240211 149885 -4636 54397 135790 153464 91291 119960 156274 60780 228588 58173
45192 58173 156567 155406 56884 169650 -6577 -53428 -110281 28822 140955 1644 5281
45181 5281 50585 243599 221493 229823 67301 56887 214936 87244 192533 265849 358670
45170 358670 428981 485733 688260 583317 458640 188016 131761 171991 362570 416774
45160 416774 275036 260601 130207 25270 147993 233170 -6517 66204 147090 232895
45150 232895 268209 175691 154207 194484 87965 -161273 -142920 -80520 40772 -52196 21701
45139 21701 -120336 -38963 107046 125938 131708 170492 307616 281887 276253 286147 186944 143566
45127 143566 157173 123510 16119 -117346 39780 84582 -36159 -78011 -86733 -133837 -145395
45116a45395P7074m8538M0697K42684q7075R2651O6399j53496q3397J44725K6092
45105A72421k4583m1126j42350J46203K4756j51446o6887K7326J21678J95337
45095B61329j1102o0342k0469J31739L2641k3060o3966j88550L551J21350O358
45084A89479m0165R4473j830j18030j10618j50560Q59R8223J12636l1472j08533
45073f5538Q3232O1529J14622j09072Q6772J6148n2118m507J8195k102r7955L0191
45061G9397K6883q1661q19R0769L2538q9686K00437Q4626m3768j54181j04827
45050C9708k2812O5635j9532P5410P0193j72705p3577K43027n5032r9535M2228
45039I3008R7722m0712j45425j0952J36915J66151o6096N2446j03938k19386J50413
$$ plain form
45116 -145395 -68321 -116859 -76162 166522 79447 172098 238497 85001 1604 146329 172421
45105 172421 147838 106712 -35638 110565 135321 -16125 -83012 -55686 65992 261329
45095 261329 250227 189885 169416 301155 333796 310736 246770 58220 61771 183121 189479
45084 189479 149314 243787 241957 123927 13309 -137251 -136392 -38169 74467 42995 -65538
45073 -65538 17694 79223 193845 84773 171545 187693 135575 131068 149263 147161 49206 79397
45061 79397 106280 24619 23800 114569 147107 57421 257858 342484 298716 144535 39708
45050 39708 16896 82531 62999 138409 208602 35897 -37680 205347 150315 50780 93008
45039 93008 190730 150018 4593 -6359 130556 296707 230611 283057 179119 -40267 110146
45028A10146P4377l9094j0424n7875K11474J15741p9151k66476N3393K8458p8228
45017F2341j10398n1471p9895J40968K43063r5505n0957j18342m1473M9915R9378
45006D7624K9549M031J13647P1568m2384R1004j05516j78071n3183M1482J13050
44995A32801J49002J27898q7181k67790j33148M6562J15557N5129Q1288O6856
44985B86974o7432k30418p0867R8127P7949P9620k46385J07158J06062P4288J13267
44974C28343O0958j17641j72784J37157j20300P3795R7410r4820J1016Q2989j15152
44963A70971j01783M9376R7874L4726j79790k4211P1709K4090J5081j30703M7224
44952G4564K2648j43197J19794J71319k35749j21022K25185j1070k98449p3832
$$ plain form
45028 110146 184523 145429 135005 77130 288604 404345 325194 58718 112111 140569 62341
45017 62341 -48057 -99528 -179423 -38455 204608 109103 58146 -60196 -101669 -51754 47624
45006 47624 77173 81204 194851 266419 224035 315039 209523 31452 -21731 19751 132801
44995 132801 281803 409701 322520 54730 -78418 -31856 83701 138830 220118 286974
44985 286974 219542 -10876 -81743 16384 94333 173953 -72432 34726 140788 215076 328343
44974 328343 389301 271660 98876 236033 115733 189528 286938 192118 203134 286123 170971
44963 170971 69188 118564 216438 251164 71374 47163 118872 142962 158043 27340 74564
44952 74564 97212 -45985 73809 245128 9379 -111643 113542 102472 -195977 -269809
44942b69809L81698R3424j02729Q6297j58352O8427J25556k17694J23698N5175
44932A85691j23498L2143J05945J18765J59638O4488j44312j02494o5632j90725
44922D0009O7822J46986q9203j4478L4040l0552J40190Q9772J6513P878P6191
44911D85168J9758j81745j69637o5621p5697J92724p2062j5038o4542L37555K2887
44900D13750k14509J07040o5636j07791O23p7001q9677N1338J34753J81345Q5933
44889D20168k081j49105o9790J90211N3520j03077n6444q0668J3054P1094l7441
44878B49441j324k5526R76J93294j83989M5298J1902M6479m2316k8054K6485N89
44866B93255m1582r1347j7471J09320l8553j10971J31312n2099k2162j03980J13091
$$ plain form
44942 -269809 111889 205313 102584 188881 30529 98956 224512 6818 130516 185691
44932 185691 62193 94336 200281 319046 478684 543172 398860 296366 230734 40009
44922 40009 107831 254817 165614 151136 185176 154624 294814 384586 401099 408977 485168
44911 485168 504926 323181 153544 87923 12226 204950 132888 117850 53308 390863 413750
44900 413750 199241 306281 240645 132854 133477 56476 -33201 18137 152890 334235 420168
44889 420168 418087 268982 199192 389403 442923 339846 283402 202734 215788 286882 249441
44878 249441 248117 222591 223567 416861 232872 278170 290072 336551 294235 266181 292666 293255
44866 293255 251673 160326 142855 252175 213622 102651 233963 181864 159702 55722 168813
44855A68813J72051o1988l3901j8666L6395K4597R7422q2082j05086J5053O141
44844B18749K0840J21273j40952R6794K7261J13131m540j27654M217n1136Q9978
44833C67961K8370j09550j05740J16004Q5035p1398j20764l048q2146L08631L6239
44822D49594m4744p0966n5337j04039j11990K7703P012r2260K2794j6290P1754
44811H3231O3573n8178J8104j38731J70158n9066n7946J53052J38336j8715j21244
44800A72574M8857K0957P215j17721n1465J35141O558q1318J30467m7023J90088
44789D14330K6119q3888r5382l4275K16741j3758M5797m1567n1481j56227J40577
44778C66986p4060k9685j1562o0902n0254Q9331M8592J674J07079j21868n3524
$$ plain form
44855 168813 340864 278876 244975 226309 262704 287301 384723 302641 197555 212608 218749
44844 218749 239589 360862 219910 316704 343965 457096 452556 324902 329119 277983 367961
44833 367961 396331 286781 181041 297045 382080 310682 189918 186870 104724 413355 449594
44822 449594 404850 333884 278547 174508 62518 90221 97233 4973 27767 11477 83231
44811 83231 146804 88626 106730 -32001 138157 79091 21145 174197 312533 293818 172574
44800 172574 221431 242388 249603 131882 80417 215558 222116 140798 271265 224242 414330
44789 414330 440449 356561 261179 226904 443645 429887 475684 434117 382636 226409 366986
44778 366986 292926 263241 251679 190777 140523 229854 278446 280120 387199 265331 211807
44767B11807L07471m5957j55693Q3937P4780j0215n6546p8268j50109J37788J51312
44756D70307J28191L1936n7925j44891k1845L1714j02188q705J97663M0195Q6935
44745F51387j05887O1078L6716q0010J67153p4830n8517j08661m6976K9121q1878
44734C88696q4609L0666J07174o0697J55999k2382k0246M0363n4824n4837n3647
44723C71656K31328K01486q324o9171j8169q74j17991M5225r2281J06229j4642
44712F34472j9809P3498j00520j27441j59723Q8004Q5953J12459K8871k9715j30014
44701D56035K48961J00426J59160k11850k73347O5719R0154K61448j2442J2692
44691H96956j31174M9904J25940L6517q6338O5271O976j74013J06302P7402K6431
$$ plain form
44767 211807 519278 473321 317628 401565 476345 466130 409584 331316 181207 318995 470307
44756 470307 598498 630434 572509 427618 405773 437487 335299 326594 524257 564452 651387
44745 651387 545500 606578 643294 563284 730437 655607 597090 488429 441453 470574 388696
44734 388696 304087 334753 441927 381230 537229 514847 494601 534964 480140 425303 371656
44723 371656 602984 804470 796146 726975 708806 707932 589941 635166 542885 649114 634472
44712 634472 614663 688161 587641 460200 300477 388481 474434 586893 615764 586049 456035
44701 456035 704996 805422 964582 752732 479385 545104 635258 896706 884264 896956
44691 896956 765782 815686 941626 978143 891805 957076 964052 790039 896341 973743 1000174
44680A000174p2782L5852m2429p6669P1776P9124J651J96326k9290n4095K41760
44669A351398O8706j56945j64583J21004O9523j07374J55151J31844q9412j1557
44659A367755K8856J60845o1937N0560K44922M1559K6854m7727j36335L73006
44649B048358M1695N5246J47706O4861j03209J83019K36528P5565P1888L71779
44639C193436O94365P63173L73320j0727k76900j68860J13342J63554m04803m59745
44629C980155k2789k42665k23518m4494l574r0066m4957K4211K10292p0812Q008
44618C479791Q5271J27522P6844j53335j15476J44960J04568J68867J03875Q5832
44608D108719K35390J74818K705l3329M90302L98920L04714L19681M39988Q74560
$$ plain form
44680 1000174 927392 963244 920815 844146 915922 995046 996697 1193023 1163733 1109638 1351398
44669 1351398 1420104 1263159 1098576 1219580 1289103 1181729 1336880 1468724 1379312 1367755
44659 1367755 1396611 1557456 1495519 1546079 1791001 1832560 1859414 1811687 1675352 2048358
44649 2048358 2090053 2145299 2293005 2357866 2254657 2437676 2674204 2749769 2821657 3193436
44639 3193436 3887801 4650974 5024294 5013567 4736667 4567807 4681149 4844703 4439900 3980155
44629 3980155 3957366 3714701 3491183 3446689 3443115 3353049 3308092 3332303 3542595 3471783 3479791
44618 3479791 3565062 3692584 3769428 3616093 3500617 3645577 3750145 3919012 4022887 4108719
44608 4108719 4344109 4518927 4521632 4488303 4978605 5377525 5682239 6001920 6441908 7316468
44598G316468J589955J716991O15950n18472j195091j177954q48381n01473m72036
44589F525957l52677Q7142j36558Q1696J09799M40228M09599N26247L74273j61123
44579G904583o8044j18821n05228l95072l29430k77620l89647k76608J93261K3308
44569E760682k87276O3503P8342R0670K86937N45640J58220k67756j14897j70055
44559F144010J05200K89719L32228K46201L60236K96738K26723L39973K67366
44550H608394M1800k16292m5604K45807M3316L50206M22087K14960O07847K07749
44540A0480270j38823J16397L99043O94191Q18691J123698J484967J228863J040258
44531A7247555J087776J223567J253172J159077K72533m96338j351793j398004
$$ plain form
44598 7316468 8906423 10623414 11239364 10720892 9525801 8347847 7499466 6997993 6525957
44589 6525957 6173280 6260422 6123864 6205560 6315359 6755587 7165186 7691433 8065706 7904583
44579 7904583 7836539 7717718 7212490 6817418 6487988 6210368 5820721 5544113 5737374 5760682
44569 5760682 5473406 5536909 5615251 5705921 5992858 6538498 6696718 6428962 6314065 6144010
44559 6144010 6249210 6538929 6871157 7117358 7477594 7774332 8001055 8341028 8608394
44550 8608394 8650194 8433902 8388298 8634105 8677421 9027627 9449714 9664674 10272521 10480270
44540 10480270 10341447 10457844 10856887 11551078 12369769 13493467 14978434 16207297 17247555
44531 17247555 18335331 19558898 20812070 21971147 22243680 21747342 20395549 18997545
44523A8997545r23531j99980K46719Q15736J425724J998681K606518K759424K053518
44514B9780354J196233J57155p3941J61156R45109J519103K391668K717521K401883
44505D1196241K460044L180361L996624N057434O134084P453689Q460948J0141673
44497H8081098J2570243J6568894K1967767L1713602M8404618P8771128J10235575
44490D08312925R7165193K0522143n4577325n3976421o854350O652576l7267278
44483C79977463q1092973q2754106n6121619l2885343j9441198j3974977j3742815
44476G9964432j3281025j1201975q377711o280972m959042l673649k996995k809954
44468B6383109k361726j963844j768013j274623r59536o60361o23253j98474K49513
$$ plain form
44523 18997545 18074014 17874034 18120753 18936489 20362213 22360894 24967412 27726836 29780354
44514 29780354 30976587 31133742 31059801 31220957 32166066 33685169 36076837 38794358 41196241
44505 41196241 43656285 46836646 50833270 55890704 62024788 69478477 77939425 88081098
44497 88081098 100651341 117220235 139188002 170901604 219306222 298077350 408312925
44490 408312925 505478118 526000261 471422936 417446515 410592165 417244741 379977463
44483 379977463 298884490 216130384 160008765 127123422 107682224 93707247 79964432
44476 79964432 66683407 55481432 47103721 40822749 35863707 32190058 29193063 26383109
44468 26383109 24021383 22057539 20289526 19014903 18055367 17395006 16771753 16573279 16822792
44459A6822792K41705j33340q75078j211339j055568p09664l34666k1820J44201
44450A2867223j838m21996n13923L1319J02949l63251j017706j087704j009391
44441H585682q66569m22574m26566l49111k72355l87900k26874l83060k62099
44432D988574Q106k10763j46187k30250j02494j78910m14294j276l45889j25091
44422C241526o4441j71832j17540l0539l7781j19982M4899o5100l26547j27969
44412B224694N0005j97722l531L8390n863l2435K3678P1790r5321q8299k94506
44401A690880k0604J03662J22717o3699p237O7355M9931j32811l77795j70814
44391A261585J55466J0632Q6463J1034N0855j7143J4290j64806J07035K51400
$$ plain form
44459 16822792 17064497 16931157 16056079 14844740 13789172 13079508 12744842 12723022 12867223
44450 12867223 12865385 12443389 11929466 11960785 12063734 11700483 10682777 9595073 8585682
44441 8585682 7719113 7296539 6869973 6520862 6248507 5860607 5633733 5250673 4988574
44432 4988574 4996680 4785917 4639730 4409480 4306986 4128076 3713782 3712506 3366617 3241526
44422 3241526 3177085 3005253 2887713 2857174 2819393 2699411 2744310 2679210 2352663 2224694
44412 2224694 2274699 2076977 2073446 2111836 2105973 2073538 2097216 2169006 2073685 1985386 1690880
44401 1690880 1670276 1773938 1896655 1832956 1825719 1893074 1943005 1810194 1432399 1261585
44391 1261585 1417051 1427683 1514146 1525180 1576035 1558892 1573182 1408376 1515411 1766811
44381A766811J96118K23004j27290l60610q0145N8482j17591m8956j22145j33521
44371A254157j27126N8888j10083o8579J91566j84269m6226r9131j48668M4734
44361G65263o3894J40433j25653J27192j5946L0885J64961R1646J77267o2824
44351A229330o8651k75251m8590L2898j01897L3213o4563k0274L4018j00822q2340
44340E67071P209J21725k47452k7353j50748J79588J24432J7705j25133o186J3682
44329D74540J8443P0610j0298K23333j2287m02L9542k30948J4911j20932K2311
44318D88823J58319O4990j74338o5973j40172J20727J6650j74171J25092N1054
44308D71001J37488Q9382j67917M1845J39028o4480j39542J17024J34026m2545
$$ plain form
44381 1766811 1962929 2185933 2058643 1698033 1617888 1676370 1558779 1509823 1387678 1254157
44371 1254157 1127031 1185919 1075836 1007257 1198823 1014554 968328 869197 720529 765263
44361 765263 701369 841802 716149 843341 827395 858280 1023241 1114887 1292154 1229330
44351 1229330 1160679 885428 836838 869736 767839 801052 736489 716215 750233 649411 567071
44340 567071 574280 696005 448553 421200 270452 450040 574472 592177 467044 460858 474540
44329 474540 492983 563593 553295 776628 764341 763939 803481 572533 587444 466512 488823
44318 488823 647142 712132 537794 471821 331649 452376 469026 294855 419947 471001
44308 471001 608489 697871 529954 571799 710827 646347 506805 623829 757855 715310
44298G15310j64382K27517R7809k08358M7901J90891K1025q967L7744j49021m505
44287H02964n0072K21727L08792M13580O19796O84009O6415J02890k75713l53048
44277B541340l574J18596k39281m36931l57890n22367k39528j70814R606J36114
44267H35271k1124j24390k2266J69463j0271j00726L3283p5991k37937r7937j34493
44256B12882J586J76019L4347n9133j95408j05249K9991m7660J77169J08525K50674
44245E83743n7124j28868o2755r4779J62094j5762j08438m0431m1593R0784j9859
44234B67012j9247P7207N8114p4388L973K2408j01925j17957Q0481k0914K17136
44223C91900j7827j78970Q356K12884j02075q9796M0501J75579q4344O9021m6000
$$ plain form
44298 715310 550928 778445 876254 667896 715797 906688 927713 918746 956490 807469 802964
44287 802964 752892 974619 1283411 1696991 2316787 3000796 3067211 3170101 2894388 2541340
44277 2541340 2537766 2656362 2417081 1980150 1622260 1099893 860365 689551 699157 835271
44267 835271 814147 689757 667491 836954 826683 725957 759240 683249 445312 347375 212882
44256 212882 214468 390487 424834 365701 170293 65044 95035 47375 224544 333069 583743
44245 583743 526619 397751 334996 240217 402311 386549 278111 237680 196087 286871 267012
44234 267012 247765 324972 383086 308698 312671 335079 233154 115197 195678 174764 391900
44223 391900 374073 195103 203459 416343 314268 224472 264973 440552 356208 425229 379229
44212C79229j39403J48002J76811J31507j8782o9503K2053j9331j5349j78038
44202D17196j83223Q9340J53188m0607k69306n4280P7854L591K26108o2442p7594
44191B79825l7004j1537j18803j04065P6987J04455J58475j46664q63J70839K3993
44180C95638j58721N8298k04702n1420P4275J69004J63834L7587j01406N4637
44170D37024r2400k9576K8619p5158J08308j38858l4194J44215J61359k20997
44160B88342R1756L7426m9171O0623j37490r709k23469j99998K95043J00761Q682
44149B62796j60958m6647O9507M4464K0279r0160R0567o0917M8292J83526J20011
44138D80760o7695l6824k46324l3549K29662P070L4703r0318l0215j09703K02452
$$ plain form
44212 379229 239826 387828 564639 696146 677364 607861 629914 610583 595234 417196
44202 417196 233973 323313 476501 435894 166588 112308 190162 193753 419861 357419 279825
44191 279825 242821 231284 112481 8416 85403 189858 348333 201669 200806 371645 395638
44180 395638 236917 295215 90513 39093 113368 282372 446206 483793 382387 437024
44170 437024 344624 315048 343667 268509 376817 237959 203765 347980 509339 288342
44160 288342 380098 417524 368353 428976 291486 281777 58308 -141690 153353 254114 262796
44149 262796 101838 55191 124698 169162 189441 99281 189848 128931 177223 360749 480760
44138 480760 413065 376241 129917 96368 326030 333100 367803 277485 247270 137567 340019
44127C40019O304k2846j47206l8474N1742j06523j7478J26678J39847k8032k18176
44116H5855Q134P8799J00872l4569O5580J8031k5625j16189j77056J57646N094
44105A66572l3629O5588P4423l8364j0020J210j42159O2024k9408m1491M2629
44094A17375L0614m3480O8228J58284l1353R2771n0033j00670J4825j22343k87115
44083a52897J78308L38528r9046j75022J5683M4145j7370J90533j3054j08328
44073B01480J6505j53779N8767M3521Q9923J8075j66990m2973L0185J21297n5930
44062A60081p480n3190R98q5383P2804O7082L8453O6910J3934o7508l88189N8296
44050a23192K05895J88436q1936j27935j21963L2748J05591j9426m0926J72698
$$ plain form
44127 340019 346323 323477 176271 137797 189539 83016 65538 192216 332063 304031 85855
44116 85855 93989 172788 273660 239091 304671 322702 297077 180888 3832 161478 166572
44105 166572 132943 198531 272954 234590 224570 225780 83621 145645 116237 74746 117375
44094 117375 147989 104509 172737 331021 299668 392439 342406 241736 256561 134218 -152897
44083 -152897 25411 363939 264893 89871 105554 149699 132329 322862 309808 201480
44073 201480 217985 64206 122973 166494 256417 274492 107502 64529 94714 216011 160081
44062 160081 152601 99411 100409 15026 87830 154912 193365 260275 274209 206701 -181488 -123192
44050 -123192 82703 271139 189203 61268 -60695 -27947 77644 58218 17292 189990
44040A89990J39171j45439j38084J77713J66924n3665j45056J38542N0730l580
44030C77246n980j0271j6506M8489k21429O435j0843O7572j70182J63953O152
44019B34636q0997K13805J60263j88577j51523o4343l059J73570l09617J38097
44009A22255Q065j5349K96472j62734j15119p0690Q8066l3398J30832m3014j59223
43998D6163J74610K36550J16809j68348k63834J56948K59858J93035j34745l12013
43988C05033j50026n8770J43714o6899j21631J04737m8147N9135n5199J00177
43978B12124q8072j34046P5151J42811n7027j6275m8553Q4107J22508p5763O5056
43967B82021J66873q8978k37472j24638q6169L88J33711J51109L6718j18537M5862
$$ plain form
44040 189990 329161 183722 45638 223351 390275 336610 191554 330096 380826 377246
44030 377246 371266 360995 344489 392978 171549 177984 167141 234713 64531 228484 234636
44019 234636 153639 367444 527707 339130 187607 123264 120205 293775 -15842 122255
44009 122255 130320 114971 411443 248709 133590 62900 150966 117568 248400 205386 46163
43998 46163 220773 457323 574132 405784 141950 298898 558756 751791 617046 305033
43988 305033 155007 96237 239951 173052 51421 156158 108011 167146 111947 212124
43978 212124 124052 -9994 65157 207968 150941 134666 86113 170220 292728 216965 282021
43967 282021 448894 359916 122444 -2194 -88363 -87975 45736 196845 233563 115026 160888
43956A60888M5247K5247j43672k19509J37291J31111Q2469n6282q1878J1350J01625
43945A93887O746M9722R825N4860l187q0057k4861J03761k4212k60109Q218J05274
43933A39867j47205j4003O5782K44658l03046l5070L23044n2119j02333j0908
43923A08667k9748j0306j27076O4061K15649J78459r4227p7567n0270K02728P3435
43912D53805l7073j47780k52728P6477M0998K9365J6037j88737J70283J08929
43902B69576p1056L4762n772q5915J25389l8767j86119J34074j3031q2469Q9803
43891A70475J01737Q3208j7083n4447l574j28198R5391M1147l8705p4796q1859
43880I3296j07756J24175j20204R7667m5447l4900K2580K8476r5545J6765j04487
$$ plain form
43956 160888 206135 231382 87710 -131799 5492 136603 219072 162790 80912 92262 193887
43945 193887 200633 250355 260180 315040 311853 231796 206935 310696 286484 26375 34593 139867
43933 139867 -7338 -21341 44441 289099 -13947 -49017 274027 221908 119575 108667
43923 108667 78919 68613 -58463 5598 221247 399706 305479 227912 177642 380370 453805
43912 453805 416732 268952 16224 92701 133699 163064 179101 -9636 160647 269576
43902 269576 198520 233282 227510 141595 266984 228217 42098 176172 163141 80672 170475
43891 170475 272212 355420 338337 283890 280316 152118 247509 288656 249951 175155 93296
43880 93296 -14460 109715 -10489 87178 41731 6831 29411 57887 -37658 -20893 -125380
43869a25380Q4749L44687O5574j18869O5429q6999j0238m9552l4164k6430M926
43858A13733M3934o4338K2526L8064n8958K75292K68229k63222l41516p2232J25777
43847H7289O2792k0066L7493K4359N1025K4461j64869J69986J0386o0639r9043
43836A23174J00981R4880j64727J92242R7901j30716j27288j12811P6916K0183
43826A70735J90946r7127k2239j9886j78790L8675R2125k0626L9885j28184j35165
43815f9651J53174m4607m7810J78841j39342O5117Q0977J73973o6895p9052j53976
43804E0749j85187J51405J17346J31952k9863j53986m2749P9624R9147j20375
43794I8063K18984K5611k69454k29962O062K26802J38143r6690q5569j53665n2207
$$ plain form
43869 -125380 -40631 304056 369630 250761 316190 229191 218953 169401 135237 108807 113733
43858 113733 157667 93329 115855 153919 94961 370253 638482 375260 33744 -38488 87289
43847 87289 150081 130015 167508 191867 242892 267353 102484 272470 282856 222217 123174
43836 123174 224155 319035 154308 346550 444451 313735 186447 73636 150552 170735
43826 170735 361681 264554 242315 222429 43639 82314 174439 153813 193698 65514 -69651
43815 -69651 83523 38916 -8894 169947 30605 95722 176699 350672 283777 204725 50749
43804 50749 -134438 16967 134313 266265 236402 82416 39667 119291 218438 98063
43794 98063 317047 342658 73204 -156758 -150696 76106 214249 117559 31990 -121675 -173882
43783a73882M1939J47283j09017l0254M199L7184J60131P4671r6983q3958P9559
43772E0872K22098K0960j72236j6845J70957J66741l86017n4173k7090O0464P9904
43761A15635K3447J47493L311j15359n6361k3916J3067r0471j916K02407J8935
43750B36272r2543m9511j44667K0277l0316J29831J88909j81031J40885p8214
43740A39892J2701K09975P1803j56509l47213N1757N4626P2000J31865k4939J31169
43729C47127J79295k59373k40627M1436o6320q5682m8229M9211J24446J20194
43719A61478l6258j44715R7658L2819J00106Q830J874p2229j71426q7616j2580
43708a22059M6339K37577K3673p2011R6250J630j32061Q035N2613L7804M9423
$$ plain form
43783 -173882 -131943 15340 -93677 -123931 -119732 -82548 77583 152254 55271 -28687 50872
43772 50872 272970 293930 121694 104849 275806 442547 56530 2357 -24733 35731 115635
43761 115635 139082 286575 289886 174527 118166 94250 107317 16846 14930 217337 236272
43750 236272 143729 94218 -50449 -30172 -60488 69343 258252 77221 218106 139892
43740 139892 152593 362568 434371 277862 -69351 -17594 37032 109032 240897 215958 347127
43729 347127 526422 267049 26422 67858 1538 -84144 -132373 -83162 41284 161478
43719 161478 125220 -19495 78163 110982 211088 219918 221792 149563 -21863 -109479 -122059
43708 -122059 -75720 161857 185530 113519 209769 211399 79338 87373 139986 177790 227213
43697B27213J01300M3292o8759l3354j00997q0972J03469R656r3549m3038K44841
43686C09102J70822J3033o9809J43880q0261j00045j09729O9640L0497J15789
43676D92919j67761j56365j04410J83477J57616k8523j46948k60981N8687P013
43666C4724P2308J77995J5683l63077m6308J96210P1506L104o3405R9372o1106
43655A37006j80691J69430Q1797L0704L0057j53864o3430J79396j00357j66766
43645c6718K03007o7247j22249j3367Q4532J80058j11901J77323k4461L1140k4693
43634B75424J21796q0517J25644o0796j72273n8591J61610j96058n9679r7999
43624d1439o3827M3300R4395K6557M621J4293p085q1336Q7595Q389m4804p0527
$$ plain form
43697 227213 328513 371805 303046 269692 168695 87723 191192 200848 107299 64261 309102
43686 309102 479924 492957 423148 567028 486767 386722 276993 346633 377130 492919
43676 492919 325158 168793 64383 247860 405476 376953 230005 -30976 27711 34724
43666 34724 107032 285027 300710 -62367 -108675 87535 159041 162145 98740 198112 137006
43655 137006 -43685 125745 207542 238246 268303 114439 51009 230405 130048 -36718
43645 -36718 166289 99042 -23207 -36574 47958 228016 116115 293438 268977 300117 275424
43634 275424 397220 316703 442347 381551 209278 150687 312297 116239 56560 -41439
43624 -41439 -105266 -61966 32429 58986 63607 77900 70815 -10521 77074 85463 40659 -29868
43612b9868j71550l7638J17167J40600R9310O8073k3170j91629j33676J20717
43602d1664N4374j02455N4093p920J16400J39415R7767K0693j71476r0651K407
43591G0983n2365o0437j65810r229J47073J30587j2464q2993j93989N9128K55740
43580H6224L3864J16911n3485O4625j27187L2599o9044o1074p91p2026J80263
43569A30879j2021J10638R2786j71960r3524J04407J8186j09526m9092K09582
43559B30355J5833Q2862j9471Q0047J3730o965j99216o7724l2960k17759M9122
43548g2146k1574L09560J35075K6972k02048j37904J15961K9798L8828k2743J068
43537B00847k58016J12142J4087l594J32102p9039j11496j3141N6842k2894O459
$$ plain form
43612 -29868 -201418 -239056 -121889 18711 118021 186094 162924 -28705 -162381 -41664
43602 -41664 12710 -89745 -35652 -43572 72828 212243 310010 330703 159227 68576 70983
43591 70983 18618 -41819 -207629 -216858 -69785 60802 48338 -34655 -228644 -169516 86224
43580 86224 120088 236999 183514 248139 120952 153551 84507 23433 22642 -49384 130879
43569 130879 118858 229496 322282 150322 56798 161205 179391 69865 20773 230355
43559 230355 246188 329050 309579 389626 403356 396391 197175 129451 96491 -121268 -72146
43548 -72146 -93720 215840 350915 377887 175839 37935 153896 183694 222522 199779 200847
43537 200847 -57169 54973 69060 65466 197568 118529 7033 -6108 50734 27840 34299
43526C4299j46662K4229J12349r2702L76Q0794O602m7617Q3995O040q4338Q6759
43514F4124m2365l3595p590J47132J5535K685M1344q0219K7553R1208Q3415j87521
43502A21706q4833L10745j13523l238m3040O8608P3928q604M7813n6990M9818
43491C62390k45139k13531J00499j05573j62052P2487J71704J6279J80360j2107
43481A65317k36943J32242J53233l833j65920k0094q009P0314L4440n512N0349
43470A65584j10605j82058J36J31075o7077P3244J93424K209p4023M8250K7122
43459B07281L9317p7614J24878o5110j3333j15829p8303J47813M6100K5472J41329
43448C82001j47530k16153J25233K23549N0632K1940k09924p1599j61763P7200
$$ plain form
43526 34299 -112363 -88134 24215 -68487 -68111 12683 19285 -28332 55663 61703 -22635 64124
43514 64124 21759 -11836 -19426 127706 143241 145926 187270 107051 134604 225812 309227 121706
43502 121706 36873 347618 234095 230857 187817 256425 330353 321749 369562 312572 362390
43491 362390 117251 -96280 4219 -101354 -263406 -190919 -19215 -2936 177424 165317
43481 165317 -71626 60616 213849 210016 44096 24002 15993 86307 120747 115235 165584
43470 165584 54979 -127079 -126943 4132 -62945 10299 203723 205932 131909 180159 207281
43459 207281 246598 168984 293862 228752 215419 99590 21287 169100 215200 240672 382001
43448 382001 234471 18318 143551 367100 417732 439672 229748 158149 -3614 73586
43438G3586K4331K4667J94726N4152k01952n8297J27233j53572K5519L25430O1836
43427D97659j68829q5656j7635J17746Q3707j20904o4436m4255j29033m058J90337
43416B54643j02959r1706P0068O9105j28935j18733J15891O3180j19137r4305
43406h2888K57628O7199p613j48810Q8720J73562Q6504K5286J2033m2164j46276
43395B83181j40013j05737K0547L2632L4422m0640l5493J45980k6656O1795m3547
43384A86471k09164j13485M1232K23376m8256n495R2602r9697K5673j92860J05525
43373E922K73705L9591j50468r828j06711j6508k9343J7880n650J09602j1796
43362A16396n0376L4633n4098J5587o7062J06260J28677N1317r6236k15423r6725
$$ plain form
43438 73586 97917 122584 317310 371462 169510 111213 238446 84874 110393 435823 497659
43427 497659 328830 243174 225539 343285 426992 306088 241652 197397 68364 64306 254643
43416 254643 151684 59978 130046 199151 70216 -48517 67374 130554 11417 -82888
43406 -82888 174740 241939 234326 85516 174236 347798 434302 459588 471621 429457 283181
43395 283181 143168 37431 57978 90610 125032 84392 48899 194879 168223 230018 186471
43384 186471 -22693 -136178 -94946 128430 80174 74679 167281 67584 93257 -99603 5922
43373 5922 279627 319218 168750 158922 52211 35703 6360 24240 18590 128192 116396
43362 116396 66020 100653 46555 62142 -4920 101340 230017 281334 185098 -30325 -127050
43351a27050J09247N1361j0118L4984Q0987J17398J7189M0732o3556r6243o2511
43340I2420J9915K90395L1487j12593q0698r6091J9877j96029j695M867J3947
43329a4198p0841L2197P2739R5611N9960j79492j01000j44088K00970l12P4421
43318B5967L0625q7675N8761N8430N6350K52711k54996M7962Q273r4083q7322
43307A5003J1488J33972J00850K24774L0757j28703j72311j35363J8488J38531
43297B37486O7115j10232r8403J26483K8656J71036p9629r8852j32834j38494
43287b7668K01471r9234o8219M07K7035J15237k33048o6233P7367J97446J53506
43276B78067O57n4988m2170m7005K6766q9387L6139J86473j07491j37995j25839
$$ plain form
43351 -127050 -17803 33558 23440 58424 139411 256809 273998 314730 251174 154931 92420
43340 92420 112335 402730 434217 321624 240926 144835 164712 -31317 -33012 -28145 -14198
43329 -14198 -85039 -52842 19897 115508 175468 -4024 -105024 -249112 -48142 -48454 25967
43318 25967 56592 -31083 27678 86108 142458 395169 140173 188135 196408 102325 15003
43307 15003 26491 160463 261313 486087 516844 388141 215830 80467 98955 237486
43297 237486 304601 194369 95966 222449 251105 422141 342512 243660 110826 -27668
43287 -27668 173803 74569 6350 6757 33792 149029 -84019 -150252 -72885 124561 278067
43276 278067 278724 223736 181566 134561 161327 71940 108079 294552 187061 49066 -76773
43265g6773Q719J44779j82482Q3694O5518j10925O9031N2241K1941n827Q8193
43254A58109p9600R1984m8955R7527J42587k50284p8199J6036J17645r0667j13147
43243c6964N7908j04798j27683L4116P6368k5434K00735M4281J02710M1313j38909
43232A23643r6450N2008r7229L0078J97740J4368L4812o3494j47888R8839J53476
43221B99903j5188j7932L9130M5436k07235k1295J9063J32397J23534l02302K3795
43210A19306J36816m6240o2014O875K01393K6056o5642k62099R7180J06091L9924
43199B97646j19842j5896o581n3947q118o585N6575n6970l39360J70438L10110
43188B27470n4776k09621j78934J6115p4846M1872L67462J43296p9195j10539
$$ plain form
43265 -76773 -68054 76725 -105757 -22063 43455 -67470 1561 53802 75743 69916 158109
43254 158109 78509 170493 121538 219065 361652 111368 33169 49205 166850 76183 -36964
43243 -36964 20944 -83854 -211537 -177421 -101053 -126487 74248 118529 221239 262552 123643
43232 123643 27193 79201 -18028 12050 209790 224158 258970 195476 47588 146427 299903
43221 299903 284715 266783 305913 351349 144114 122819 141882 274279 397813 95511 119306
43210 119306 256122 209882 147868 154743 356136 382192 316550 54451 151631 257722 297646
43199 297646 177804 161908 155327 101380 93262 86677 143252 86282 -253078 -82640 227470
43188 227470 172694 -36927 -215861 -199746 -274592 -232720 134742 278038 198843 88304
43178H8304L7131O1946r2741j21859j85115Q7946N4764Q5106l7886n0597J22827
43167D9826K5208k28707L0666O8832J48891N0400j16616q8399p694L53586N848
43156B91841q8663k80225Q2219J87590k8460j2256j95040k1090k2173O7837o4433
43145h2853Q5341J50574M7790J34622j39419r5436J37717Q110N2751j16087k01852
43134a8742k7801J47538P5767L2248O1571l09129J99287K3143k9537n320j78244
43123b9219J34829j2399N5242j50252K13826N0001j41960K2658j88482m758Q5764
43112C5250j444m6752K0762L4566O2019k21714J73761J17294p5482k6513k01458
43101a29711J22976R7591j6122R3775M3263j09276J90306j23066o0874J01108
$$ plain form
43178 88304 125435 187381 94640 -27219 -212334 -124388 -69624 15482 -22404 -73001 49826
43167 49826 75034 -153673 -123007 -54175 94716 145116 28500 -59899 -67593 285993 291841
43156 291841 203178 -77047 5172 192762 164302 152046 -42994 -64084 -86257 -18420 -82853
43145 -82853 2488 153062 200852 335474 196055 100619 238336 246446 299197 183110 -18742
43134 -18742 -46543 100995 176762 209010 270581 -38548 160739 183882 154345 149025 -29219
43123 -29219 105610 93211 148453 -1799 212027 262028 120068 142726 -45756 -50514 35250
43112 35250 33806 -12946 7816 42382 104401 -117313 56448 173742 98260 71747 -129711
43101 -129711 -6735 90856 74734 168509 211772 102496 292802 169736 108862 209970
43091B09970J4903r8980R1377j26353J98419k8124l13106P8086l6656n0365j36611
43080a97440l0154L17796j00415j00207P8086M6078R7485P1530J20881p977j92232
43069A03431N6505J50956p4169J1793R9488J6344k48127p0657J92436J6469N2379
43058C06848l7703j73911j48237K73543P492N868J7294o6445J69033o539k50509
43047I6734j63581K0874L0384L2052J19324K6253J5649j257j0792J80411M8078
43036C94129j77123j32143j87449P4867J48409j04867M6117J06989M0506K45540
43026D54975n8336j55408j65101K0422l8251l2572J0115j62598M8931K34899j55986
43015A090j77129J31211m0259n7333O4088J2367j27357p9253J81155P2047L8116
$$ plain form
43091 209970 224873 125893 217270 90917 289336 261212 -51894 26192 -10464 -60829 -197440
43080 -197440 -227594 90202 -10213 -110420 -32334 13744 111229 182759 303640 295663 103431
43069 103431 159936 310892 236723 248516 348004 364348 116221 45564 238000 254469 306848
43058 306848 269145 95234 -53003 220540 228032 233900 251194 184749 353782 347243 96734
43047 96734 -66847 -45973 -15589 16463 135787 162040 177689 176432 165640 346051 394129
43036 394129 217006 84863 -102586 -27719 120690 15823 61940 168929 209435 454975
43026 454975 396639 241231 76130 96552 58301 25729 35844 -126754 -77823 157076 1090
43015 1090 -176039 -44828 -85087 -142420 -78332 -65965 -193322 -272575 -91420 -19373 18743
43004A8743J14132j53888J08373n9503L2198J0517j19384j1315J9396N8065O8829
42993H6163O2240J78J3689M4066j12583J1847j28177J06621M3054q66o384O7681
42981A87529q4937r7734p1984N2299j00643m1942J0685K34914J66003n3295P9355
42970B80250j22888j87509J04378n768J80326j83696j10225M2362o3307J71030
42960A04953Q6503j68702q6607J98837J30213p2278L8950k13067n6577J07675
42950F9900l6068J09115J49396m3176k7670j62067p1326q2764O234j8918O6897
42939d0447J9808J17756P1559l44135k879Q3571R2286J02453P8399j984j39145
42928C7242j23806j1291K35170L1157j21116r3581o6059J29096J61436m8292l510
$$ plain form
43004 18743 132875 -21013 87360 27857 60055 70572 -48812 -60127 -40731 17334 86163
42993 86163 148403 148581 162270 206336 93753 105600 -22577 84044 127098 126232 119848 187529
42981 187529 102592 4858 -67126 -14827 -115470 -157412 -146727 88187 254190 200895 280250
42970 280250 157362 -30147 74231 68463 248789 65093 -45132 -2770 -66077 104953
42960 104953 191456 22754 -63853 134984 265197 192919 231869 18802 -37775 69900
42950 69900 33832 142947 292343 249167 221497 59430 -11896 -94660 -88426 -107344 -40447
42939 -40447 -20639 97117 168676 -175459 -178338 -94767 -2481 99972 178371 176387 37242
42928 37242 -86564 -97855 137315 168472 47356 -46225 -112284 16812 178248 129956 126446
42917A26446j99681o9949J30710l5714j78810K91410L341k20744J23987J56924
42907A27920J40440q0343k38557M8977J13043k3930K0941m3711J04808J83383
42897C52971n1926j0548O3207p5859j96377r3905Q0357j87616J74710J59774P7404
42886B92192K90464k3903l00648L6124k25659J00749p4731m2113K1926J39693
42876B14094n8255J22318j87093M9090J61130j38929j33258M5168J03758J93208
42866C71231j8145o7884j79062p7579J05229M8445K0785j59644K2940j62469o6700
42855a62853j3121l3930J42319J26629J01465O2410K702J7708l5235p4741k283
42844A31070n2299j20492L0627p8553O4285J91557J37837j69778M5514n4990K938
$$ plain form
42917 126446 -73235 -143184 -12474 -48188 -226998 64412 67753 -152991 -29004 127920
42907 127920 268360 188017 -50540 -1563 111480 87550 108491 64780 169588 352971
42897 352971 301045 290497 353704 277845 81468 -12437 67920 -119696 55014 214788 292192
42886 292192 582656 558753 258105 294229 68570 169319 94588 52475 74401 214094
42876 214094 155839 278157 91064 140154 301284 162355 29097 74265 178023 371231
42866 371231 353086 285202 106140 28561 133790 182235 203020 43376 66316 -96153 -162853
42855 -162853 -175974 -209904 -67585 59044 160509 222919 225621 243329 208094 133353 131070
42844 131070 78771 -41721 -11094 -89647 -25362 166195 304032 134254 179768 124778 127716
42833A27716N5287J52954j81539j44873P7393p8610K8942Q2260o2544q6408R8468
42822F9046m9507K6631r6363M9189P4647m2481M4473N056M4420j2263o8997N8001
42810A01852O2134j99862J34860J21052l4724M4101j19067N6788o5746q0143N5946
42799G7191N6690l9626j25164k0506j37060J28417J36171K2839j60142o8882J34216
42788D144K00435L0860J6288j2584r5598p5608j83701R1097P6501J70765M3981
42777B66580k02064K1901P9770j5158j08868k89812J22397O7319O1882o850k9464
42766c2367J41948J510j56365J69640J41435o1118J59786k52490j13646J4907
42756A3240j44056K21961J11483l9880o1250J42203k93889j71204l0489P1790
$$ plain form
42833 127716 183003 335957 154418 9545 86938 8328 37270 119530 56986 -29422 69046
42822 69046 19539 46170 -50193 -1004 73643 31162 75635 80691 125111 112848 43851 101852
42810 101852 163986 -35876 98984 220036 185312 229413 110346 167134 101388 21245 77191
42799 77191 133881 94255 -30909 -51415 -188475 -60058 76113 98952 -61190 -130072 4144
42788 4144 204579 235439 251727 239143 143545 67937 -115764 -24667 51834 222599 266580
42777 266580 64516 86417 166187 151029 42161 -247651 -125254 -57935 3947 -2903 -32367
42766 -32367 109581 111091 -45274 124366 265801 204683 364469 111979 -1667 13240
42756 13240 -130816 91145 202628 162748 101498 243701 -50188 -221392 -251881 -180091
42746a80091R7635q5689P8519J21908r5431j15645L22931l1975j23105M9371l6204
42735B224O9536J37181J4700K08696k64323j36971k3920M1724J55778N8084L4925
42724B97634M5728R7468j0847q4161j56487p1051r4618k974K0688J2208o9368
42713a5780p4689J6975J88675K6393j91441k5709M1634Q7098L3351J0401m4690
42702E2218j0184n0007o2046K82180N8737N580N3362J45219o6458j06169j29123
42691A73309k4732j3649M62J9813Q6807J17535p5919j24036O6667M6725j70447
42680A02535j09725K30738j94961K3600l6865o6125O7092R8446m7561j9120M2332
42669I0386L493K34017j08739j00028L8115M409r0950r7567L0074m9684J20670
$$ plain form
42746 -180091 -82456 -168145 -89626 32282 -63149 -178794 144137 112162 -10943 38428 2224
42735 2224 71760 208941 223641 432337 168014 31043 7123 48847 204625 262709 297634
42724 297634 343362 440830 429983 345822 189335 118284 23666 20692 41380 53588 -15780
42713 -15780 -90469 -73494 115181 141574 -49867 -75576 -33942 53156 86507 96908 52218
42702 52218 42034 -7973 -70019 212161 270898 276478 329840 475059 408601 302432 173309
42691 173309 148577 134928 135390 155203 242010 359545 283626 159590 226257 272982 102535
42680 102535 -7190 223548 28587 52187 15322 -50803 16289 114735 67174 48054 90386
42669 90386 93879 327896 219157 119129 157244 161653 70703 -26864 3210 -46474 74196
42658G4196J57916j54687O068J62859k06210J0502L4664M8953J54374k01745q62
42647H6028j36081Q3351J21186M0551j62196j07726N6503J19372J70413k2682
42637B48719p4054n4916j66106q64L08172L7377O9273L7334J570k07950r4105
42626A04450K67o1875Q7817K28160m2683K0447j2718k94693o8n6392J61821j05492
42614B9041j44673j25052J95427J40617J51652J92917k07980l02100l7976k9503
42604a37630J59155R250M9200N5497o9021J09828m2890O6281Q304p4279j40273
42593f578N2658P5384l3558l6324J07363j68784J41356R3661l3992r3846j59412
42582f2072n757l5091l5403j92332J04633K19950J73007J60480j90370o7961Q3783
$$ plain form
42658 74196 232112 77425 83493 246352 40142 50644 85308 134261 288635 86890 86028
42647 86028 -50053 33298 154484 195035 32839 -74887 -18384 100988 271401 248719
42637 248719 174665 119749 -46357 -47221 260951 298328 367601 404935 406505 198555 104450
42626 104450 104717 42842 130659 358819 316136 336583 323865 29172 29104 -27288 134533 29041
42614 29041 -115632 -240684 -45257 95360 247012 439929 231949 -70151 -108127 -137630
42604 -137630 21525 30775 79975 135472 66451 176279 133389 199670 207974 133695 -6578
42593 -6578 46080 121464 87906 51582 158945 -9839 131517 225178 191186 97340 -62072
42582 -62072 -67829 -102920 -138323 -330655 -226022 -6072 166935 327415 137045 69084 152867
42571A52867J44309k0550p3700j70716O0113p3056o0415j05799J37851K06769
42561A97673Q9860n9078n4642R8558l9541l0708J26274q4689j84750K2609m9149
42550C2417J01258r5854j27199M0912J82722p8324P2280k1993q6651j16322K8092
42539f8662P2248m3902Q6839P6014J07097K7961j7676j55262k31617K10423j596
42528F1867n651o0005k0283J51999k30825k5864R5509L23172P2587k28891q3156
42517E0459j08751J74716O6736l9946j64323j84903r7327R8127R02L0352J07626
42506f6332J52946j0600N5968j00558m1085J66870j37443J06962k0232R046K050
42495A17592q5593K5653P1885l7818N7801N4658O513j68257P9356o7579N2262
$$ plain form
42571 152867 297176 276626 202926 32210 92323 19267 -41148 -146947 -9096 197673
42561 197673 287533 228455 173813 272371 232830 202122 328396 243707 58957 81566 32417
42550 32417 133675 37821 -89378 -48466 134256 55932 128212 106219 19568 -96754 -68662
42539 -68662 3586 -40316 46523 122537 229634 257595 239919 84657 -146960 63463 61867
42528 61867 56216 -3789 -24072 127927 -102898 -128762 -33253 289919 362506 133615 50459
42517 50459 -58292 116424 183160 143214 -21109 -206012 -303339 -205212 -204310 -173958 -66332
42506 -66332 86614 76014 131982 31424 -9661 157209 19766 126728 106496 115542 117592
42495 117592 31999 57652 129537 91719 149520 204178 210691 42434 121790 54211 106473
42484A06473R2312J30807j83194k06832R085J06940J488p0188N7480N2763M4793
42473A41927R8370j23468k60181O6566k8723K23674n8611K4361Q1640p4775j71908
42462h1128j5291Q6943q1982J47930J37056j17951P8424Q1447j00887R6570p445
42451B23686j06293Q5228N8714L7151m3392l3745M5076n0763M9378M6338k37428
42440G3950J1168J5618r5360j10549k7863j06629J94659n7496l1660N1822j0532
42429i2872j7779N2215m3897M9033J55564K7647m1937L4215J090m373n8709l1732
42417B8465n939N5785J16535j05117p9998j25548k8643m6627O7703J67671K8347
42406G2634J34601N2155J8603l00541O3188J5043R0707l6575l29170O8625J30276
$$ plain form
42484 106473 198785 329592 146398 -60434 -51349 55591 57079 -13109 44371 97134 141927
42473 141927 240297 116829 -143352 -76786 -105509 118165 59554 83915 165555 90780 -81128
42462 -81128 -96419 -9476 -91458 56472 193528 75577 154001 235448 134561 231131 223686
42451 223686 117393 202621 261335 298486 255094 221349 266425 215662 265040 311378 73950
42440 73950 85118 100736 5376 -105173 -133036 -239665 -45006 -102502 -134162 -82340 -92872
42429 -92872 -110651 -58436 -102333 -53300 102264 129911 87974 122189 123279 118906 60197 28465
42417 28465 22526 78311 194846 89729 9731 -115817 -144460 -191087 -123384 44287 72634
42406 72634 207235 259390 277993 -22548 40640 55683 146390 109815 -219355 -150730 -20454
42395b0454O6015J3624p7399m040J15910j10287n2944J14700J47570m8163k9939
42384A14593o9890m6876N8019j02494J09451R2779O3361L4988k317l351l7530
42373B10733r7206q3893o8472O2574O1937M5604k8595j15731P248R8773m9644
42362D3328R113J49834r39p7560j26197N6684M9953o8401J57967j5844j15328
42351F2610j05883j6553K25946J29808k13265j88713r316J28340J80271j8021
42341A75224Q4499m6225J16899q5199k22801J05602N451q2438Q7006J53073j57247
42330A33844k3038K4509k75000j07650k843m6277l624N3043O2181P6677j8224
42319a26402J4352J08172M0822R9731j88138K9491P7384L3204J17607n4439j15883
$$ plain form
42395 -20454 45561 59185 -18214 -22254 93656 -16631 -69575 45125 192695 144532 114593
42384 114593 44703 -2173 55846 -46648 62803 155582 218943 253931 251614 248263 210733
42373 210733 113527 29634 -38838 23736 85673 131277 102682 -13049 -5801 92972 43328
42362 43328 52441 202275 201336 123776 -2421 54263 104216 35815 193782 177938 62610
42351 62610 -43273 -59826 166120 295928 82663 -106050 -115366 12974 193245 175224
42341 175224 259723 213498 330397 245198 22397 127999 133450 51012 138018 291091 133844
42330 133844 110806 135315 -139685 -247335 -250178 -296455 -300079 -247036 -184855 -108178 -126402
42319 -126402 -112050 -3878 36944 136675 -51463 -21972 55412 88616 206223 151784 35901
42308C5901J50418j78499J12184j9795K2312j25352j47185K11342N8806l5382
42298H4750j22435j40822J57085P6036l849J59125p091k53900k5451j0083J65704
42287G9069J06994j54265J35314j2216L2757J00271j54786J46004j6338r1891
42277A70913l0397R6154j00446j63380O8762n6852J1077m3098K1547p2623k8940
42266a27283N9434L7511q9512J19525k5136M5802J77659N6858J4689j77978r0395
42255A174r8314J11642M9996j52734o545L6887L9247O5898j3958o6806j22404
42244a55917L7350J34904P7172P9718j53141L7540M3281l26981J1420O9012J22408
42233b3234j57022r4643J97843M9981J35624J40965j03903j67841K6649J24081
$$ plain form
42308 35901 186319 7820 120004 100209 122521 -2831 -150016 61326 120132 84750
42298 84750 -37685 -178507 -21422 54614 50765 209890 202799 -51101 -76552 -86635 79069
42287 79069 186063 31798 167112 154896 187653 287924 133138 279142 262804 170913
42277 170913 140516 236670 136224 -27156 41606 -15246 -4169 -47267 -25720 -98343 -127283
42266 -127283 -67849 -30338 -119850 -325 -25461 20341 198000 254858 269547 91569 1174
42255 1174 -97140 14502 64498 -88236 -94781 -57894 -18647 47251 33293 -33513 -155917
42244 -155917 -118567 16337 93509 173227 20086 57626 100907 -226074 -214654 -145642 -23234
42233 -23234 -180256 -274899 -77056 -27075 108549 249514 145611 -22230 4419 128500
42223A28500O1930k7656o6469j03452j26795J84537J59811j34119M9473J23214
42213B48974J45683Q588p5575k1759q4644P9408K3082j80344K2471j13012j42289
42202h9417l096K52618L0309j02415J03709J42995r5746j15036q8320J36848J00396
42191B72845j3971o3659J8958N1318p063k83428j00145o0571K1548J52082N6775
42180D4689J7536q0000q7481j4847J57242J11650K7065K18206L0341l21359p6140
42169B6902O1700k25876J01651J31914k2090J09781r972P462j2558K3364j38968
42158E3310J04838P6571j14197k03176k2189N2429Q5970K21608j2618N567J3747
42147B61860j42833q3909k57588j08596K52174J30627M064j50545Q618l7166N4222
$$ plain form
42223 128500 190430 162774 96305 -7147 -133942 50595 210406 76287 125760 248974
42213 248974 394657 403245 327670 305911 221267 300675 323757 143413 165884 52872 -89417
42202 -89417 -92513 160105 190414 87999 191708 334703 238957 123921 35601 172449 272845
42191 272845 258874 195215 214173 265491 258428 -25000 -125145 -185716 -164168 -12086 44689
42180 44689 62225 -17775 -105256 -120103 37139 148789 175854 394060 424401 103042 26902
42169 26902 88602 -137274 -35623 96291 74201 183982 174010 181472 168914 192278 53310
42158 53310 158148 234719 120522 -82654 -104843 -52414 33556 255164 242546 248113 261860
42147 261860 119027 35118 -222470 -331066 -78892 51735 55799 -94746 -86128 -123294 -69072
42136f9072J98663q0337l7690j86229J93717N8502j86013j22906K47627J73464
42126A89726N5413R590l24210K33277l405j77947o8065J33152j59052J01440O2971
42115E2890K0124j0921N4051j94048j18635K02720m8203k9301J42729M6188p5718
42104D1876L4553p7265L9064j21140q2263l5400R9961J57370N9446M7094J39117
42093C02413n7451j37073J3844j3449n7576M1707o9549J95107p8683p0676m8966
42082A9648q5446q4298K3256J68352L0902p5340p6590N6488J02449J43531O6954
42071B89906p66j78113k97687J25707Q8643M400O2894j73936J33481j5004Q3238
42060A22763J53075n1299o3300J82776j37672j07417J51293L9515O570J7485j72917
$$ plain form
42136 -69072 129591 49254 11564 -174665 19052 77554 -108459 -231365 16262 189726
42126 189726 245139 254729 -69481 163796 160391 -17556 -85621 47531 -111521 -10081 52890
42115 52890 73014 62093 116144 -77904 -196539 6181 -42022 -71323 71406 117594 41876
42104 41876 76429 -836 38228 -82912 -165175 -200575 -100614 56756 116202 163296 302413
42093 302413 244962 107889 121733 108284 50708 92415 22866 217973 139290 68614 19648
42082 19648 -65798 -150096 -126840 41512 72414 -2926 -79516 -23028 79421 222952 289906
42071 289906 289140 111027 -186660 -60953 27690 32090 94984 -78952 54529 39525 122763
42060 122763 275838 224539 161239 344015 206343 98926 250219 289734 296304 313789 140872
42049A40872J8594j60739O802p6694O6299K2902k1564J0085Q2706J92157k0842
42038B60578k93069k02031K19985J42061Q5861r1570j19187J31669L6352j1464
42028A59185J10033P647j99639J76039r5908j15218j59506K6766k9360l6855K27106
42017G0290L7445K45742N7747l89192J46014J2758k19197R2417j35181k46549
42007c27706K45080m4437j15771Q0772Q6095K0002K1812J7334J9827j39148J07478
41996b8662L4301k12086n4851J93018J93876J00266m3607k59344k3890J80732
41986G9753J69994l0182p4932j560m0867J9127n4177j49475J31097j16103R221
41975e8104L5167J49783j388J38526J57111r4022j55245o9787J11455J19417k7370
$$ plain form
42049 140872 159466 -1273 5529 -71165 -4866 18036 -3528 6557 89263 281420 260578
42038 260578 -32491 -234522 -14537 127524 213385 121815 2628 134297 170649 159185
42028 159185 269218 276865 77226 253265 157357 42139 -117367 -90601 -119961 -156816 70290
42017 70290 107735 353477 411224 22032 168046 180804 -38393 54024 -81157 -327706
42007 -327706 -82626 -127063 -242834 -162062 -75967 -55965 -34153 -16819 3008 -136140 -28662
41996 -28662 5639 -206447 -261298 -68280 125596 225862 182255 -77089 -100979 79753
41986 79753 249747 219565 144633 143073 102206 121333 67156 -82319 48778 -67325 -58104
41975 -58104 -22937 126846 125458 263984 421095 327073 171828 102041 213496 332913 305543
41964C05543k4900j30467j46850j2289J4985J64021L9877P936J6699M394j82889
41953E6060K5995J53999m5150q9378J14994R8277n4239j45987k8547j20151j33159
41942a67286M7163J59092L2884O0001o4658p3694o9360J45827J51054m9865k35157
41931f3999o2913J52681j20885n8410K37517o6337j72161R3253Q9117J88117P6261
41920B92241R6254k11281k520n1810k8825j34285n1044k2952J00538K2809l6N3434
41908F2523q5464l5930n2410K68540l4443m8513K7212J17055j92251J2107R5351
41897A33777n8065K21792k2394j32517P7557N0701J26415j38016j45811k5582
41887H7857r008J74608k04100j23962J14321L693r8983M8500m4129P325O2803
$$ plain form
41964 305543 280643 150176 3326 -8963 6022 170043 209920 217856 234555 238949 56060
41953 56060 82055 236054 190904 101526 216520 314797 260558 114571 86024 -34127 -167286
41942 -167286 -120123 38969 71853 131854 67196 -6498 -75858 69969 221023 171158 -63999
41931 -63999 -126912 25769 -95116 -153526 83991 17654 -154507 -61254 27863 215980 292241
41920 292241 388495 177214 174694 122884 94059 -40226 -91270 -114222 -13684 9125 9089 62523
41908 62523 -22941 -58871 -111281 157259 122816 74303 101515 218570 26319 38426 133777
41897 133777 75712 297504 275110 142593 220150 270851 397266 259250 113439 87857
41887 87857 78849 253457 49357 -74605 39716 43409 -55574 -7074 -51203 -43878 18925
41876A8925p0379P3016Q7983o0951J43836m9970j36121J83478J38155j32469l685
41865A91818r9719K08530P7514P565J08538j60886j31989k11077K2709l8167r3908
41854a19072J82114q9001l9034J76038n9801J52001q6254l271k1603P5743J3955
41843A81815p8039o1710N0752O9340k73334m8463J11756J39382m0846O1190j14996
41832c153k06085L1026O5109m5570J40507J40809J55910N5964j71685j1918J21621
41821B72535K5994k27612k28619j18948J14232J55537r6220R7349N7431m9080
41811B599k1388l8825P3852J95323K7597k07307l5127J00464J06860k42483P4823
41800C6388L4939j4082J25385j37611j01503J01016o1350R8552J2066k12472Q3514
$$ plain form
41876 18925 -51454 21562 109545 48594 192430 142460 6339 189817 327972 195503 191818
41865 191818 92099 300629 378143 385708 494246 333360 201371 -9706 13003 -25164 -119072
41854 -119072 63042 -25959 -64993 111045 51244 203245 116991 113720 92117 167860 181815
41843 181815 103776 42066 92818 162158 -111176 -159639 -47883 91499 50653 111843 -3153
41832 -3153 -209238 -178212 -113103 -158673 -18166 122643 278553 334517 162832 150914 272535
41821 272535 298529 70917 -157702 -276650 -162418 -6881 -103101 -5752 51679 2599
41811 2599 -18789 -57614 16238 211561 239158 31851 -3276 97188 204048 -38435 36388
41800 36388 71327 57245 182630 45019 -56484 44532 -16818 81734 93800 -118672 -35158
41789c5158P8415j00376j53135M7281J86787N0112j19839J94001n3516j67792
41779g3220j6466K7063k1667j67311J14755N2727M2883J0586J9110J56515K49084
41768C94059j62383l10059J58071p8783M1292P4689j41645R950l8200k027L270
41757e1766J19582o6737L1921R2245M4264K28016O7771k61674k73683M8500R6827
41746G5266p311q1045k4782Q3288m0876R9277J20452J71419k41932k8408j52639
41735b7291M1505J34612M433k2483R5245P9726n2387j52857L6188L480K3895K1805
41723A85871P5944r978k922n0256r2473J21918P5327j66453j04256P56N3194o0800
41711B5872M2621J5405k76388l7046J75043j7160J13776n4080J45718j67264l2038
$$ plain form
41789 -35158 43257 -57119 -210254 -162973 23814 73926 -45913 148088 94572 -73220
41779 -73220 -89686 -62623 -84290 -251601 -136846 -84119 -41236 -30650 -11540 144975 394059
41768 394059 231676 -78383 79688 905 42197 116886 -24759 -14809 -53009 -55036 -51766
41757 -51766 67816 1079 33000 125245 169509 397525 465296 203622 -70061 -21561 75266
41746 75266 67955 -13090 -37872 45416 4540 103817 224269 395688 153756 125348 -27291
41735 -27291 14214 148826 153259 130776 226021 305747 253360 100503 136691 140171 164066 185871
41723 185871 261815 251837 248915 198659 106186 228104 303431 136978 32722 33478 86672 25872
41711 25872 68493 83898 -192490 -229536 -54493 -71653 42123 -11957 133761 -33503 -65541
41700f5541K54776l302p2055j12600m7010J39732j22074j29326J62373K0292R0711
41689A15976j9985J93632q5641j10176R0432k19342j83793J64946L2669J7011
41679d271j2959P9972M7962O3722K1334j44877j61465n6351K4572R217J60109
41668B6965m6624n5564J83254J38292J9556j20312O201M0610O8013J0858q8510
41657A82739Q4510j9018j95472L2329J12276J66818j63306l6991j28543n3915
41647a8573J4013j17656J36372j1257K9150J10427K6108j1515J62058Q7065j16748
41636B89444l5019K1198J34009p9520j55283K3000n78K91378J3278k26134o9739
41625B06034j06066L3332L7057J070j52807M8027p7878o5579j3161M1725J14800
$$ plain form
41700 -65541 189235 185933 113878 1278 -45732 94000 -28074 -157400 4973 25265 115976
41689 115976 95991 289623 203982 93806 184238 -35104 -218897 -53951 -21282 -4271
41679 -4271 -17230 62742 110704 174426 195760 50883 -110582 -166933 -142361 -133144 26965
41668 26965 -19659 -75223 108031 246323 265879 145567 151768 192378 260391 271249 182739
41657 182739 267249 248231 52759 85088 197364 364182 200876 163885 35342 -18573
41647 -18573 -4560 -122216 14156 2899 32049 142476 168584 157069 319127 406192 289444
41636 289444 254425 275623 409632 330112 174829 197829 197251 488629 501907 275773 206034
41625 206034 99968 133300 170357 171427 18620 66647 -11231 -76810 -89971 -48246 66554
41614F6554j6217k6319K5267R5892l2473l8488j26127K09022N599j50763K03735
41603B15682J38646k39698o0046l7705j14711k3036J64054j9276M029J82734O4148
41592B74821j35603j01305l0806q8869J09684k9191J78576O733k95357j79847
41582b91164J05403J13305N8380k15200M8061K46913J3074L9126J11594j99177
41572C0315j82812P1453m8377l3064l9659O5695J62594L9433J35341J34626r5533
41561B40012j05748k0612j93076K08158J21817K2800P0865j77063k17831O5885
41551A5207J61203J30789j49894K7386j1677j5348k42551L0374P1687J31441q5044
41540F3573K3375R7611Q3550j87652l3049R3768r7131J6154o2460R7973m383p8140
$$ plain form
41614 66554 50337 24018 49285 145177 112704 74216 -51911 157111 162710 11947 215682
41603 215682 354328 114630 54584 16879 -97832 -120868 43186 23910 27939 210673 274821
41592 274821 139218 37913 7107 -81762 27922 -1269 177307 184040 -111317 -291164
41582 -291164 -185761 -72456 -14076 -229276 -181215 65698 78772 117898 229492 30315
41572 30315 -152497 -81044 -129421 -162485 -202144 -136449 26145 65578 200919 335545 240012
41561 240012 134264 113652 -79424 128734 250551 273351 344216 167153 -50678 15207
41551 15207 176410 307199 157305 184691 173014 157666 -84885 -54511 17176 148617 63573
41540 63573 86948 184559 268109 80457 47408 141176 44045 60199 -2261 95712 91329 13189
41528A3189K9352J41376j27828J71881L5742L2607j10897q2508k4476r8848K7581
41517G171R4117J29451o2917j14288Q0065n9576p5921K16212N0013j56008j946
41506A06373q6267J6148P1776M2090j27730k16232K4325J24439n544n609M3154
41495a3077K4482Q2594O924L0084n5853K7737r0884N9422J02946o1862j0545j79921
41483g7953k5597r3390L4511J59965l2970J0274R2905J5914j0597K464L8385K2256
41471A36167R0380l501j17943k9514K27124j6247n1178J47591J05095k68260k14164
41460E550Q7465j09279k14526J74341K37298k3500j9284r9132P3124J89183Q2236
41449C83476J1409p0946l4066k30310j1169K16559L8471M2714k8595O0033l5301
$$ plain form
41528 13189 42541 183917 56089 227970 263712 296319 185422 102914 78438 -20410 7171
41517 7171 101288 230739 167822 53534 133599 74023 -1898 214314 264327 108319 106373
41506 106373 20106 36254 108030 150120 22390 -193842 -169517 -45078 -50622 -56231 -13077
41495 -13077 11405 93999 100923 131007 75154 102891 12007 71429 174375 112513 101968 -77953
41483 -77953 -103550 -196940 -162429 -2464 -35434 -25160 67745 83659 73062 75526 113911 136167
41471 136167 226547 223046 105103 75589 302713 286466 235288 382879 487974 219714 5550
41460 5550 93015 -16264 -230790 -56449 180849 157349 138065 38933 112057 301240 383476
41449 383476 394885 323939 289873 59563 48394 264953 303424 346138 317543 377576 342275
41438C42275j64002j73658J30464O2168j6611j70851J54554j58798j6098l0140
41428d0697K10736P8839J2057l51113M7835K08826k2531P6759J65493n2429m6932
41417B86843j63033J16162J14159j6229k08139j29424Q4148l567J70222p1836
41407A79306j85917K9852L4601M4124j95552k72617P1535K36081J64426J90491
41397B96330l2536k17259O5518J79384J41465r5316p6870k09339m3486J22978
41387A30869J41188m0604J9724J81893o3439q5707n4736p8291M5408p1868K6386
41376A50823J40638P6038j77158P2132k3329L3137p5331j36023j1946K3298J53421
41365B25700n4551o3234N8922O0062j6657j2325l083n2114q1325j18511M820o3497
$$ plain form
41438 342275 178273 4615 135079 197247 180636 9785 164339 5541 -10557 -40697
41428 -40697 170039 248878 260935 -90178 -42343 166483 143952 220711 386204 333775 286843
41417 286843 123810 239972 354131 337902 129763 339 84487 80920 251142 179306
41407 179306 -6611 23241 57842 101966 -93586 -366203 -294668 -58587 105839 296330
41397 296330 263794 46535 112053 291437 432902 337586 260716 51377 7891 130869
41387 130869 272057 231453 251177 433070 369631 283924 229188 150897 196305 124437 150823
41376 150823 291461 367499 190341 262473 239144 272281 196950 60927 48981 72279 225700
41365 225700 171149 107915 166837 226899 210242 197917 194834 142720 61395 -57116 -52296 -115793
41353a15793j02311Q4217n2381K80174m6522J0944p7154j4404O824J14852K620
41342I1066R1694j5861l2756j91295j11055J02347P1020p8776P9441J14774J51374
41331B71973j60849p1609j28485R5348l027K8122m7573o5920K11231k4263k9940
41320G5008P172k9640j11812l4732M7453l9625K14939J174k46150n4188J35829
41309c4572n6883j55000O4827L6646J42320m2234o5814O5136J40770M6500k68861
41298a27165O800K35930J63577J13800j73072j37679L6350K55390q5558m2759
41288B45614J78197j87414r8710N6015k58185K35882Q5914n9540j85058j39975
41278a27260L9852J7089M3598r4913J07038J09967j70056J0064L309j61575k271
$$ plain form
41353 -115793 -218104 -133887 -186268 93906 47384 58328 -18826 -33230 -26406 88446 91066
41342 91066 182760 166899 134143 -57152 -168207 -65860 5160 -73616 5825 120599 271973
41331 271973 111124 39515 -88970 6378 3351 31473 -16100 -82020 129211 104948 75008
41320 75008 82180 52540 -59272 -94004 -46551 -86176 128763 129937 -116213 -170401 -34572
41309 -34572 -91455 -246455 -181628 -144982 -2662 -44896 -110710 -45574 95196 141696 -127165
41298 -127165 -120365 115565 279142 392942 219870 82191 118541 373931 288373 245614
41288 245614 423811 236397 137687 193702 -64483 171399 257313 197773 12715 -127260
41278 -127260 -87408 -70319 -26721 -121634 -14596 95371 -74685 -64621 -61312 -222887 -225158
41267b25158K03861p7813o2613J32066K31702n7916N202J3272q4662n858l0232
$$ plain form
41267 -225158 -21297 -99110 -161723 -29657 202045 144129 149331 162603 77941 72083 41851
$$ [...]
##END NTUPLES=NMR SPECTRUM
##END=
