##TITLE=1H_MBP03-3
 CDCl3. 8 sc
 
 15.3.2017
##JCAMPDX= 6.0         $$ Bruker NMR JCAMP-DX V2.0
##DATA TYPE= NMR FID
##DATA CLASS= NTUPLES
##ORIGIN= UXNMR, Bruker Analytische Messtechnik GmbH
##OWNER= root
$$ XWIN-NMR		Version 3.5
$$ Wed Mar 15 18:30:45 2017 Russian Standard Time (UT+4h)  she@DPX200
##.OBSERVE FREQUENCY= 200.13135
##.OBSERVE NUCLEUS= ^1H
##.DELAY= (6, 6)
##.ACQUISITION MODE= SIMULTANEOUS
##.ACQUISITION SCHEME= undefined
##.AVERAGES= 8
##.DIGITISER RES= 18
##SPECTROMETER/DATA SYSTEM= spect
##.PULSE SEQUENCE= zg30
##.SOLVENT NAME= CDCl3
##.SHIFT REFERENCE= (INTERNAL, CDCl3, 0, 15.7039)
##AUDIT TRAIL= $$ (NUMBER, WHEN, WHO, WHERE, WHAT)
$$ ##TITLE= Audit trail, XWIN-NMR		Version 3.5
$$ ##JCAMPDX= 5.01
$$ ##ORIGIN= Bruker BioSpin GmbH
$$ ##OWNER= she
$$ F:/spectra/data/she/nmr/H-F/1/audita.txt
$$ ##AUDIT TRAIL=  $$ (NUMBER, WHEN, WHO, WHERE, WHAT)
(   1,<2017-03-15 18:29:25.17 +0400>,<she>,<DPX200>,
      <created by zg, POWCHK disabled, PULCHK disabled
       configuration hash MD5:
       00 E9 B6 7A A2 85 ED C7 34 08 36 98 17 FE 4E 26
       data hash MD5: 16K
       5F 04 1B 75 E1 C2 E7 9C 4A B4 75 25 CB C5 C8 56>)
$$ ##END=
$$ 
$$ hash MD5
$$ EC F0 30 DC 0E 30 7A 9B C5 83 2A 3E C7 1D 23 A0
##$RELAX= 
##$RELAX= 
##$RELAX= 
##$RELAX= 
##$RELAX= 
##$RELAX= 
$$ Bruker specific parameters
$$ --------------------------
##$DU= <F:/spectra>
##$EXPNO= 1
##$NAME= <H-F>
##$PROCNO= 1
##$TYPE= <nmr>
##$USER= <she>
##$AMP= (0..31)
100 100 100 100 100 100 100 100 100 100 100 100 100 100 100 100 100 100 
100 100 100 100 100 100 100 100 100 100 100 100 100 100 
##$AQSEQ= 0
##$AQ_mod= 1
##$AUNM= <au_zg>
##$AUTOPOS= <>
##$BF1= 200.13
##$BF2= 200.13
##$BF3= 200.13
##$BF4= 200.13
##$BF5= 200.13
##$BF6= 200.13
##$BF7= 200.13
##$BF8= 200.13
##$BYTORDA= 1
##$CFDGTYP= 0
##$CFRGTYP= 5
##$CHEMSTR= <none>
##$CNST= (0..31)
1 1 145 1 1 1 1 1 1 1 1 1 1 1 1 1 1 1 1 1 1 1 1 1 1 1 1 1 1 1 1 1 
##$CPDPRG= <>
##$CPDPRG1= <>
##$CPDPRG2= <>
##$CPDPRG3= <>
##$CPDPRG4= <mlev>
##$CPDPRG5= <mlev>
##$CPDPRG6= <mlev>
##$CPDPRG7= <mlev>
##$CPDPRG8= <mlev>
##$CPDPRGB= <>
##$CPDPRGT= <>
##$D= (0..31)
0 1.2 0 0 0 0 0 0 0 0 0 0.03 0 0 0 0 0 0 0 0 0 0 0 0 0 0 0 0 0 0 0 0 
##$DATE= 1489588164
##$DBL= (0..7)
120 120 120 120 120 120 120 120 
##$DBP= (0..7)
150 150 150 150 150 150 150 150 
##$DBP07= 0
##$DBPNAM0= <>
##$DBPNAM1= <>
##$DBPNAM2= <>
##$DBPNAM3= <>
##$DBPNAM4= <>
##$DBPNAM5= <>
##$DBPNAM6= <>
##$DBPNAM7= <>
##$DBPOAL= (0..7)
0.5 0.5 0.5 0.5 0.5 0.5 0.5 0.5 
##$DBPOFFS= (0..7)
0 0 0 0 0 0 0 0 
##$DE= 6
##$DECBNUC= <off>
##$DECIM= 32
##$DECNUC= <off>
##$DECSTAT= 4
##$DIGMOD= 1
##$DIGTYP= 9
##$DL= (0..7)
0 120 120 120 120 120 120 120 
##$DP= (0..7)
150 150 150 150 150 150 150 150 
##$DP07= 0
##$DPNAME0= <>
##$DPNAME1= <>
##$DPNAME2= <>
##$DPNAME3= <>
##$DPNAME4= <>
##$DPNAME5= <>
##$DPNAME6= <>
##$DPNAME7= <>
##$DPOAL= (0..7)
0.5 0.5 0.5 0.5 0.5 0.5 0.5 0.5 
##$DPOFFS= (0..7)
0 0 0 0 0 0 0 0 
##$DQDMODE= 0
##$DR= 18
##$DS= 0
##$DSLIST= <SSSSSSSSSSSSSSS>
##$DSPFIRM= 0
$$ [...]
##$SUBNAM2= <"">
##$SUBNAM3= <"">
##$SUBNAM4= <"">
##$SUBNAM5= <"">
##$SUBNAM6= <"">
##$SUBNAM7= <"">
##$SUBNAM8= <"">
##$SUBNAM9= <"">
##$SW= 20.0189038669367
##$SWIBOX= (0..15)
0 0 2 0 0 0 0 0 0 0 0 0 0 0 0 0 
##$SW_h= 4006.41025641026
##$TD= 16384
##$TD0= 1
##$TE= 0
##$TE2= 300
##$TE3= 300
##$TEG= 300
##$TL= (0..7)
0 120 120 120 120 120 120 120 
##$TP= (0..7)
150 150 150 150 150 150 150 150 
##$TP07= 0
##$TPNAME0= <>
##$TPNAME1= <>
##$TPNAME2= <>
##$TPNAME3= <>
##$TPNAME4= <>
##$TPNAME5= <>
##$TPNAME6= <>
##$TPNAME7= <>
##$TPOAL= (0..7)
0.5 0.5 0.5 0.5 0.5 0.5 0.5 0.5 
##$TPOFFS= (0..7)
0 0 0 0 0 0 0 0 
##$TUNHIN= 0
##$TUNHOUT= 0
##$TUNXOUT= 0
##$USERA1= <user>
##$USERA2= <user>
##$USERA3= <user>
##$USERA4= <user>
##$USERA5= <user>
##$V9= 5
##$VALIST= <valist>
##$VCLIST= <CCCCCCCCCCCCCCC>
##$VD= 0
##$VDLIST= <DDDDDDDDDDDDDDD>
##$VPLIST= <PPPPPPPPPPPPPPP>
##$VTLIST= <TTTTTTTTTTTTTTT>
##$WBST= 1024
##$WBSW= 4
##$XGAIN= (0..3)
0 0 0 0 
##$XL= 0
##$YL= 0
##$YMAX_a= 123656
##$YMIN_a= -111865
##$ZGOPTNS= <>
##$ZL1= 120
##$ZL2= 120
##$ZL3= 120
##$ZL4= 120
##$ABSF1= 10
##$ABSF2= 0
##$ABSG= 5
##$ABSL= 3
##$ALPHA= 0
##$AQORDER= 0
##$ASSFAC= 0
##$ASSFACI= 0
##$ASSFACX= 0
##$ASSWID= 0
##$AUNMP= <proc_1d>
##$AZFE= 0.1
##$AZFW= 0.1
##$BCFW= 1
##$BC_mod= 2
##$BYTORDP= 1
##$COROFFS= 0
##$CY= 11.3945322036743
##$DATMOD= 1
##$DC= 2
##$DFILT= <>
##$DTYPP= 0
##$F1P= 17.636669327981
##$F2P= -2.38241207721045
##$FCOR= 0.5
##$FTSIZE= 0
##$FT_mod= 4
##$GAMMA= 1
##$GB= 0.15
##$INTBC= 1
##$INTSCL= 1
##$ISEN= 128
##$LB= 0.24
##$LEV0= 0
##$LPBIN= 0
##$MAXI= 10000
##$MC2= 0
##$MEAN= 0
##$ME_mod= 0
##$MI= 1.114404
##$NCOEF= 0
##$NC_proc= 0
##$NLEV= 6
##$NOISF1= 3.799351
##$NOISF2= 2.8
##$NSP= 1
##$NTH_PI= 0
##$NZP= 0
##$OFFSET= 15.70392
##$PC= 1
##$PHC0= -2125.174
##$PHC1= 12.59996
##$PH_mod= 1
##$PKNL= yes
##$PPARMOD= 0
##$PSCAL= 0
##$PSIGN= 0
##$REVERSE= no
##$SF= 200.130013532006
##$SI= 16384
##$SIGF1= 3
##$SIGF2= 2
##$SINO= 400
##$SIOLD= 16384
##$SREGLST= <1H.CDCl3>
##$SSB= 0
##$STSI= 0
##$STSR= 0
##$SW_p= 3612.71676300578
##$SYMM= 0
##$S_DEV= 0
##$TDeff= 0
##$TDoff= 0
##$TI= <>
##$TILT= no
##$TM1= 0
##$TM2= 0
##$TOPLEV= 0
##$USERP1= <user>
##$USERP2= <user>
##$USERP3= <user>
##$USERP4= <user>
##$USERP5= <user>
##$WDW= 1
##$XDIM= 8192
##$YMAX_p= 0
##$YMIN_p= 0
$$ End of Bruker specific parameters
$$ ---------------------------------
##NTUPLES= NMR FID
##VAR_NAME=  TIME,          FID/REAL,        FID/IMAG
##SYMBOL=    X,             R,               I
##VAR_TYPE=  INDEPENDENT,   DEPENDENT,       DEPENDENT
##VAR_FORM=  AFFN,          ASDF,            ASDF
##VAR_DIM=   8192,          8192,            8192
##UNITS=     SECONDS,       ARBITRARY UNITS, ARBITRARY UNITS
##FACTOR=    0.0002496,     1,               1
##FIRST=     0,             0,               0
##LAST=      2.0444736,     0,               0
##MIN=       0,             -111865,         0
##MAX=       2.0444736,     123656,          0
$$ Real data points
##PAGE= N=1
##DATA TABLE= (X++(R..R)), XYDATA
0@%%%%%%%%%%%%%%%Qj6J6j6J6k4L2l2M0m8N5o3P2q0Q8j04J20j36J53j77K00k24
37a20K53k82L14l49L89m30M74n26N82o41P08p78Q56r44J040j147J263j396J547
56H13j719J916k142K409k731L124l618M264n141O409q412J2051k0682P6355O0760
71A23656j77138J0352N0284o9807K9121J53948o1226j42528N3739N7196q1529
82e3932M6094J11499q7892r8578R3461J7743r7807O3346J08372r4269p2895P8766
94A3908j5207p1814J03610P8897j22111n7205P7551k6056l2433J22853K7879j54602
106e4730k8164R7971j6998j5072R7240k7251j41289K8524J03831l8671j7709P6874
118F4556m7903j03143O8344P4219p3129n183Q6301n0356q6308O6287M2332o5894
$$ plain form
0 0 0 0 0 0 0 0 0 0 0 0 0 0 0 0 0 8 -8 8 -8 8 -16 16 -16 24 -24 31 -32 40 -40 48 -56 64 -72 81 -96 104 -120
37 -120 133 -149 165 -184 205 -225 249 -277 305 -336 372 -406 450 -494 546 -601 662 -734 813
56 813 -906 1010 -1132 1277 -1454 1670 -1948 2316 -2825 3584 -4828 7223 -13459 62896 123656
71 123656 -53482 -43130 7154 -62653 -33532 120416 59190 -83338 -29599 27597 -53932
82 -53932 -7838 103661 15769 -82809 10652 28395 -69412 -6066 102306 8037 -64858 13908
94 13908 -1299 -73113 30497 109394 -12717 -69922 7629 -18427 -50860 71993 99872 -54730
106 -54730 -82894 15077 -1921 -16993 80247 52996 -88293 -59769 44062 5391 -12318 64556
118 64556 16653 -86490 -18146 56073 -17056 -22239 64062 13706 -72602 -6315 36017 -29877
130b9877L1328P4932q1905p6913P9658L6591n0938M1301L7546j03649l9926J05639
142B3787K1947n9591L2706J4470r0541L935J03445j4357o3848M1389R063p4663
154e2258K6234Q0590m2635m7153N7830j266p0891L4659O1158m9244k1056N9871
166C5839k6219o7863N0798N4260m9615r390M3466m4872m4109P3471L7721o4009
178a0522o981L6547l9997j5771P2704L529p0103J3739M0655l8947p348N6799j7535
191A6769n2356L6308K8351n0569m56N2761k1038l5869L6836O861m7802J8233M6728
204C4757l0508k6910L3972n246l5356L2630L2691m2171j8618L5723o710k4333
216b0079L1187J4163m1073k796L3384j2288j6267K7021q06l3546J4086K8089k3615
$$ plain form
130 -29877 1451 76383 -5522 -82435 -2777 33814 -17124 24177 61723 -41926 -81852 23787
142 23787 45734 -13857 18849 33319 -57222 -53287 50158 35801 -28047 13342 22405 -52258
154 -52258 -26024 54566 11931 -35222 22608 21342 -49549 -14890 46268 -2976 -24032 35839
166 35839 9620 -58243 -7445 46815 -2800 -12190 31276 -13596 -57705 15766 53487 -10522
178 -10522 -17503 19044 -20953 -36724 35980 39509 -30594 -16855 23800 -15147 -22495 34304 16769
191 16769 -35587 721 29072 -21497 -21953 30808 9770 -26099 10737 17598 -30204 -11971 34757
204 34757 4249 -22661 11311 6065 -29291 3339 36030 -6141 -24759 10964 4254 -20079
216 -20079 11108 25271 -15802 -18598 14786 2498 -13769 13252 12446 -21100 -7014 21075 -2540
229b540j4525K8275o40k5536J3600J5834k2522l561K5006o972j9069J4339O333
242H022j8978P675K0296j7168j6293K0191O762j8529M608J4277j2847p915J5190
255E291j63j2335Q290O689j3720j49J4439o331j0953J1709N541j4359k68J3182
269F863l703q559N960K131o492L905N232p612k446Q406j397o759N468M056q490
284c437j783Q993L13o558R16K388k267J561L205l604k917L494Q79k331K311J473
300B636n006j561N746K150m088k189R31R50J832J157k569k704J160K460R65k09
316A661j984k645P92M057J780k879l691r0L427K642j061k920j656O84K760K368
332C245j575l993q23K990K526Q3k091l134l62M081K882k319l463o50J381K598
$$ plain form
229 -2540 -17065 11210 10570 -14966 -1366 14468 -8054 -11615 13391 6419 -12650 1689 8022
242 8022 -10956 -3281 17015 -153 -16446 3745 10507 -8022 -3414 10863 -1984 -9899 5291
255 5291 5128 -7207 1083 7772 -5948 -6097 8342 2011 -8942 2767 8308 -6051 -6319 6863
269 6863 3160 -5399 561 2692 -3800 105 5337 -2275 -4721 3685 2288 -4471 997 5053 -3437
284 -3437 -5220 3773 4086 -2472 -1556 832 -1435 126 3331 -273 -3190 304 1183 -1148 1163 2636
300 2636 -2370 -3931 1815 3965 -123 -2312 -1381 -431 1401 2558 -11 -2715 -1555 905 1870 1661
316 1661 -323 -2968 -2176 1881 3661 782 -2909 -2999 428 3070 2009 -911 -2567 -1883 877 3245
332 3245 1670 -2323 -3146 -156 2370 2453 362 -2772 -3134 947 3829 1510 -1953 -2603 -1222 1376
348A376K061k151m423k01L952K336q38k371k662N5M067K884k468m018p65K224
364i42L034J311k548m038k28L917L106r49l761k677J493M213K005k471m078j227
380c840L143L975N2l573k888K26L052L635m14n273l028L706M496r3k649k832j463
397c768L085M834r06m877j417J353J408L373J300n960m601N084N402k029k546
412b65m40k224P08N590K78n405m54K323j341J636M160m546o240N667O207n067
428E87l646L400j004j654N865Q01q188n18O148j111o75N147m508r611O317J0486
444G836n344n805M698j786n688P172N980p935k577O095l920m199R234K082j0387
459d544K176Q508q016o249J1432L587r664J651M924q830j358J2867m34r808L948
$$ plain form
348 1376 3437 1286 -3137 -3338 614 2950 2112 -259 -2921 -2866 1201 4085 1617 -2401 -3166 -942
364 -942 2092 3403 855 -3183 -3411 506 3612 2663 -1098 -3775 -2282 1931 3936 1465 -2613 -3840
380 -3840 -697 3278 3330 -243 -3131 -2905 147 3782 3368 -1905 -4933 -1227 3269 3176 527 -2305 -3768
397 -3768 -683 4151 3245 -1632 -3049 -1696 -288 3085 4385 -1575 -6176 -1092 4310 2281 -265
412 -265 -705 -2929 -2221 3369 3647 -1758 -2212 111 -1230 406 4566 20 -6220 -553 5654 587
428 587 -3059 341 -663 -2317 3548 4349 -3839 -4357 1791 680 5 5152 644 -8967 -2650 7836
444 7836 2492 -3313 1385 -401 -6089 1083 7063 -872 -3449 2646 -1274 -5473 3761 5843 -4544
459 -4544 -2368 6140 -1876 -8125 3307 6894 -2770 -1119 3805 -5025 -6383 6484 6050 -3758 190
474A90K051j0502L946J5297n283j2389N718K614r307O192J3273q379j0622O744
488d57J55p522J0402J0470j3051q488R163j885o800J3535Q721j6285p966R583
502d25j595l134J4698L323j9158m626J1244k074p34J4811j985k0940l73J3274
516B306k982l3J3850n647k0662L137J3306l603K151J2790j0635k0688P504J4309
530E103l974L446J0128j5842j8999J3369J5110n447L325O553j9817j4850J9471
543b424J4025p974L277L063k2780r166K5209J1229j1010L161o66k4166j438K9766
557A0106O047j4334L513l847k3367P135L1457j297j6435N021o498k1188J5274
570h413L0375r100j6763O649q944j7430K2248K6409j6001j4768P519j1983j2254
$$ plain form
474 190 2241 -8261 -4315 10982 5699 -6690 -972 1642 -7665 -1473 11800 3421 -7201 -457
488 -457 -302 -7824 2578 13048 -3 -8491 672 -1213 -8013 5522 14243 -2042 -10008 -425
502 -425 -2020 -5154 9544 12867 -6291 -10917 327 -1747 -2481 12330 10345 -10595 -10968 2306
516 2306 -676 -709 13141 7494 -13168 -10031 3275 -328 1823 14613 3978 -16710 -9206 5103
530 5103 1129 4575 14703 -1139 -20138 -6769 8341 2894 6219 12772 -7045 -21895 -2424
543 -2424 11601 3627 6904 9967 -12813 -21979 3230 14459 3449 6610 5944 -18222 -19660 10106
557 10106 16153 1819 5332 1485 -21882 -14747 16710 15413 -1022 3999 -2499 -23687 -8413
570 -8413 21962 12862 -3901 2748 -6196 -23626 -1378 25031 9030 -5738 1781 -10202 -22456
583b2456K8792K0824k2452j2612P523j3352n002L3410J2978k8185j0381P322j1565
596a5156M172L3878Q69l2561m280R683r820R696L0402r928l2729L140J1347q878
610a0165J2097K4527j6971k7948Q948Q572q501J6504J9853k4070k4254J4106P154
623a48p201J9185J4049k9731k0173J8339P411m118J8696M198l3555j1055K4133
636C0M890m679J6849l230l3769j294K8078O17p251J4234o948k9467O741K6225
650A1026n080o060J4289j1368k6578J3859K4148j0135m387J4150j5457k3341K0037
663d897K1680j3680k953J1345j8888j6168K6190J5301j8442L73J0123k1417r319
676b0752L0096P888k1741M303Q668k2484k375L0795j82k1789Q694N123k2664N660
$$ plain form
583 -22456 6336 27160 4708 -7904 -381 -13733 -18735 14675 27653 -532 -10913 -3591 -15156
596 -15156 -10984 22894 23763 -8798 -13078 -3395 -13215 -3519 26883 16955 -15774 -12634 -1287 -10165
610 -10165 1932 26459 9488 -18460 -9512 -940 -9441 7063 26916 2846 -21408 -7302 -148
623 -148 -7349 11836 25885 -3846 -24019 -5680 1731 -2387 16309 20507 -13048 -24103 30
636 30 4920 241 17090 13860 -19909 -21203 6875 7492 241 14475 7527 -21940 -15199 11026
650 11026 5946 -114 14175 2807 -23771 -9912 14236 4101 -286 13864 -1593 -24934 -4897
663 -4897 16783 3103 150 11495 -7393 -23561 2629 17930 -512 -139 9984 -11433 -20752
676 -20752 9344 17232 -4509 -206 8462 -14022 -16397 14398 14216 -7573 1121 6244 -16420 -10760
690a0760K9515r023k0395J3141J906k1224J2185K5099j6414j6210J6649j927j8578
703a6036J6903J8494k1151r479J8424o909j5511K0373J2102k2991l078J7195j1334
716b998j0632K2826N517k3374J960J4472j3347m314K2779k219k2660P123J2600
729G733j3457K13J9066q974j8369J2915R619j4816K445J5298j1638j1953J5713
742C795L849j6006N824J3633j2617p873J4771j107j3703J0125J0695j4969n180
755h763J4249l007j0104J1457N217j6180l36J4887n025q837J0392J336j3754M990
769c478J3033r045q047J0791M89j0394P010Q033j1984l986J2935j200r961O553
783G49M578j0724J116J2129n492r717Q001M050q716K811P803q453n359J1061J617
$$ plain form
690 -10760 18755 9732 -10663 2478 4384 -16840 -4655 20444 4030 -12180 4469 2542 -16036
703 -16036 867 19361 -1790 -11269 7155 246 -15265 5108 17210 -5781 -8859 8336 -2998
716 -2998 -13630 9196 14713 -8661 -6701 7771 -5576 -9890 12889 10670 -11990 -4867 7733
729 7733 -5724 -5511 13555 4581 -13788 -873 8746 -6070 -3625 11673 35 -11918 3795
742 3795 7644 -8362 -2538 11095 -1522 -9395 5376 4269 -9434 691 11386 -3583 -8763
755 -8763 5486 2479 -7625 3832 9049 -7131 -7467 7420 2395 -6442 3950 5286 -8468 -3478
769 -3478 9555 510 -7537 3254 3743 -6651 359 8392 -3592 -7578 5357 4157 -5804 749
783 749 5327 -5397 -4281 7848 2356 -7361 640 4690 -4026 -1215 6588 -1865 -7224 3837 5454
798E454r980K821N962p081p59R975l542j0093N703O512o067j67N871o125n465
813f981R302L959q351m30M890m464j324Q227r86q747K401N823l620j114M660l264
829a9m861N680L822n824j485M118j625j625M618l77o205J136N350j137k146J518
845I38j755k641M069L563l731k941J779M15r4K618k49m223l23L578O51j362q3
862B09r09j143K042K159j737k238O46J169L79M90n82j837j10K048J029j060j296
879g41l95N43J262P52q92j669k78J448J240l83j185o43J38R56J106l87j723n08
897a359J374R23k87n34p86m75J214J468q54j677N8Q81M60N04l11j653l38J830
915D38R49j001q45k59p8J081J193r54j767J99J285N26j6n78j209m0J589P86r23
$$ plain form
798 5454 -4526 -1705 4257 -2824 -3583 6392 2850 -7243 -1540 4972 -1095 -1262 4609 -1516 -6981
813 -6981 2321 6280 -2071 -2501 2389 -2075 -3399 4828 3842 -4905 -2504 3319 -301 -1415 3245 -19
829 -19 -4880 800 4622 -1202 -2687 1431 -194 -1819 2799 2422 -3783 -2647 2703 1566 -580 938
845 938 -817 -3458 611 4174 443 -2498 -719 -304 -398 2220 1971 -2252 -2575 1003 1654 292 209
862 209 -700 -1843 199 2358 621 -1617 -971 198 577 1067 485 -1352 -1462 586 1615 555 -741
879 -741 -1136 -593 669 1421 529 -1140 -1418 30 1270 887 -298 -941 -803 153 1259 872 -851 -1359
897 -1359 15 938 651 117 -669 -1144 70 1538 684 -993 -935 -54 406 910 599 -1054 -1392 438
915 438 1387 386 -459 -718 -796 285 1478 524 -1243 -1044 241 767 751 173 -1036 -1076 513 1299 376
934C76j065k76N27J147N09j014j246M2J015J015qj281j011O08J133M83j71j078
952b95j195Q38J872j42j342l03j08K9J606P10k220j203J737P51n71O89n29k381
970b057R38L218q11k410Q00K65j385J968K158l070k100K843N66j951J897J092
986A961l883k36M345j011l304K570J334l725R89L828l132k813M525Q68m497J769
1002d12L078m590j078O420q21n912K678L038m841P06O467l366n965M587K503n315
1018b823K457N795o062m902P013J403o281L756N095p636l252Q281l79o297N320
1033A488L596q941p67Q988l025n967P520K138j0299J394R095n247m655R380j48
1048D550j1311L672Q504o842j899J0353m393j1923P508Q296q531J56R718q450
$$ plain form
934 376 -689 -965 -438 709 1218 204 -1042 -1000 15 1030 1022 -259 -1270 -662 471 954 783 -295
952 -295 -1490 -652 1220 1078 -264 -567 -675 -646 960 1670 -550 -1753 -16 735 164 853 324 -2057
970 -2057 -1119 2099 1288 -1122 -322 -57 -1442 526 2684 -386 -2486 357 923 -1028 869 1961
986 1961 -1922 -2158 2187 1176 -2128 442 1776 -1949 -960 2868 -264 -3077 1448 2316 -2181 -412
1002 -412 2666 -1924 -3002 3418 2597 -3315 -637 2401 -2440 -1734 4733 1367 -4598 -11 2492 -2823
1018 -2823 -366 5429 -633 -5535 1478 2881 -3400 356 5451 -2185 -5437 2844 2465 -3832 1488
1033 1488 5084 -3857 -4624 4364 1339 -4628 2892 5030 -5269 -3875 5220 -27 -4682 4698 4550
1048 4550 -6761 -3089 5415 -1427 -3326 7027 2634 -9289 -1781 6515 -2016 -1860 7858 -592
1062e92j0309J1931O728j0652J909Q253j1206o286J5218K411j2633N109P250j3182
1076f051k472J6224k381j2218Q964M927j5239J218J6101n998r598J1494J62j6551
1090a1418O423J6084r249p457J1700m736j4839J2666J4204j3521n635J1500p664
1103a942j0760J7076R113j7420j881J1997r926p033J8755L202j8359L295J0958
1116G075j3038l379J9791j692j7338P336P491j5220K047K0355o854j6278R772
1129F8L967j4552Q005J8354j2888j4344J2398J620j2410J1969J3460j7720r932
1142a2005J5202j111j0853J3934Q381j9670m357J6071m836r171J5682M316k0006
1155h423R2J4724p934n592J7355o88k0624M152J3644r403j728J6818o637j9751
$$ plain form
1062 -592 -10901 1030 7758 -2894 -985 7268 -3938 -10224 4994 7405 -5228 -119 7131 -6051
1076 -6051 -8523 7701 5320 -6898 2066 6993 -8246 -7028 9073 3075 -6523 4971 5133 -11418
1090 -11418 -4995 11089 1840 -5617 6083 1347 -13492 -826 13378 -143 -5778 5722 -1942
1103 -1942 -12702 4374 13487 -3933 -5814 6183 -3743 -10776 7979 11181 -7178 -3883 7075
1116 7075 -5963 -9342 10449 8757 -8581 -1245 6246 -8974 -6927 13428 6574 -9704 68
1129 68 4035 -10517 -2512 15842 2954 -11390 1008 2628 -9782 2187 15647 -2073 -12005
1142 -12005 3197 2086 -8767 5167 13548 -6122 -10479 5592 756 -8415 7267 11583 -8423
1155 -8423 -8331 6393 -1541 -7133 10222 9534 -11090 -6938 6706 -2697 -4425 12393 5756 -13995
1169a3995R223J2759j0662O59J4082j1383j5606J4525R527j3236K996J2274j4019
1182b856j0851J7471M604j4727O437J0837j5984o921J8022j3j3269J0391P160
1195A0301j8813k204J9048l859j1455J2516K304j9753L784J9202p823r979J2698
1208E967j914j7027R896J5840j2936p070J3927m866j3996J3444J0721j6090k475
1221f579J4693p710j1367J4596N651j5633K885J2511j1657p644J6253J361j4683
1234g323O512R095j3941k784J7009k955j3633Q541N839j3290K262J4701q054j0873
1248h894J1302L024j2493N391J1101j1199o545J3283l05j1942P083P791j1504
1261c907j795J2550m517j0211R273N123j1270J386J0401p310p120J0797K083j1013
$$ plain form
1169 -13995 -4772 7987 -2675 -2016 12066 683 -14923 -398 9129 -4107 -1111 11163 -2856
1182 -2856 -13707 3764 8368 -6359 78 10915 -5069 -11990 6032 6019 -7250 3141 10301
1195 10301 -8512 -10716 8332 4473 -6982 5534 7838 -11915 -8131 11071 3248 -6731 5967
1208 5967 4053 -12974 -3078 12762 -174 -7244 6683 1817 -12179 1265 11986 -4104 -6579
1221 -6579 8114 404 -10963 3633 9284 -6349 -3464 9047 -2610 -10254 5999 7360 -7323
1234 -7323 -811 8284 -5657 -8441 8568 5613 -8020 521 6360 -6930 -4668 10033 1979 -8894
1248 -8894 2408 5432 -7061 -1670 9431 -1768 -8313 4970 4665 -7277 -194 7597 -3907
1261 -3907 -5702 6848 2331 -7880 1393 6516 -4754 -3368 7033 -277 -7397 3400 5483 -5530
1275e530L534Q365q099l883J0274j409r576O115O540q838j888Q914l460o886P987
1290B160L774r862p0Q249m091m387P992L70r708K649P782n010l023P113j995p953
1306f010N189O061o470j625O756l214o067O240L554o998O57O372m686m781O579
1321A557J697o142K672M735o414l089P290N82n267L260K338o777l34P569j139
1336B538m901L279P35n673K220O392l351m153L820J51m386L124M214m341k270
1351b602M160r19l552L475K490m257l68L674k342k759M065J653l860K50K395k698
1367a195j068M175K79l525P43J379k425N67L711j307l300J402J297j839R04K401
1383B199j864k157J681P02j276J069J130k041q02J938p3j362J145Q49j654m14
$$ plain form
1275 -5530 -1996 6369 -1730 -5613 4661 3252 -6324 -209 6331 -2507 -4395 4519 1059 -5827 2160
1290 2160 5934 -3928 -3998 4251 160 -4227 3765 4135 -5573 -2924 4858 -152 -3175 3938 1943 -6010
1306 -6010 -821 5240 -1230 -2855 3901 687 -5380 860 4414 -2584 -1927 4445 -241 -5022 1557
1321 1557 3254 -2888 -216 4519 -1895 -4984 2306 2888 -2379 881 3219 -3558 -3892 3677 2538
1336 2538 -2363 916 1651 -4022 -1802 4590 1239 -2914 906 1057 -3329 -205 4009 -332 -2602
1351 -2602 1558 639 -2913 562 3052 -1205 -1573 2101 -241 -3000 1065 2718 -1142 -892 1503 -1195
1367 -1195 -2263 1912 2191 -1334 -591 788 -1637 -1070 2641 1334 -1966 -564 733 -1106 -202 2199
1383 2199 335 -1822 -141 561 -715 354 1484 -557 -1359 579 506 -856 289 1138 -516 -930
1399i30J426k13q54Q25L61r70L1O26n63j54J006l6j026J35N34l77n5P58n3q35
1419c64j85M02K75K31K7n38l75L12L92Q5j3k07m00m6M80M03j73n55k05L87M06
1440C39j05k65j00j18J10M51P0n02k63K20K33K19R3n23n18N04O80k28m07qj63
1461b81k6O71K63p78l98M46K21K5K34l18o96L36Q36j79n39P1j9j74N46L62p28
1482a25m66N55L03j95J18r6n91J87Q06r7o30L5J62j30L20L35n45m80M75L48k35
1503E4n0N6l20N0N32k2n38j6L34nqP1k82k08L97L36k36l45m4J46K29J85j94m02
1527b80o5L80L14j33l40j41J27K31J79o9m20k66M52N66k04n65j45J29K94N06j03
1548D47q53k74O47L79p4P9m05q01M61J219k41r74O4K92j77M57M07r46m92J038
$$ plain form
1399 -930 496 283 -571 254 615 -355 -324 302 -261 -415 591 555 -471 -336 198 -179 -234 524 471 -364
1419 -364 -549 -147 128 359 386 -152 -527 -215 177 262 249 42 -358 -404 76 479 306 -249 -454 -67 339
1440 339 234 -31 -131 -249 -139 312 382 -120 -383 -163 70 289 382 -141 -659 -155 525 297 -110 -118 -281
1461 -281 -307 364 627 -151 -549 -103 118 143 377 59 -637 -301 535 356 -183 -112 -131 -305 241 603 -125
1482 -125 -591 -36 267 72 190 94 -497 -310 496 399 -231 -196 -34 -164 156 491 -54 -534 -59 289 54
1503 54 4 60 -260 -210 322 300 -238 -254 80 75 67 138 -144 -352 45 381 145 -200 -244 -98 131 316 122 -280
1527 -280 -345 35 349 216 -124 -265 -138 93 272 203 -217 -483 -31 535 331 -234 -379 -250 44 550 447
1548 447 -406 -680 -33 346 272 351 -54 -855 -394 825 584 -390 -326 -34 -211 246 653 -293 -785 253
1568B53L36p71J48J67q67L99J627n56j879L20J151k09L43O44j580j324J691J314
1586A207r14q6K78j675k83K608M79k222jJ094j106j07J928n63j834J241J072j873
1604g57j77J874q00j026K023M6l066L78K889n33j130J224j054k466K066K958j629
1621H20j489J068j285j389L262J918l199j225J938r59j010L009P27l328OK155
1637A019j711q91L162J88l031Q31J515k620j73L951k00l320O79R34k288J198L996
1654C239j601l759J167J147j714J902L075l033l376K408J322j885J820K264l545
1669e69k313L214O05k301K193J973l855j571L400k25k097L060J390m674r82L787
1685A035o31j562L480J1n371M30M482j262j489L324j295n020K326M431k661j371
$$ plain form
1568 253 589 -182 -34 133 -734 -335 1292 736 -1143 -823 328 119 462 1106 -474 -1798 -107 1207
1586 1207 293 207 485 -1190 -1473 1135 1614 -608 -609 485 -621 -728 1200 637 -1197 44 1116 -757
1604 -757 -934 940 140 -886 1137 1183 -1883 -1505 1384 851 -279 945 -109 -2575 -509 2449 820
1621 820 -669 399 -886 -2275 987 2905 -294 -1519 419 -540 -1550 1459 2186 -1142 -1136 1019
1637 1019 -692 -1583 1579 1767 -1264 -433 1082 -1538 -1711 2240 2040 -1280 -601 333 -1955 -757 3239
1654 3239 1638 -2121 -954 193 -1521 381 3456 423 -2953 -545 777 -1108 712 2976 -569
1669 -569 -2882 332 937 -1364 829 2802 -1053 -2624 776 551 -1546 1514 2904 -1770 -2752 1035
1685 1035 404 -1158 2322 2333 -3038 -2608 1874 612 -877 2447 1152 -3868 -1542 2889 228 -1143
1701a143L471j977m181L648L302l932m08L879k807l536M409K011m380J034L674
1716C064m066k693N236R08m408K052K662m851j057N783o28m385K878J701m958
1731b762P58N548k539l988L934J045m806J851M507l856k676M770r7m620K767L293
1747C129m518r89N102j632m355L721K387m825K71M737k742l374M302R91m758J676
1763h77M079l686k230M530m81m349L077L395m449j528M308j181l283L744K041
1778C110m830m43M013j807k244M139N88n041P35L899k368j633M177l48m767J512
1794a308L328k655o36M004j549m399K406K753k884L90L725k887m066L388K513
1809B123k902Q96K783l844k871M391J693l131J384J832m380j314N039L85l376
$$ plain form
1701 -1143 2328 351 -3830 -182 3120 -812 -1220 2659 -148 -3684 725 2736 -1644 -610 3064
1716 3064 -1002 -3695 1541 2449 -1959 93 2755 -2096 -3153 2630 2002 -2383 495 2196 -2762
1731 -2762 -2004 3544 1005 -2983 951 1996 -2810 -959 3548 -308 -2984 1786 1689 -2931 -164 3129
1747 3129 -1389 -2378 2724 1092 -3263 458 2845 -1980 -1709 3028 286 -3088 1214 2205 -2553 -877
1763 -877 3202 -484 -2714 1816 1335 -3014 63 3458 -991 -2519 1789 608 -2675 1069 3110
1778 3110 -1720 -2163 1850 43 -2201 1938 2526 -2515 -1780 2119 -249 -1882 2295 1947 -2820 -1308
1794 -1308 2020 -635 -1271 2733 1184 -3215 -809 1944 -940 -550 3175 288 -3778 -390 2123
1809 2123 -779 117 2900 -944 -3815 576 2269 -862 522 2354 -2026 -3340 1699 2084 -1292
1824a292J981J275m489r6M925p85k954K630K94m577J115M673j701k217K878r74
1840F86m412K528M452k487j789K545j937l400L896L565l437j342K272k333k026
1855c219M619K064m148n31K205k438r20M565N18m112N49J845k679k7M239o19l532
1872a621J289J074k763R67L895j485l017J544L40k332J971L203k398k514J725
1887a22J3j589K485K048l051j748K017j28j061K395R37l132p78K093m39p50K157
1904A347K15k790n2J831p45l82K027l03k518L38J566p49pJ679q07k165P24J394
1922F03o85J52J187j189j615J220J136r08J00R41j121j062J288O84r86K67P94
1939H06j082o94J157K33p74O95N09j391n07J297K57o17M95M9j268J5J381M9o67
$$ plain form
1824 -1292 689 1964 -2525 -2621 2304 1519 -1435 1195 1489 -3088 -1973 2700 999 -1218 1660 686
1840 686 -3726 -1198 3254 767 -1022 1523 -414 -3814 82 3647 210 -1132 1140 -1193 -3219
1855 -3219 1400 3464 -684 -1215 990 -1448 -2368 2197 2715 -1397 -848 997 -1682 -1709 2530 1911 -1621
1872 -1621 -332 742 -2021 -1054 2841 1356 -1661 -117 223 -2109 -138 3065 667 -1847 -122
1887 -122 -109 -1698 787 2835 -216 -1964 53 -75 -1136 1259 2196 -936 -1714 379 -60 -810 1347
1904 1347 1562 -1228 -1280 551 -194 -576 1451 1148 -1370 -1032 534 -215 -222 1457 650 -1515 -791 603
1922 603 -82 70 1257 68 -1547 -327 809 -99 1 942 -179 -1241 47 731 -255 12 806
1939 806 -276 -970 187 420 -354 341 850 -541 -1048 249 506 -111 384 433 -835 -820 561 610 -57
1958e7J93k23p24O81J046o54p94M91J44m26M41M41p61l08P38J29n15O5J03k74
1978b64L52N10n37o97L70N26l4j6o7n33j74O93M86l12n06k14R5M52M22k65o40
1999c53j46M37L91Jk57l49j14L19N04j2n94l40L13M60J19j93m11k95L58O08j6
2020D30n25k38M9J76M82J51o58m89M31N15l0j53k44l69J96P17L8o23j96J83R5
2041f2L02K27n43n16M20N36j19k09j04k95J20O46N1o40j96K89J31J46J62l99m57
2062e10L63M87j16k37o6j75P5M62P8m93j65K62J18N3N7k71k56K74L40j09k35q3
2084a47JJ50K52r0l33p4J66J63J02q4l02m5K67J35m7j06j77k1L01J33k78j35J42
2107b7%N6K14j94m01K04L95j31j20O3k67j06N73J58n91q4L56j79o9N23j60o72
$$ plain form
1958 -57 136 -87 -811 -130 916 262 -532 -41 103 -323 118 559 -202 -510 228 357 -158 -93 10 -264
1978 -264 88 598 61 -636 -266 260 226 210 143 -390 -564 129 615 303 -203 -417 -322 130 552 287 -353
1999 -353 -499 -62 329 330 73 -276 -390 -71 433 421 -173 -513 -200 260 379 186 -225 -520 -162 446 430
2020 430 -95 -333 -284 -108 374 525 -133 -622 -191 324 294 141 -103 -472 -276 441 479 -144 -340 -157 -62
2041 -62 240 467 -76 -592 -172 364 245 36 -68 -363 -243 403 454 -186 -382 -93 38 184 346 -53 -510
2062 -510 -147 340 224 -13 -79 -254 -179 283 361 -132 -297 -35 83 136 193 -78 -334 -60 280 171 -64 -147
2084 -147 -146 4 256 166 -167 -241 -75 88 190 106 -196 -241 26 161 114 8 -169 -190 111 244 -34 -169 -27
2107 -27 -27 29 243 49 -352 -148 247 116 -4 59 -208 -314 259 417 -174 -258 98 -81 -150 373 213 -459
2129d59K98N21l89j53M52k75m06O24K39q40L8P78l43m48O45l3r06M44Q95o07n03
2150d28O66k05o45Q38N82j110k63R89l35o95R59L43j236O1J083n85o35J048Q2
2169E14j162M48Q83r95l50J365k05j307P11Q06j158r9J427n43j257R84N98j268
2187f08K95J328j008j031J391K67j494P00J301j380p96J633j06j467J108J037
2203A170j764l40J795n82j325J538N71k092K88J973j140j232J823J51k067R21
2219c12J725j778q25K169l22j975J441J216k233j41K417r51j877J853P39k349
2235a203O01K241j696j476K336J93k433J172J896k184p48K618o49k449J819J580
2251A618k422o5K417j557k000K638J057k687M23K030k129j094L128J39k903J044
$$ plain form
2129 -459 -161 360 -29 -182 270 -5 -411 213 452 -388 -350 428 85 -363 282 249 -657 -213 682 75 -428
2150 -428 238 33 -612 226 808 -302 -565 424 89 -606 353 696 -540 -479 604 19 -616 432 514
2169 514 -648 -200 683 -312 -662 703 498 -809 -98 708 -450 -549 878 335 -922 62 660 -608
2187 -608 -313 1015 7 -1024 367 634 -860 -160 1141 -239 -1035 598 492 -975 133 1170
2203 1170 -594 -934 861 279 -1046 492 1063 -1029 -741 1232 92 -1140 683 834 -1233 -312
2219 -312 1413 -365 -1190 979 657 -1318 123 1339 -894 -1035 1382 431 -1446 407 1146 -1203
2235 -1203 -602 1639 -57 -1533 803 996 -1437 -265 1631 -553 -1301 1317 668 -1781 38 1618
2251 1618 -804 -869 1548 -9 -2009 629 1686 -1001 -578 1452 -677 -1771 1357 1496 -1407 -363
2267c63J700k378k52L115q66k683J803J213k658M02K941j488k098K193L39k756
2283a836J304K784k005j699K104m13k215K285K232k770j352K103o75j407K770
2298A210J115l388o29K405q49r78K664J45l305L55K305j383o38K703m64k993R84
2315g41J711j854J72K969j178l077J221J386j530J088K512k382k917J933J430
2330G43j214J437J442l394j992L071J235j601J238P16l382p49L432K73j835J531
2346I51L45l243J43L126o78j360K225l16l600P11L065q44o36K035j614l454J859
2363a285L165j079m33J180k599k338L385K637k052n75P94k513r05L856J253k696
2379b05m0P50k310P5L530o2k454Q54L62k521O97L294o10j920R79n13k315J691
$$ plain form
2267 -363 1337 -1041 -1293 1822 956 -1727 76 1289 -1369 -967 1974 486 -1612 581 920 -1836
2283 -1836 -532 2252 247 -1452 652 239 -1976 309 2541 -229 -1581 522 -153 -1560 1210
2298 1210 2325 -1063 -1692 713 -136 -1114 1550 1695 -1610 -1255 1050 -333 -971 1732 1268 -1725 -741
2315 -741 970 -884 -712 2257 1079 -1998 -777 609 -921 167 2679 297 -2620 -687 743
2330 743 -471 966 2408 -986 -2978 93 1328 -273 965 1681 -1701 -2450 982 1255 -580 951
2346 951 1296 -1947 -1804 1322 644 -716 1509 1193 -2407 -1696 1369 525 -111 1924 310 -3144 -1285
2363 -1285 1880 801 368 1548 -1051 -3389 -4 2633 581 6 800 -1713 -2618 1238 2491 -205
2379 -205 -245 505 -1805 -1730 1800 1738 -716 138 500 -2021 -1324 1970 1360 -560 419 -94 -2409 -718
2397g18L123j194j728O58j041j396K693K397k110j655O81q17m00K814J152k623
2413a64j039R52o18N7K376J70k391l14R20p53K76K107k46k067l2N79o95P51J899
2432A768p34j998R9N24k82J078J342j352j793N35P37q8R31O45j619j175R69O19
2450B06k18P21K81j479o42J041K77k37P68J05j423m22R83J83m3P65k69j497r8
2469i98J131K15k0M74o83j272M68J203o2k38K41o82p86Q09Q80m55k34K78n10m52
2489f93P67M22n37O7L28o13l74P22K61l58K20P9p41j29P85J94k95R9k33n89L31
2510b87P59j14l82K8j98k52M91M56l65l22J21p1k3L67N8l71j0K17j73o7K58k5
2532I5j84J25O7k24k2K16Ll3M1j62j49K02J86r5o8Nj35J0K12P0j39l7n1m9J65
$$ plain form
2397 -718 2405 1211 -517 141 -900 -2296 397 2794 684 -971 -290 -1107 -1507 1307 2459 -164
2413 -164 -1203 -251 -869 -812 1564 1734 -657 -971 -51 -804 -528 1579 1333 -734 -766 -187 -882 -131 1768
2432 1768 1034 -964 -865 -341 -623 455 1797 445 -1348 -813 -76 -164 767 1412 -207 -1382 -413 206
2450 206 -12 709 990 -489 -1131 -90 187 -50 718 823 -600 -1022 -39 144 101 866 597 -900 -998
2469 -998 133 348 328 802 119 -1153 -685 518 456 218 459 -223 -1009 -200 680 225 -9 269 -241 -693
2489 -693 74 496 -41 26 354 -259 -633 89 350 -8 212 291 -450 -579 206 400 105 204 -29 -618 -287
2510 -287 472 358 -24 4 -194 -446 45 501 136 -186 -65 -136 -159 208 266 -105 -115 102 -71 -138 120 95
2532 95 -89 36 103 -121 -143 73 76 43 84 -78 -227 -25 161 66 -2 3 -132 -122 90 160 21 -16 -67 -116 49
2557D9J14j57r9J02ro3J23N0j70k2J24k4m5Q8n0j25J11J13j44k8J34p0j16J68
2581E4N9j76mJ30o5n2J31k8j73Q9J40j26l8J43p1j41J50R7j45m7J35q0o0J59J7
2606I8j97K5J60p7o5J34m0j59J03J49j30r4J29k9q8J30N5j77m3J74k1q7J03mj71
2631a22M7J93o3j22O9J1q9Q9J16j39j01J19L4q5P5M0j46lJ53j4j31M2O0o2K1R8
2657I0r6j22J25Q5q1k0N1q5l9J67L1j52m0Q3rnR9n4j38M5J29k1m4Nm4m2J18P4
2685A10j25p1Q2K7rL3k1j11K2J41J3q6l7k8J5J01M9j02j36N9J18L4k7o6q3J7J24
2712D3Q7o2j41m1P1J08N9p1j32n9J18J30k1r2n2k2L3J24K5j57p3J20P2k2m8l0
2738c3o2J11J60j02k02QR9O0J22Qk93j80K44K25j5n8j32k30Q2L56Q3k23p9m5j01
$$ plain form
2557 49 163 6 -93 9 0 -63 60 110 -60 -82 42 18 -27 61 11 -114 -3 110 -34 -62 72 2 -114 54
2581 54 113 -63 -67 63 -2 -54 77 49 -124 -35 105 -21 -59 84 13 -128 22 119 -26 -73 62 -18 -78 81 98
2606 98 -99 -74 86 9 -56 78 38 -121 -18 131 1 -93 36 7 -81 49 104 -73 -116 58 37 -50 53 49 -122
2631 -122 -75 118 55 -67 2 13 -76 13 129 -10 -111 8 42 -43 32 72 -74 -77 76 62 -69 -27 33 -29 -8 90
2657 90 -6 -128 -3 82 1 -19 32 -53 -92 75 106 -46 -86 -3 -12 -17 82 28 -110 -65 64 43 -1 4 -40 -82 36 110
2685 110 -15 -86 -4 23 14 47 26 -85 -63 78 91 5 -32 -60 -45 56 105 3 -133 -74 44 78 51 -15 -98 -81 43
2712 43 130 68 -73 -114 -43 65 124 53 -79 -138 -20 110 89 -3 -55 -77 -44 80 105 -52 -125 -5 67 45 -3 -33
2738 -33 -95 16 176 74 -128 -120 -21 39 161 169 -124 -304 -60 165 150 92 -40 -270 -188 168 251 28 -51 -96 -197
2763a97J83K52j35k12P5M5j29Q3J65j00n7J35j14k41J44K53j4l6j5k99j62L87
2785A1L38j10k20j62k03R3M95K06l06l00r6j8K04M11K7l77k32K7L1J94L22l5l40
2808d0j81nL6K14L76m4m33k72M2J44L39L55j91o08k29K10K85L51K30m12o53n6
2830e42M11L05K61R1n52o16J63M98K25K29J7o72n72L56N26J87K44j07q46m86N93
2851b87O08J40J55l43r96k04Q93N65lrn52r33K01J069L40j79j04o53p44N44J027
2872E35Q7k25j36p34n81P82R45o9k07k57q63l61J085Q71k15l21m77q94J12J334
2892D11O44m71n14n82o09N99J362K07p43n42m73k44Q80J112k04q11m25l41OR65
2912B27Q35m41p90l19k48J90R90O33n88q20l06j07M17J053L88q67q50j67J38O47
$$ plain form
2763 -197 -14 238 103 -109 -34 11 -118 -35 130 30 -27 108 -6 -247 -103 150 136 100 85 -214 -376 11
2785 11 349 239 19 -143 -346 -253 242 448 142 -158 -254 -272 -68 343 370 -7 -239 -212 -181 13 335 300 -40
2808 -40 -221 -226 -190 24 400 356 -77 -349 -307 -163 176 531 340 -268 -497 -287 -2 349 579 167 -486 -542
2830 -542 -131 174 435 526 -26 -642 -479 19 244 473 490 -182 -754 -398 128 315 559 452 -394 -880 -287
2851 -287 321 461 616 273 -723 -927 -34 531 528 519 -33 -966 -765 304 644 465 361 -292 -1036 -492 535
2872 535 622 397 261 -473 -1054 -272 673 604 397 140 -723 -1084 1 872 657 336 -141 -1035 -923 411
2892 411 1055 584 70 -512 -1121 -522 840 1047 304 -238 -711 -955 -75 1037 833 22 -403 -744 -738 227
2912 227 1062 621 -169 -488 -736 -546 444 1077 489 -331 -637 -744 -327 726 1114 247 -603 -770 -632 15
2932A5R70M0j133p82J37M39O86P13l77j204m98M57N37N82M25o51j131j34O72M52
2952B15M07K41p84r72J66P16L12L26P8q67q03M09O85K42K81o0j010o06O57P00
2972C33J19J70k70j037k96R24N71m8M9m47r45J26J045L17k46m5n14p16M81R53
2992E24j3l27k6m80m60O45P27k46k54L7m96l23P32N21l22j30k4n62j26Q02L61
3013E60l52j09j63n28J56Q43J62m67j48j91l23M28O86j37m98p6r1r0M47L81l26
3034A64l71J01k1n9L22K09l02j86J20j02o4L03J73k14j57jj12N8L46J05l02j96
3056a86K5M0J70K41q7l49r9J71J24O3M7j36k18R0J87j9o1J7k7p6P6P5j09m0J60
3081G9L1j51n0N7j0R6J02j16k02L9J68L4K6k0j77j03K26J54j06j31j6j5O9J32
$$ plain form
2932 15 985 1025 -108 -890 -753 -314 372 1085 708 -496 -994 -537 0 582 1007 356 -775 -909 -237 215
2952 215 622 863 79 -893 -727 -11 301 627 705 -162 -965 -556 129 371 652 592 -418 -1024 -367 333
2972 333 452 622 352 -685 -981 -57 514 466 515 68 -877 -751 294 611 365 320 -194 -910 -429 524
2992 524 511 184 158 -322 -782 -137 590 344 90 127 -369 -692 40 561 239 109 85 -477 -603 199 560
3013 560 208 99 -64 -592 -436 407 569 102 -46 -237 -560 -132 554 417 -81 -157 -248 -338 109 490 164
3034 164 -207 -106 -127 -186 136 345 43 -143 -23 -125 -189 114 287 73 -84 -85 -197 -139 207 312 10 -186
3056 -186 -161 -121 49 290 203 -146 -245 -74 50 113 160 24 -194 -104 83 64 3 20 -7 -83 -7 68 -41 -81 79
3081 79 110 -41 -91 -34 -44 52 154 38 -164 -125 43 77 103 83 -94 -197 29 183 77 -54 -70 -85 -16 116
3105A16l1j74j4J15L1RRj15q6J61J39r6j51MN3M6J01m7j80k8J62O9k0o1j01n1
3131a40J45J45o2j87k2J05P9K3l7j28o2J51J17l8j11p7J7R9J21m5j91n3J56Q4
3155H9k2m4p4q1J04J53k5j55m1N8O0P4lj76o7J60R6n7n3m0m5P4J45o2j51qQ2L5
3183B6L3mj34m8J48J03q9o7j2k4P4J15m6j67J0J15J1Rj7j02n0J45Q3r9p4QJ2O4
3211B3Q1o6j51K4J21L6l2l4p1j5J30O5r3p7QL9O2M4q0j25L6J11M3l5p3p1L3J24
3239E7M7p8q2l3O3R5K3q2q0J4N7O8%r1p1O3R6j0m8l5k7M0J03l1j10j8L7L6O6L3
3269A02j49j16J31J35l0m3m1j03K4J81K3j03l8j2o7J08J39r4j40O7O3r5L4J00
3293G6p6n4J05m5j32J08J03p6PP3j51j49K27J59j23n3Jj44j0K46R4j47p9j2j31
$$ plain form
3105 116 85 -89 -103 12 43 52 61 -54 -140 21 160 64 -87 -83 -30 16 117 70 -110 -138 24 93 73 12 -89 -140
3131 -140 5 150 88 -99 -121 -16 63 86 49 -79 -141 10 127 89 -22 -99 -82 17 138 93 -98 -151 5 89
3155 89 67 23 -51 -132 -28 125 100 -55 -96 -38 22 96 93 -83 -150 10 106 49 -4 -44 -89 -15 130 68 -83 -91 -9 26
3183 26 59 55 -79 -127 21 124 35 -32 -44 -68 6 121 75 -92 -82 33 44 53 36 -66 -116 29 112 13 -61 -53 -41 23
3211 23 104 38 -113 -89 32 68 36 2 -69 -84 46 111 18 -59 -51 -12 50 94 14 -111 -75 36 79 44 -29 -100 -67 57
3239 57 104 26 -56 -89 -26 69 92 10 -70 -56 1 69 69 -22 -93 -30 66 56 8 -27 -54 -14 89 58 -52 -70 -33 3 69 102
3269 102 -47 -163 -32 103 73 30 -11 -114 -90 91 114 11 -27 -39 -106 2 141 47 -93 -26 37 -58 -24 76
3293 76 0 -54 51 6 -126 -18 85 9 16 89 -62 -211 16 175 52 -1 0 -144 -154 92 186 39 -40 -52 -183
3318a83J10K74j5k24l9J1q8J40K56p4k52j7km2K05K08j77k08K3lm3K61J68k30
3342E9k33O2qJ7K78J24k73j97K5k7J12L69L4m09k10Q6N4K07L46j25n11j51K00
3365a71J56K31K11k98n14J8L25J37J76J18m29m28K14L04P2J73L6m72l28K91K56
3386G8N8K10l7n70k58L65K67J24K07k26o74j00N08K91J15Q6m60o47J87O48J85
3407C57Qp3n66m35M56N80K9n1j50n54k39N93M33p2m6k01n86n9O66L37r8n8l62
3430i1n66J88P35K30j75j71m68l94M72P17L4k61k78m69j38O58N74j64l33k72l77
3451e49P4O97L69k73l03k75l30K68P14J89l43l22k97k09M46O97K2m62l63k62L2
3472d80O14N15k16n08k81j25K14N96L13m07m80j53M2K89M71J15m26l80p7P3L39
$$ plain form
3318 -183 -73 201 186 -38 -77 -66 -154 -14 242 168 -84 -101 -103 -145 60 268 91 -117 -94 -97 -140 121 289 59
3342 59 -174 -112 -120 -103 175 299 26 -171 -146 -173 -61 308 342 -67 -277 -191 -137 70 416 291 -220 -371 -171
3365 -171 -15 216 427 129 -385 -367 -42 95 271 389 -40 -468 -254 50 122 295 331 -141 -469 -178 78
3386 78 136 346 309 -261 -519 -154 113 237 444 218 -456 -556 -48 243 358 444 -16 -663 -476 172 357
3407 357 365 292 -274 -709 -253 327 356 305 155 -399 -638 -45 388 316 270 69 -517 -576 90 427 329 271 -91
3430 -91 -657 -469 266 496 321 150 -318 -712 -240 477 511 250 -28 -497 -635 23 597 433 100 -172 -549
3451 -549 -475 222 591 318 15 -260 -590 -322 392 581 238 -84 -381 -590 -144 553 575 113 -250 -512 -480
3472 -480 134 649 433 -75 -356 -481 -267 329 642 235 -245 -398 -356 -67 404 519 93 -287 -364 -291 48
3493D8M26j5m79l30kJ30L65L78j48n46k96J21K86L85J99l67n31p5K77K90K75J4
3515D05m54m08J46L47J66J14q9l88k24K32K18Q1J15q7l83j38K71J58N2J52j43
3536A43m39n2L23J52Q1Q2k81m23J37M00Q4j6Ql59k61L13L49r3n0l3k88p8L72J42
3560B13j59lJ0k64J3L13oj23J14m2k85O6K72k2p0J07j48k72K04K62r0o0N2j94
3584a12j44K92J78j73o9N2j59J4K72Pk16J7Q2j37L4J94q1j28J16K2j59L3J44n6
3608B3n3J01m7j70J04J49q0m4M6p7p4J66R5j33p5P2k8oJ18rj45K3Q7k5k5N3m4
3635Bo9Q0O4o9o4N5Rj9N4Nj06J2R3j1l8Pj3n0O1P7o3p1L7M6l7J8L2p5k1P2K5m4
3667apJ5m8L3P5m1q5K9O3l1LK9m2n4O9M3n6QJ2n9RR4j2q0K2M2n6LO2j9o3N3K2
$$ plain form
3493 48 474 459 -20 -350 -352 -222 143 521 373 -173 -469 -348 -62 323 522 155 -376 -451 -174 116 391 405
3515 405 -49 -457 -311 36 202 316 227 -161 -385 -153 65 146 261 174 -209 -347 -76 82 134 286 143
3536 143 -296 -348 -25 127 208 290 9 -414 -277 123 207 191 199 -160 -421 -108 241 148 98 65 -223 -301 71 213
3560 213 54 51 61 -203 -190 123 117 -6 108 66 -219 -153 119 97 27 134 -14 -286 -82 180 90 30 82 -112
3584 -112 -256 36 214 41 -28 24 -135 -121 151 158 -58 -41 41 -96 -62 132 51 -77 39 61 -98 -65 79 23
3608 23 -30 71 24 -146 -42 107 27 -17 29 -48 -122 44 139 6 -69 3 -25 -31 87 78 -67 -44 43 18 -7 46 2
3635 2 -67 13 77 8 -56 -1 8 -11 43 48 -58 -46 47 36 -2 5 -8 -58 3 80 17 -54 -17 29 -8 10 42 -33 -54 18 43 -1
3667 -1 -8 7 -41 -8 67 26 -59 -30 33 2 5 34 -8 -62 7 50 -6 2 14 -45 -36 58 46 -34 -12 30 -26 -23 39 20 -43 10 32
3700C2m5RJ9k6j8O6Op3K7L4n2lN9k2m3J5L2l8K5L2n1l4O2K0k9KK0n0lP4on1J7
3733GNk0K4K7l3l8K3L0j9QJ9n7j3N9K0m8JK7m8K3N9l3n6QM2j6K4J2m8l5O3L0m3
3766Dj4Oj3LM4Np9J4L4nRJ0l1l2N1M1m0k8L3k1PM7j4o9MM9Jj5J1k3n1N9N1m2l2
3801b6K3Jk5M8Qn5mO4k4m8K4J7k9M2M5o4n9O5K3k2QK4q2k2J00Pn6J8K5p7K9Q7
3833F5n0n5N6K2q2K0O0n0rQ7l5j18M8Q8m0OM7r2r8J15J05o6m0K2j04J2J59L2j23
3862a8pL9q2K3J28l6j13O1M4r5j5J17k1m6Q6n3j54P4J58rn1J4j17j00J82J73r5
3889H7j20mn9NJ98P4j65j03N0k5K0J67j6j65j4P4o5MJ61j3j10KJ3j10N6J98j0
3916A30j37l4l5n0J52J99j00k40kL7K4J77J04j99k09P2R7J1J39L1k38j06J37O8
$$ plain form
3700 32 -13 -4 15 -11 -29 37 43 -30 -3 31 -21 -24 35 13 -30 -15 17 -21 4 36 -15 -49 13 33 4 6 26 -24 -27 47 41 -10 7
3733 7 12 -8 16 43 10 -28 -5 25 6 14 33 -24 -37 22 42 -6 -5 22 -26 -3 56 23 -33 -25 17 1 25 37 -11 -46 17 47 4
3766 4 -10 -4 -17 -14 30 35 -44 -30 4 -1 8 18 -13 -45 6 47 7 -21 12 -9 -2 45 31 -38 -34 15 16 1 12 -11 -62 -3 48 6 -26
3801 -26 -3 -2 -27 21 29 -26 -30 34 10 -38 -14 3 -26 16 61 -3 -62 3 26 4 12 36 -46 -68 32 39 -17 1 26 -51 -22 65
3833 65 15 -40 16 38 -44 -24 36 -14 -23 64 29 -89 -41 47 7 13 60 -32 -130 -15 90 24 -16 6 -98 -86 73 105 -18
3862 -18 -25 14 -68 -45 83 47 -66 -5 39 -56 -71 46 25 -21 65 12 -142 -68 90 81 30 44 -73 -173 9 182 87
3889 87 -33 -37 -96 -91 107 181 16 -87 -37 -62 -42 125 109 -56 -70 4 -61 -57 104 91 -19 -17 -4 -114 -58 140 130
3916 130 -7 -41 -76 -126 26 225 125 -115 -117 -80 -56 121 225 26 -183 -111 -14 -3 136 167 -71 -177 -40 28
3940B8l7J32K4k27p7J39J0lJ70k0k63n7J45K8N6J72j23l07RK06L5O4J15k29k71
3965b81J52K34j9K7M6k77j61K48J81q0L5Pk68q2K71Q1o3O1m4k96ML05N1o7O7j28
3991Dk91J03L38Lp6K1j94k22K28L07q0r5J5k08j25K99K19j66p8J4j81m8L00J39
4015B26j73n8%j86K5L03P7j68n8k9j66J12K99Rj96p1m1q7J68K69r1k34l3Rm5K02
4041F3J96j66k05K5K7l3J72J46j83j67N5K1j5J69R1j99j40J04pkJ84L8k33j00
4065a59J22J4K2J79n2k52k3J80j7J5J37j02k24P2J69o7NJ26j26j94J33J29j05
4088a8L8J08j57j35J65Q0j23P2Q9j79j10K23K7j25Q9M9j90j8K00l1j06J04K0j87
4112a15N7J57p9q8J27j2j69R9J25j14k2J24o1j42J24Q1j29J8J00r4q9J39N0j25
$$ plain form
3940 28 -9 123 147 -80 -157 -18 -8 -11 159 139 -124 -181 -36 -8 48 220 97 -210 -201 5 40 104 219 -10 -281
3965 -281 -129 105 86 113 159 -118 -279 -31 150 70 105 112 -156 -238 33 114 51 112 68 -228 -224 81 132 65 132 4
3991 4 -287 -184 154 157 81 102 -92 -314 -86 221 141 46 61 -147 -272 27 246 80 2 16 -165 -213 87 226
4015 226 53 -5 -5 -191 -166 137 214 46 -12 -41 -207 -95 204 213 17 -54 -95 -182 -14 255 164 -70 -103 -94 -139 63
4041 63 259 93 -112 -87 -60 -93 79 225 42 -125 -70 -49 -64 105 196 -3 -143 -39 -46 -48 136 174 -59 -159
4065 -159 -37 -23 -1 178 126 -126 -149 31 14 29 166 64 -160 -88 81 14 19 145 19 -175 -42 87 -18
4088 -18 20 128 -29 -164 1 81 -42 30 119 -60 -170 53 80 -45 44 93 -97 -115 85 54 -52 52 72 -115
4112 -115 -58 99 20 -68 59 47 -122 -23 102 -12 -34 90 29 -113 11 92 -37 -19 81 -13 -102 37 87 -38
4136c8NR0q4l6J22pj19M4P3q6j0R7l8r2J01M9r1j5P7m6n0J00J9j13J5O8l2l4P0
4165C9pq5K4P2m9k9N2K0p5L8L1m8j2O3Pq1K2L9n2K4P4l5q3L3M4m2J2N4n6o7O8
4196eL6l8J6M5p1m4Q3K2o8L6M3o8l0P5qm4M1K0q1%Q2k5l6O1j7p8L1O5l2l5M5j7
4228Dn8M8O4o5k5N8k5l4M8K7o1J4L8l6l4N1J7m5K6K3o1rN9J5m1Qlm4K2O3j8n7
4260c1J3OOL3J4l8m2L8K8j5J3l0k8J0N0Om9rJ5J7J9mm4qK4L2J0l1j8qJ5L8Nm3
4294fl0PM8J1Ll8n2K7N2Rl2j7j8J3M5J6l6m2PL7K3Nl1k4rM8K4l2k0j5PL8K4k7
4328A5m9%L6K3Qk7l9KL9K9m0j9j0J6L1K6l4n0K4M1mkj6l9qN4L9m5k7kMK8L2j7
4362A9o3J3L5LRJ1l8k2N1J0l1oJ4joK7j9m8L2M6k1k0Jk2nN7J3o4j4L5lkN5j9p3
$$ plain form
4136 -38 -33 57 -27 -63 59 52 -67 -23 50 -36 -46 51 13 -79 22 71 -20 -35 42 -4 -54 46 65 -48 -33 35 3 -31 39
4165 39 32 -53 -29 43 -6 -35 17 37 -38 0 31 -17 -29 34 41 -40 -18 21 -31 -7 67 32 -51 -18 26 -16 -4 50 -6 -73 -5
4196 -5 31 -7 9 54 -17 -61 22 44 -24 12 55 -13 -43 32 24 -20 21 41 -40 -40 42 17 -19 42 25 -53 -22 43 11 -24 21 4
4228 4 -54 -6 58 -7 -32 26 1 -33 15 42 -19 -5 33 -3 -37 14 31 -14 12 35 -26 -35 24 39 -2 6 3 -41 -19 44 26 -31
4260 -31 -18 -12 -6 27 41 3 -39 -1 27 12 25 -5 -33 -23 27 33 -16 -25 -10 7 26 22 -22 -30 -6 26 36 5 -13 -21 -6 32 37 -6
4294 -6 -36 -29 19 30 33 -5 -57 -30 22 31 -1 -18 -36 -23 22 38 2 -40 -33 4 27 32 1 -23 -32 16 40 8 -12 -27 -20 18 42 15
4328 15 -34 -34 2 25 33 6 -33 -31 8 37 -3 -22 -32 -16 15 41 7 -43 -19 22 18 16 0 -39 -47 7 46 1 -26 -28 -24 4 36 19
4362 19 -44 -31 4 7 16 27 -11 -33 18 28 -3 -9 5 4 -2 25 6 -42 -10 36 15 -5 -4 -26 -31 26 39 -25 -39 -4 -7 -9 46 27 -46
4397d6L6L0k5j1L3On0K9K1n6J3N6j4n0K6%m4N6O2n1o2L8%k7O6L8q8n0N7K6l1M4
4429C2L1r2k9Q0rm6O6J9r8OO5l7l1J04kj12J7N7n7K5J07n2j31L0P8l8M4P8j08
4458cj07J02O8p0K8O1j09q7J29L6p8P0M5j42m3J47mp4R0L2j70j4J50l1n7J22k2
4485F9j92M5J58m9m5J11p1j78J09J44j03j2J21j28j33J53J28j25j4J09j43j14
4507a60K03Q8j32K2O1j71n1K29K1j34M4L0j74K4K26l7j33P9J3j92P7K20r2j25
4531f4R8l2j65J40J93j26j12J14p9j37K04J47j62j03J03o7q3K15R5k16o0J47r8
4554d8o4K36K2k33QJ51j17m9K27lk28N2J07j44J4K46q8k16J02P9j62Q6K24j66
4578C6k22J74P3j48J16J64k32j35K26K6j75J32J18k57l3K41n4j70J77O9k43K8
$$ plain form
4397 -46 -10 20 -5 -16 17 23 -27 2 23 -33 -20 36 22 -28 -2 -2 -46 10 72 21 -41 -3 -3 -30 36 74 -14 -64 -7 19 -12 32
4429 32 63 -29 -58 22 13 -33 33 52 -46 -40 25 -12 -43 61 59 -53 -36 21 -36 -11 96 44 -87 -57 21 -17 27 105 -3
4458 -3 -110 -8 60 -10 18 79 -30 -117 12 48 -30 40 85 -57 -100 47 43 -31 59 91 -79 -93 57 26 -31 91 69
4485 69 -123 -78 80 31 -14 97 26 -152 -43 101 -2 -14 107 -21 -154 -1 127 2 -12 97 -46 -160
4507 -160 43 131 -1 21 82 -89 -140 89 110 -24 20 50 -124 -100 126 89 -44 35 48 -144 -67 153 61 -64
4531 -64 34 2 -163 -23 170 44 -68 46 -33 -170 34 181 19 -84 19 -48 -131 84 179 -37 -97 50 -48
4554 -48 -112 124 146 -87 -79 72 -45 -94 133 130 -98 -46 61 -83 -69 177 89 -127 -25 54 -108 -22 202 36
4578 36 -186 -12 61 -87 29 193 -39 -174 52 78 -97 35 153 -104 -137 104 50 -120 57 126 -117 -89
4600h9K07j14j30K32K6k64O7J89j60n6K29n9k55J39J87j71m1K02j30j98K35J10
4622A56k39NK02j52j03K21L4k56P9J84j49q7K05n7k01J60J65k13n2K03q3j44J83
4645F1Q0k40K0K11j19j30J91J5k06R9J69j89r1J84J2j47J16Q6k23j4K46l8j55
4668f2Q5L1j79Q5K17j26j62J03L8j26J17J43j75j27J73K5j46J02J01j63n0J68
4690G2m8j43J42J00j58j8J31j01r2J93N4j89k5J11o9k4J90l3k24M9J45r1J8J43
4714A33j04j76J25J20j09RJ00j15j08J67L6j26L7J20j48o2J42Nj04Q7P4j62n8
4737a17J60jq0R4Qj70K8J61m2o2O5k3j26Q8J25p9n7P2m0r3J00O7r4j6Q4n1p4R6
4765B3L4p2MP5r5l7R8L1p9K3K8p5jJ08j7p0RK2m9K0Q3n2n6L2K9l5K1K6l2k8M7
$$ plain form
4600 -89 118 4 -126 106 132 -132 -65 124 -36 -92 137 78 -177 -38 149 -22 -63 139 9 -189 46 156
4622 156 -83 -78 124 -28 -131 90 124 -132 -53 131 -18 -105 100 43 -158 2 167 -46 -98 105 22 -122 61
4645 61 141 -99 -79 132 13 -117 74 89 -117 -18 151 -38 -129 55 67 -80 36 122 -101 -115 131 93 -62
4668 -62 23 54 -125 -40 177 51 -111 -8 30 -96 21 164 -11 -138 35 60 -86 16 117 -46 -96 72
4690 72 24 -119 23 123 -35 -53 78 -23 -115 78 132 -57 -82 29 -40 -64 126 93 -131 -82 63 -28 -10 133
4714 133 29 -147 -22 98 -11 -2 98 -17 -125 42 78 -48 -11 109 -39 -101 41 46 -58 29 103 -59 -117
4737 -117 43 42 -38 56 64 -106 -78 83 41 -21 44 21 -105 -17 108 29 -28 44 4 -89 11 78 -16 -32 52 1 -73 23
4765 23 57 -15 -11 64 -31 -68 30 61 -18 5 33 -42 -43 65 48 -22 -13 9 -40 -20 63 11 -45 -13 16 -19 2 28 -4 -32 15
4796A5%k6OK7k7rL2j0m7L7M0k8k7J2joL2J3m5j8K3MjK5J1n3j3O0nk5nK1l4J4L3
4831B5k0k3J6jj0J6J0k4j4L0J2k3oJ3kQJ2j0k4J5J6pj2L1k5j8K6J5k9OqKnL4p
4866A9l4JJ0J0rJ8Jl6J6K0qj4J2j1j4K7Pk4kJ9j6lQJ5k2LJ6j8j0L1k7lJ0K9k0
4901AQ%qj0K9j0qJ1Jj2mJ2rj1QJ4j1q%Lj0K8Mk6KQjPJ5j1l1QJ7QnJ6k6j9K4L1
4941C5l3jQj5k0M2ml8K3L5k8j1L0j5j9L2L1m7j9L4rj4M0j1n2pN3j0j7K9j0o4M3
4974iN0k9m3M3Lm9L9K1m8oP4j8n8L8J6m8K6O6o0n5N2K4l6J6L9p3l2P8K8m9MK6
5006C0o2j0R5j6p6M8K7n6MO7n1n3J00J6j03NO8m2j2P4j8j26M7R4n0j6P4p8q4J18
5036A4P0r6k3Q3o7k6J01J1j17K9Q5q2k7R1j2r5Q4O2j19l2J15k4p0P0K3j42M5J30
$$ plain form
4796 15 15 -11 -5 22 -5 -14 18 8 -39 -2 38 10 -17 -5 -6 -12 20 33 -12 -30 -7 -3 -4 21 32 -21 -34 26 21 -4 -9 12 -22 -8 25
4831 25 5 -18 -2 -3 -13 3 13 -11 -25 5 17 -6 -12 1 -1 7 19 9 -15 0 16 9 -3 28 3 -15 11 26 -3 3 -5 -3 -8 26 19
4866 19 -15 -14 -4 6 -3 15 16 -20 -4 16 8 -6 6 -5 -19 8 15 -9 -11 8 -8 -11 -3 12 -10 -7 9 -9 -19 12 -15 -18 -8 21 1
4901 1 9 9 1 -9 20 10 2 13 14 2 -2 10 1 -10 -2 12 1 -7 -7 -4 -14 14 18 -8 -6 2 1 8 23 12 -19 -11 6 14 9 25 -1 -20 4 35
4941 35 2 1 9 -6 -26 16 12 -26 -3 32 4 -7 23 8 -11 21 52 5 -14 20 11 -3 37 26 -26 -33 20 10 -7 22 12 -52 -9
4974 -9 41 12 -31 12 15 -34 5 26 -22 -28 46 28 -30 8 24 -24 2 68 8 -47 5 29 -7 9 48 -25 -57 21 49 0 4 30
5006 30 -32 -42 53 37 -39 9 36 -20 -16 51 0 -53 47 63 -40 -35 33 -9 -21 53 35 -91 -44 50 0 -16 58 -20 -104 14
5036 14 84 -12 -35 48 -19 -45 56 67 -50 -21 64 -18 -45 46 34 -61 23 85 -34 -66 49 25 -45 25 48 -94 -49 81
5064H1n5p3P7j2r7Q2J10j14q0J08nq6Q5N7j28k0J30l6q2P6M4j21K0J28r9r0J40
5091D0L0j36N0R2j15m9J65qj52N0R6j15MJ38o7j33J13P6j32QJ35j03r4J66K5j60
5117g6K8J25j10m4J54l3j57R8J23j48k5J37o4j21J41P8j70KJ46q4j03J45J7j43
5141h4O3J33j30q1J59j6j12J00Q1j74l1J56l6r5J16K6j79N1J51p2j05J37k2j48
5165a12R4J37j14r6J48j8j50J00J11j34k9J48o6j34J23P9j12mJ15j09j14J67O5
5188I5j31K2P5j15n8K03J0j72L7Q7j20mJ93m5j62Q0O6j42L5J60p9j36J05N6j56
5213i6Q6J23j01j18J29jj18J08J09j40o5J07j5p6J27P0j81l4J24l8o2J29K3j66
5237g6j0J22m5l5J41l0j59M2J06p6j3J26n7j52R6R2r5J3J08j03j02J24L2q8L7
$$ plain form
5064 81 26 -47 30 18 -79 3 113 -1 -81 27 22 -64 21 78 -50 -70 60 24 -58 18 62 -59 -39 89 -10 -100 40
5091 40 70 -66 -16 76 -39 -88 77 69 -83 -33 63 -52 -48 90 23 -110 3 79 -53 -45 90 -13 -107 59 84 -76
5117 -76 -48 77 -33 -77 77 44 -113 -15 108 -40 -65 72 8 -113 28 106 -64 -62 84 0 -103 42 59 -84
5141 -84 -21 112 -18 -99 60 44 -68 32 113 -61 -92 64 28 -67 49 75 -104 -53 98 26 -79 58 36 -112
5165 -112 -18 119 5 -91 57 39 -111 -11 100 -34 -63 85 19 -115 8 87 -25 -29 86 -23 -137 30 95
5188 95 -36 -14 61 -54 -112 91 101 -71 -34 53 -67 -71 122 77 -85 -5 61 -81 -46 114 35 -101 4 60 -96
5213 -96 -10 113 12 -106 23 22 -96 12 121 -19 -84 23 8 -68 59 129 -52 -86 38 0 -62 67 90 -76
5237 -76 -86 36 -9 -44 97 67 -92 -50 56 -20 -33 93 36 -116 -20 72 -23 -10 98 -5 -107 17 49 -39 -2
5262bR2j38o5J36K3j01P2N1j30k5J40j0p9P4Pj15L3R6k8m4N5k8j06O0J09o1l6
5289b0N9k3q6P2O9p9k1O5m2m6O3M7p8nO2n2k8P0J7n1%K5n1j4Q3Mo2RK6m5NP5j3
5322C5o3KK9l0K0M2k0n5M2J9l6OL8nm8K5J2l7K6L1k4k9L5j3j3K0K4k9k9K4Oj0
5354eK5Ml5qL4%j9OJ3l7RM4k4k1K4lk3QK0j8j7K6Lk1KJ4j%K0k2k1K3L5l4KQj5
5391dlK1Kj9MOk0J2J9j1j7RJ3opkj2KQOj0j9K7%lRLk5PJ8Ok5JOj3J7Qj6oJ4MJ
5433E%j0OlK0Kj9oJ2j3OJ9j4j3KJ6oj2J0Kj4MJ1rqJ6opJ6pj5J8LmlNmj2J2Mj4
5474a0jnJ0mOmJJJ9j8lPNj2NJ7j2rJJ4k1J6jkjJrkNKj4K1Kk8jK4qoJ9J0m0J2J7
5517Dj3MJ9j4k3K0J4mj7K1mk5K0J7j9mJ9j3k4K6lj9K2Nj6j2K0J2j7RJ2j6lK1j4
$$ plain form
5262 -2 90 -48 -113 23 46 -55 17 68 -62 -87 53 43 -36 38 45 -70 -37 59 31 -13 42 14 -92 -32 77 16 -20
5289 -20 39 16 -70 2 71 -8 -29 36 -6 -52 11 58 -20 -25 37 -15 -43 27 44 -7 -7 18 -33 -47 36 40 -22 -13 13 -32 -27 48 35
5322 35 -28 -26 3 -27 -7 35 15 -40 2 21 -15 -9 29 24 -24 1 13 -24 2 33 9 -20 15 2 -11 9 33 4 -25 -1 5 -5
5354 -5 20 24 -11 -19 15 15 -4 2 15 -22 -13 31 7 -14 10 7 -16 -8 12 -6 -23 3 6 -15 -13 1 0 0 20 -2 -23 0 35 1 3 11 -4
5391 -4 -7 14 16 -3 1 7 -13 -1 18 7 -10 -1 12 6 -1 -3 -15 -13 -5 1 -9 -28 -1 -1 -4 5 8 -17 -10 8 14 -11 -10 -4 -17 0 8 -8 -14 0 4 5
5433 5 5 -5 1 -2 18 20 1 -5 7 -6 0 19 5 -8 -6 10 4 -8 2 4 -10 -6 5 -4 -12 4 -2 -9 7 0 -15 3 6 2 -1 4 0 -12 0 4 -10
5474 -10 -11 -16 -6 -10 -4 -8 -7 -6 13 -5 -8 -1 4 -8 -3 14 2 -7 -6 8 -13 3 2 0 -1 0 -9 -11 -6 -4 -18 3 5 -23 -24 0 -8 -14 5 15 -25 -13 4
5517 4 -9 -5 14 0 -23 -3 11 7 -10 11 7 -18 2 19 0 -4 15 2 -22 4 1 -18 4 9 -7 -19 1 13 -4 5 17 1 -2 19 5
5552Ek2L0mk0mK7j1j9K7jk8J7K1k1k1M6j7l2K7K1m1JL6ol7M7Kl3rM5k9l0M0Ol6
5587b3J0M5m0k5N8j2l2K5K7n4JN8k3l3K9J2n0mO6k7n0N2J2n2J5M9n0k4N9Op3K9
5619a9M4m6j7P5k6n5M6M2o3ON5n4l9P2jn9L4M4n5j2O0k9n4N3N4r5KO7k6m2N9Q
5651B9p2J6O7n3k4P8kq2K0O8o8j1Q0k3p8L7M1n2K2M4m3m2O0K7n9K0O2o4l5P7n
5682C5o0J9M8p4oO6pn4L5L8q2OO9lo9L7L3q2QP4k2m2N4j3o6K5R5n4l7M8j4n9M1
5715a3Q1p7l3M9j7l9O0N0p8j5N1j8n2P4K9o8j6N8l9l9Q6J9o8jM3n8JP7%p9J3K8
5747Im6J7O0j8p5L5L6m9L0N1m1n3M6J2m4K6N9n6m2N4nk6K9M6o5l1N3k3j2M9J1
5778C7o6k2O3mk5M0J5o6j0P6m2j6M8po7K0N0k8j8L9rn9K9N2m9RM9m0o3N6L0l7
$$ plain form
5552 5 -17 13 9 -11 -15 12 1 -18 9 8 -20 -3 18 -3 -24 22 5 -27 0 21 -20 -19 17 11 -26 21 23 -10 -19 26 -3 -33 7 13 -23
5587 -23 -13 32 -8 -33 25 13 -19 6 33 -21 -20 38 15 -18 11 23 -27 -31 35 8 -42 10 22 -30 -15 34 -16 -40 19 25 -48 -19
5619 -19 25 -21 -38 37 11 -44 2 44 -19 -13 42 -12 -51 21 20 -39 -5 39 -16 -28 32 3 -51 2 56 -39 -37 30 4 -38 21 29
5651 29 -43 -27 40 -13 -37 41 39 -43 -23 45 -23 -34 46 23 -55 -18 23 -29 -7 37 -6 -48 12 39 -20 0 62 -2 -37 40 35
5682 35 -25 -6 42 -32 -38 28 21 -33 2 40 -42 -36 33 30 -39 -2 31 -51 -43 31 9 -33 21 8 -58 -33 62 8 -29 19 5 -54 -13
5715 -13 68 -9 -42 7 -10 -49 11 61 -17 -32 19 1 -51 23 52 -16 -32 26 -13 -52 34 53 -15 -16 27 -31 -30 47 47 -32 -19 9
5747 9 -37 -20 40 22 -53 -18 18 -31 -1 50 9 -44 2 14 -30 -4 55 -1 -43 11 6 -20 9 55 -10 -41 12 -11 -23 26 37
5778 37 -29 -51 12 8 -17 23 38 -28 -38 38 -4 -20 28 21 -46 -26 24 -4 -22 17 8 -51 -22 30 -19 -10 39 -1 -64 -8 22 -15
5810a5K6K8m8m5N4M3m2J7K1n5k5N5J2l7RK1m3j2N7j4l8L0K4m3KM1ok6L5jo0QO2
5843C5k0k5J9j8n3M7L8k0k8K0Ml2L5M6o0k7M2rj4K0K3m3kN0k6k8M6Nl2mL3l5j2
5876b5M6J1l7JOj5kM1%m7J0K4k7K0L6l7l3K4J3k2J9J1k7j9L7jk5K2J0k3j8K8j0
5909ik2L4J4k6lK1mj0K5Pl9lK2knJ0j4j6J3J4jj4kLpK1pj1kPmnJ8j3mJ1Jjj3K2
5949Fjj0JJ1j7jJ2nmkRj9J5K1j2npPlOJ3j5j0NJ3jk0J9MmlMk4QOlR%rpJ2Oj4j1
5993b0K1%qjJ8k1kJ4ljoRljJ%jlJ5j4PJKj8J4qQkNmj0R%lJ1Kj3NMPk1J0jjj4J8
6039Bj4MQkoj3K5Lj7RKrOQj6lJ3Pj3KPomJ1%j3MOomNnQJ4j8j5K4nNKmnrJ5%k5
6085b2J5J3j9J6%mj4OJ5j4lJ7j7j3J7J4k7J8J0j9jK0Qk3J3Kj0%LNk8K6Rk6PK0
$$ plain form
5810 -15 11 39 -9 -54 0 43 1 18 39 -16 -41 14 26 -11 -2 19 -24 -36 21 7 -31 -1 23 -20 -18 23 17 -9 26 25 -35 -27 35
5843 35 15 -10 9 -9 -62 -15 23 3 -25 -5 -1 -33 2 48 -12 -39 3 -6 -20 0 23 -20 -22 28 2 -26 20 25 -7 -11 22 -13 -25
5876 -25 21 32 -5 -4 2 -13 -15 26 26 -21 -11 13 -14 6 42 5 -28 -4 9 -13 6 17 -10 -29 8 7 -18 4 14 -9 -27 1 -9
5909 -9 -31 3 17 -9 -12 9 5 -5 20 27 -12 -15 7 5 0 10 -4 -20 -7 7 6 -8 -10 -7 -14 7 0 -11 -13 -6 -10 -15 3 -10 -14 -3 -2 -3 -16 6
5949 6 5 -5 -4 7 -10 -11 1 -4 -8 -10 -1 -20 -5 16 4 -1 -8 -1 -4 2 15 0 -10 -5 8 7 -13 6 10 6 3 7 -17 -9 -3 -6 3 3 -6 -13 -1 5 -9 -20
5993 -20 1 1 -7 -8 10 -11 -13 1 -2 -3 -9 0 -3 -4 -3 -3 -4 -7 8 -6 1 2 4 -14 0 -8 0 -2 3 -1 -11 -2 -2 -5 6 8 -5 0 4 11 -10 0 -1 -2 -16 2
6039 2 -12 -8 0 -2 -8 -21 4 7 -10 -1 1 -8 -2 6 -10 -13 0 7 -6 -4 3 -3 -7 4 4 -9 -5 1 -5 -9 -4 -9 -1 13 -5 -20 4 -1 4 6 2 -3 -12 3 3 -22
6085 -22 -7 6 -13 3 3 -1 -15 -9 6 -8 -11 6 -11 -24 -7 7 -20 -2 8 -11 -12 8 16 -7 6 8 -2 -2 1 6 -22 4 13 -13 -6 14
6121A4j8oK6j9j3J7J4j6k0L8j5m1L6J4j6k3N0j2l0K8Nl7QM5l2j8K3Mn2M0M4l8
6153@l4M7Ml5L3K1n2j3M8%l9L3J7m4QL9l8k5M4J5n5J0K7k2k1O0lo7K8L4n1MO5
6186C8k3p1M8M1n6NO0m0o6P7K5p1J8N6o3l5P6J7p8M0M9o5l6Q0j6m9N5M9j01j6
6216e2Q2ko2O6J8j00J0J04n3m1P1j6r0M0P9o2l2O8j2q4O8P2q4j0O6m2p5Q2O1r9
6246b9J5O8o6p7J01N4r1J4O5r3m5J36Kj05O1M0r4pJ17j0j18P0M1r0PJ18n6q6Q9
6275C1Oj10N8R6o4q3R2j4r0P5J07j12n6R6k3q7R6Q3j21m0R9m4n4J10L4j30JQ5
6303D1o2l4J11K3j47N0O6r3lJ31l6j22N4O6p7QJ26p4j21P6M4p7M0J00q8r2R7K3
6331C0p3M7P5j10m6R7Rq0O4O2j17k8J03k7n3P1N1j35%R9j1o5R1jj21K2Q0k7n0
$$ plain form
6121 14 -4 -10 16 -3 -16 1 15 -1 -21 17 2 -39 -3 11 -5 -28 22 10 -20 8 13 -24 -16 29 -3 -21 2 6 -46 -6 38 0
6153 0 -34 13 17 -18 15 36 -16 -29 19 19 -20 13 30 -14 -6 33 -5 -30 14 29 -26 -16 11 -11 -32 28 25 -42 -14 20 -31 -27 38
6186 38 15 -56 -8 33 -23 -18 42 2 -64 13 38 -33 -15 41 -22 -57 19 36 -42 -2 47 -18 -54 26 10 -39 16 65 -36 -52
6216 -52 30 28 -34 32 50 -50 -40 64 11 -30 41 25 -65 -25 54 -8 -40 28 16 -68 0 72 -12 -22 44 2 -73 9 70 -29
6246 -29 -14 54 -12 -89 12 66 -25 -11 54 -39 -84 52 54 -51 10 50 -44 -51 66 56 -62 8 49 -41 -34 84 28 -58 31
6275 31 37 -73 -15 81 17 -66 26 12 -78 -3 104 -8 -64 32 9 -78 18 101 -20 -60 39 -5 -59 51 85 -45 -44 41
6303 41 -21 -55 56 79 -68 -18 48 -45 -48 83 47 -75 -21 45 -32 -24 102 28 -93 -17 27 -50 -10 90 2 -90 7 30
6331 30 -43 4 79 -31 -77 20 29 -51 13 75 -42 -70 33 6 -47 24 75 -60 -60 39 28 -37 54 53 -68 -46 34 7 -43
6360d3R0j7r5M1Q6n3l3P5k5r7O1P3n5l5P2n1o6P4N1p2J3N9p7m1P8K8p0J0M4o8
6390d3j0Q4rn8L7L8p0j5R1qp6N4J3p3K3P6m9m7N3J3o3K7P7o4l1N3Ln7K8M6o0j4
6422c1M1om8N2K1l6j8M8j7l4M1J2m6JM0l5j9N4%m1QK5j7j1M1j4k5J8K1k9oL6j2
6455A4l9L0J8k3lL0j3k4K0Jj7J0K4l5pK6rj0J7J1l7PK3Lk5JJ7k1mK5Jk1J3mm%
6491eJ5j6oJJ7pj2J8j9LK4j2oJQnNJ4j1j3OJ3j6j0K2qj7K2j0j1OJ2loJ8j4j5J8
6529AJ4j3pQjLrOj1lJ2kqRKj3RPqj6J4J0nJ0Pj8pK4%j7PQj2mJ9j0j8J2MnJ1j1
6571aqLJ1pK%nmMQ%jrJ8pklm%K2pj4kQNQq%k5J1K2jj4Lj5J3J6mj4JlJ4oRj1qJ4
6618IJ1Jqlj0oJ5Nk6PPrkJ7Lj9%J7j5KJ8k3MJ8Jk8KK2o%MJk1K9Mk3JK3k8J0ON
$$ plain form
6360 -43 47 30 -65 -24 62 9 -24 51 26 -71 -10 63 8 -27 45 -6 -72 2 53 -19 -6 53 -24 -65 13 41 -29 -19 25 -43
6390 -43 -53 31 22 -36 1 39 -31 -46 45 37 -39 15 28 -45 -22 54 5 -42 11 24 -39 -12 65 1 -30 23 26 -31 -3 43 -17 -31
6422 -31 10 4 -44 8 29 -7 -25 23 6 -28 13 25 -21 -20 20 -15 -34 20 20 -21 -13 12 -5 -16 25 11 -14 4 25 -4 -10 26 14
6455 14 -25 5 23 0 -3 27 14 -10 10 11 -6 4 28 -7 -14 12 3 -7 10 21 -16 -9 14 17 -8 -7 10 -11 -15 10 11 -10 3 -1 -5 -5
6491 -5 10 -6 -12 -11 6 -1 -13 5 -14 -11 13 1 -5 -4 4 -1 4 18 7 -6 0 13 -3 -13 9 1 -16 6 -4 -15 -9 3 0 -6 12 -2 -17 1
6529 1 15 2 -5 3 2 5 -4 2 -9 -12 0 -2 -10 -1 1 -12 -3 4 -4 -20 -6 4 -1 9 16 -2 -9 15 15 -2 5 13 1 -3 16 6 -12 0 4 -1 10 -1
6571 -1 -9 -6 5 -2 0 0 -5 -9 -5 3 3 2 -7 11 4 2 -1 -5 -5 17 10 -4 -6 2 7 15 7 7 -18 -7 15 14 0 3 -12 1 17 13 -1 0 -3 11 5 14 3 -5 9
6618 9 20 21 13 10 0 -6 9 14 -12 -5 2 -7 -9 8 11 -8 -8 9 -6 -4 14 -9 -5 13 14 -14 -12 10 4 4 8 9 -12 17 21 -2 -1 22 -6 4 10 15
6660A5l0LK1j3jJ7nk5J4K3j8j3J7j3mJ1J6k9kJ9mj7J5Ok5K4K2k3k0K3lj7K4J7
6694B5m2jL8j7j2K4Ml0J0K7k7j4L7j3k7J3L3m5J2K8j2l1K3Rk5K0K5l0l1L1Rk8
6726a7J1K3l2j8M0Nk0NK3l1j8N4k5k7L1Ol6RM5k3k6M4Po1K5M1l2j1M1k7n2L8M4
6759C6m3rM9l5m0N1L5o1NM2l7k2N8Pn2PL5m1j9N9%n1K6L5n2j2O5j2n4M0Rm9OP0
6793D6k6m2K6J4m9J8O4l6l7M5nn8M5M9n7k4M9k0l9N2M1q3mN4m0j8O4Mo8J4N1m6
6825a6j2P0j3p1K0O3n7LN6j6p7M3L2p3L5N8m0o0N6K4l7J4N6o1m1O8Jm5L7M6r3
6856c0%O1qm3L9K4o8rO1j6k7K6L3p8j1P4k4m2N6J2p9K9N3k3k1M3%q8M0O0n0oL9
6889B7k4m8N0M3o3jN4m0m1O0J4m9LM9l6l9O3Qn0K0L9o4j6N5J7n1K0K3m8j3O9j7
$$ plain form
6660 15 -15 -12 9 -4 -5 12 7 -18 -4 19 1 -12 5 -8 -12 -1 15 -14 -16 3 -1 -18 -3 3 -22 2 24 1 -19 4 1 -16 8 25
6694 25 -17 -18 20 3 -9 15 19 -11 -1 26 -1 -15 22 9 -18 -5 28 -17 -5 23 11 -20 3 12 -13 7 32 2 -29 2 11 -17
6726 -17 -6 17 -15 -33 7 12 -8 -3 20 -11 -29 25 0 -27 4 10 -26 -17 28 5 -21 23 30 -31 -6 35 3 -8 33 6 -46 -8 36
6759 36 -7 -16 33 -2 -42 9 44 -17 -12 30 -7 -29 29 36 -16 -9 26 -15 -34 25 25 -26 0 35 -17 -29 36 24 -30 10 19 -30 -24 46
6793 46 20 -22 4 18 -31 -13 51 15 -22 23 18 -40 5 54 -3 -27 22 2 -37 15 56 -27 -31 23 -17 -35 29 33 -35 -21 30 -16
6825 -16 -28 42 29 -42 -22 41 -16 -13 43 27 -50 -7 25 -48 -13 45 5 -55 1 25 -12 2 58 -3 -44 24 25 -20 17 63 -30
6856 -30 -30 31 23 -20 19 43 -25 -34 27 11 -16 10 43 -35 -46 28 4 -38 18 30 -49 -20 33 10 -11 32 32 -56 -16 44 -6 -12 27
6889 27 3 -45 5 48 -15 -16 38 -2 -43 17 31 -18 -15 34 -2 -41 22 30 -20 0 39 -25 -41 14 31 -20 0 23 -25 -38 31 14
6921A4m6L4J3m5K6N0l5m8N1Nl5K0L1m9rL3Rm4L3K9l7j6M4j8m8M6K0l9rM0l0j5
6953b5N8jo0MN1k1k0M0rl7J1L2k9j2L4k0k9L8J6l6LK8k1oK1Mm5RM8k9k5L7ql1
6987c0L8J8l4j1M3pk2J9Ml7ML4nk0J0%j4OL3j5l8K6K8l3ORl0QL0Jl6JK2j5LK4
7023B0j4m5L9Rl0J1J6j9j5M5Kk0mJ6jNJ0nl2K5Ljj7J4oj6K8Ok9KK1lk3J0Nj8P
7060dJ9j7oK2j2oOJ3k4nK6jj2mJ5j5MJ5j2j2QJnJ5Rj1j2J9Lj3J0j5Mj3J7Qj7%
7098bRj0J1%j4kLJ4rj3J4jj1J4lpPKJpQjj7J0PKj6J1lRMKmj7J9kj1J0kj6RJ0n
7141Ck0K0Oj5MJ3j0ONj1r%LOj4K3j0j2PJ0k1LK3j5j1RQPk3J5Lk1J8Oj7NJ4Lj6
7180eJ6Lk3J7jj4jK3k1oJ1RmpOoJQOj9K4nj3JKqJQOr%Kjj0%RjoJ2j2OJ7lk6J6
$$ plain form
6921 14 -32 2 15 -30 -4 46 11 -37 14 19 -16 4 35 -14 -23 10 19 -25 8 37 0 -16 28 10 -38 8 28 -11 -20 20 -10 -25
6953 -25 33 32 -28 -24 27 6 -14 26 17 -20 -9 23 -6 -18 16 -4 -33 5 21 -15 -12 16 -5 -11 10 14 -31 -22 26 -3 -28 9 1 -30
6987 -30 8 26 -8 -19 24 17 -5 14 18 -19 -15 19 14 -6 4 4 -10 -4 29 14 -24 2 30 -3 3 12 -18 -10 20 21 -15 -14 8 -7 -4 20
7023 20 6 -39 0 9 -21 -10 6 -13 -28 17 19 -1 -5 11 10 15 25 20 -12 13 16 15 -2 12 6 -10 18 24 -5 -3 18 15 -8 2 7 -11 -4
7060 -4 15 -2 -8 14 2 -4 2 15 -9 -14 12 11 -1 -5 10 -5 -1 14 2 -10 -2 -1 -6 9 18 7 -5 14 17 4 14 -1 3 -10 7 15 -2 -2
7098 -2 7 -3 8 8 -6 -8 -5 9 0 -13 1 0 -11 3 0 -7 0 2 3 -4 4 3 -14 -4 3 5 -11 0 -3 6 10 12 8 -9 10 8 -3 7 5 -11 -2 8 3
7141 3 -17 3 9 -6 -2 11 1 7 12 1 -8 -8 -5 1 -13 10 0 -12 -5 5 -16 -13 10 -5 -16 -7 1 8 -15 0 3 -18 0 6 -11 -6 8 11 -5
7180 -5 11 14 -9 8 7 -7 -8 15 -6 -12 -1 8 4 -3 3 -3 -2 6 12 -7 17 12 -1 0 2 -6 -5 3 9 0 0 2 1 -9 -9 0 -1 -7 5 -7 -1 16 13 -13 3
7225CPpMJ3k2RJ2Rl3J0Pj1KJ2jl0K0J5l0J9NmpQNj5%J2kqJ3ok2J4J3qLLj2oJ6
7266A0Pj9OOj5j3L4oj7K0Mj9pL4j8kOK0l0j2K4lk2K8lk9J3L4k5j5L6k5k0K1J7
7301B0k5qK3qj6K6Jj6kK5j6k6M4jl3K3Pl2rL9%l8K9%j6OL3j5k8K2J3l2J2K5k1
7336Fl0M1Nk6J1K2j6k5L6k2k0K5J7m0NK1j3j2K8J4m2J0K7k0rK2Ll9J1K9k1j1L4
7369B1nm1L3oj0LK3k4j7L4Lk3KK8j8k2L6J0m6K8K6m4NK6j5j6J1J8m2J2K0j5nJ9
7403IMl7J6L3k1j4K5mk9K0J5l1j2M6k6j3K5K5m1J3J7k2j1K8J3l4%K1k3j4M6nl0
7436a1J8K2l4nL6lk9KJ9k7OL3k5j4J9nj1JL0l3kJ9jk9J3J9j8j1L0Rl5L0Lk3J1
7471DJ9k0j6J7J4k6lL3j9j2K5Nk0jK3j2k0L3j8k6K2OqpJ7jk6J8J3k1OJ7j6kJ5
$$ plain form
7225 3 10 3 7 20 -2 7 19 28 -5 5 12 1 3 15 14 -16 4 19 -11 8 13 9 2 10 15 0 0 12 10 2 15 9 -13 1 14 6 9 12 0 -6 10
7266 10 17 -2 4 10 -5 -18 16 10 -7 13 17 -2 -9 25 7 5 11 31 1 -11 13 10 -12 16 13 -16 -3 31 6 -9 27 2 -18 3 20
7301 20 -5 -13 10 2 -14 12 13 -3 -5 20 4 -22 22 21 -12 11 18 -14 -23 16 16 -22 7 7 -9 -3 30 15 -13 9 22 -10 2 27 6
7336 6 -24 17 22 -4 7 29 13 -12 24 2 -18 7 24 -16 -11 10 -3 -15 13 27 -15 -5 22 2 -7 15 18 -21 -10 19 -2 -13 21
7369 21 16 -25 8 2 -8 -5 18 -6 -23 11 14 -9 -7 21 3 -19 17 27 -19 9 35 -9 -4 22 7 -9 2 20 -22 -10 10 -5 -10 9
7403 9 13 -24 -8 25 4 -10 15 11 -18 2 17 -14 -26 20 -6 -19 6 31 -10 3 20 -2 -13 15 28 -6 -6 15 -8 -22 24 19 -11
7436 -11 7 29 -5 -10 26 23 -6 -4 15 -12 -6 27 2 -12 7 2 -9 -8 22 -11 -13 6 5 -24 -11 8 -10 -21 9 18 -17 13 16 -7 4
7471 4 23 3 -13 4 18 -8 -11 22 3 -9 16 21 1 0 23 11 -9 24 6 -20 2 8 0 -7 10 9 -17 1 14 -7 -1 16 0 -2 13
7506A3Nl4QK3j8kJ3lqJ0njJJ4oj5J7njj0K4j2jNj5jJ1Qlj0J5rj1RpjJ0NqkjNo
7549AKJ0k3J2PqNqKj5RMljNMjPMj8lK4k0NNJj4J6OOj6J6j0Nj6J0olJ1j2JmKmN
7594@jLjjRLj9J8rjk%PoOoJ1qQMj0%L%j6QoNJ5poJ9mrOpM%mkNLkj3J5Lj2jJKq
7645cOlmJ3rRKjj4JKQJ4k2J3j3J1j7J7j6J2Pj4%LlnJ4Nj4Pk%lJ4JoJ1j8J2mKn
7688HmKmmRj4QMnJ3j6jPkKj1QKj3J6nMKLjkJKLmj%j0OJ0j0JLLJmj1NL%kNJJ1k1
7738bQMqJ1oqpJ3qMMnMojkLMmJ5lkj3K0rjjQj6QjKjj3J6MmPnlNj0K1j7lOnn%J0
7788HljRqPj3J0j4J1qlJrJ1jKkL%KkJ0j0nORj8J5kjqK2j8LO%j7J2OlrPJqkJ0j1
7835elJ4n%jJ1Lj3Pjj5PM%Klj0j0K0Qk0MkJ4pMJk3NK0LkNqj2J2K1k6lJ6mj4J3
$$ plain form
7506 13 18 -16 -8 15 -3 -5 8 5 -3 7 2 1 2 16 10 -5 12 7 6 -4 20 8 7 12 -3 -4 7 15 12 2 17 8 -3 6 -1 -2 8 13 5 3 2 7 1
7549 1 3 13 -10 2 9 1 6 -2 0 -15 -6 -2 -5 -6 -1 3 2 9 13 -5 -8 16 -4 1 6 7 -7 9 15 21 5 21 11 16 0 10 4 1 12 0 1 -3 -1 -5 0
7594 0 -1 2 1 0 9 12 -7 11 2 1 -1 -1 6 0 6 0 11 3 11 15 5 5 8 8 -8 0 -6 -1 14 7 1 20 16 7 13 6 10 10 6 4 9 12 10 -3 12 15 3 2 3 5 -3
7645 -3 3 0 -4 9 0 9 11 10 -4 -3 -1 7 21 -1 12 -1 10 -7 10 -6 6 13 -1 -1 2 -1 -6 8 13 -1 6 4 4 1 15 16 10 21 3 15 11 13 8
7688 8 4 6 2 -2 7 -7 1 5 0 13 -3 -4 3 1 3 -8 0 2 -11 5 0 4 6 9 8 6 7 9 12 8 7 7 -3 3 13 3 4 7 10 11 7 -4 1 4 4 2 7 8 19 -2
7738 -2 6 10 2 13 7 -1 -8 5 -3 1 5 0 4 -2 -3 -5 -2 2 -2 13 10 8 -5 15 6 5 4 12 -4 4 3 5 4 -9 7 11 7 14 9 6 11 1 22 5 2 8 3 -2 -2 8
7788 8 5 4 13 5 12 -1 9 -5 6 -2 -5 -4 -13 -2 -3 -1 -3 0 0 2 0 10 0 -5 1 10 -8 7 5 4 -4 18 0 3 9 9 -8 4 10 7 -2 5 6 -2 -4 6 -5
7835 -5 -8 6 1 1 0 11 14 1 8 7 -8 -1 3 3 5 2 -8 -18 2 10 -10 -6 -8 6 -1 3 4 -19 -14 6 9 7 12 4 -8 4 25 -1 -4 12 8 -6 7
7878GJ1k2%J8j1j3K2lj8J1J0j4k0K2Pj2QOk2MK2Kk2J2Qj1MQok0J6Lj3JJ9roJ0
7916IQj7jK2k2qK9j5j9J7Rj8MJ7j4o%J8j3oJ4k2mK4%k4J6Rj2j0K6j1qK1%j9%K1
7954A5j0k3L1%k5PJ5j6qL5j6j7K3J5k0rK8j0k1K2Ol3J6NmqNJ6j8nK3j9mJ6pj5
7990a0QJj7jK8kj3OK1k2oK5j2k1K0K8k4%Qjk3K8j3njOj6lL0qj8JJ9j2%J5j2j3
8028iK5rj7J4J6k0j2J5Rl0K2Pk0MJ3j8ljK4k8J3J6k3kJ9J8k1MJ0j5mJ2lrJ7km
8065Hj3J9rj6J7Mj2pJ7jj4J4Qj5JJ6k3O%krjL0k0j2K0oKLQk0kK1j3j0J1mpQK5
8105B2k2nJ2Qj6J2Rj1pJ5%j7LNjnJ0qj0LJ0j1QKjk1K5NqojjrJ6PpKKoQMpj2J0
8149FRj3JJqoJ8lqQMPoqQKLjojn%MNjonJ5lnPj4%kJ3k2J1KmlJ4j1
$$ plain form
7878 7 18 -4 -4 14 3 -10 12 9 -9 2 12 -2 -22 0 7 -5 3 9 -13 -9 13 15 -7 5 13 2 6 14 8 -12 4 7 -6 -5 14 5 -1 9
7916 9 17 0 -1 21 -1 -9 20 5 -14 3 12 -6 -2 15 1 -5 -5 13 0 -6 8 -14 -18 6 6 -18 -2 7 -5 -15 11 0 -8 13 13 -6 -6 15
7954 15 5 -18 13 13 -12 -5 10 -6 -14 21 5 -12 11 26 6 -3 25 15 -6 16 22 -11 5 10 6 -2 3 19 1 -4 19 0 -4 12 5 -10
7990 -10 -2 -1 -18 -19 9 7 -6 0 21 -1 -7 18 6 -15 5 33 9 9 17 16 -7 21 8 3 2 8 -8 -11 19 11 -7 -6 13 1 1 16 4 -9
8028 -9 16 7 -10 4 20 0 -12 3 12 -18 4 11 -9 -5 8 -10 -13 -14 10 -18 -5 11 -12 -14 5 23 2 6 16 1 -3 9 6 -3 14 12 8
8065 8 -5 14 5 -11 6 10 -2 -9 8 7 -7 7 15 0 1 17 -6 0 0 -2 -11 -12 18 -2 -14 6 0 2 5 13 -7 -9 12 -1 -11 0 -4 -11 -3 22
8105 22 0 -5 7 15 -1 11 20 9 2 17 17 0 3 8 7 2 12 4 -6 -3 7 -4 4 6 5 -16 9 14 6 0 -1 -2 -11 5 12 5 7 9 3 11 15 8 -4 6
8149 6 15 2 3 4 -4 -10 8 5 -3 5 9 16 10 2 10 12 15 14 8 7 2 2 6 11 10 4 -1 14 11 6 13 -1 -1 -3 10 -12 -1 1 -3 -6 8 -3
8191c
$$ Imaginary data points
##PAGE= N=2
##DATA TABLE= (X++(I..I)), XYDATA
0@%%%%%%%%%%%%%%%Qj6J6j6J6j6K4l2L3m1M8n6P1p9Q8j04J20j36J52j71J95k20
37a16K46k75L08l43L83m28M73n23N77o36P04p76Q54r42J039j145J263j392J536
56H07j703J892k109K362k659L019l462M021m755N769p268R735j4724M1319r8139
71f5895l4190J27352m1501K563J12887m8529j64552N9548J04161o1215l277J00848
83H8200p6498j12475R1366O4763r4761K8067J04429q5833r9205Q9506L2866p1653
95d1228O4212P6011j23695p4795J04050K2384n1066P8248K5597j50377l1454J34960
107C2847J2470n4474N6515j3018j28342L0215J32441k9720o2314N5721k0892r5116
119h3667O2631R6218p0246m1475P9032k7201r0432O2655P0333o5818o201O9206
$$ plain form
0 0 0 0 0 0 0 0 0 0 0 0 0 0 0 0 0 8 -8 8 -8 8 -8 16 -16 17 -24 24 -32 39 -40 48 -56 64 -72 80 -91 104 -116
37 -116 130 -145 163 -180 203 -225 248 -275 302 -334 370 -406 448 -494 545 -600 663 -729 807
56 807 -896 996 -1113 1249 -1410 1609 -1853 2168 -2587 3182 -4086 5649 -9075 32244 -65895
71 -65895 -100085 27267 -14234 -11671 101216 52687 -111865 -52317 51844 -9371 -12648 88200
83 88200 11702 -100773 -9407 55356 -39405 -11338 93091 7258 -91947 -2441 30425 -41228
95 -41228 22984 98995 -24700 -99495 4555 26939 -24127 54121 79718 -70659 -102113 32847
107 32847 45317 -9157 47358 34340 -94002 -63787 68654 38934 -23380 32341 11449 -83667
119 -83667 -21036 75182 4936 -36539 42493 15292 -75140 -12485 57848 -7970 -14171 55035
131E5035o2630p9321Q6911O3186o5528L17M0992p8262l8733J12870L5615q5704
143a5252J860L4150o4643k291J04421q065q8495K5463L5483n9312J1807Q2739
155E7865l5573o7926M9760K2548o5771K0816P0074m3437m4058N4343l897o5136
167e0392M2348O5018n2349l5076M5823j8899m3297O4016M3204p2784k5653N0642
179A2601j6179k4573O0065R374p5942L800N7275k5993k3287N0038o215n7675K7389
192i322M1894m4291j3944N3818j1230m6617K9408K1894m3203P061M9372k5949
204H891l9111L2776J1405l4779K0657L4978l9884k7368M0290O829l0031K0061
216D714J9117l8469q915L9089m348k5341K0191P356l1727P942L2200j9311k1889
$$ plain form
131 55035 -7595 -86916 -5 63181 -2347 -2030 38962 -39300 -78033 34837 70452 -15252
143 -15252 -13392 20758 -43885 -46176 58245 50180 -38315 -12852 22631 -36681 -24874 57865
155 57865 22292 -45634 4126 26674 -39097 -18281 51793 8356 -35702 18641 14744 -50392
167 -50392 -8044 56974 4625 -30451 15372 -3527 -46824 17192 60396 -12388 -38041 12601
179 12601 -3578 -28151 31914 41288 -34654 -30854 26421 428 -22859 27179 20964 -36711 -9322
192 -9322 32572 -11719 -25663 28155 16925 -29692 -284 21610 -21593 -14532 34840 8891
204 8891 -30220 2556 13961 -20818 -161 34817 -5067 -32435 7855 14684 -15347 4714
216 4714 23831 -14638 -23553 15536 11188 -14153 6038 13394 -18333 -10391 21809 2498 -19391
229a9391K6730O808k7905P517K1328j8682r675K4730k091k3087J1029J3263j6985
242f411R23K0168j3234j9038J9425J2063j9770r71J6661r373j1357J4790M016
255G892j4293M401R691j1516l452J4691l150j3079R240Q345j3472k788J4275j950
269D835j1210N049N438o444J078O067o111m012Q379O29p825L470N438p194k815
284e228R110R70q099L05M560j604k40K840k878l268L768K122k951O36J821l828
300a964j426N675J846n190k318K612J745O22Q4k502k106K078K851p0j528j736
316a327j272J676L635M33l779k956J506L883J553k433l122l91K044K501Q85k427
332D09l464M10L827J885j609k606j776J043L961J742l463l529Q44K724J873L20
$$ plain form
229 -19391 7339 14147 -13758 -6241 15087 -3595 -13270 11460 9369 -13718 -2689 10574 -6411
242 -6411 -5488 14680 1446 -17592 1833 13896 -5874 -6845 9816 443 -10914 3876 7892
255 7892 -6401 -2000 7691 -3825 -7277 7414 4264 -8815 425 8770 -4702 -7490 6785 4835
269 4835 -6375 -1326 4112 -2332 -1254 4813 -1298 -5310 3069 3698 -4127 -657 4781 -2413 -5228
284 -5228 3882 4852 -3247 -2942 1618 14 -226 2614 -264 -3532 236 2358 -593 43 1864 -1964
300 -1964 -3390 2285 4131 -1059 -3377 -765 980 1602 1686 -816 -2922 -844 2007 1937 409 -1327
316 -1327 -2599 -923 2712 3145 -634 -3590 -2084 1799 3352 919 -2203 -2594 -550 1951 2836 409
332 409 -3055 -2645 1182 3067 1458 -1148 -2924 -1881 2080 3822 359 -3170 -2326 398 2271 2591
348B591k689l542J101M571J447k613k683j011J424L726J492l612l796Q90L487
363G83K161n26l165k933J343M397J817k691l801r69K934L820K88l714l380O91
379b945M000K889j694m176j715K161L359J839j996m852j386M864M139k006l974
394a493j604P05L340L418k199n312m27L442J798J069k80n082l099N934N435l663
410A982m381N68J99Q55M276k63n939n88M111k14l00K742l324n387N329O550n568
427F48n212M293J519k456L553J075p486o85P718K0l654K878k218p564N869J0738
443I036o015q751M793K038n062N035O136q068m829P128n05n093P007L289j0328
458d189k89R611n085p329J0287N101j1162j362P366n240k832J1585M28j2235J774
$$ plain form
348 2591 -98 -3640 -2539 2032 3479 866 -1817 -2828 -1404 2322 3814 202 -3594 -2704 783
363 783 2944 2418 -747 -3680 -2337 2060 3877 1186 -2615 -3584 -650 3170 3458 -256 -3636 -2945
379 -2945 1055 3944 2250 -1926 -3641 -1480 1879 3718 1722 -3130 -4516 348 4487 2481 -1493
394 -1493 -3097 -2392 948 4366 2167 -3145 -3572 -130 1668 2737 2457 -2625 -5724 210 5645 1982
410 1982 -2399 -1831 -1632 -777 3499 3236 -2703 -3291 820 606 306 3048 -276 -5663 -334 6216 648
427 648 -4564 -271 1248 -1208 2345 3420 -4066 -4751 2967 2987 -667 2211 -7 -7571 -1702 9036
443 9036 3021 -5730 -937 1101 -3961 1074 7210 -858 -5687 1441 936 -4157 2850 6139 -4189
458 -4189 -4478 5133 48 -7281 3006 8107 -3055 -4417 2949 -2291 -5123 6462 6890 -5345 -3571
473c571O107p006J531J3553n090j4953N250P954p101K424J1695q140j3083P597
487b833O051o644N758R109j2901j0516J1426M147p373Q287P493j6381r249J3617
501iM254n685Q486K488j8585m506J6335K517n433Q351j778j9484P67J8627j10
516F235o363P964m191j8648M820J8780k292n592P378q000j7881J0070J9571m871
530F980n888N818j1323j5243J6273J9259r009o953M474j3099j0698K1914J6527
543A9032j4003o975L861j4178n366K6696J1878j9164o034L663j4291J122K9881
556A6122M677k3878l431M066j3381P597L0174m156k6403J172M335j2430J3360
569b176K8110j3073k6362O233L825j0817J8268K3620k0848k3501J0597J870q200
$$ plain form
473 -3571 2536 -4470 -2939 10614 5524 -9429 -4179 3775 -3326 -902 10793 2653 -10430 -2833
487 -2833 3218 -3426 2332 11441 -1460 -11976 -550 3597 -3776 4511 12004 -4377 -13626 -9
501 -9 4245 -1440 7046 9534 -9051 -13557 2778 5295 -138 8213 6435 -13049 -12282 6345 6235
516 6235 -128 7836 3645 -15003 -10183 8597 6305 713 8091 91 -17790 -7720 11851 6980
530 6980 1092 6910 -4413 -19656 -3383 15876 6867 -86 4388 -8711 -19409 2505 19032
543 19032 5029 -1946 1915 -12263 -17629 9067 20945 1781 -4253 -590 -14881 -13759 16122
556 16122 20799 -3079 -6510 -2444 -15825 -8228 21946 17790 -8613 -7441 -3106 -15536 -2176
569 -2176 25934 12861 -13501 -7268 -3443 -14260 4008 27628 6780 -16721 -6124 -4254 -12454
582a2454K3060J7455k8158j9564J4447P27m114K5831Q843l4060j4182J8082J189
595b898P84K4479k977l6805m259K2441n91K054K0899j2027l4915N947K4028l891
609B269J885J6682j7163k9051J3270K0575o861M982J3531k3175k4313K0158J8255
622A1044r007O541R291k7506j8647K5935J6493j0070N406K201k8934q087L1513
635F173J0414j4064M967j438k7444J571L3909K673j8173N434j754k3197Q148L0677
649A7896m976j7186Q291m235k1204J4362K7907j1697j5609J0790o841j8994J9852
662a644K4723j7249j3916J1312q907j3426K4894J7354k3401r138J3437j1404q979
675a6344K8072R488k7501l230J4764j3559m519K8736J294k8178L371J3402j5634
$$ plain form
582 -12454 10606 28061 -97 -19661 -5214 -4487 -8601 17230 26073 -7987 -22169 -4087 -2898
595 -2898 -2114 22365 19388 -17417 -21676 765 174 2228 23127 11100 -23815 -17868 6160 2269
609 2269 4154 20836 3673 -25378 -12108 8467 1606 6588 20119 -3056 -27369 -7211 11044
622 11044 2037 8578 17869 -9637 -28284 -2349 14144 4074 9480 11681 -17253 -25340 6173
635 6173 16587 2523 7490 6052 -21392 -19821 14088 16761 -1412 4022 2268 -20929 -12781 17896
649 17896 12920 -4266 4025 -210 -21414 -7052 20855 9158 -6451 4339 -2502 -21496 -1644
662 -1644 23079 5830 -8086 3226 -5681 -19107 5787 23141 -260 -9398 4039 -7365 -16344
675 -16344 11728 21216 -6285 -9515 5249 -8310 -12829 15907 17201 -10977 -7606 5796 -9838
688i838J458K7823p834k6870J0511J1410j6990O353K4387j5327k2325J6469P557
701F784j7393J0548J9296k0369j5254K0145J653j6792J4695J4178k3103q487K0634
714F535l855j3645J8104Q058k4626k318J9608p360r068J8841N82k4131M617J8490
728I832j0087n995J6699n300j9762J1373J4799j3964l556J5340p670j4218J4253
741A744Q353j6185J084J5171r790j1199J4211L634j4486N905J2409j3244q304
754a0697J5227J333j2391P442P648j4506k782J6278k272j2238P797N048j2459
767f572K067J3944p286j1011J0193M437j0849L439R434r919o173J2966J481j1858
781e707L919P418q865j632J1837l548j1368O968P180q562o03Q446n922o763J0208
$$ plain form
688 -9838 -8380 19443 11609 -15261 -4750 6660 -10330 -3977 20410 5083 -17242 -773 6784
701 6784 -10609 -61 19235 -1134 -16388 3757 5410 -11382 3313 17491 -5612 -14099 6535
714 6535 2680 -10965 7139 15197 -9429 -11747 7861 501 -8567 10274 10856 -13275 -8658 9832
728 9832 -255 -6250 10449 5149 -14613 -3240 11559 -2405 -5961 9379 1709 -12509 1744
741 1744 10097 -6088 -5004 10167 377 -10822 3389 7023 -7463 -1558 10851 -2393 -10697
754 -10697 4530 5863 -6528 914 8562 -5944 -8726 7552 5280 -6958 839 5887 -6572
767 -6572 -4505 9439 2153 -8858 1335 5772 -5077 -1638 7796 -2123 -8296 4670 6151 -5707
781 -5707 -1788 5630 -3235 -4867 6970 3422 -7946 -978 6202 -2360 -2963 5483 -439 -7202 3006
796C006L615j0970N71Q254n039l378Q789j625j0457M915Q746o025l544N999l219
811c62n713Q226M923r287k451O771j974k996O668rq947J733P634l001l534M191
827A872j254m887M757M504o035k767N122%k921L230M83n656R12O103j157l978
843a672J231J38k027L226L194m202l483K837J861p90J167k60l692K8M152N87k573
860b78m92J41n01J647J754k030k353J232J834n0l79o23j259L35K100O05j677j284
878a278L14J035R68R0j226j326L50J699Q63r70j377k04P67R10N17p42j544p9J674
897D41Q15q71q60k83P4J108J036j119j713M54J404K84k13m84j159RJ889P08j513
916Gj016L52M78P68O63j137j602O27J657K18o97o43o87L32J538M38j358j032L49
$$ plain form
796 3006 6621 -4349 -3778 4476 -563 -3941 4848 3223 -7234 -2319 6427 402 -3142 2857 -362
811 -362 -6075 2151 7074 -2213 -4664 2107 133 -2863 3805 3796 -5151 -3418 4216 1215 -2319 1872
827 1872 618 -4269 488 4992 -1043 -3810 1312 1312 -1609 1621 2104 -3552 -2640 3463 2306 -1672
843 -1672 -441 -303 -2330 896 4090 -112 -3595 -758 1103 313 1480 1220 -2472 -2444 1708 2295 -278
860 -278 -770 -629 -1130 517 2271 241 -2112 -880 954 904 525 -98 -1357 -1022 1078 1683 6 -1278
878 -1278 -964 71 1039 1129 -97 -1423 -1073 626 1489 519 -858 -1062 -295 615 1132 390 -1154 -1233 441
897 441 1256 385 -475 -758 -684 424 1460 341 -1372 -918 486 770 557 73 -1086 -1077 812 1520 7
916 7 -1009 -657 -179 589 1252 115 -1487 -860 797 1015 318 -325 -1012 -680 858 1296 -62 -1094 -745
935g45Q65Q17mj239r71N96J265N44n71j271n83J032J225m0p57q77n35J038J675
954A464m97j752j61O98K40R40L25k066j050K111J130j210j32k0j575Q29K985r17
972A342l035P44J443j023R24J815k706k298L078J538k418O02J537l041p11M324
988B115l18l987J787K393l245j91L914k090l473L973J952m699L79L930l228k078
1004b866N725Q0o467J708M699l732j161N845k253o576M118M578m959m4N625m571
1020b51n620O840L488o763J136N708o035m311Q364J689p479K823M927p486k233
1035e203R454r82p722N302M019r293l69J0234l240p104P377K126j0811K075J0521
1050F384n215n428Q627j554j1618O360J0851q103m411R034m686j0269J0909R195
$$ plain form
935 -745 120 937 933 -306 -1277 -681 584 1128 557 -714 -1297 -265 960 920 163 -714 -1249 -211 1464
954 1464 967 -785 -946 -248 -8 932 1257 -809 -1859 252 1382 172 40 20 -1555 -726 2259 1342
972 1342 -1693 -949 494 -529 395 2210 -496 -2794 284 1822 -596 6 1543 -1498 -2209 2115
988 2115 1797 -2190 -403 1990 -1255 -1446 2468 378 -3095 878 2830 -1869 -1490 2440 -788 -2866
1004 -2866 2859 2939 -3528 -1820 2879 -853 -2014 3831 1578 -4998 -880 3698 -1261 -1305 4320 -251
1020 -251 -5871 969 4457 -2306 -1170 4538 -1497 -5808 2556 4245 -3234 -411 4516 -2970 -5203
1035 -5203 4251 3269 -4453 849 4868 -4425 -4794 5440 2200 -4904 2473 4599 -6212 -4137 6384
1050 6384 1169 -4259 4368 2814 -8804 -2444 8407 304 -4107 4927 241 -10028 881 10076
1064A0076j1675k850R373o892p293J4104M748j4570R91R977r435m719J5584J84
1078G603j4944N460Q632j2437j581J6589l638j3574Q578M805j4336L717J7305
1091A2179q141j2636J0304J259j3332R608J5354j3836j0901J2515r60j0936J3378
1104C855J0365j8348o307J4987l841r230J5251N180j9782m62J5055q031o811J7285
1118I166O16j9808M230J2877j1150k237J8609n002j9650Q237J0686j1908K663
1131b671J6986j1437j7584J2927Q722j2110N735J3076j6114j2590J7156N161j2833
1144e576P899R460j8062o890J8768L82j2551J0552O421j9058k337J8352l522j0090
1158f252J2879J865k0181K507J8248o340p704J3135l261j9319Q460J7492r751
$$ plain form
1064 10076 -1599 -4449 4924 -1968 -9261 4843 9591 -4979 -3988 5989 -3446 -8165 7419 7603
1078 7603 -7341 -1881 6751 -5686 -7267 9322 5684 -7890 688 5493 -8843 -5126 12179
1091 12179 4038 -8598 1706 2965 -10367 -759 14595 759 -10142 2373 1413 -9523 3855
1104 3855 14220 -4128 -10435 4552 711 -8519 6732 11912 -7870 -8332 6723 -1308 -8119 9166
1118 9166 9782 -10026 -5796 7081 -4069 -6306 12303 7301 -12349 -4112 6574 -5334 -2671
1131 -2671 14315 2878 -14706 -1779 6943 -5167 568 13644 -2470 -15060 2096 7257 -5576
1144 -5576 2323 11783 -6279 -13169 5599 5981 -6570 3982 10403 -8655 -10992 7360 3838 -6252
1158 -6252 6627 8492 -11689 -9182 9066 2726 -4978 8157 4896 -14423 -5963 11529 1778
1171A778o287J2198o869j5496J3869J3620j4052l614J2567r229j1869J6773Q468
1184A1857j6522O14J2668j1849r017J8071L970j6152M992J0080j5320m582K0116
1197H926n00j5891P981O661j6756J199K0677n832j5405J0110L862j5213O612J7372
1211A3803j1880j2227J3493J068j4169R879J2935j5477p099J5713k730j3241J1832
1224A900Q863j5793j644J4393p536j0190J4687M693j6178K454J2143j0526n861
1237h595J6226j51j6086N780J0007j1138j573J4558n496j3442R955P246j2159
1250d868J367J2156q744r183J2694L272j2989L872J0143r667m929J2462j470j1754
1264g638P182P935j0625j943J1168m564r011R462M741j1307P54R975o065o277
$$ plain form
1171 1778 -4509 7689 820 -14676 -807 12813 -1239 -4853 7714 -1515 -13384 3389 11857
1184 11857 -4665 -4051 8617 -3232 -12249 5822 9792 -6360 -1368 8712 -6608 -11190 8926
1197 8926 8426 -7465 516 7177 -9579 -8380 12297 6465 -8940 1170 5032 -10181 -3569 13803
1211 13803 1923 -10304 3189 4257 -9912 -33 12902 -2575 -9674 6039 3309 -9932 1900
1224 1900 10763 -5030 -6674 7719 183 -10007 4680 9373 -6805 -4351 7792 -2734 -8595
1237 -8595 7631 7480 -8606 -2826 7181 -3957 -5530 9028 3532 -9910 45 7291 -4868
1250 -4868 -3501 8655 -89 -9272 3422 6694 -6295 -2423 7720 -1947 -6876 5586 4116 -7638
1264 -7638 -456 7479 -3146 -5089 6079 1515 -7496 1966 6707 -4600 -3846 6129 64 -6213
1278f213R545J253j0263L930Q297p794m352R206p98q091N959N404r354j997R475
1293D207j975o457O175K278r253J284R197l860n610O122L82p786L857P391o006
1308e4m051O697r21o570N028N054o845j562O789k847n715N973L445o569M02N462
1324C716m788l941P263K008o529J207L752n208j197P629l86o600K109K825m545
1339b685R82O379k969n632L599K230m140J716M484l991l462M354P17l884K388
1354H6L134m096j567M040r95l219L422K262m194q29L195j484j637L639O54m130
1370a719J34K560j543k76L221j092l759J357K430j560j05K161j574k428J865J550
1386A222j453K13J208j718j024K092M33j653O24J090j492o50J624J30j144N40
$$ plain form
1278 -6213 3332 4585 -5678 -1748 6549 -1245 -5597 3609 2811 -5280 679 6083 -3271 -5268 4207
1293 4207 2232 -4225 1950 4228 -5025 -3741 5456 1596 -4014 2108 2490 -5296 -1439 5952 -54
1308 -54 -4105 2592 1671 -4899 129 5183 -1662 -3224 3565 718 -4997 976 4421 -2148 -1746 3716
1324 3716 -1072 -5013 2250 4258 -2271 -1064 2688 -2520 -3717 3912 3526 -3074 -965 1860 -2685
1339 -2685 -1703 4676 1707 -3925 -326 1904 -2236 -520 3964 -27 -3489 865 1582 -2302 86
1354 86 3220 -876 -2443 1597 602 -2617 805 3067 -1127 -1956 1239 -245 -1882 1757 2411 -1719
1370 -1719 -1585 975 -568 -844 2377 1285 -2474 -1117 1313 -247 -352 1809 235 -2193 -328 1222
1386 1222 -231 -18 1190 -528 -1552 540 973 -680 -56 1034 -458 -1108 516 646 -498 42
1402D2N86r62j87Q38k69l80Q16J8j072P8Q18k14k79N84n9q65n8O64K90o9j79m51
1424c10k06M66M44r5k57j98k08J19M96K25l44n13m8N01L66k63l68j2P4J46L09
1445C24l9n11j94M05K92j2j06m04l07N52O50l72o04Q1J33K9M53J40p86l69O42
1466cL84k14k8j96m96L62Q21k73p44J01K81q9L05K69o78m42O73M18l84j02J9l56
1488c72J63P39j44p66M3M27n9J00K30m66m42N41M53l48k19J25j46J0M54m9n72
1509b98J7M38J6j61Qj36j25L52K78l35l66Q5K80J62K0k39l38R4M14K10k70l52
1531b46l7K52K43J8j77l18j07M80M53l54o26K3M01K67J88k46p30j01Q20M03l93
1552B13j99k30m54N10J072l65j164J20O66j00J03L15p65m79J037M53r58j45N05
$$ plain form
1402 42 628 -334 -521 317 48 -332 484 502 -570 -492 326 112 -167 417 358 -507 -565 99 389 320 141 -310
1424 -310 -516 -50 394 299 42 -156 -364 -245 251 476 132 -381 -429 72 438 175 -193 -205 -131 15 324
1445 324 285 -226 -420 -15 277 265 159 -245 -552 0 650 278 -326 -245 -112 -83 370 510 -276 -645 -3
1466 -3 381 167 139 -57 -553 -191 630 357 -387 -286 -5 -94 211 480 -198 -640 33 451 67 -35 -16 -372
1488 -372 -209 530 386 -380 -337 90 31 131 361 -105 -547 -6 447 99 -120 5 -141 -131 323 274 -298
1509 -298 -281 157 173 12 20 -116 -241 111 389 54 -312 -227 53 215 235 -4 -342 -248 166 376 106 -246
1531 -246 -283 -31 212 230 53 -265 -372 108 561 207 -419 -396 5 272 460 214 -516 -617 203 606 213
1552 213 14 -216 -670 -160 912 547 -617 -497 169 69 172 487 -278 -757 280 733 -225 -370 135
1571A35m68J22J297n49j870M63J656k08m60L60j056r87J757J479j368q34N31q14
1589h14k14K310M20k559l50J695n18n58J588k26j996Q70J511j604o13J975k75
1606F42j528J383N05k633K37L171m33k166P71j0j842J755K907j959k474J264J46
1623b64j107K492J707l463j795K612K65j383K143Q20l424m56K831p82j459K598
1639A335M90l334K39K353j665p35L452j05l923L20K257j345K97L248j613m195
1655b924J362K669j272N17K385k779l497K853K621k034K73K002k972k431L564
1670C37J699k720P90K069l295j880L843R07k760J669J627m169j233M510M14k715
1686i07J999O16m684K65N290o94l107K199r3m355K004N087k487l108L011m39l939
$$ plain form
1571 135 -333 -211 1086 537 -1333 -870 786 578 118 478 -578 -1565 192 1671 303 -531 0 -814
1589 -814 -1028 1282 1702 -857 -1207 488 -30 -588 1000 774 -1222 -352 1159 -445 -1058 917 642
1606 642 -886 497 1002 -1631 -1394 1777 1344 -822 -51 -61 -1903 -148 2759 800 -1674 -410 -264
1623 -264 -1371 1121 2828 -635 -2430 182 447 -936 1207 2027 -1397 -1853 978 196 -1263 1335
1639 1335 1825 -1509 -1270 1083 -582 -1317 2135 2030 -1893 -1573 684 -661 -364 2884 1271 -2924
1655 -2924 -1562 1107 -165 352 2737 -42 -3539 -686 1935 -99 174 2176 -796 -3227 337
1670 337 2036 -684 106 2175 -1120 -3000 843 1750 -1010 659 2286 -1883 -3116 1394 1808 -907
1686 -907 1092 1708 -2976 -2711 2579 1885 -1222 977 884 -3471 -1467 3620 1133 -1975 1036 597 -3342
1703c342L079M012l905k049L908j289l790L854K974m554n93M025k687l211M936
1718A368J937n011M72L557l584j829N624K69n325J678L092m010l99N533j727n023
1734c378L280K609m472M84M846k993l770M439J355m849J517M112l800k215M967
1749B132l59m887K803L503m434j089M942j590m220L671K269m657L68M548k819
1764A81l285M250R29m547J875L968l947k584M534K30l855K576K691m531j328M628
1780A785n83l178L053J347m832O9M717j486k829L344N25m714R97M304k029k040
1796a550L352o34m410K117L841k602j250L285j871m055L363L598l193r19K768
1811A840k606k875M427K533l879k95K372l050j516N067R82m414O63K251l345n69
$$ plain form
1703 -3342 -263 3749 -156 -2205 1703 414 -3376 478 3452 -1102 -1695 2330 -357 -3568 1368
1718 1368 3305 -1706 -1234 2323 -1261 -3090 2534 2803 -2522 -844 2248 -1762 -2161 3372 1645 -3378
1734 -3378 -98 2511 -1961 -1477 3369 376 -3394 1045 2400 -2449 -932 3180 -620 -2835 2132
1749 2132 1773 -3114 -311 3192 -1242 -2331 2611 1021 -3199 472 2741 -1916 -1548 3000 181
1764 181 -3104 1146 2075 -2472 -597 3371 -576 -3160 1374 1604 -2251 325 3016 -1515 -2843 1785
1780 1785 1202 -1976 1077 2424 -2408 -2339 2378 892 -1937 1407 1932 -2782 -1785 2519 490 -1550
1796 -1550 1802 1168 -3242 -1125 2716 114 -1136 2149 278 -3777 -414 3184 -9 -928 1840
1811 1840 -766 -3641 786 3319 -560 -855 1517 -1533 -3049 2018 3000 -1414 -751 1500 -1845 -2414
1827b414N049k87m163J570J555l686N94M950j417l709K186N45l697K018M737k620
1843A211l399K396j21k928L247L729l905k777K770m77j998L807K126m704j537
1858b560L175q91j391L774O83m657j43L037j543p82L681l94m200Q56K409j966
1874i12J25L507j402l753J480J784j833R98K867k425l111K078J419j531J376J810
1890B477l043k080K641R66j452J379R09l008r59K744L25j363J325L76k684j59
1906a606K461k42j073J409q2k447L33K195m40p85J200n24k058Q35J929o33o40
1923a68Q82q03j463J297J519j044n66Q83p11j027J314R78j156k40Q32p47p47J208
1941B41N37r81K06O01j110n20J453M47r99Q3K71r28K7J441L4j097RK09m61N19
$$ plain form
1827 -2414 2635 2348 -1815 -245 1310 -2376 -1782 3168 1751 -1958 228 773 -2924 -906 3831 1211
1843 1211 -2188 208 87 -2841 406 4135 230 -2547 223 -254 -2252 1555 3681 -1023 -2560
1858 -2560 615 -276 -1667 2107 2790 -1867 -2010 1027 -516 -1298 2383 1989 -2211 -1355 1054 -912
1874 -912 -787 2720 1318 -2435 -955 829 -1004 -6 2861 436 -2675 -597 822 -709 667 2477
1890 2477 -566 -2646 -5 961 -491 888 1797 -1211 -2170 574 899 -464 861 1237 -1447 -1606
1906 -1606 855 613 -460 949 867 -1580 -1247 948 508 -277 923 399 -1659 -824 1105 472 -168
1923 -168 714 -89 -1552 -255 1264 220 -346 537 -174 -1201 113 1091 -65 -305 527 -220 -967 241
1941 241 778 -203 3 604 -506 -1026 427 874 -125 -42 229 -699 -672 769 803 -294 -285 -76 -537 -18
1961a8R51p02r91N55M98m52J86M31o38l90P88K16o54k0L22j48J18M07m97o22M90
1982a70O67k06l14k6l03k8O76L68n70n43M8L35L80J91m16n90O4N74L14k35l51
2003a35k13P0L94L34j99n77j99M90M57r8l69l08n2M47M78k11o12j39L13K64K28
2024C63l0o17l38N61N87k35l90j33j13K45N96q2p19j45M30J84Q3N1m72l88N11
2045e1N82k88m17j6l2J35M93l9o79j43M75K03m6pl25l13M05N05k30m01J4L5R3
2068d7L53l1n08j28M11J64j07n9j69j44K77L21k06l03J6J26J35J42j53l12NK65
2090D8J48l0j66k17K5L04J29j92j37o7L3K66J00l19j56K18P3l1J15j48l28K25
2112a07M38j85l05J04n3q7M49J32o21j40N14m6k07L74o7o30K30O39l38l68M25
$$ plain form
1961 -18 933 231 -760 -205 293 -159 27 458 -180 -570 218 434 -220 -240 82 -66 52 459 -38 -660 -170
1982 -170 497 291 -23 -49 -352 -380 296 664 94 -449 -401 -66 314 505 89 -501 -437 137 451 216 -135
2003 -135 -348 -278 116 450 251 -326 -525 -35 422 324 -45 -353 -405 42 520 309 -303 -442 -129 135 363
2024 363 333 -284 -622 -61 526 291 -99 -232 -345 -100 496 414 -305 -450 -20 164 247 298 -174 -562 -51
2045 -51 531 243 -174 -190 -222 -87 406 367 -312 -455 20 223 177 170 -155 -468 -63 442 212 -189 -175 -140 -47
2068 -47 306 275 -233 -361 50 214 107 48 -121 -265 12 333 127 -176 -160 -34 101 243 90 -222 -217 48
2090 48 196 166 0 -217 -192 112 241 49 -88 -155 -122 144 244 -75 -231 -13 60 29 144 -4 -332 -107
2112 -107 331 146 -159 -55 -108 -195 254 386 -235 -375 139 93 -114 260 193 -437 -207 432 94 -274 151
2133A51n9m45M65L37p67q0Q34j98o40M96K16q13K71R41n49p53O33J64o36N35O54
2154G57j033m68J083kq57O77N16j151j71J224l02q83Q34L66j161J81J076p28o36
2173f78J220N5j386M65J109r57m62J336k33j420P90R76j133j56J321o83j236J247
2191A75O61j455K22J450j099j101J554L96j589O06J277j493p24J852q4j613J058
2208I3R70j866j55K117p19j656J508P30k032L97J978j382j327K039K67k142Q93
2225b87J639j880o90K402m21k240J444J376k152p0K368j195j954K089Q67k455
2241a159N08K248j730j389K457P0k610J283K110k210q85K496p79k271K205J615
2257A959k786l82K420j298j576K774O35l198M23K393j723r67K875l40l071J345
$$ plain form
2133 151 92 -353 112 449 -318 -398 436 238 -402 94 310 -503 -232 709 160 -593 40 204 -432 103 757
2154 757 -276 -744 339 337 -520 157 673 -478 -649 575 273 -610 224 590 -571 -390 686 -42 -678
2173 -678 542 597 -789 -324 785 -172 -634 702 469 -951 -161 815 -318 -474 847 164 -1072 175
2191 175 836 -619 -397 1053 -46 -1147 407 803 -786 -180 1097 -396 -1120 732 648 -965 93
2208 93 1063 -803 -958 1159 440 -1216 292 1022 -1010 -613 1365 -17 -1344 695 962 -1180 -287
2225 -287 1352 -528 -1218 1184 763 -1477 -33 1343 -809 -879 1489 294 -1660 429 1296 -1159
2241 -1159 -651 1597 -133 -1522 935 1005 -1605 -322 1788 -422 -1307 1189 410 -1861 344 1959
2257 1959 -827 -1209 1211 -87 -1663 1111 1746 -1452 -1029 1364 -359 -1326 1549 1209 -1862 -517
2273e17K035k268l59K910j016k661J860J279k503N60K881j783k392K090P03k145
2289a326J485K263k719j930K492M45j690J827J209l303r51L009K0j665J821M62
2305A449l184Q5K962p73j467K096k8l043P35K519j321p50K429q33l209J237K442
2322A346j273j23J991j980k872K281K463j503m4J191k658j783L481J868k349j17
2338h1R99k510o82L692O75k738N19R69k532j7L466l03k362J350L75l036O39L632
2356B055o97j979J293o67k835J979L657j488k023R57j235j726L324K768k874j901
2372a392J302j030p00L535J178l534q81J669j107j67L190p0l234K87J381j672
2388a245L69L145p12k866O53O90j598J353K936j583k728Q05L60q69K145K011k643
$$ plain form
2273 -517 1518 -750 -1109 1801 785 -1876 -16 1263 -1240 -680 2201 418 -1974 116 819 -1326
2289 -1326 159 2422 -297 -2227 265 710 -980 847 2056 -1247 -2198 811 831 -834 987 1449
2305 1449 -1735 -1650 1312 539 -928 1168 1140 -1903 -1168 1351 30 -720 1709 876 -2333 -1096 1346
2322 1346 73 -50 1941 -39 -2911 -630 1833 330 286 1477 -1181 -2964 517 2385 36 -81
2338 -81 918 -1592 -2274 1418 2093 -645 -126 843 -1689 -1706 1760 1457 -905 445 820 -2216 -1577 2055
2356 2055 1358 -621 672 5 -2830 -851 2806 1318 -705 252 -983 -2709 615 3383 509 -1392
2372 -1392 -90 -1120 -1820 1715 2893 -641 -1522 147 -960 -1127 2063 1993 -1241 -954 427 -1245
2388 -1245 -876 2269 1557 -1309 -656 34 -1564 -211 2725 1142 -1586 -781 -421 -1290 855 2866 223
2405B23k319J348N35l60K055P42k999j306J820L78k80J641m5k649l66J756r9j75
2423a00J539m18k312L7J430j95K19J334q96k175L77J410l3L73P87j418j750J000
2441g91J443j82J34K59j466r99J391J077n32M0J53j258m94J377N97o14K29N7j222
2460h01k46J312M18m88K50k31j246J28J454K51n94N0m54r16O57J376k12p97N7
2479c2k85n08Q39R25o32o25K99j76l59P38M95o96k12L99l74l44P35L78n71o9J81
2500A06n17p8Q50J96n77j00Ml54L28P64k19o63M9Q8j23M02L92m75m41K36J44n6
2522d4K47N8m17m5K94o1j40K27Ok37Q2J23j79k9K32J9j47Ro4j06K00J92j66j44
2546i0L6l7K1K00K7k05o5M8J2J22Q5j70j22J21N9p5Q7M0j51l2J54Lr3O8k3j07
$$ plain form
2405 223 -2096 -748 -213 -573 1482 2224 -775 -2081 -261 117 -163 1478 1433 -1216 -1582 174 75 -100
2423 -100 1439 1021 -1291 -1254 176 -19 200 1534 638 -1537 -1160 250 217 590 1377 -41 -1791 -791
2441 -791 652 470 604 863 -603 -1602 -211 866 334 374 527 -731 -1225 152 749 135 364 421 -801
2460 -801 -1047 265 683 195 445 214 -1032 -904 550 801 207 257 -197 -1113 -456 920 708 -89 -32
2479 -32 -317 -825 14 939 307 -318 -19 -195 -554 184 679 -17 -229 170 -204 -548 187 565 -6 -75 106
2500 106 -411 -489 361 557 -20 -120 -116 -470 -142 622 403 -260 -211 -123 -246 156 548 73 -368 -132 12 -44
2522 -44 203 261 -156 -201 93 32 -108 119 125 -112 -30 93 -86 -115 117 136 -11 -2 -66 -172 28 220 54 -90
2546 -90 -54 -91 -70 130 157 -48 -113 -65 -53 69 154 -16 -138 -17 42 -33 54 94 -57 -89 65 68 -25 43 20 -87
2572h7R0J35j52q3J71l4j17J08R8j86l5J47k3q0J04Jj80P6J71j18q2J30l8j26
2596a10J08J42j68q9J54jr9J15M2j90NJ96o9j15J25lj42P0J83j33j37J42K6j05
2620e3R0P0j62n8J93Qj22M0N1j50M1J81o3j62N7P1p0L5J27j39j26J55O6j02MP0
2646E2j12l7J72kj44K3R5o1j4J01p0j14J05J16r8n4N5l7l2J39K1j80j5J25J5l5
2672A4N5n2j19O0J43k6j04J3jk6Q5N9j34p1R1P1m4kk2o6K7J30Kj08l2L2K5N9L5
2701I4j24r3Q1J36Oq7o1l1L7J31L3j06j27JJ18J10rr9j33J4J42J23q6j19l8L4
2727e3P6Q3k2j59m8J34R3q6n5nj2R1J07j28j84N6J74K4J5m6k23r0L03K27j52j75
2753e5o7p4J15L32J5l30j02Q4J5J20K02j54k74R3J38j00L6J59r5j38J06l5j82
$$ plain form
2572 -87 3 138 -14 -97 74 40 -77 31 129 -57 -92 55 32 -48 56 57 -123 -47 124 6 -76 54 16 -110
2596 -110 -2 140 -28 -117 37 36 -63 52 94 -96 -91 105 36 -79 46 43 -99 -29 154 21 -116 26 52 -53
2620 -53 37 107 -55 -113 80 88 -34 6 57 -93 -52 129 66 -96 -39 32 -38 -3 124 -15 -141 14 80 -22 -18 52
2646 52 -60 -97 75 73 -71 -48 47 -14 -28 73 3 -111 -6 110 12 -42 13 -24 -56 83 104 -76 -91 34 49 14
2672 14 69 17 -102 -42 101 75 -29 -16 -17 -43 42 101 -33 -104 -13 58 14 12 -10 -76 -49 81 83 -25 -57 -25 0 59 94
2701 94 -30 -123 -42 94 100 13 -48 -79 -42 89 122 16 -111 -110 8 118 109 10 -123 -109 33 156 70 -49 -87 -53
2727 -53 23 106 84 -75 -123 11 104 18 -37 -42 -54 37 144 16 -168 -112 62 86 101 55 -168 -258 45 272 120 -55
2753 -55 -122 -196 -81 251 266 -64 -166 -82 -67 53 255 101 -173 -80 58 -42 -6 153 58 -80 26 -9 -191
2776a91J48K87r3j99j8j27m1L67K78k74l39n3K6J77M00N9m67k90R3J74K11K60
2798C88j38m46j58K08J73J42J60j51l94j20K00J68J75J62j85m67j41K72K82K08
2818C38R9l64n55j4M79L40J03q4m82n02K06O29K59o5j87n02l81L99O56J01j74
2839B99j77n51l20N89O91n3k01k43o31j87Q37O71k13l17l56o49J25J090M77m79
2859D02m01m03m81M72J146J36p07l41l28l16P19J027k16p59k11l16j91R28Q77
2878A037m62p29j93l60J0J142O92p09p34k42k98M20J289L10j044p21j34LP45J146
2898A168k25j221n13J14K50Q53P71o33j125k22K74L33Q03M57q16r82j2L58L77
2917IP35K26r35q75J17M51N10O86q4j113p56L50O41N49M72m09j230m94P03P74
$$ plain form
2776 -191 -43 244 151 -48 -66 -193 -234 133 411 137 -202 -255 -229 -52 348 407 -60 -350 -257 -83 128 388
2798 388 250 -196 -354 -146 27 169 329 178 -216 -336 -136 32 207 369 184 -283 -424 -152 130 338
2818 338 437 73 -482 -496 -17 323 426 342 -140 -642 -436 193 452 387 200 -302 -683 -284 372 473 299
2839 299 122 -429 -749 -160 531 478 277 34 -597 -784 53 724 511 194 -162 -811 -686 404 881 402
2859 402 1 -402 -883 -411 735 871 164 -177 -505 -821 -102 925 709 -50 -261 -577 -768 160 1037
2878 1037 575 -154 -347 -707 -697 445 1137 428 -306 -548 -846 -426 863 1173 129 -592 -726 -723 22 1168
2898 1168 943 -278 -791 -677 -427 426 1197 564 -561 -783 -509 -176 627 1084 268 -714 -726 -368 9
2917 9 744 970 35 -840 -723 -272 238 924 840 -273 -1029 -679 -38 511 983 574 -656 -1150 -447 327
2937C27M17J06o70j118r4R70O48J53j40p64r01K87J062M17j19j97p32o93N39J000
2957D98J74k01k38p33m90P44R01l2k61k69p47k78R48P92k65l38l10p00K8J108
2977C31N50n00l68l23n49L81J149J35p12k85j98l45O02R56k33p39q3j21k04O74
2997A18O90m78n76O6j37j33O97M91n69m05R5k24kP77K86o59l07M7j90K32P74p
3019E86p30k09R7m0L69N73l20o72k1K32L7L12K68m34m51K02K11m9K24J30l61k31
3041b77K04O0n3K19J29l03j84J06M4N1K51Pl62j72J70J35J17J03j41l39k9K94
3063C0J46m6o0j30j45J25K27l8j32nL0p7N5Q7q6o4J43K4j68m2J16L7K8N9j27j76
3089a89R7K07qo5l6j30k5K25J42j89j38L9M8O9Q8o0j94J2J71L4p4k2o8l6J50J41
$$ plain form
2937 327 744 850 180 -938 -1032 -62 586 739 599 -165 -1066 -779 283 700 581 384 -348 -1041 -502 498
2957 498 672 471 233 -500 -990 -246 655 623 362 93 -654 -932 16 808 543 205 -105 -805 -777 331
2977 331 881 381 13 -310 -859 -478 671 806 94 -191 -389 -734 -132 824 591 -148 -231 -352 -556 118
2997 118 808 330 -246 -180 -317 -450 247 738 169 -236 -141 -365 -367 410 696 37 -270 -223 -413 -181 593 586
3019 586 -144 -353 -256 -296 73 646 326 -346 -367 -135 -98 214 482 48 -403 -201 10 -39 185 315 -46 -277
3041 -277 -73 -13 -66 153 282 -21 -205 -99 -55 -4 247 254 -108 -280 -110 25 142 245 104 -235 -264 30
3063 30 176 130 70 -60 -205 -80 147 109 -23 -28 2 -75 -20 67 -19 -83 60 84 -84 -126 -10 27 55 114 -13 -189
3089 -189 -92 115 107 42 6 -124 -149 76 218 29 -109 -70 -22 47 135 75 -119 -107 64 98 24 2 -66 -102 48 189
3115A89j63j63N9J03L8J5n9j38LJ77P0j06q1m3K0J31J02j19j85L1J61O2m0p2j00
3140a08jJ59R1j00j27j8Q1Q9O8q2j87OJ84R3r7r1l4NJ09J11q8j67NJ07O0J9n2
3167C5j40j6J67Q2r9q7PkP0R9p4j63J6J47J8k2k8r7j2J50R0j41r4L6M4M0Q2p5
3195C3j47L9J43K0p2k1n1k0J41P0j28j00N4N5K8L1o9j12M9J18K5q9m0k6J9J12
3221F2L7j22q1N4Q0K9j5p4p9N6J35np6p6j4P6J01J5j23p1L4Q6N9j8j00o9P1P9
3249E1J6k9q1m1O8J06l1r0qmN6O8l6j09k2R4M2qkj17p2J50J37q2j06Kn5O1J71
3278A29qj69m6N5oP1J10r7j66Q2J09q2lJ16o8j00R1J1j09P4J25q8o6P9r5r0J94
3305E3J72j85j33N6l8j3K44N5k36j07O0l2R1K41p4k98k0J36k5R1J87j26k90J2
$$ plain form
3115 189 26 -137 -78 25 63 78 19 -119 -116 61 131 25 -56 -99 -79 52 154 35 -150 -119 42 104 64 -8 -108
3140 -108 -109 50 141 41 -86 -104 -23 66 134 52 -135 -129 55 148 51 -40 -74 -69 40 151 63 -104 -99 8 68 87 35
3167 35 -105 -121 46 128 29 -58 -51 -53 17 116 42 -121 -105 42 60 38 10 -87 -99 51 141 0 -94 -58 -14 26 108 33
3195 33 -114 -75 68 88 16 -5 -56 -76 65 135 7 -93 -39 16 44 75 6 -106 -57 61 86 -3 -43 -69 -50 62
3221 62 99 -23 -104 -50 30 59 44 -30 -109 -53 82 77 1 -75 -89 -13 88 103 -20 -91 -57 29 88 70 -30 -99 -28 51
3249 51 67 38 -43 -84 -16 90 59 -31 -39 -43 13 81 45 -64 -86 8 50 42 40 -77 -149 1 138 56 -50 -48 -103 -42 129
3278 129 121 -48 -94 -39 -45 26 136 39 -127 -45 64 -18 -21 95 27 -73 18 29 -80 -6 119 31 -35 44 -51 -141 53
3305 53 225 40 -93 -37 -75 -88 156 211 -25 -132 -72 -104 -13 228 154 -144 -164 -28 -53 38 225 99 -191 -179
3329a79J54J7J21J25k23k54J09J25kJ49J07k81k43J50J57MJ61M4l28k09J75J29
3351HQ4K03p1m35j59K86J78R3J37j99n07k0M12K09K7K1l39m20J86M85J01n5o2
3374A63l56l15L58M38l2q9n5m00j94M32L73q8n3r6m71j06N51L35j12p3k52m98
3396e40R5O88K63k25j68l58m04L85P33L6l47k04l51j93N92N97k10l76j58l23m
3417d72O67M10l45l14j38l12J38P17K41m10k88j82k64L55P42M1n05l04j94q9N80
3438G4O40k44n80k36j18J27O73M06m62n44j31j0K53O33J73n64m39n5K9L59O15
3459E99l9o33l47K2Q8M82N14k58o74k73J05K77N41K71m82o11q2K22L36M54M6n96
3481c8m88J06L21L14K76j14n45l17J90K74K96K21k47n42j98K73L16K44J25l37
$$ plain form
3329 -179 -25 -8 113 238 15 -239 -130 -5 -7 142 249 -32 -275 -125 32 36 197 241 -87 -296 -121 8
3351 8 92 295 224 -211 -370 -84 94 187 324 125 -382 -402 10 219 246 267 -72 -492 -306 179 280 225 163
3374 163 -193 -508 -150 288 256 167 112 -288 -482 -50 323 235 182 86 -385 -491 60 395 283 210 -42 -540
3396 -540 -445 243 506 281 113 -245 -649 -264 469 505 158 -46 -397 -590 2 599 389 13 -145 -468 -472
3417 -472 195 605 260 -54 -192 -504 -366 351 592 182 -106 -288 -552 -197 545 586 81 -223 -417 -506 74
3438 74 714 470 -110 -346 -464 -337 336 742 280 -264 -395 -405 -152 481 654 90 -349 -404 -375 -16 599
3459 599 560 -73 -420 -398 -310 172 686 428 -246 -519 -414 -137 404 675 193 -418 -500 -278 58 512 558 -38
3481 -38 -526 -420 -99 215 491 377 -168 -485 -295 -21 275 496 249 -293 -491 -218 98 342 467 130
3501A30n25r6L77L70J74p1m62m21J40M69K62K2k04m36k45L47M29N6j36j68l16
3522c04o8L74K66n2r7j19k96j0L75J94j02j0j64l29M2M46J57j31p7k35k60K30
3544a70M66J8k15j01k37j27M06L55k04k39k3j41lL84J31k78j09O0j40J6L24J5
3566A88k40K4M5k15O8L11k8j81M8o1j93J93L02j23k07M8q7q4K91J67k53j40J03
3589b4m9%K36Mk60j8J64p7j9J70n8j88R9R7j51J3J66n0j30Q6Kj37Q4J79j03j11
3615g5O2j2o1J36Q7j77p2J02J0k7R2j4j32PJ36l2n0M2k1n5N8Q3r0n8P6K9m6J6
3643A4J0o4kJ03ko7k0J5k9M3O9n9r3N8O2l6qL1n4rO5Kn1j1L6k4RO6l2r4L9O9k5
3676A1l0L7j9m4N9M5n6j6K7l0kP2or6K8N9k7k9N2j2n5K4M7m2oK2l0j4M9No6K0
$$ plain form
3501 130 -395 -491 -114 256 430 359 -103 -524 -384 85 347 369 165 -271 -516 -169 260 316 180 12 -304
3522 -304 -372 2 268 216 119 0 -296 -306 69 263 161 151 -13 -342 -300 146 303 172 95 -140 -400 -170
3544 -170 296 314 99 -2 -239 -366 40 395 191 -48 -71 -212 -215 169 300 22 -87 -27 -167 -151 173 188
3566 188 -52 -28 17 -198 -130 181 153 -28 20 -41 -234 -41 261 138 -69 -21 -108 -192 99 266 13 -127 -24
3589 -24 -73 -73 163 167 -93 -111 53 -24 -43 127 69 -119 -20 77 -74 -61 105 55 -75 11 13 -124 -40 139 36 -75
3615 -75 -13 -25 -86 50 137 -40 -112 -10 0 -27 65 51 -81 -74 62 30 -20 22 1 -54 4 87 -3 -61 15 44 -2 14
3643 14 24 -40 -42 61 59 -8 -28 -13 -42 1 70 11 -82 -24 38 2 -6 25 -29 -38 27 29 -22 -33 3 -21 -12 54 22 -72 -33 36 11
3676 11 -19 18 -1 -45 14 59 3 -13 14 -16 -18 54 48 -48 -20 39 12 -17 35 23 -32 -8 39 -3 -9 13 -17 -31 18 23 -43 -23
3708b3N2l2l3O7j5n8K4N0m1rL2j9m6N9K7n5J6K7l6j5N8J4p6JN0k6KM0l3m8N2L2
3740C8l9oK0l8qN3L0p0j7L4lJ8J4k4o1L6O3k9k1J2m1j4O8L3o2k0K4MLL2j1n9J0
3773c1M9Mk6Pj6k0N0M9o6l5L5J6j5K3No5J1M6J5m4K2j3l5M0N1m3m7L3oj1J9K7
3805B9n1kN4j3n1K9K4m1J3N6n7m4N3L1l6PJ4l9j8R0Lo8J5J8l8jP4k2p8N3M1r0
3837d5J2P8l3l8O2j3j08O1J02m3n6L6n6p0J27J13j04q2L0l0MJ40K0j50m0Q4k9
3864b8pJ17l9j23M1R1r8j6J25rr0M7nj20P1J87n4j31J3k4n9J54J63j39j91M0K6
3891e8L4J52K5k05j14J29M0J2R5l1j88nJ44k5k5R9Lj55j2Q1m9M6J46l5k01k7Q9
3918c5JJ00J32j43k46M2J71M9O4M1k40j82J67J60J2J8pk22j03K22J12p4M0j2k02
$$ plain form
3708 -23 29 -3 -36 31 16 -42 -18 32 -9 -18 14 -5 -51 8 35 -20 -4 23 -13 -28 30 44 -32 -31 19 -7 -5 35 2 -46 6 38
3740 38 -1 -7 13 -25 -33 20 50 -20 -37 -3 -6 12 26 2 -59 -23 40 11 -10 2 -39 -53 15 48 -14 -34 -10 -6 -3 29 18 -41 -31
3773 -31 18 22 -4 3 -13 -33 17 66 0 -35 0 16 1 24 29 -36 -25 21 36 -8 14 1 -34 6 57 14 -33 0 -6 -17 2 29
3805 29 -22 -24 30 17 -34 -5 19 -22 -9 47 -10 -54 -1 30 -6 1 15 -24 -42 48 51 -17 -2 16 -22 -23 51 29 -49 4 45 -45
3837 -45 -33 45 12 -26 36 23 -85 -24 78 35 -21 15 -41 -111 16 129 25 -57 -27 -57 -53 87 107 -43 -83 1 -28
3864 -28 -35 82 43 -80 -39 52 -46 -62 63 54 -36 11 6 -114 -43 144 90 -41 -28 -52 -111 43 206 67 -124 -84 -58
3891 -58 -24 128 153 -52 -166 -37 3 15 110 79 -109 -114 30 5 -20 79 82 -73 -85 -4 -53 -7 139 104 -97 -124 -35
3918 -35 -34 66 198 55 -191 -149 22 71 135 176 -64 -246 -79 81 93 111 104 -118 -221 1 113 39 79 67 -135
3943a35n3K18O1p4P5j1k62j8K39O8n8P8j17k60N8L13L1q2K7j90k14K28K99q1j15
3968B5J4j96j02L05K05j76q2J3j67m6L15J17j90l9J2k02K5L32N7k04k4n6k02J64
3992a02L33k9k26k5p3j27K45L02j60k48J2m0m7K89K00k52j87O3m3rK75J04k50
$$ plain form
3943 -135 -188 30 91 17 92 81 -181 -199 40 108 50 128 11 -249 -191 122 153 71 98 -92 -306 -78 221 140 25
3968 25 39 -157 -259 46 251 75 -7 6 -161 -207 108 225 35 -4 8 -194 -169 163 220 16 -8 -64 -266 -102
3992 -102 231 202 -24 -49 -122 -249 -4 298 138 -110 -98 -138 -185 104 304 52 -135 -72 -115 -124 151 255 5
$$ [...]
8191A
##END NTUPLES=NMR FID
##END=
