##TITLE=1H_DCP03-3
 CDCl3. 8 sc
 
 15.3.2017
##JCAMPDX= 6.0         $$ Bruker NMR JCAMP-DX V2.0
##DATA TYPE= NMR FID
##DATA CLASS= NTUPLES
##ORIGIN= UXNMR, Bruker Analytische Messtechnik GmbH
##OWNER= root
$$ XWIN-NMR		Version 3.5
$$ Wed Mar 15 18:54:02 2017 Russian Standard Time (UT+4h)  she@DPX200
##.OBSERVE FREQUENCY= 200.13135
##.OBSERVE NUCLEUS= ^1H
##.DELAY= (6, 6)
##.ACQUISITION MODE= SIMULTANEOUS
##.ACQUISITION SCHEME= undefined
##.AVERAGES= 8
##.DIGITISER RES= 18
##SPECTROMETER/DATA SYSTEM= spect
##.PULSE SEQUENCE= zg30
##.SOLVENT NAME= CDCl3
##.SHIFT REFERENCE= (INTERNAL, CDCl3, 0, 15.7039)
##AUDIT TRAIL= $$ (NUMBER, WHEN, WHO, WHERE, WHAT)
$$ ##TITLE= Audit trail, XWIN-NMR		Version 3.5
$$ ##JCAMPDX= 5.01
$$ ##ORIGIN= Bruker BioSpin GmbH
$$ ##OWNER= she
$$ F:/spectra/data/she/nmr/H-F/1/audita.txt
$$ ##AUDIT TRAIL=  $$ (NUMBER, WHEN, WHO, WHERE, WHAT)
(   1,<2017-03-15 18:52:38.96 +0400>,<she>,<DPX200>,
      <created by zg, POWCHK disabled, PULCHK disabled
       configuration hash MD5:
       00 E9 B6 7A A2 85 ED C7 34 08 36 98 17 FE 4E 26
       data hash MD5: 16K
       30 9E D8 55 BA 8E 59 6C C6 28 13 71 FB 71 24 38>)
$$ ##END=
$$ 
$$ hash MD5
$$ 67 5C FD 57 24 83 60 1A 02 1C 68 E1 75 D5 48 3A
##$RELAX= 
##$RELAX= 
##$RELAX= 
##$RELAX= 
##$RELAX= 
##$RELAX= 
$$ Bruker specific parameters
$$ --------------------------
##$DU= <F:/spectra>
##$EXPNO= 1
##$NAME= <H-F>
##$PROCNO= 1
##$TYPE= <nmr>
##$USER= <she>
##$AMP= (0..31)
100 100 100 100 100 100 100 100 100 100 100 100 100 100 100 100 100 100 
100 100 100 100 100 100 100 100 100 100 100 100 100 100 
##$AQSEQ= 0
##$AQ_mod= 1
##$AUNM= <au_zg>
##$AUTOPOS= <>
##$BF1= 200.13
##$BF2= 200.13
##$BF3= 200.13
##$BF4= 200.13
##$BF5= 200.13
##$BF6= 200.13
##$BF7= 200.13
##$BF8= 200.13
##$BYTORDA= 1
##$CFDGTYP= 0
##$CFRGTYP= 5
##$CHEMSTR= <none>
##$CNST= (0..31)
1 1 145 1 1 1 1 1 1 1 1 1 1 1 1 1 1 1 1 1 1 1 1 1 1 1 1 1 1 1 1 1 
##$CPDPRG= <>
##$CPDPRG1= <>
##$CPDPRG2= <>
##$CPDPRG3= <>
##$CPDPRG4= <mlev>
##$CPDPRG5= <mlev>
##$CPDPRG6= <mlev>
##$CPDPRG7= <mlev>
##$CPDPRG8= <mlev>
##$CPDPRGB= <>
##$CPDPRGT= <>
##$D= (0..31)
0 1.2 0 0 0 0 0 0 0 0 0 0.03 0 0 0 0 0 0 0 0 0 0 0 0 0 0 0 0 0 0 0 0 
##$DATE= 1489589558
##$DBL= (0..7)
120 120 120 120 120 120 120 120 
##$DBP= (0..7)
150 150 150 150 150 150 150 150 
##$DBP07= 0
##$DBPNAM0= <>
##$DBPNAM1= <>
##$DBPNAM2= <>
##$DBPNAM3= <>
##$DBPNAM4= <>
##$DBPNAM5= <>
##$DBPNAM6= <>
##$DBPNAM7= <>
##$DBPOAL= (0..7)
0.5 0.5 0.5 0.5 0.5 0.5 0.5 0.5 
##$DBPOFFS= (0..7)
0 0 0 0 0 0 0 0 
##$DE= 6
##$DECBNUC= <off>
##$DECIM= 32
##$DECNUC= <off>
##$DECSTAT= 4
##$DIGMOD= 1
##$DIGTYP= 9
##$DL= (0..7)
0 120 120 120 120 120 120 120 
##$DP= (0..7)
150 150 150 150 150 150 150 150 
##$DP07= 0
##$DPNAME0= <>
##$DPNAME1= <>
##$DPNAME2= <>
##$DPNAME3= <>
##$DPNAME4= <>
##$DPNAME5= <>
##$DPNAME6= <>
##$DPNAME7= <>
##$DPOAL= (0..7)
0.5 0.5 0.5 0.5 0.5 0.5 0.5 0.5 
##$DPOFFS= (0..7)
0 0 0 0 0 0 0 0 
##$DQDMODE= 0
##$DR= 18
##$DS= 0
##$DSLIST= <SSSSSSSSSSSSSSS>
##$DSPFIRM= 0
$$ [...]
##$SUBNAM2= <"">
##$SUBNAM3= <"">
##$SUBNAM4= <"">
##$SUBNAM5= <"">
##$SUBNAM6= <"">
##$SUBNAM7= <"">
##$SUBNAM8= <"">
##$SUBNAM9= <"">
##$SW= 20.0189038669367
##$SWIBOX= (0..15)
0 0 2 0 0 0 0 0 0 0 0 0 0 0 0 0 
##$SW_h= 4006.41025641026
##$TD= 16384
##$TD0= 1
##$TE= 0
##$TE2= 300
##$TE3= 300
##$TEG= 300
##$TL= (0..7)
0 120 120 120 120 120 120 120 
##$TP= (0..7)
150 150 150 150 150 150 150 150 
##$TP07= 0
##$TPNAME0= <>
##$TPNAME1= <>
##$TPNAME2= <>
##$TPNAME3= <>
##$TPNAME4= <>
##$TPNAME5= <>
##$TPNAME6= <>
##$TPNAME7= <>
##$TPOAL= (0..7)
0.5 0.5 0.5 0.5 0.5 0.5 0.5 0.5 
##$TPOFFS= (0..7)
0 0 0 0 0 0 0 0 
##$TUNHIN= 0
##$TUNHOUT= 0
##$TUNXOUT= 0
##$USERA1= <user>
##$USERA2= <user>
##$USERA3= <user>
##$USERA4= <user>
##$USERA5= <user>
##$V9= 5
##$VALIST= <valist>
##$VCLIST= <CCCCCCCCCCCCCCC>
##$VD= 0
##$VDLIST= <DDDDDDDDDDDDDDD>
##$VPLIST= <PPPPPPPPPPPPPPP>
##$VTLIST= <TTTTTTTTTTTTTTT>
##$WBST= 1024
##$WBSW= 4
##$XGAIN= (0..3)
0 0 0 0 
##$XL= 0
##$YL= 0
##$YMAX_a= 111110
##$YMIN_a= -89776
##$ZGOPTNS= <>
##$ZL1= 120
##$ZL2= 120
##$ZL3= 120
##$ZL4= 120
##$ABSF1= 10
##$ABSF2= 0
##$ABSG= 5
##$ABSL= 3
##$ALPHA= 0
##$AQORDER= 0
##$ASSFAC= 0
##$ASSFACI= 0
##$ASSFACX= 0
##$ASSWID= 0
##$AUNMP= <proc_1d>
##$AZFE= 0.1
##$AZFW= 0.1
##$BCFW= 1
##$BC_mod= 2
##$BYTORDP= 1
##$COROFFS= 0
##$CY= 11.3945322036743
##$DATMOD= 1
##$DC= 2
##$DFILT= <>
##$DTYPP= 0
##$F1P= 17.636669327981
##$F2P= -2.38241207721045
##$FCOR= 0.5
##$FTSIZE= 0
##$FT_mod= 4
##$GAMMA= 1
##$GB= 0.15
##$INTBC= 1
##$INTSCL= 1
##$ISEN= 128
##$LB= 0.24
##$LEV0= 0
##$LPBIN= 0
##$MAXI= 10000
##$MC2= 0
##$MEAN= 0
##$ME_mod= 0
##$MI= 1.114404
##$NCOEF= 0
##$NC_proc= 0
##$NLEV= 6
##$NOISF1= 3.799351
##$NOISF2= 2.8
##$NSP= 1
##$NTH_PI= 0
##$NZP= 0
##$OFFSET= 15.70392
##$PC= 1
##$PHC0= -2121.631
##$PHC1= 7.99996
##$PH_mod= 1
##$PKNL= yes
##$PPARMOD= 0
##$PSCAL= 0
##$PSIGN= 0
##$REVERSE= no
##$SF= 200.130013532006
##$SI= 16384
##$SIGF1= 3
##$SIGF2= 2
##$SINO= 400
##$SIOLD= 16384
##$SREGLST= <1H.CDCl3>
##$SSB= 0
##$STSI= 0
##$STSR= 0
##$SW_p= 3612.71676300578
##$SYMM= 0
##$S_DEV= 0
##$TDeff= 0
##$TDoff= 0
##$TI= <>
##$TILT= no
##$TM1= 0
##$TM2= 0
##$TOPLEV= 0
##$USERP1= <user>
##$USERP2= <user>
##$USERP3= <user>
##$USERP4= <user>
##$USERP5= <user>
##$WDW= 1
##$XDIM= 8192
##$YMAX_p= 0
##$YMIN_p= 0
$$ End of Bruker specific parameters
$$ ---------------------------------
##NTUPLES= NMR FID
##VAR_NAME=  TIME,          FID/REAL,        FID/IMAG
##SYMBOL=    X,             R,               I
##VAR_TYPE=  INDEPENDENT,   DEPENDENT,       DEPENDENT
##VAR_FORM=  AFFN,          ASDF,            ASDF
##VAR_DIM=   8192,          8192,            8192
##UNITS=     SECONDS,       ARBITRARY UNITS, ARBITRARY UNITS
##FACTOR=    0.0002496,     1,               1
##FIRST=     0,             0,               0
##LAST=      2.0444736,     0,               0
##MIN=       0,             -89776,          0
##MAX=       2.0444736,     111110,          0
$$ Real data points
##PAGE= N=1
##DATA TABLE= (X++(R..R)), XYDATA
$$ [...]
1521g9K7J43o0j64Q8J36j43p5K36M5k92j0K88n4k62J80K39k97k21L49J72l63l1
1544a48M20j31m61J99M12l02k84M40J82n67p6N63q0n09L45M61n39m54N95K70n94
1565b58N4P17k87q36M09O93n43l85Q07J75j024o4R87j79p67N80O85r44o27R83
1585A76L46r47J65J084n59j172O72R12q51l99J215P3j517P0J348l63r41R85P65
1604A062j464p39J430L78j262M05J346r67j490J072J162j146l95J577j84j988
1620a203L39J771o33j137J404P67k050p17K003K59j640P33J636j551j767J677
1636a09J320j644k64K080n48k552P68K229j058j310J926P18k692n59K624M7k084
1653a108J118J878k128j923K302J396k217j40K543q98k948J217K569j561j495
$$ plain form
1521 -79 -52 91 31 -133 -45 91 -52 -127 109 154 -138 -148 140 86 -176 4 243 -54 -275 74 246 -117 -148
1544 -148 272 141 -320 -121 291 -11 -295 145 327 -240 -316 247 167 -342 3 464 -75 -529 66 336 -258
1565 -258 -204 513 226 -610 -201 492 -51 -436 371 546 -478 -542 445 266 -501 79 764 -180 -807 176
1585 176 522 -425 -260 824 265 -907 -235 677 -174 -573 642 715 -802 -732 616 253 -688 297 1062
1604 1062 -402 -1141 289 667 -595 -190 1156 189 -1301 -229 933 -213 -608 969 785 -1203
1620 -1203 -864 907 274 -863 541 1308 -742 -1459 544 803 -837 -104 1532 -19 -1786 -109
1636 -109 1211 -433 -697 1383 835 -1717 -949 1280 222 -1088 838 1556 -1136 -1695 929 976 -1108
1653 -1108 10 1888 -240 -2163 139 1535 -682 -822 1721 823 -2125 -908 1661 100 -1395
1668a395K461O78l261l70L151k17k478J535K075k674k042K930J417k711N7K920
1684B076j353l331J813K887k061j576K913L86l812Q3L760o48k806J968K061l362
1700a002j849L687J225l247L74L158j987l436K597L004k707j446L294p7m189P41
1716a860M145j170k946K391J799l889j410M283Q95l610P14L096k564l243L321
1731d8K906l149j321L418o07m256J452M349j687k996K679J407m183q11M689M17
1747B259l823J047K977l024k910L888K586l568r18L555j171m258K093M240k226
1762G47k699L054R60m488k53M863j50l819J570K737l461k519M242K131l805n00
1778a390L587j534m051K501L892k576k438L210P13m354J16M642n41l651J770K482
$$ plain form
1668 -1395 1066 1744 -1517 -1887 1264 1047 -1431 104 2179 -495 -2537 393 1810 -901 -844 2076
1684 2076 723 -2608 -795 2092 31 -1545 1368 1754 -2058 -1975 1785 1137 -1669 299 2360 -1002
1700 -1002 -2851 836 2061 -1186 -812 2346 359 -3077 -480 2524 -183 -1629 1665 1588 -2601 -1860
1716 -1860 2285 1115 -1831 560 2359 -1530 -2940 1343 2238 -1372 -658 2438 -126 -3369 -48
1731 -48 2858 -291 -1612 1806 1199 -3057 -1605 2744 1057 -1939 740 2147 -2036 -2847 1842 2259
1747 2259 -1564 -517 2460 -564 -3474 414 3000 -568 -1486 2069 898 -3360 -1267 2973 747
1762 747 -1952 1102 2062 -2426 -2679 2184 2034 -1785 -215 2522 -939 -3458 784 2915 -890 -1390
1778 -1390 2197 663 -3388 -887 3005 429 -2009 1201 1914 -2440 -2324 2318 1777 -1874 -104 2378
1794B378l440k118M184J752l726k72L318j695l634K675L564k649k219K998L80
1809A496m008N45M423q07l442J730K078l317j568M111J311l582m8K984j786l110
1825b990K741L024k689j762K875O1l647P79L900j024k898J819J639l120j170L691
1841A229Q39l120K62K558j800k535K534K352k472j262K543j43l035R10L145j170
1857H35k326J734J293k657p30L042L93k662M20K129j557j900K218J690k236r09
1873a223K135k16k351R80K419j206j834J511Q89k115k84K476qk183N39J590j380
1890b61j263J957J100j922n32J717l77j781R92J798j128j316J294N73j708p1J904
1907I76j57j629N25J155j104q79J473O97j420k55J260l69j269P72J207r11q28
$$ plain form
1794 2378 -1062 -3180 1004 2756 -970 -1242 2076 381 -3253 -578 2986 337 -1882 1116 1496
1809 1496 -2512 -1967 2456 1649 -1793 -63 2015 -1302 -2870 1241 2552 -1030 -1078 1906 120 -2990
1825 -2990 -249 2775 86 -1676 1199 1260 -2387 -1608 2292 1268 -1630 189 1828 -1292 -2462 1229
1841 1229 2068 -1052 -790 1768 -32 -2567 -33 2319 -153 -1415 1128 985 -2050 -1140 2005 835
1857 835 -1491 243 1536 -1121 -1851 1191 1584 -1078 -658 1471 -86 -1986 232 1922 -314 -1223
1873 -1223 912 696 -1655 -675 1744 538 -1296 215 1104 -1011 -1295 1181 1173 -1010 -471 1119 -261
1890 -261 -1524 433 1533 -389 -921 796 419 -1362 -370 1428 300 -1016 278 851 -857 -928 976
1907 976 819 -810 -285 870 -234 -1113 360 1057 -363 -618 642 273 -996 -224 983 72 -756
1924g56J028L40j228M4J302k56j131M91Q32q31n77J060L88j055p8R31k80q67N60
1943h3P38o89n08P50J93p90O0Q22k51p11M07M75n66k78O76J24o64P6N66k71m58
1964c82M04L70m92k26N02L5m62J07M70k22l61K83K13l36j23L70L4l35N9K80j59
1985B9k24K32J41k44q3K14kj71Q8J64j36j20J27Q2j17k8J03m0r3O2R5m5m0L2J4
2010D0o0%M2j9j9K3Kj3J2p%Omk5qL3rk7L7M0o0l2P0J2p1J0P2m0p5Q0P6q0n3R3
2044D6Rr3J0Q9m5r1O9O2m4m0O4Pr8K2P0l7n0L7M8n8lO0no7RN0k8k7K9K8k9j3L2
2077A3L1l8j8RK9k0m2K9N2m0k9N7N4r8o1Q3L3j08KJ27l2j22P2J18j00j02J31N0
2105H0j66j0J80m9j79J50J55j79j35K21O0k63K8L14j28l13K32K37k96j72L93O3
$$ plain form
1924 -756 272 612 -616 -572 730 474 -657 -166 666 -165 -742 318 706 -349 -427 504 224 -643 -83
1943 -83 655 -34 -542 208 401 -389 -329 493 242 -469 -62 413 -153 -431 245 369 -295 -219 347 76 -382
1964 -382 22 392 -100 -326 176 211 -251 -144 326 104 -257 26 239 -97 -220 150 184 -151 -92 188 29
1985 29 -195 37 178 -66 -149 65 63 -108 -20 144 8 -112 15 97 -20 -48 55 15 -78 -16 79 34 -6 26 40
2010 40 -20 -20 22 3 -16 7 9 -4 8 1 1 7 3 -22 -30 3 -6 -33 4 44 -16 -48 22 34 -37 -27 45 5 -70 10 86 6 -47 46
2044 46 55 -38 -28 61 16 -75 -6 56 12 -28 36 43 -55 -33 37 0 -50 -13 35 -23 -26 34 29 -38 -29 21 -7 -34 -5 23 -6 -19 13
2077 13 44 6 -12 -3 26 6 -36 -7 45 5 -24 33 87 -11 -72 11 44 -64 -62 65 33 -89 -17 101 1 -101 30 80
2105 80 -86 -96 84 35 -144 6 161 -18 -153 68 128 -135 -107 207 79 -234 -2 235 -61 -233 160 223
2127B23m33K9M41j81l92L02L45m07k24M70P1n45R7N48k26m70L79L34n30j97O57
2148B91N9o78J26O27l97n37N76M58o95k52P94l4q50K46Q22m51o53O67M56r02k73
2169f00J004N4r41K85Q61o70p91Q81O24r43k61J060j48j191M37J138o49q50R53
2188B53M79j263k50J390j1j244M82J080j010j006J244P73j246k37J360l78j539
2205a123O66J484q44r79J210M33j714j62J817m2j470O55J156j393j105J662Q94
2222A145j542j70J561o16j813R64J715j061j041J498L33k062j15K097j29j579
2238h15R15J205j761j204J923R32j687L8J717r61k039J215J848j240r21J752Q9
2255A006k419J37K331l64j617J260J113k144j068K237O97j853M02J803j401k084
$$ plain form
2127 223 -210 -181 260 79 -313 -11 334 -73 -297 173 244 -301 -204 344 118 -352 27 361 -169 -366 291
2148 291 350 -328 -202 425 28 -509 67 525 -170 -422 372 338 -512 -266 556 105 -548 119 575 -327 -600
2169 -600 404 458 -483 -198 663 -7 -798 83 707 -236 -497 563 415 -776 -339 799 150 -700 253
2188 253 732 -531 -781 609 598 -646 -164 916 -94 -1100 144 917 -329 -566 794 416 -1123
2205 -1123 -457 1027 183 -796 414 847 -867 -1029 788 746 -724 -69 1087 -306 -1411 251 1145
2222 1145 -397 -567 994 378 -1435 -471 1244 183 -858 640 973 -1089 -1204 893 764 -815
2238 -815 100 1305 -456 -1660 263 1195 -492 -454 1263 302 -1737 -522 1326 86 -835 917 1006
2255 1006 -1413 -1276 1055 691 -926 334 1447 -697 -1765 472 1169 -684 -282 1521 120 -1964
2271a964J608J716j507n85K003l40k660M92K429o88j428J636P88k595q26K565
2287F44M79j856P56J689j916k016J977J666j646l19K080p70k749P97K428q77j231
2304h64J878N20k842o17K610K06j723J168J599k273j951K110J402j738J40K240
2320A865j139k817J026K274j172r23K195K78k990l56K548j56j665J531J522k426
2336d05j687K177R56j847M69K256j296k594J238J897j437o70K315M7k851m5K375
2353H98m97j531J705J309k431j368K188O65j826O40K084j405k319J357J673j466
2369c24n05K210j37k661J54K156o42j298J728J058k356j045K024L35j675R02J870
2386A794j505j985J395J208j530q8K184l36k421L56J729r30r62J893Q35k202p46
$$ plain form
2271 -1964 -356 1360 -147 -732 1271 931 -1729 -1237 1192 504 -924 712 1500 -1095 -1921 644
2287 644 1123 -733 23 1712 -204 -2220 -243 1423 -223 -542 1538 768 -1981 -1184 1244 367 -864
2304 -864 1014 1534 -1308 -1925 685 891 -832 336 1935 -338 -2289 -179 1223 -515 -375 1865
2320 1865 726 -2091 -1065 1209 37 -886 1309 1587 -1403 -1759 789 633 -1032 499 2021 -405
2336 -405 -2092 85 1041 -806 -337 1919 623 -1971 -733 1164 -273 -943 1372 1419 -1432 -1477 898
2353 898 401 -1130 575 1884 -547 -1915 273 938 -888 -248 1836 431 -1888 -531 1142 -324
2369 -324 -829 1381 1244 -1417 -1263 893 251 -1047 681 1739 -617 -1662 362 697 -978 -76 1794
2386 1794 289 -1696 -301 907 -623 -711 1473 1137 -1284 -928 801 -129 -1091 802 1637 -565 -1311
2403a311J773q0j490J103J688j437j597J308P69j527J32J988l96j958M89J329
2419G83j077p82J755O44j823m04J469l28j311J056J395j267j164J207M48j372
2435g71K02J677m32j582O05J035j035n75J479L94j540j30J273m30j083R48J042
2452A077j101q04J078K34j177K47J332m31j176N81P20r31l80J245K40j186k2R45
2470D91m46p98Q43P68r07n41Q55O3r22K61J038l76q58M93M90p57k92R71J80q50
2490b94K0O61l81o32O32N90o01l51N84l2o74K25P35k74n44L62K59n49j19O87M8
2511C52n90J01M24l19l79M80L13m59j65M33l5m73J85M34k11l23K77J45l53p8L93
2532A52K4l15P8K05j92j78K70J43k32n8K08p3k09J38K09j60j33J65M6j84J4J90
$$ plain form
2403 -1311 462 382 -1108 -5 1683 246 -1351 -43 726 -801 -669 1319 923 -1035 -546 783
2419 783 -294 -1076 679 1323 -500 -904 565 237 -1074 -18 1377 110 -1054 153 601 -771
2435 -771 -569 1108 676 -906 -301 734 -301 -876 603 997 -543 -673 600 170 -913 35 1077
2452 1077 -24 -828 250 484 -693 -446 886 455 -721 -140 580 -351 -731 514 754 -432 -454 491
2470 491 45 -753 90 858 -49 -590 265 328 -594 -333 705 329 -529 -36 454 -303 -595 376 556 -294
2490 -294 -274 387 6 -626 6 596 -5 -356 228 196 -478 -253 482 208 -336 26 285 -264 -383 304 352
2511 352 -238 -137 287 -32 -411 69 382 -77 -242 191 156 -317 -132 302 91 -232 45 190 -163 -241 152
2532 152 176 -139 -61 144 -48 -226 44 187 -45 -103 105 32 -177 -39 170 10 -123 42 88 -96 -82 108
2554A08m0j56P0J01r1q9R2P7p9l8Q0rp6J4M3mKOj4k6J6K1j1K2j1j8j4K8K1j0k
2585A3j0mJ0K3k3k4J8Pl4J5N1k2o3K8M6m7k6O2K2r3KQ8j6p3L1N8m2n1O8M1p7p
2617b9N2ln7L9M1o2j8O7jm7%N8m2m2N6L3o1l6N5Pl8KN0l2j3MK7j3qJ4pj7NK3l
2652DJPj8pJ6Kj2J8lk9J7K1j2j0J9Om4J7L8l6n1N3O0p5k8R4oj27L1J40n6j12Q6
2685DQ1j27n5J68K7j70K4J46q4j38J51J00j83n8K15l2k08J06J97j65j69K25J07
2708A62k96k2L23m7l13J37K79k52k15L30J53l72o3L98p7l64J81L50l03k76L80
2729I3J61m20k6M51j23m50K36L81l66k47M96J32n48l6N26j29m87L50M36m88l62
2750d20N39J79n82M1O55j95o44L36M73m93k91O84J49p31JO59k63n74N17N26o48
$$ plain form
2554 108 68 -88 -18 83 -8 -97 -5 72 -7 -45 35 26 -50 -36 7 3 5 11 -3 -29 -13 8 -3 19 8 -10 -24 4 25 15 13
2585 13 3 -1 9 32 9 -15 3 10 -24 -9 42 20 -43 -15 31 -16 -42 20 42 -51 -49 39 23 -50 -19 39 -3 -54 14 55 -22 -29
2617 -29 23 20 -37 2 43 -19 -37 30 29 -18 -18 40 -2 -44 12 45 -16 -52 3 10 -28 -26 24 -8 -21 -17 10 -3 -11 3 -4 -21 -16 7 4
2652 4 5 12 -6 -13 3 5 -7 11 8 -21 -4 17 5 -5 14 20 -24 -7 31 -5 -56 -3 57 -18 -46 48 42 -85 -54 86 30 -82 4
2685 4 85 -42 -97 71 98 -72 -48 98 14 -124 27 127 -56 -114 101 69 -139 -33 164 -1 -170 55 162
2708 162 -134 -156 167 120 -193 -56 223 -29 -244 86 239 -133 -196 202 125 -239 -58 292 -11 -287 93
2729 93 254 -166 -192 259 136 -314 -78 303 -63 -310 186 318 -230 -266 260 131 -356 -6 430 -58 -420
2750 -420 119 298 -284 -243 412 217 -427 -91 382 -111 -402 282 431 -300 -299 360 97 -477 40 566 -82
2771h2l71O63R1p36K01P96l61p32N04M77o77k40Q75N2r25J33P87l94o11P00N00
2792F50q78l40Q70M1q20L19Q38n87p89O96N23q05j34J006j35j094K78Q95n40n64
2812e70R30M04j155k91J028o5q61O04Q86r06q82Q83M77q96J15J158l93j276M37
2831c73Q84o73m29J180K69j368j84J126k85q58Q87Q70j122q10J019K83j032L13
2849c03J303n68j293O03Q35q86l27J331J30j455k5J162m11q50J008P97j282p13
2867i44J181K57j092M01J224p55j278Q05Q68r27k67J306o1j525J37J248m51p88
2885f61J060O27j422o10J231J97r92N48J127r62j238Q60P84q71l8J307k90j553
2903h96K34J160n06n66J149M32j461m81J171N6q87O90R94r80j084Q64N80q88P9
$$ plain form
2771 -82 -453 210 301 -435 -234 562 201 -531 -27 450 -227 -467 408 460 -465 -332 455 61 -550 150 650
2792 650 -228 -568 302 343 -477 -158 680 93 -696 0 523 -282 -416 590 455 -639 -361 534 -6 -570
2812 -570 360 764 -391 -682 346 281 -580 24 910 4 -878 5 482 -414 -299 859 466 -810 -373
2831 -373 511 -162 -591 589 858 -510 -694 432 147 -711 176 1046 -76 -886 133 416 -616 -303
2849 -303 1000 432 -861 -258 577 -309 -636 695 825 -630 -655 507 96 -754 254 1051 -231 -944
2867 -944 237 494 -598 -197 1027 272 -1006 -201 667 -260 -527 779 718 -807 -670 578 127 -661
2885 -661 399 1026 -396 -1006 225 422 -570 -22 1105 143 -1095 -235 549 -322 -360 947 657 -896
2903 -896 -662 498 -8 -574 575 1007 -454 -935 236 292 -595 95 1089 109 -975 -111 469 -419 -340
2922c40J246l31j361L00R44n80m44J126L25j336l20J060j00p70P24Q21j011q36
2940h83Q88M36q30J65J043m69j153M63Q45o09l37R86J15j212o9R84j87o34O92
2959B34N53r99n79Q76K85p01K87P88n92r43N64O54n55j33Q34j22j046J01Q45k32
2979A19m66O43L15r10l41P99J33o00L18O18n74o88N40M51n28o5O95j50p94J71
2999c14O42l01l57N58K35p32j72O46j2m94L07M56m86m36M99K81m93k0N61j86n82
3020d00K43M80l32k59M67J04n73l2N31p8l98K82K98m32k69M53J65l92L6L73k28
3041C9l89K75L47k73j68L48pm36N4M20j03k73K02J84l56j22L77P5l07N1K60k09
3063a1k54K62K30k46j01K55m5l06J12K88j21k02J77Q7k51l1K84mk29P4J47j54
$$ plain form
2922 -340 906 575 -786 -486 458 -122 -566 560 885 -451 -771 289 189 -581 143 964 -47 -883
2940 -883 5 441 -389 -224 819 350 -803 -340 505 -104 -441 545 660 -552 -621 363 176 -458 234
2959 234 787 -212 -791 85 370 -331 -44 744 152 -791 -227 427 -128 -261 573 451 -595 -494 351 119
2979 119 -347 296 611 -299 -640 159 292 -308 10 628 54 -634 -94 357 -171 -236 459 309 -485 -314
2999 -314 328 27 -330 228 463 -269 -441 205 193 -301 6 462 -24 -460 39 320 -173 -193 368 182 -400
3020 -400 -157 323 -9 -268 199 303 -270 -302 229 151 -247 35 333 -99 -368 85 250 -142 -106 267 39
3041 39 -350 -75 272 -1 -169 179 172 -264 -210 210 107 -166 36 220 -136 -258 119 194 -113 -62 198 -11
3063 -11 -265 -3 227 -19 -120 135 90 -216 -104 184 63 -139 38 125 -126 -157 127 123 -106 -32 115 -39
3085c9j36K10J13j89k4J51p5j55J23J61j29r2J29%j67L2J96l9j41O9N9j16m7J60
3109E4M7j36oQ5m7p4Q9O8p1m9O4lo0L3M8l4m1M1Rn0LO8k2l7K9K6o0j5N5J3m2%
3141a5L1k4l2L2K7k7lPkk0L2Pj2%Qj7JK4J1l1%J9nk8J8K2l6j1K9J5k9qL2mk8M
3177a3J0j0j1K0jj9J8J4j7kJ8ll2J1L2j4j7J4K6k9j5K3J5k7kK5%l0kL4pk3J7Q
3211A1j3kJ0J6j9pkOl1L3J3Lk7J4J6m8QN1%n2LM1j1m5K6M0k8m3N0K8o1j8O1J5
3245C8n3KM3m5n2O6P1o9l2N6k3r1O7J13n0j00O1M5j04rJ55Nj48J1J12q1r5J38
3273C1J01j29q0J21j4j40N9J92o8j56P7M7j59oK37L3k01nR1j18p8K31J67k06j28
3298a01J06m2j63J74L00j35k40N7P9k02K3L53L9k95l4J18j60j03L28K08k48j49
$$ plain form
3085 -39 -175 35 148 -41 -65 86 11 -144 -21 140 11 -81 48 48 -119 -87 109 70 -71 -2 57 -59 -106 54
3109 54 101 -35 -41 44 -3 -77 12 80 9 -40 24 21 -39 -6 42 8 -33 8 17 -33 -30 38 16 -21 8 34 -26 -41 14 27 -15 -15
3141 -15 16 -8 -40 -8 19 -8 -11 -4 -6 -26 6 13 1 1 9 -8 -7 17 28 -3 -3 16 11 -17 1 23 -13 -24 5 20 -9 -17 15 11 -17 -13
3177 -13 -3 -13 -24 -4 -5 -24 -6 8 -9 -11 7 4 -28 -17 15 1 -16 -2 24 -5 -20 3 18 -9 -11 14 14 -16 -18 16 9 -14 3 11
3211 11 -2 -4 6 22 3 -4 -6 0 -31 2 15 18 -9 5 21 -27 -19 32 32 -20 -17 24 13 -32 -6 34 6 -37 13 41 -20 -38 23 38
3245 38 -15 -13 30 -15 -67 -1 70 1 -31 25 2 -89 -22 91 41 -59 2 47 -57 -66 89 94 -54 -43 69 -12 -107 31
3273 31 132 3 -77 44 30 -110 -51 141 73 -83 -6 41 -118 -124 113 146 -55 -60 31 -87 -165 66 233 27 -101
3298 -101 5 -37 -200 -26 274 139 -101 -44 35 -167 -144 209 248 -47 -81 37 -123 -226 102 310 62 -87
3320h7J05r8k12K51L62j42k51P9l6k75J13M55K3l29j8Q5k77o6M76K36l39j62J48
3343D1j83k28L73M03k47k70J31o0l24K14N18p9l83O9O6l54KN65J68m28q9J70l00
3366b25k23N49M41l86l02J76j37l89L57O69j68m77O1M1m23R1P44J21n34j01J49
3387C4l67j89O92M47m75k90K10k37m29M78P24k52m73J64l2n61J37Q67J04n54k0
3408b2J18m97j82P80M49n05k37K07l07m42N50O98k95m58K07o5n65K02Q29Pn77
3429a05O3J60m92j68P73L60n66j81L01l07m30N41O48l65m12K42n1n40K46P69n8
3450D28n60R3J42m76q9P65K41n67j08K68l38l25N75N22m27l21K82j23m98K85P14
3471D83j52m92J83R8n17j7O99J59n03RK57m19k94N66M11m07j92L23j93n14L20
$$ plain form
3320 -87 18 -80 -292 -41 321 179 -72 7 -29 -304 -191 264 287 -42 -60 25 -252 -318 158 394 55 -107 41
3343 41 -142 -370 3 406 159 -111 20 -40 -364 -150 368 289 -94 -25 41 -313 -311 254 422 -6 -95 75 -225
3366 -225 -448 101 542 156 -146 30 -107 -496 -139 530 362 -115 -54 -13 -436 -345 399 520 -14 -115 34
3387 34 -333 -522 170 617 142 -148 62 -175 -604 -126 598 346 -127 37 5 -556 -419 448 552 -2 -22
3408 -22 96 -401 -583 197 646 141 -96 111 -196 -638 -88 610 315 -143 64 -1 -566 -364 465 472 -105
3429 -105 -42 118 -374 -542 231 591 25 -156 145 -162 -592 -51 597 232 -180 62 11 -529 -283 486 428
3450 428 -132 -39 103 -373 -462 303 544 -23 -131 137 -201 -526 49 571 144 -177 105 -18 -516 -231 483
3471 483 331 -161 22 120 -397 -414 285 444 -59 -50 207 -212 -506 60 471 64 -128 195 2 -512 -192
3492a92O11k19l55K74N3n39j1O53M4m55J29K51m11k89N34L02m36o0L44j89m66
3513d27L13M65k89k63L53M6m98M1N09p2l82K16K62m07k25M70J59m16K7L76k14
3534D4l88L01L21l13j79L81L0m30N5L94j28l29K73K39l41j73L50N1l53R8L77j87
3556I3l25K06K21l02q4L95J7l74J5K79j36k36K80K22l09j39K48Lk74J15L23j41
3578I7k72J54J39k49l4L35J9k97K3J80j39j47K49J86k51j17J97l6k18J38K54j32
3600G9k01J19Q7k04j2K70J1k24J3J38j25j07K12J26j74j03J37m3j57J21K01r4
3622G0j52Q4M3j61K1K20Jj74J0Q6r7p4J71J03j50n3Q3m1j09J13J34q1j04P0Oj09
3648i0K3J48Lj08RM6q0k9J15N4r1k7M5l3n1O6Q0n3o3M1J3o1J0R3j6o4K0K2n0k0
$$ plain form
3492 -192 419 200 -155 119 172 -367 -378 275 319 -136 -7 244 -167 -456 78 380 -56 -116 228 39 -427
3513 -427 -114 351 62 -201 152 198 -300 -259 250 178 -204 12 274 -133 -358 112 271 -145 -118 258 44
3534 44 -344 -43 278 -35 -214 167 197 -233 -178 216 88 -241 32 271 -70 -243 107 158 -195 -97 280 93
3556 93 -232 -26 195 -107 -191 204 221 -153 -138 141 5 -231 49 271 -38 -177 71 74 -200 -85 238 97
3578 97 -175 -21 118 -131 -165 170 189 -108 -85 95 -44 -191 58 244 -7 -124 73 37 -181 -43 211 79
3600 79 -122 -3 84 -120 -132 138 149 -75 -62 76 -49 -156 56 182 8 -95 42 -1 -158 -37 164 70
3622 70 -82 2 45 -116 -95 125 126 -48 -38 48 -49 -123 48 151 1 -52 31 -10 -119 -6 128 47 -57 13 19 -90
3648 -90 -67 81 84 -24 -15 31 -49 -78 37 91 0 -27 18 -15 -66 0 80 27 -36 5 18 -43 -33 60 44 -20 0 22 -28 -48
3678d8O8K5n3k3L9k0k9N4K4k5l5J1J0k2K2K7ok8%PjkJ4J7k8kJ7qj2J5K6k9njk
3713cj1PJ1JmmJ1k0RMRj0j4NOjoJ8mj5pK0K3j9mQj0nJ0Nkkj0J3nj2J6plpRonr
3757b0J9lnJ1Lj9OJ3pjJ2jj6J0lJPKj8JJ5nlJ4r%j4J5jkoK5j9j9J7Lj3j5K6J7
3797A8k8oK5Jk0J7L0l6l5L2J8j8jL1j6m2J2K7Kj6K2Mn2mL9Jk7L6K7m7m5M2K0k2
3831a1J3M2j4o4K3K5j4j5N4J3p7k3N9j2oN2Rn5n8N6K9l0J8L8m6o5K2N7j6j0M8
3862D2j4p7%O6Jl2N1Mo8m2O3K0k0K5N4p1p0L5N0k3K3P0n0j02LO8pJ0P1j3j10m0
3894h3O7K0j2O2M9j04q1M4L6j1L2P0m8j17K9M2k4K2R9Mj16l1M0k0j2R4N5r9p7
3923g0N1J3m4P9P6n6j08J6M9l4NR1Nj17k0P2k1m0J00L4q9o3O4J6m9N4P9o8r2M0
$$ plain form
3678 -48 20 45 -8 -31 8 -12 -41 13 37 12 -23 -12 -2 -24 -2 25 19 -9 -9 -2 -3 -5 9 26 -2 -4 13 5 -7 8 34 5 0 -1 -3
3713 -3 -14 -7 4 5 1 -3 8 -12 -3 1 10 0 -14 -9 -3 -4 -10 8 4 -11 -18 2 25 6 2 10 0 -5 5 10 8 6 -4 9 4 -8 8 1 -2 -9 0 -6 -11 -20
3757 -20 -1 -4 -9 2 5 -14 -8 5 -2 -3 9 8 -8 2 -1 0 7 9 -9 -8 7 2 -1 13 4 4 -10 5 4 2 -4 21 2 -17 0 3 -10 -25 1 18
3797 18 -10 -16 9 10 -10 7 37 1 -34 -2 16 -2 -3 28 12 -30 -18 9 11 -5 17 21 -31 -35 4 5 -22 14 41 -6 -51 -9 11 -11
3831 -11 2 44 30 -34 -11 14 0 -15 39 52 -25 -48 11 -1 -7 45 54 -1 -59 -3 26 -4 14 52 6 -59 -37 20 4 -6 42
3862 42 28 -49 -49 17 18 -14 37 41 -27 -69 -6 14 -6 19 73 2 -68 -33 17 -6 17 87 37 -65 -62 6 -1 9 80 67 -43 -83
3894 -83 -16 4 -8 54 103 -1 -82 -38 -2 -13 19 89 41 -76 -47 -5 -29 -7 92 96 -20 -51 -11 -31 -43 51 106 7 -70
3923 -70 -19 -6 -50 29 105 49 -59 -43 6 -28 -23 68 73 -44 -64 8 -13 -53 47 81 -8 -71 -7 9 -40 14 93 25 -67 -27
3953b7M0m7J7J01j0j17k2P0k3k0Q8M3j15n7N9J1k4N0O5o1q8J6N0l4K6Q4k6r2N
3982c8L2j6j3Q7K8q6l7M6k0k4M8P3m1o1J1Om4L2Q2j8o4oL1m3j1P8K3p2j6K8j2
4013a7k8N5M6n5l2M2qo6N0P0k6n7L5Pn9NP0J3o4PL7n2l1P3N6o6j3K1j7n7O5O0
4045F4m5n5M5%n9K5Q0k0p2K9L6n1k2P7K3q0rN2j4m3L5O5o7n0M5L1n2J7N8j8p3
4076d8K8M0k9j3O4qp5nO1ol3M3L2n1m3L4K6k9K9M4k3q1J1L8j8pN9J2o2l3M0Qm0
4109c5L5N9m4m2J1Rk8PO3Po9nK5k0oM8L0l6l7K0Pk0K6M0k3n3J8J5pMM8j9n8JL4
4144EMk2M0Kn1k7L7K4j0NK3k9n2J6L0OjL6k4n0j8M4J0OJ2K7n5l7K2M5pPJ7k6m1
4179c2j2M0QlK5j2l7j4K3J3jJ3Kk0k7J0J7J7PRj9l4kL3jmK4Jk4k8J0K4j6K3j2
$$ plain form
3953 -27 13 -34 -17 84 74 -43 -65 5 -18 -38 50 93 -22 -79 -20 -9 -33 17 82 21 -67 -51 -1 -35 -9 75 49 -43 -38
3982 -38 -6 -22 -35 52 80 -6 -43 3 -17 -41 7 80 39 -22 -11 -5 -49 -17 65 47 -17 -23 8 -35 -46 32 55 -17 -33 -5 -17
4013 -17 -45 10 56 1 -31 11 3 -63 -13 57 31 -26 9 16 -43 -38 32 45 -19 -12 25 -27 -58 15 71 5 -8 13 -4 -61 4 64
4045 64 19 -36 9 9 -50 -25 55 35 -37 -8 28 -23 -45 32 55 -25 -34 18 4 -39 -4 61 -6 -56 -11 20 -32 -15 43 25 -48
4076 -48 -20 20 -9 -22 42 34 -41 -46 15 9 -24 19 51 0 -43 -9 17 -12 17 61 38 -43 -32 6 -12 -19 40 52 -10 -43 -3 5 -35
4109 -35 0 59 15 -27 -16 -7 -35 -28 35 42 -27 -32 -7 -27 -33 15 45 9 -28 -8 -1 -21 5 45 22 -31 -13 2 -5 -1 47 28 -30 -29 5
4144 5 9 -13 27 29 -22 -49 -12 12 2 7 30 1 -51 -35 -5 1 0 36 12 -38 -56 -12 -2 4 16 43 -12 -49 -27 18 11 18 35 9 -32
4179 -32 -44 -4 4 1 26 14 -23 -37 -14 -1 -2 11 13 -7 -34 -24 -7 10 17 26 7 -27 -29 4 3 -1 23 24 0 -28 -18 6 -10 13 1
4214Aoj1pK7knLkk8J4J5pmK3lj4qQJ4PLMj1k8J3QJ0lNrj6MJ2qpJ7jk0jJ3Olq%
4258eqJJ7mNpnkkJ8nMrRQj3oMPkJJ0j7j0J2J1rj2K5k2LmMJ1j1JJOj9J6jkNjj2
4303iJ1pMlKPk0RJrJ8j4K0j2Jj0J4j3jNokJ5rMNnKnJ1Jj0J3nj2PmRj1PjjJjMP
4349H%j4J1klkNnjOmnrJ0JoKQmOomK%PlnNmJ2l%Ojj3%Oj1j1K6J0%kj2ojJJ9Kk4
4399h%Mk0OJ7J5j6%omj8J7K4j3pKQk9J5K6Mk5%J4k3pL5K6j8rkk7j9L8K2j6j4N
4437ckk1KL5J8l6qJ1j7j9N5kj1j1J6k6j8K4K7kl1J4pl1J8N0ml6KOl4MM6K6k8o
4473ANl4j1M8L4j9k7Pln1L2N2qk4JJ2o4K2O4Om2J0Nm8j7N1M2l5k2L1k2o0M0P1
4507D7l1l4J2K7p6PP5%m3J3L5o1l6Q3L9o9rM7j8n1K2Q3n2n3P4Jp7j7J00j3n5K4
$$ plain form
4214 1 -5 -16 -23 4 2 -3 0 -2 -30 -16 -1 -8 -12 11 8 -6 -14 -6 8 15 18 22 11 -17 -4 4 14 11 16 7 -9 -5 7 -1 -8 9 8 -12 -13 0 6 3 -5 -5
4258 -5 -13 -12 5 1 6 -1 -6 -8 -10 8 3 7 -2 7 15 2 -4 0 7 5 6 16 -1 -11 1 12 3 -9 16 -6 -3 -7 -3 8 -3 -2 -1 5 -14 2 1 -1 4 3 -9
4303 -9 2 -5 -1 -4 -2 5 -15 -6 -5 -14 4 -10 10 -2 -1 -11 3 -10 -11 -6 -12 -14 1 -8 -4 1 -4 -2 -7 4 5 -5 8 3 -9 -2 -6 3 -8 -1 -2 -3 -2 -3 1 8
4349 8 8 -6 5 3 0 -2 3 -2 -3 3 -1 -6 -15 -5 -4 -10 -8 0 -4 2 -4 -8 -6 -6 1 -2 -7 -2 -6 6 3 3 9 8 -5 -5 1 -10 -21 5 15 15 13 1 -5 -6 -5 14 16 -8
4399 -8 -8 -4 -24 -18 -1 14 -2 -2 -8 -12 -30 -13 11 -2 -9 -7 1 -28 -13 13 17 -8 -8 6 -17 -24 11 37 19 10 8 -19 -38 0 22 6 -8 -3
4437 -3 -5 -26 -24 11 29 -7 -15 -4 -21 -40 15 13 2 -9 7 -19 -37 -13 14 12 -19 -5 -12 -43 -25 25 21 -15 -13 -7 -41 -37 9 35 7 1
4473 1 6 -28 -39 9 43 24 -3 4 1 -50 -18 34 26 2 3 15 -49 -27 37 43 1 11 16 -32 -49 2 44 9 -13 18 -4 -64 -24 47
4507 47 16 -18 -6 21 -55 -48 27 27 -16 -3 32 -29 -65 18 57 -12 -21 26 8 -43 -21 62 10 -43 31 32 -45 -62 38 25 -30 -6
4539fN3o7m8P9L6p4KP5l7p2N4N4m4m5N4K9r1MR4l3p8M0P3o2l9P4K3r0rJ06k3q2
4571e0O0N3p0o1Q3K5n9RP6m9r7N1P5m3l4R2k0r8j4J04j1o1O8L5j03n7J04L3o4
4600b3J9Q2q7q7O2Q7n0l2Q0l2j08L0J03j3o2O0Or1k9J18K8o9RN0q6o0Q0P8n1k0
4630hM4k5j02M5J15j8o7M6Kj08k0J28L6p7K3K5p8q8J11P6l8j5M3n0j17M5J12m
4658C6m1N4j0j17k4J10K9l4K8J9q4o6P3O9k6NM6o9q9L6Q8k3PM2k2r6k9J04K2l4
4688DJ9K3q2n8Q3M6l2jL8n3q0N0Q0j2k5J9j3p4J0R9ll9L0J1q6j4O5N1m0rK0m4
4720a7n7M9O1j6k5N0l9p5K4O6J5l6J6J4o9k7P3J3k7J4K3m1m4L6L9k9PK5l0l5Q
4751c4M9pj8L5j0m9oM9J5l0RJ9l6k2L4L2k6pJ1ll3J3L5qk7K1J0k5lL5j5j7J8N
$$ plain form
4539 -6 47 -20 -68 11 47 -27 -25 50 13 -59 -5 49 5 -40 14 43 -48 -44 50 17 -61 -21 52 -10 -49 25 48 -42 -51 55 32 -50
4571 -50 10 63 -7 -68 15 40 -19 -10 66 17 -80 -29 46 3 -31 61 41 -57 -71 33 22 -39 29 64 -39 -96 8 41 -23
4600 -23 -4 78 -9 -96 -34 53 3 -29 51 19 -89 -59 44 31 -31 29 35 -56 -85 33 61 -8 1 51 -35 -95 -15 63 12 -8
4630 -8 36 11 -91 -46 69 51 -16 30 32 -76 -96 32 68 -9 14 39 -39 -127 -16 60 22 7 50 0 -117 -72 40 36
4658 36 -5 49 39 -78 -102 8 37 3 31 50 -34 -100 -27 42 16 21 67 -2 -91 -55 33 10 17 59 37 -59 -88 16 38 4
4688 4 23 46 -36 -94 -11 35 3 2 40 -13 -93 -43 37 25 0 19 6 -68 -58 41 38 -1 29 40 -46 -60 5 56 16 7 27 -17
4720 -17 -74 -25 36 20 -5 45 6 -69 -45 21 36 0 16 30 -39 -66 7 20 -7 7 30 -11 -55 -19 20 -9 -2 23 -7 -42 -34
4751 -34 15 8 -10 25 15 -34 -40 9 24 -6 3 22 -14 -36 -2 30 4 -3 8 5 -28 -15 20 12 -15 6 16 -9 -12 23 8 -9 9 14
4785A4k1oJ2J8k0Qjrj1PJ1nj1J1j0j7K1J7k5J2RJ1l2LJ1Pj0OJ0qj9K4JooQjj1
4823hJ1J1j2mMjj0RJ1j1Jkj5OJ8j0Mj2LPlJ1j6mjJ%J0mOLj6PJ4j5OKJ3j2jJ9j
4865A9j9pJ1oQkMj2NJ%JRprpKK0nJ0npmLqQLj7J4j4RLplJ4j1RQ%%j4mJ1QmpMR
4913A4k0J5rLlnJ8mpNPj0j1NJ4j1knj0J4RpmJ7qj9RJ2kj7J6LqqJ7jj3lJ0lj3M
4955a1J7j4oJ9Qk2mJ8Rj5JJ0Kj3QKj2kK5jk6nJ8nk3L3Qk8rK9ok5J9K7k1k9K7k
4993Aj6kL0nk3LJ9mj9K2J2k2pL4j0l1J4J9j4j0J5K4n7J4K7ok2J5J6k1k7L7J4l4
5027a4KL4j8l3K7M3m2j7L2j4j9J6M2m9j7K7J7m9J3N1j2o2L1L3k2m1P1K0p0j7M4
5058Gj1l7M5O3o9m1O1ln4L5P9m2p5L0L6o1rJ11j0j00J1O7m3n1R4M6j12l3R9nr5
$$ plain form
4785 14 -7 -13 -1 17 -3 5 4 -5 -16 -9 2 -3 -14 -3 -13 -30 -9 8 -17 -5 4 15 -17 -14 -3 4 -6 0 10 2 -17 7 8 2 -4 4 3 -8
4823 -8 3 14 2 -2 2 1 -9 0 11 0 1 -1 -16 -10 8 -2 2 -10 -7 0 -3 8 -8 -12 -13 -12 -12 -2 -6 0 3 -13 -6 8 -7 -1 1 14 2 1 20 19
4865 19 0 -7 4 -2 6 4 8 -4 1 2 2 3 12 5 -4 -11 -9 11 6 16 11 4 0 3 -5 3 6 -11 3 -11 -2 1 -6 -9 5 -6 3 11 11 11 -3 -7 4 12 8 1 5 14
4913 14 -6 9 0 3 0 -5 13 9 2 7 14 4 -7 -2 12 1 -1 -6 -16 -2 7 0 -4 13 5 -14 -5 7 5 -12 4 7 -1 -9 8 7 -6 -9 1 -2 -15 -11
4955 -11 6 -8 -14 5 13 -9 -13 5 14 -1 0 10 12 -1 7 9 -3 -5 20 19 -7 -12 6 1 -22 11 19 -9 -18 11 5 -20 -1 26 5 -24 3 1
4993 1 -15 -17 13 8 -15 -12 7 3 -16 6 18 -4 -11 23 13 -18 -4 15 1 -9 6 30 -27 -13 14 8 -14 1 17 -4 -31 6 20 -14
5027 -14 -12 22 4 -29 -2 41 -1 -18 14 0 -19 -3 39 -10 -27 0 17 -32 -19 32 20 -42 -11 22 0 -41 30 50 -20 -37 7
5058 7 -4 -41 4 67 -2 -43 18 15 -39 -4 75 33 -42 -12 24 -37 -46 65 55 -45 -34 33 -10 -61 33 79 -33 -66 33 28 -67
5089f7N2P8o5q8Q7N3q3qJ05k4j17N0R1o5n6J01J0j30KJ13kq6O9O5j06p1J09M8
5117F5r1OJ06o5j23P4R4q1l8J12kj32JJ31m5r1J02P7j37n4J12J8r6M3J21q3j31
5144a07Q7R3j12j5J42jj71J7J36p9q1J31Q3j54p0J40Jj12O9J39j24j29J02R1j24
5169d8PJ54n1j66M1J35p7o6J50L6j95m0J66Kj12Q3J06j54j27J53Q6j24OJ45p4
5194C6j86R5J55r4q1J47K7k16QJ88k6j34J08J05j67j01J81N7j47QJ52q7j65J19
5218a8J39j37p6J55K0j83K8J85p4j45J06J15j51q1J75K3j72L5J60q9j40J29J07
5241A11j50o2J57J0j71M6J67p1j39J16Q6j56m7J66J5j54L7J46r8j28J40R5j39
5264b3n3J37j1j57N2J62q3j23J16O1j50j6J76nj55L4J13j05r1J46Q5j33n5J22
$$ plain form
5089 -67 -15 63 -2 -90 -3 50 -33 -41 64 40 -77 -27 64 -1 -57 44 54 -76 -74 39 37 -49 20 85 -21 -92 17 65
5117 65 -26 -20 86 21 -102 -28 66 -15 -53 59 57 -75 -74 57 12 -79 23 100 -37 -91 21 39 -57 -14 107 24 -107
5144 -107 -20 73 -39 -54 88 87 -84 -67 69 -10 -91 40 123 -31 -101 39 40 -72 -3 136 12 -117 -15 76 -48
5169 -48 -41 113 62 -104 -63 72 -5 -71 79 115 -80 -120 46 48 -64 19 125 -29 -156 -3 83 -41 -35 110 36
5194 36 -150 -55 100 6 -75 72 99 -117 -109 79 53 -81 27 132 -35 -136 45 102 -45 -37 115 28 -137 -18
5218 -18 121 -16 -92 63 83 -100 -72 113 39 -106 0 115 -36 -117 58 81 -91 -56 104 15 -125 4 111
5241 111 -39 -101 56 66 -105 -59 108 37 -102 14 100 -56 -103 63 78 -76 -39 107 9 -119 21 116 -23
5264 -23 -76 61 50 -107 -55 107 24 -99 17 78 -72 -88 88 83 -72 -38 75 -30 -121 25 110 -23 -78 44
5288D4oj44P9J42r8j01R3N3j24j2J70k3j46L2R7q9o2J34N8j27l9J12k8j10Q7J25
5314A17j07r6R1M1j14K8J34l7j30M8Q0p8l8J04M3j34oR6k7r9R6Q8r8p0Q8J4j14
5341h0M8J19n1j12O3N8q7k6J29J1j14nR3m2n7P9M9q3m7O8J2p4L2Q5n1p2N7L5p7
5370d0J2O6Nq8J6O4m9l8O7L5o2k8O2qo6M5N0l5m9M0J9l5j2O4j5n1J8M4m0nL2J3
5402C1n4J6K9ql3K5K7l4k3K4K1l2JK5Ll3J0QLj6K0J1l1j1L0pj2RJ6k7%K0Rk6J0
5437AJ5k5qJ0K6k6jJ1Oj2PK4l0qJ8Rk4nL1j8j5J5J9jk8J5Oj2pJ9j0j2QK0j2l0
5473b4L2J4l6%K2j0j4K1Qj6k6M1J1n4J4L8j6m0K3L8l4k0N1Rn0kM8j5l5K1N3o6
5505a4j8M0K3m6oN4k0n5M5L4m9j5M8%n7RP6m2n4M0N6o7l5R0pp2J4Q2m0p2N7N0
$$ plain form
5288 44 38 -106 -27 115 17 -84 9 62 -62 -74 96 73 -73 -41 56 -33 -95 39 97 -30 -69 43 15 -95 -8 117
5314 117 10 -86 5 46 -68 -40 94 57 -73 -25 55 -23 -61 43 86 -48 -54 42 15 -84 12 100 2 -68 20 34 -80
5341 -80 -32 87 36 -76 -13 45 -42 -68 61 72 -42 -47 46 4 -53 26 75 -8 -55 13 25 -49 -17 68 17 -55 2 37 -40
5370 -40 -28 38 43 -45 -29 35 -14 -52 15 50 -12 -40 22 14 -52 -7 43 8 -41 -1 18 -17 -29 35 20 -31 -13 31 -9 -14 18 31
5402 31 -23 -7 22 14 -19 6 33 -1 -24 0 21 -11 -10 15 18 -15 -5 3 6 -10 10 21 -10 -21 9 2 -10 -1 15 -12 -12 8 17 -9 1
5437 1 16 -9 -17 -7 19 -7 -8 3 9 -3 4 28 -2 -10 8 17 -7 -12 19 1 -14 1 20 19 -9 6 12 0 -7 12 2 -10 -2 18 6 -24
5473 -24 8 22 -14 -14 8 -2 -16 5 13 -3 -29 12 23 -31 -17 21 5 -35 -12 26 -8 -28 23 32 -18 -20 28 13 -22 -1 52 -14
5505 -14 -32 8 31 -15 -21 33 13 -42 3 37 -12 -27 21 21 -36 -27 49 7 -47 -7 49 -18 -53 37 30 -42 -28 54 14 -58 -1 49
5537D9o6l3R9rj00L2R0m8o4P2M4j10k3J21Kj06K9R0q7o9J11O3j31k3J36m6j18
5564i5P0J31j08r2J30N1j68kJ68k6j56Q7J24j35j03J57O8j62qJ71o2j97J28J62
5588A33j40j13J89L2k25J0K53o6j97J36J41k26r7K59M1k34L9K22j27k30J88J92
5610A80k20q9K42Ml07O9K87j03k15J93J54l00j16L37M0k80P4K50k19k48K69K17
5632B19k68q9K99n1l68J34L60j82k31K70J23l75r1L99J1l28J38K88k87k80L21
5653A2K28l14n2L45j05m08J75L64k15k12L20Q2m29m0M33n5l28K08K70l48k58L78
5675E1J60l52K4L82j73m25K39L22k69j58L78M5m69NM39j07l08K82K37m01k35M24
5697I1J00l47R0L92k65m31K98L19l03j18M28m4n31P7M59j44k79L36J94m97j88
$$ plain form
5537 49 -17 -50 49 40 -60 -28 62 14 -50 22 66 -44 -67 54 56 -50 -21 69 -18 -87 24 87 -44 -67 69 23 -95
5564 -95 -25 106 -2 -94 36 87 -81 -83 85 59 -97 -10 114 -21 -124 33 101 -61 -69 102 40 -157 -29 133
5588 133 -7 -120 69 101 -124 -114 139 73 -124 12 153 -73 -170 89 130 -104 -65 157 30 -200 -12 180
5610 180 -40 -129 113 117 -190 -121 166 63 -152 41 195 -105 -221 116 156 -124 -50 200 -19 -267 2 219
5632 219 -49 -138 161 110 -258 -124 236 54 -177 93 216 -159 -250 149 160 -168 -30 258 -29 -309 12
5653 12 240 -74 -126 219 114 -294 -119 245 30 -182 138 220 -209 -249 184 129 -199 9 279 -69 -327 51
5675 51 211 -141 -117 265 92 -333 -94 228 -41 -199 179 224 -245 -240 199 92 -216 66 303 -98 -333 91
5697 91 191 -156 -66 326 61 -370 -72 247 -56 -174 254 210 -321 -244 215 71 -208 128 322 -175 -363
5718c63M65Q2l63J78L61l47m12L30L09l40l3M34j10n40J24M32j79k34L83J47n24
5739b00j43M55L5l39K38L37l96l73L70K23l34K1M46j52n21J61L74k21j78M25R0
5760C18n28r4M38n2k91K81L11m35l19L85J68l61R1M33k09m83K11L27k52j24M45
5781B60J4n05k3L85q9k55L16K58m30k50L70P8k99J65L60k60m16K33K54k50l2M09
5803B93m9m94M0L52j28j92L20J85m30j93L44M1k66J85L12k73l39K36J82k50K2
5824a02L68q0m15P5K80j62j34L31J18l96j16L04qk44K23K72k90k81K45J42k54
5845a24M5L45j21l60R2K46j67r2L00O6l65n4K70m7j97K09K08k65k03K26Q1k23
5867a30P2K93j39k92J31J81j81p6K87K6l05j5K38p5j69K06J52k42j37K05L8j92
$$ plain form
5718 -363 102 184 -179 -1 360 13 -399 -69 240 -100 -133 301 191 -349 -225 207 28 -206 177 324 -200
5739 -200 -343 112 147 -192 46 383 -13 -386 -16 207 -127 -106 340 188 -333 -172 202 -19 -197 228 318
5760 318 -210 -304 134 82 -209 72 383 -52 -371 14 182 -179 -88 345 136 -347 -136 191 -61 -185 260
5781 260 274 -231 -254 131 42 -213 103 361 -69 -319 51 129 -170 -5 355 95 -321 -88 166 -84 -116 293
5803 293 244 -250 -210 142 14 -178 142 327 -103 -296 48 89 -177 8 320 47 -292 -56 126 -124 -102
5824 -102 266 186 -229 -154 126 -36 -170 161 279 -117 -233 71 63 -181 42 314 24 -257 -12 130 -124
5845 -124 -79 266 145 -215 -123 123 -44 -136 164 230 -135 -189 81 34 -163 46 254 -11 -214 12 93 -130
5867 -130 -58 235 96 -196 -65 116 -65 -141 146 172 -133 -148 90 15 -154 52 204 -38 -175 30 68 -124
5889a24Q5K19j26k24J50J23j77l4K38mk46K4J88r3j29J97R6k18p8J92nj63P5J74
5913A40j29j44J21R0j40k2K01l9j92N6J38r5r2J45N4j55j8J24nj24R0R4j04q7
5937i3J15M3j25J3J23k9j23O7O6p1m1J07Kj09J4Q7l2p3O0O2q5m1P9L2q6J5O9m4
5965Bo9M4O2n5l1P6rn5J0N6k7n2N0K5l8k7O5k1m5L4K7k7l8M5K6m0j6M7j0m4L3
5996bL0l3j2K8J4m6jM8j8l4J2L7l1k0L8Nm5J0L9k0l3L4K4m1k9M9J1m9J0N5j6n3
6028c9M0K7k8m1M9K6n2rN0k3n4L8N3m4l5M8K9o3RN4k8m8L1M5n7k1N0J1o7J7O6
6059C4k9o2N8L7o1l1P6J5q9K0P0l2p2P2N5r5k6R3qq9L5J02n8q1O2O7j05k8J23
6088E3kj10J5J22q8r7J28O4j30k6J31k6j35O9J39j12r1J12O1j59j0J90k9j83P7
$$ plain form
5889 -124 -39 180 54 -170 -20 103 -74 -108 130 126 -120 -96 92 -1 -130 67 163 -55 -133 59 54 -109 -34 140
5913 140 11 -133 -12 78 -62 -84 117 78 -114 -58 80 -15 -107 38 92 -63 -81 43 38 -86 4 98 -6 -93
5937 -93 22 65 -60 -47 76 47 -76 -9 57 -14 -55 52 54 -55 -41 46 14 -59 1 63 -22 -63 16 48 -38 -23 46 2
5965 2 -67 -23 39 -16 -47 29 20 -35 -25 31 4 -48 2 27 -11 -38 27 6 -39 -5 22 -5 -43 2 28 -12 -28 19 9 -35 -2
5996 -2 28 -5 -17 11 25 -21 -22 26 8 -26 -14 23 -8 -28 10 15 -30 -20 19 -1 -34 0 24 -17 -46 3 14 -35 -25 30 14 -39
6028 -39 1 28 0 -41 8 34 -18 -27 23 0 -54 -16 37 -7 -42 6 35 -28 -19 35 7 -41 -10 35 -22 -43 7 18 -49 -32 34
6059 34 5 -57 1 38 -23 -54 22 37 -52 -32 38 6 -66 6 61 -34 -60 33 25 -64 -29 73 15 -66 -4 63 -42 -70 53
6088 53 51 -59 -44 78 -10 -107 21 85 -45 -71 60 34 -101 -32 107 -5 -96 16 77 -82 -92 98 69 -114 -37
6113c7J41j28r9J71P4j96k5J90n3j85J35J81j60j53J86O1k35L1K60n6k44J04J73
6136A36j94j12K66R7k91j6K45j04k29K02K35k35j76K51L6k92M8L41r9k90J63K00
6158A82k82j27L60Q0l51J3K89j54k83K74K69k78j83L05Ql60J08M00j46l24K13
6179A3J72l35r5M47L8m10O9L21k24l01L58K70l73j50L60o3l85J97M20k46l33K94
6201D4J56m10n2N19j7m55J13L40l36k48M65K38m71j07M11j27m26K91M69l32l40
6222b75L73R1m84M6N97j13n03K04L22m08k31N74J93n33m0M34k20m37L89M69m17
6243C1l09M16N2n40J05O27j66n06K83K84m78j84O29J24n63LM70k86m37M67M39
6264D61m95k75N02k4n65J92O40k59n31L63K84n37j34O85N9o39Q9N04l61m26N65
$$ plain form
6113 -37 104 -24 -123 48 122 -74 -99 91 38 -147 -12 169 9 -144 42 103 -132 -101 159 103 -141 -37 136
6136 136 -58 -170 96 193 -98 -114 131 27 -202 0 235 0 -176 75 111 -181 -133 208 109 -181 -18 182
6158 182 -100 -227 133 213 -138 -125 164 10 -273 1 270 -8 -191 114 122 -238 -130 270 124 -200 13
6179 13 185 -150 -245 202 240 -170 -101 220 -4 -305 53 323 -50 -200 160 97 -288 -91 329 83 -250 44
6201 44 200 -210 -262 257 240 -215 -102 238 -98 -346 119 357 -114 -221 190 63 -363 -72 397 65 -275
6222 -275 98 189 -295 -249 348 235 -268 -64 258 -150 -381 193 386 -147 -187 247 27 -410 -21 448 31
6243 31 -278 138 190 -350 -245 382 216 -290 -7 277 -201 -385 244 368 -195 -192 278 -8 -445 22 461
6264 461 -34 -309 193 169 -396 -204 436 177 -354 9 293 -244 -378 307 366 -273 -184 320 -41 -467 98
6285I8L83n77k17N36o2n81K81O05l29m93M01K47n73o1O94k7o20J50M65m03l58
6306d41N70L22n86j70N51j34n42L29N70m17m23M50J95n57lO47p9o16K29M13m19
6327a11k95N98K36o18q1N28j50n10L65N11m67l78M78J42n52O5O34j73n68K73L87
6348C14m43k36N80J57n95l0N08j89m40L86M01m55l16M72J04n07J14N50k17m92
6368c34K64L34l91j75N33P0n33L0M31j83l66L77L19m39k35M27M9m31J27M73k52
6389I5l95K85K63l79r7M55J8m79O3L94k02k90L56K25m14j60L83K4l69J54L66k48
6411D8l31K75K14l24n2L87m2m04R9L22j98k12L18J42l58r9L33j8k84J39K88k32
6433A1k27K37J31k64lL00p4k98J16K29j69j48K41Q8k68l9K45l8k11J34J79j81
$$ plain form
6285 98 481 -96 -313 223 161 -420 -139 466 137 -356 45 292 -281 -342 352 325 -295 -145 320 -83 -441
6306 -441 129 451 -135 -305 246 112 -430 -101 469 52 -371 79 274 -283 -286 361 282 -334 -105 308 -111
6327 -111 -406 192 428 -190 -271 257 107 -403 -38 473 6 -372 106 248 -304 -239 395 222 -346 -73 314
6348 314 -129 -365 215 372 -223 -253 255 66 -374 12 413 -42 -358 114 218 -289 -175 375 158 -334
6368 -334 -70 264 -127 -302 231 301 -232 -202 229 46 -320 57 376 -63 -298 129 178 -253 -126 347 95
6389 95 -300 -15 248 -131 -228 227 245 -234 -171 223 21 -269 87 312 -102 -262 121 145 -224 -70 296 48
6411 48 -283 -8 206 -118 -170 217 175 -229 -130 192 -6 -218 100 242 -116 -215 118 100 -184 -45 243 11
6433 11 -216 21 152 -112 -115 185 111 -187 -71 158 -11 -159 82 170 -98 -137 108 70 -141 -7 172 -9
6455ij64K08P6k05QK28r0k07J26J46j45r3J94M4k09nJ93o7j43J22J11j47r0J62
6479D4L4j44K1J56o8j42Q5J08j16l4J21Lj39K1J10l7r5R3M9j01n0J17Lr5L9R2
6505G5o6q1P7M3p8k2R2j0p8K0Q4o4m4P0L0p8NO2j1n3K3N6n4l7M8K7o2J1N0k4m9
6536c8L4L1l0k2M7J0n2KM1k2l2L1L7n5mK6Ql3JL5j6l7L3K2l6rK9J0k6nK5j0j8
6569b3K1J1k0rK7poKK2j7j6L0Jk7KK7nk3J7J9j7k0J4J4l0KJ7j2j9RK9k2JOJ8k6
6605a0%K7k0k3K2Kk1lK1J8l5J0K2j2k4K0L0k9j8L9qk6J2L4k1l2L4J3l7kL4Ol5
6638a2ML1j1m7L4K5m6rL5Jm3K2L6k2l5M7J5m0k5O5lo6L2O1n1n3O1K9o6j0P0pn9
6671c7J8O3m0m8O2K7p9mO7no6K9P0m6p0P2L9r3LQ6j9r6M8P0o3n6R6K5j01nJ08
$$ plain form
6455 -9 -173 35 111 -94 -86 142 52 -155 -29 117 -28 -121 73 117 -92 -97 96 29 -114 8 119 -28 -118 44
6479 44 78 -66 -45 111 43 -99 -14 94 -22 -56 65 68 -71 -50 60 23 -72 21 70 -31 -81 36 39 -56 -17 75
6505 75 9 -72 5 48 -30 -52 40 30 -48 -28 56 -8 -52 18 48 -30 -25 37 26 -27 -4 52 -2 -39 9 36 -26 -15 35 11 -38
6536 -38 -4 27 -3 -25 22 32 -20 -18 23 1 -31 0 37 -18 -22 4 12 -21 -20 15 -1 -38 -5 17 -19 -28 1 11 -15 -20 5 -5 -23
6569 -23 -2 9 -11 -20 7 0 -6 -4 18 1 -15 15 16 -11 -9 18 13 -10 7 26 9 -11 3 17 -13 -11 6 -6 -25 -16 13 -9 -8 -2 16 -10
6605 -10 -10 17 -3 -26 -4 -2 -23 -26 -5 13 -22 -12 10 -2 -26 -6 24 -5 -23 16 8 -18 -6 28 7 -25 9 22 -15 -17 17 23 -12
6638 -12 -8 23 12 -35 -1 24 -22 -31 4 5 -38 -16 20 -2 -37 10 25 -15 -40 25 22 -44 -12 49 -2 -55 6 35 -31 -41 29 22 -37
6671 -37 -19 44 4 -44 18 45 -34 -38 29 24 -42 -13 57 11 -59 13 52 -41 -38 48 29 -67 -19 51 -12 -68 28 53 -48 -53 55
6702E5k6j00O8Q1j04o2J18L1j18MJ27n1j09P2J01j05n3J22%j28K2J32n2r9R0Q1
6728I7j20o5J27K5j31K6J26o4j11Q0Q4j14m2J52oj51L6J26o5j20J26P8j53l1J46
6753E6qj45O0J32r5j04J18O4j23k4J48k6j44O1J20r7p9J24L7j41OJ33l2j27P7
6778iJ04r9q7J36K6j29J3J22m0j39R2R5j11m8J35Kj35K6J28p8r2J18O7j31m1J21
6804D6j3j23P0J08q6q8J01N7j21kJ28l2j30O1J14j04o3J16N0j33qJ30n3j08Q9
6829FQ4r6n7J19pj27M5J20o5j07J07N0j30k2J47j9j20M9R8j00o6J25M9j34OJ19
6855G4p1j14R3J12r4p9J30%j57L2J63o2j03Q9M7j17l7J51J6j34N4R4j04q8J18
6880A3Q3j25k3J31n0j43P3J42r4q0J20K8j63LJ56k3j26Q5R4j42q1J59N4j43RJ35
$$ plain form
6702 55 29 -71 -3 78 -26 -88 30 61 -57 -53 74 23 -86 -14 87 -18 -71 51 51 -77 -55 77 25 -74 16 97
6728 97 -23 -88 39 64 -67 -41 85 21 -90 -10 74 -40 -82 70 64 -87 -51 75 10 -110 16 94 -59 -90 56
6753 56 48 -97 -37 95 0 -104 14 78 -45 -69 79 53 -91 -30 90 -7 -86 38 75 -66 -60 73 41 -86 -9
6778 -9 95 -4 -91 45 71 -58 -45 77 37 -102 -10 85 -26 -74 61 63 -72 -46 82 4 -88 30 97 -34 -75 46
6804 46 33 -90 -20 88 2 -86 15 72 -49 -51 77 45 -85 -24 90 -14 -77 39 89 -44 -52 78 25 -83 6
6829 6 90 -6 -63 56 49 -78 -33 87 22 -85 22 72 -58 -80 67 48 -72 -23 75 -25 -91 34 83 -51 -45 74
6855 74 3 -111 -18 94 0 -79 51 51 -106 -74 89 27 -76 13 60 -57 -94 57 73 -61 -7 87 -17 -105 13
6880 13 96 -29 -52 79 29 -114 -41 101 7 -73 47 75 -88 -85 71 48 -78 7 101 -41 -122 37 91 -52 -43 92
6906I2p2j58J19J34j23o4J54j8j70M3J64o6j18J08O1j54n4J98J7j42L2J27j09
6929Aj41J34J26j47l3J34l5j69N3J85o3j27J17N8j86k5J81J3j53P2J15j42j18
6952a50J57J03j54qJ57n7j81Q2J62j07q0J48J8j80k0J95k4j39Q3J08j38j15J70
6975C0P2j62J4J64q8j70J11J47j25p9J45K1j88K2J78l9j42R7Q5j57o5J71M6j56
6999f8JJ70q8j45J18J20j29m8J31Pj70L8J52m6j26J08O7j45m0J62J4j34L2J06
7023H7q4r9J04Q7j05m7J27k3j31L4J30o4q5J02L9j24k3J36qj27N7R1p6q4J08M8
7049G0j09nJ07k1j22N4R7p2o0Q9K3r6qJ02j5q5N1N9p2m5R2K1q4OP8m2p4N7O6p0
7079hm0Q4jq7J8P6j1q3N6M6p1j3N8J2n8PN1k9n8M6M7n2j4N5ro0K4M7k7m5N1J7
$$ plain form
6906 92 20 -138 -19 115 -8 -72 82 64 -106 -63 101 35 -83 25 86 -68 -122 76 93 -49 -17 110 1
6929 1 -140 -6 120 -27 -60 74 39 -130 -77 108 45 -82 35 93 -93 -118 63 76 -77 -5 110 -32 -150
6952 -150 7 110 -44 -52 105 48 -133 -51 111 4 -76 72 90 -90 -110 85 61 -78 5 113 -25 -140 30
6975 30 102 -60 -46 118 30 -140 -29 118 -7 -86 59 80 -108 -86 92 53 -89 8 93 -64 -129 42 88 -68
6999 -68 -67 103 15 -130 -12 108 -21 -69 62 69 -101 -63 89 43 -83 25 92 -53 -93 69 83 -51 -19 87
7023 87 3 -96 8 95 -10 -57 70 47 -84 -50 80 16 -69 33 72 -52 -75 61 53 -74 -17 74 -2 -86 22 70
7049 70 -39 -44 63 42 -80 -26 71 -1 -61 28 51 -45 -53 49 34 -51 0 59 -13 -58 34 55 -29 -23 55 13 -61 -4 62 -8
7079 -8 -48 36 35 -52 -34 42 31 -52 4 50 -21 -34 24 36 -22 -15 36 7 -51 -5 42 -10 -24 31 22 -38 -14 33 6 -39 12 29
7111B9m5j6N9mn1KN7k9l3M0K5l5l0N1jl6lN8m7j2L7J3m6lM3%m2RM1l4l2N0J3l8
7145a0nL1jn0L2L2l3k2L9J2m0OL3rl5K3J6k1qK9Nl8jN0k4l1K0L7n3j0O2rm9MM2
7180B4k6k5L4K1m3j6M9Qo2K0N4n4l5N1L5o5rO7j2n4L0M8l4n8O4L3q2qQ8lq7L2
7212a5O5m8o1P3L4q1j1R1j3r9N1Q6o8n8P9K6j18LJ21pj28O9Q4j09o5J19N7j38
7240f1JJ22k7j38Q9J02r9q3J28L8j41jJ54m1j36O8J41j43q3J53N7j51k4J71n5
7265D1j67J14J32j38r5J72K5j89K0K05n7j80J16J23j78q3K08M0k06K6J87j00j74
7288a58J57J58j88r7K18Lk39N4K37j06k03J88J31k35q2K67K2k59P3K35j58k25
7310b07K19J84k50r8K90k5k99R6K79j54k30K41J30k95o3L26ol19J19K67k08k38
$$ plain form
7111 29 -16 -32 27 23 -28 -26 31 2 -31 9 34 -1 -31 20 19 -17 -20 38 -9 -21 16 29 -17 -20 23 23 -19 -10 31 -3 -35 15 28 -10
7145 -10 -15 16 15 -35 -3 29 -4 -26 13 25 -15 -9 24 15 -20 3 19 -2 -10 19 24 -14 -15 35 11 -20 0 37 -16 -26 36 27 -22 -18 24
7180 24 -2 -27 7 28 -15 -31 18 26 -36 -16 38 -16 -51 0 35 -30 -39 28 16 -38 -8 40 6 -52 12 45 -37 -45 43 40 -47 -15
7212 -15 50 2 -59 14 48 -33 -44 47 34 -65 -14 72 4 -54 25 51 -67 -64 57 50 -78 -9 75 -34 -99 20 77 -61
7240 -61 -60 62 35 -103 -14 88 -11 -94 34 72 -69 -70 84 43 -93 -25 116 -27 -110 43 100 -51 -75 96 41
7265 41 -126 -12 120 -18 -113 59 84 -105 -85 120 63 -117 -1 122 -56 -139 69 109 -97 -71 116 16 -158
7288 -158 -1 157 -31 -128 90 93 -146 -92 145 39 -164 24 155 -80 -162 105 127 -132 -59 176 18 -207
7310 -207 12 196 -54 -152 138 113 -186 -90 189 35 -195 46 176 -119 -182 144 138 -181 -62 205 -3 -241
7332b41K92J56l20m5L32o7l52J68L11k28k27L08J24l75k7L83n0l53J69K88k89
7353d3k18L45J51l64l5L94j21l68K10L14k80k16L59Q9m11KM21r1l68K08K96l35
7375f1k19M01J19m10OM09j59l81K60L36l41k15M01N9m46O0M41j48l78K69K73l75
7397i9j83M45O5m31O5M02k20l59L34K88l85j62M23J1m63J25M36k03l51L08K37
7418B83m31j18M67L1m61J36L79k73l40L66K71m17j31M42m9m51J68M34k55l33L51
7439F9J95m27r2M65j7m31J50L74k99l04L94K10m08r0M41r2m27K04L93k80k83L49
7461I4J47m32k6M60o5m26J92L16l12k41L95J75m24m2M11j18l99K41L35k94k43
7482b56L53J02m01kM50j10l64J90K75l15j96M01J17l95pL62j45l40K54L11k97
$$ plain form
7332 -241 51 207 -113 -158 174 107 -245 -77 234 6 -221 87 211 -164 -191 192 142 -211 -42 246 -43
7353 -43 -261 84 235 -129 -164 230 109 -259 -49 265 -15 -231 128 217 -194 -192 229 138 -230 -22 274 -61
7375 -61 -280 121 240 -170 -164 245 86 -295 -35 301 -40 -255 146 205 -241 -181 260 112 -266 3 276 -99
7397 -99 -282 163 228 -203 -138 264 44 -315 19 307 -78 -240 183 194 -269 -144 292 89 -262 46 283
7418 283 -148 -266 201 232 -229 -93 286 13 -327 39 310 -107 -238 204 155 -296 -128 306 51 -282 69
7439 69 264 -163 -255 210 193 -238 -88 286 -13 -317 77 287 -121 -211 230 138 -289 -85 308 28 -255 94
7461 94 241 -191 -217 243 178 -248 -56 260 -52 -293 102 277 -147 -189 222 104 -295 -54 281 -13 -256
7482 -256 97 199 -202 -204 246 136 -228 -38 237 -78 -274 127 244 -151 -158 204 59 -281 -27 284 -13
7503a3j97L20O4l89N2L97j02l48J94K47l03j70L79J00l77L0L11j49k92K37K72
7524B63l06j49L17Kl32Q6L40j42k74K06J78k93j07L53M8l39N5K77j74k37K57J96
7546B25k75j04K79j5k89R2K89j55k23K00J46k66p3K99J3k77P5K20j62j80K14J54
7568A87k54o0K48l6k44R4K37j55j79K00R1k25k9K34pk32Q7J77j55j37K05R7k04
7591f0k9J89m5j95J00J78j34j11J69L6j85J2J73k4j78R5J19j36p2J51M4j68LJ60
7615I2o9j25Q7J26j26p4J42Qj34J1J53o6j06Q2Q1j26n4J40J4j19J8J05m8r7Q5
7640@Q0j04n1J10J2j19L9R6m9p8P1N2r0l1J00Jr1K7P7m1o8O9L9o4k7P8rp4J3Q5
7670E3n6m1N5K1m5k9O2J1p7L4M1j8n1M6K4n6j0N3Mn9K7M0l3l3N7om2NN9k2n1K4
$$ plain form
7503 -13 -210 110 174 -215 -163 234 132 -216 -22 225 -78 -248 131 231 -146 -116 195 46 -246 -9 263
7524 263 -43 -192 125 127 -205 -119 221 79 -195 11 189 -104 -211 142 190 -149 -94 183 9 -228 29 225
7546 225 -50 -154 125 110 -179 -87 202 47 -176 24 170 -96 -169 130 143 -134 -59 161 -1 -181 33 187
7568 187 -67 -127 121 85 -159 -65 172 17 -162 38 129 -96 -125 109 102 -130 -43 134 -21 -158 47 144 -60
7591 -60 -89 100 55 -140 -40 138 4 -107 62 98 -87 -75 98 74 -104 -9 110 -26 -98 53 97 -71 -68 92
7615 92 23 -102 -15 111 -15 -89 53 61 -73 -62 91 25 -81 1 82 -44 -98 42 56 -63 -45 60 12 -85 0
7640 0 80 -24 -75 35 47 -72 -33 63 14 -64 7 59 -31 -62 38 39 -52 -25 52 11 -57 12 51 -13 -40 38 29 -45 -32 53
7670 53 -3 -44 11 32 -13 -42 20 31 -46 -12 29 11 -40 6 30 -26 -36 17 21 -38 -11 29 -4 -37 20 14 -28 -23 36 14 -37 -13
7702a3L9k9k4M6J2m2nM0j7m1L4L0m1j6L7Qm3MM4j8k4J4J6l0jK6J0o1K1M9l0k3
7734b8J9L8m8k1N2Qo4L1M8k9n5N5K4n7%N3%o0L1M8n3m6O0K6n7j2P8j9o7L6N1n5
7766a3m2O7M0r3j2R7j6q1K1Q6o1n3P2M5j04qR9j5q7N2P9q2o0J00L1r9k0J23l0
7795C6j09P1Q5r1p2J11L9j29J0J31m9j08O6Q8j11o3J37L2j27j6J48m8j40J09J08
7820A08j31p6J58J1j51K6J53p0j51J22J10j39p4J71K0j76K0J86q8j47J38J12j83
7843e1o8K03Pj94M4K05j26j67J80J03j97n3K31k1k30O3K24j45j73J99J18k38n2
7866a38K51%k63R9K20j70j89K26J27k53m6K63l3k77J19K61j92j89K46R2k80l1
7888a57L34n7k97J31K39k38j68K89J23l14j6K92r2k84J73K69k29j87K97N5l46
$$ plain form
7702 -13 26 -3 -27 19 31 -11 -16 24 7 -34 0 30 -11 -27 10 18 -25 -21 23 5 -19 -5 11 -19 -20 6 16 -45 -24 25 -5 -28
7734 -28 -9 29 -19 -40 12 20 -44 -13 35 6 -49 6 30 -27 -27 26 26 -34 -3 45 -8 -54 6 32 -25 -37 41 22 -45 -9 42 -13
7766 -13 -55 12 52 -41 -53 44 28 -53 -32 54 -7 -60 12 57 -47 -55 44 29 -58 -6 73 -9 -69 31 62 -37 -57 66 36
7795 36 -73 -2 83 -8 -80 31 70 -59 -49 82 33 -75 -9 79 -32 -95 42 74 -53 -69 79 31 -109 0 108
7820 108 -23 -99 59 70 -81 -55 98 28 -123 -1 109 -30 -104 67 87 -89 -69 117 29 -118 20 132 -51
7843 -51 -119 84 91 -103 -59 146 20 -147 33 136 -61 -114 117 96 -134 -71 153 8 -165 34 152 -86 -138
7866 -138 113 113 -150 -51 169 -1 -190 36 163 -90 -136 127 94 -183 -64 197 5 -184 62 154 -126 -157
7888 -157 177 120 -177 -46 193 -45 -213 76 199 -115 -131 161 69 -215 -42 227 -2 -189 108 163 -183
7909a83L1L38q3k82J71K22l02j48L49Q8l23J7L12j74k95K46K55k84j44L24Nl70
7931b30Q2L69j46k83K42J96l58j15L87L7l43Q6L19k27k96L12K36l32j24L56l8
7952A30l87J42L73j93k76K77J50l90o5M22Jl72J28K86k86k45L64K06l51p7L62
7973A99j19l93K14L84k43k59L28P6m25%M59n4l58J82K58l52k18M19J62l59k2L68
7995B47j88l89K72L52k83k02L49K0m42N6M45j03l38K40K23l86j91M43J00l75N7
8016i3L43k22l59K97L17l19j67L74pm43R9M40j62l16K59K04m09j22M45O0m02J13
8038g0L17k63l10L47K80l52j15L49m9m23J58M01j94k79K78J46l99q1M26K9l65
8059a69J12K86k74k68L40K36l37p9L32p9l91J86L57k08k44K77J15l73m8M09k5
$$ plain form
7909 -183 -152 186 103 -179 -8 214 -88 -236 113 201 -122 -105 207 33 -262 -16 239 -45 -189 135 140 -230
7931 -230 -148 221 75 -208 34 230 -128 -243 144 181 -162 -76 243 16 -280 32 268 -64 -188 168 130
7952 130 -257 -115 258 65 -211 66 216 -174 -239 183 184 -188 -60 226 -60 -305 59 265 -86 -163 199
7973 199 80 -313 -99 285 42 -217 111 187 -238 -238 221 167 -191 -9 249 -103 -321 98 260 -99 -121 247
7995 247 59 -330 -58 294 11 -191 158 178 -264 -208 237 134 -204 36 259 -127 -318 125 225 -150 -93
8016 -93 250 28 -331 -34 283 -36 -203 171 164 -279 -180 260 98 -218 41 245 -164 -286 159 219 -183 -70
8038 -70 247 -16 -326 21 301 -51 -166 183 134 -289 -131 270 76 -203 75 221 -178 -259 167 196 -169
8059 -169 -57 229 -45 -313 27 263 -74 -153 179 100 -291 -105 252 44 -200 77 192 -181 -229 180 155
8080A55l23J32K65k75k45L51J59l09l1L13j17l25J78L12k11k05K62Q3l41NL47
8101A80o0k85J38K26k61j60L06J08k98JK65j14k65J89K40k30j54K69L2k87K9K95
8123A64q5k30J48J67k32j22K75O2k47MK47j26k17J84J93k20j05K26J5k39M5K41
8145A48r7j77J37J34k10p4K29L7k26L3J99j20j65J65J27j68q1J94Kk16O9J85j05
8168B0j40J30R6j76l2J75Oj80N1J52r7j13J21Q8j57l1J60j9j54P7J32r2j08
$$ plain form
8080 155 -168 -36 229 -46 -291 60 219 -90 -121 192 75 -250 -72 240 29 -176 86 169 -172 -167 180
8101 180 120 -165 -27 199 -62 -222 84 192 -106 -105 160 46 -219 -30 210 -20 -174 95 127 -160 -131 164
8123 164 79 -151 -3 164 -68 -190 85 147 -100 -96 151 25 -192 -8 185 -35 -140 86 101 -138 -93 148
8145 148 51 -126 11 145 -65 -139 90 127 -99 -66 133 13 -152 13 140 -28 -109 85 87 -129 -60 125 20
8168 20 -120 10 106 -70 -102 73 79 -101 -50 102 5 -108 13 101 -56 -87 73 54 -100 -23 109 17 -91
8191i1
$$ Imaginary data points
##PAGE= N=2
##DATA TABLE= (X++(I..I)), XYDATA
0@%%%%%%%%%%%%%%%%pJ5j6J6j6J7k5L2l2M0m8N0n8P1q1R1j06J21j37J54j71J90
38A00k14K39k65K96l29L65m04M46m93N45o02O62p29Q04q85R76j079J193j321J466
58G71j633J830k063K343k688L125l699M495n677P640j1661L3506p3145l4683J06518
73B4979l0264m8764R3889P1270j23036p5889Q2968K7645p3856M8492J03289o3856
85C6867j15720M7873O0878o2695n242J13555l171j23301l893Q1292l5718m6424
97e5699R3477N5298j07687n6145P8182Q383o9071N1551R3822o4753r7668M9533
109b0777N0048o2670K16J02177q755j10262M292P2729l4488l9484Q2518M1035
121G6579r5507m0771P1045J638n9065M8270P5128o1214p5537M9008L5363n8126
$$ plain form
0 0 0 0 0 0 0 0 0 0 0 0 0 0 0 0 0 0 -7 8 -8 8 -8 9 -16 16 -16 24 -24 26 -32 39 -42 49 -57 64 -73 81 -90 100
38 100 -114 125 -140 156 -173 192 -212 234 -259 286 -316 346 -383 421 -464 512 -567 626 -695 771
58 771 -862 968 -1095 1248 -1440 1685 -2014 2481 -3196 4444 -7217 26289 -46856 -81539 24979
73 24979 -5285 -54049 39840 111110 -11926 -87815 -4847 22798 -51058 -2566 100723 36867
85 36867 -78853 -30980 29898 -32797 -38039 75516 72345 -50956 -54849 26443 -9275 -55699
97 -55699 37778 93076 -14611 -70756 7426 15809 -53262 -1711 92111 27358 -70310 -20777
109 -20777 29271 -33399 -33183 68994 60239 -50023 -45731 26998 -7490 -46974 35544 76579
121 76579 -18928 -59699 11346 12984 -46081 2189 77317 16103 -59434 -10426 24937 -33189
133c3189P114Q7495j5250r1233J2313N7952l6780k9068P4734K9218q2592k7828
145d7114N9976m889m8327M4590N9106n3761n6996M3248K4182m8778R366O8495
157D9098j7133o9095J6411M3273l4155k0596O0056J7667o4477j3456M8414j0819
169E188l9369L7964M3410m4664l8053L9096J3982m2674R681N3330j7201n1160
181c0470J9177L2289l1518j4921M8055R669n0688m500L9374j2120l0606L0903
193D644K9481l7661k4569L4655R067l3836Q356L7247j7253l5424K0055K3905k5751
206g084j0836L3564L517l4800K473K8459j2473k2081K2525J8333k6270j2337K5072
219H062J581k4670Q916K5616j3876k2339J5721J3249j9935m583K4847K56k4555
$$ plain form
133 -33189 -26075 61420 46170 -45063 -32750 25202 -11578 -40646 34088 63306 -19286 -47114
145 -47114 12862 7973 -40354 4236 63342 9581 -47415 -4167 20015 -28763 -19397 49098
157 49098 31965 -37130 -20719 22554 -11601 -32197 27859 45526 -18951 -32407 16007 5188
169 5188 -34181 3783 47193 2529 -35524 3572 17554 -25120 -15439 37891 20690 -30470
181 -30470 -11293 20996 -10522 -25443 22612 32281 -18407 -22907 16467 4347 -26259 4644
193 4644 34125 -3536 -28105 6550 15617 -18219 -9863 27384 10131 -25293 -5238 18667 -7084
206 -7084 -17920 15644 19161 -15639 -13166 15293 2820 -19261 3264 21597 -4673 -17010 8062
219 8062 9643 -15027 -6111 19505 5629 -16710 -989 12260 -7675 -12258 12589 12845 -11710
232a1710L403J9189r818j3944J6363J0738j8947p014J7723P07j5970O094J5022
245A1836j0111j2491J1812P337j3501k048J4765j788j3826N184J0999q593p825
258h250J1309M878j2334j851J1578j836j0237N338Q969p334o923Q077L830q482
272c268q64Q434j518p539L324N965m572l855N512J758n922j9N457j588m510L017
288a88L403l815k022M259O11m333M69L864j503l138K298K343k672j422K832O06
304A592k707j6K169o16j635J053J203j135o74J061K70p84J06M07m84k97N21K14
322B48k12J17N6l43l3L52j4j94M8j48k34L41L85k76j47L09k29m84L94N40n53m89
344e66O18L21o45P7P89l01q82L37P22m43n03N52K91n96m4O69Mn90K4L17j44j98
$$ plain form
232 -11710 -8307 10882 1064 -12880 3483 14221 -4726 -11740 5983 6690 -9280 -3186 11836
245 11836 1725 -10766 1046 8383 -5118 -7166 7599 5811 -8015 -2831 8168 -425 -8250
258 -8250 3059 7937 -4397 -6248 5330 3494 -6743 -1405 7564 230 -6693 1384 5214 -3268
272 -3268 -4132 4302 2784 -4755 -1431 4534 -38 -3893 1619 3377 -2545 -2564 2893 1305 -3205 -188
288 -188 3215 -600 -2622 1637 2248 -2085 -1616 2248 745 -2393 -95 2248 -424 -1846 986 1592
304 1592 -1115 -1131 1038 422 -1213 -160 1043 -92 -766 295 565 -219 -113 294 -190 -487 34 248
322 248 36 153 209 -134 -167 185 171 -23 25 -123 -357 -16 369 93 -54 255 26 -458 -64 476 -77 -566
344 -566 52 373 -272 -195 594 293 -589 -252 470 27 -476 76 367 -229 -273 396 400 -190 -166 151 7 -191
366a91K15J64j80j42J23K04j8k54p0K48q5l69K37N73m17o08O64O01q98m30J159
387E26J5j485L54J692p16j521J270J245j918q59K382L55k617L66K588j335k466
404b124K244K203k850j404L339J76l902R00M042j854l486L063K537m377j563N236
420B180M75n290J125M928l174m594M823L903n566k168O200k66o974K274P068l735
436A209n816N462L696p514j811Q848J54q579K300P371n637o464Q145N356q956
451b236k615R289j342j0092M469J0160o214p937Q136M283j0954j462J2768m88
465E765j1649L710R214q414p831J1680O522j2012k704J1701k883j2585O864J2631
479A0009q581r311J0634M229j4071o89J5872j725j3940N877J0756j1429q957J4748
$$ plain form
366 -191 24 188 8 -134 -11 193 175 -79 -149 99 14 -355 -118 455 38 -570 94 695 -203 -633 526
387 526 541 -944 -590 1102 386 -1135 135 1380 -538 -1397 985 1340 -1277 -911 1677 342 -2124
404 -2124 120 2323 -527 -1931 1408 1584 -2318 -1418 2624 770 -2716 347 2884 -1493 -3056 2180
420 2180 2655 -2635 -1510 3418 244 -4350 473 4376 -1190 -3358 2842 2576 -4398 -2124 4944 1209
436 1209 -4607 855 4551 -2963 -4774 4074 4228 -4351 -2051 5320 -317 -6781 1364 6720 -2236
451 -2236 -4851 4438 3096 -6996 -2527 7633 1419 -6518 1618 5901 -5053 -6515 6253 5765
465 5765 -5884 -2174 7040 -1374 -9205 2475 8997 -3015 -5719 5982 3099 -9486 -2622 10009
479 10009 1428 -7883 2751 6980 -7091 -7780 8092 6367 -7573 -1696 9060 -2369 -11326 3422
493C422O762j4754j572J4453m957j5252R201J4403j1084r689J3646L620j7363
506i164N18J8643l472j5759Q222J1544j4267q770J7831N929j7574l82J6257o855
520B701j5894J2026J4565j4133r670J5830K676j8642K762J9792o039j6663J0217
533d72J1259j6084p295J9991M386j9245J029J6494q994j5361J4917J4245j6398
546a528r062J6855P12j9328N639K0736q643j7062J2214J0379j8032n459K1884
559I305K091k0667L631J7267j1555j5291J7149J2905j8560o760J9096j500k0705
572a3594P623K0439j1179j5805J5185R174k0003l859K2441o40k0759O548J7179
585A2750j3452j3963J8349J0215j9936m239J9913l238j9760R519J8325j3511j3957
$$ plain form
493 3422 10184 -4570 -6142 8311 3354 -11898 -2697 11706 622 -9067 4579 8199 -9164
506 -9164 -8646 9997 6525 -9234 -1012 10532 -3735 -12505 5326 11255 -6319 -6701 9556 2701
520 2701 -13193 -1167 13398 -735 -10405 5425 8101 -10541 -7779 12013 5974 -10689 -472
533 -472 10787 -5297 -12592 7399 11785 -7460 -6431 10063 1069 -14292 625 14870 -1528
546 -1528 -10590 6265 6977 -12351 -6712 14024 5381 -11681 533 10912 -7120 -12579 9305
559 9305 11396 -9271 -5640 11627 72 -15219 1930 14835 -3725 -10485 8611 7111 -13594
572 -13594 -5971 14468 3289 -12516 2669 11843 -8160 -12019 10422 9782 -10977 -4429 12750
585 12750 -702 -14665 3684 13899 -6037 -10276 9637 6399 -13361 -3842 14483 972 -12985
598a2985J6621P430j9794j341K1509l388j9755Q420J5403j4438j1199J9111P507
611A3101k0048k011J8679n590j7690J1943J6317j4906j1726J6643M347j9273J919
624h295K0751n788j8058R927J2558j5572q052J9604M609j9307O58J6832p864j5162
638a3159J3429J3224j5486q405J6274J476j7581M278J7835p905j4840J1221R730
651A0091j5066n091J7526J220j7005L316J4595q603j2056J2793R274j4676n066
664h748J4914l74j4842N457J4125q848j1530J1114P062j3337k361J4996j396j4550
678h318M762J1968q588q764J2113N859j3693k472J3260k019j2287O437J1186r251
692A93q683J0730M527j2142l62J3081k733j2058N373R225q524o197J1231L759
$$ plain form
598 -12985 3636 11066 -8728 -10069 11440 8052 -11703 -3283 12120 -2318 -13517 5594 13101
611 13101 -6947 -8958 9721 4131 -13559 -1616 14701 -205 -11931 4712 9059 -10214 -8295
624 -8295 12456 6668 -11390 -1463 11095 -4477 -12529 7075 11684 -7623 -6965 9867 2003 -13159
638 -13159 270 13494 -1992 -10397 5877 7353 -10228 -5950 11885 3980 -10860 361 10091
651 10091 -4975 -10066 7460 8680 -8325 -5009 9586 983 -11073 1720 10994 -3682 -8748
664 -8748 6166 5792 -9050 -3593 10532 1684 -9846 1268 8330 -5007 -7368 7628 6232 -8318
678 -8318 -3556 8412 -176 -8940 3173 9032 -4661 -7133 6127 4108 -8179 -1742 9444 193
692 193 -8490 2240 6767 -5375 -5737 7344 4611 -7447 -2074 7151 -1373 -7570 3661 7420
706G420j1910r31J0827k942r554O610Q408q568o237R262K721r849Q58J0217l399
721B933r251N256O878p299m165R066J972r469K34Q441l049p116N722N929p185
736a103m153P486J418p581J479P636l490o866M659M884n894k402P125N42p411
751c671R63O437k863n000M852L775n916k490N980N07n669J687N425l175m723L860
767b1L132m531j219N199j46n208J154M306k366l117L594K150m235j210M090m5
783A527l654J459L325k426k758K797J698l057m62L329m31l208J063K552j758j718
799a722K429J065k718m92K485l02k113J179J836j694j446J776P68j844JJ909n30
816E87j751Q73J310j155p85J445L63j517j3J305l83j033P85Q21r40n64R36J69
$$ plain form
706 7420 -4490 -5421 5406 2464 -7090 -480 7928 -640 -6877 2385 5106 -4743 -3885 6332 2933
721 2933 -6318 -1062 5816 -1483 -5648 3418 5390 -4079 -3845 4596 1547 -5569 153 6082 -1103
736 -1103 -5256 2230 3648 -3933 -2454 5182 1692 -5174 -515 4369 -1525 -3927 3198 3740 -3671
751 -3671 -2708 3729 866 -4134 718 4493 -1423 -3913 2067 2574 -3095 -1408 4017 842 -3881 -21
767 -21 3111 -1420 -2639 2560 2414 -2794 -1640 2666 300 -2817 777 2927 -1308 -2518 1572 1527
783 1527 -2127 -668 2657 231 -2527 270 1968 -1089 -1551 1778 1347 -1861 -798 1754 -4 -1722
799 -1722 707 1772 -946 -1438 1047 745 -1368 -189 1647 -47 -1493 283 1051 -793 -792 1117 587
816 587 -1164 -291 1019 -136 -921 524 887 -630 -643 662 279 -754 31 852 -88 -652 284 453
834D53r07J77Q33l87o81M93M34n64j80O05ln65J24M31k65k80L33J74l01n9K66
855A31o4j80J05J07j27l2J14l6l8P8Lr5N3O8j26j8J55m2j67J05J60j63j13K21
879I9L6k82M7K69j54k22K33J71l01p4L48l4l66J53L22k55k55L53J60l93j1M11
901B55r8m18K11L52l06k70L85J45m37qM44j20m00K16L13l18k22L85R6l99J2M18
923B36j34l59K23K94l17j78L64Q6l80L3L59j18l21K17K43k93j86L24R7l27OL28
945A97j03k93J60K53k34j73K53R5k73k8K68m1k49J18K31j80j83J95J38k16n4K29
967A10Rk50L8K48q1j92J24J75j98j48K14J22k33m4K45m6k67P2K64j22j97J98J35
990A76k91j20L11P8l06P9K95j90l08K25K78k60j41L34M6m27L5M20r5l41K51K62
$$ plain form
834 453 -454 -277 556 169 -512 -19 415 -149 -329 276 273 -292 -168 263 -2 -282 51 225 -76 -135 131
855 131 67 -113 -8 99 -28 -60 54 18 -20 58 61 -34 19 87 -39 -57 98 56 -111 -6 154 -9 -122 99
879 99 135 -147 -100 169 15 -207 26 197 -104 -178 170 136 -230 -77 245 -10 -265 88 248 -145 -156 255
901 255 157 -261 -50 302 -4 -274 111 256 -181 -189 255 135 -265 -49 264 -54 -276 109 205 -194 -182 236
923 236 102 -257 -34 260 -57 -235 129 215 -165 -132 227 109 -212 5 248 -45 -231 93 190 -137 -131 197
945 197 94 -199 -39 214 -20 -193 60 155 -118 -146 122 81 -168 -50 181 1 -182 13 151 -65 -119 110
967 110 119 -131 -93 155 74 -118 6 181 -17 -165 49 171 -62 -106 139 93 -174 -102 162 40 -157 41 176
990 176 -115 -235 76 154 -152 -73 222 32 -276 -51 227 -33 -174 160 206 -221 -186 234 139 -202 49 311
1012C11l93k41M41J42m34M2M36k20m48L13L84l87j99M51L2n70Q4N62j65m24L36
1033E3K92n27k14O03J08n40J08M73l54m64N02M19n17j75N17j08o35K63O52l20
1053A36m50M51J98o74o0P47l4o17K52M31n48l67O86L08o50j1N97l31o56N10O03
1074E21n41l16O65k4q21K11Q26l24n75N23L14q17j70Q90N3p70K83N93o52n31Q10
1095A48M09p95p2P64l45q12N96P56o42m48P77j0r79K34J075l56p80O29M00j017
1115d68k30J220J06j018K51P54q39o97J150O65j064k36R66m55j130Q12J187q41
1133A33p61R83R4j349K75J546l78j200O93O65j326m08J671L16j441J90J128r76
1151a45j114J423J072j369n37J320l36j564Q59J704r28j244J137M30j680QK022
$$ plain form
1012 311 -82 -323 118 260 -174 -132 304 84 -364 -51 333 -54 -253 198 230 -340 -256 306 141 -283 53
1033 53 345 -182 -396 207 315 -225 -117 356 2 -462 40 459 -58 -233 284 176 -459 -196 456 136
1053 136 -314 137 335 -339 -399 348 314 -303 -51 380 -168 -535 151 459 -191 -202 395 64 -592 -82 521
1074 521 -20 -336 329 305 -516 -305 521 197 -378 145 459 -358 -528 362 415 -355 -72 521 -131 -662 148
1095 148 557 -238 -310 454 109 -703 -107 649 7 -441 336 326 -653 -419 656 300 -480 149 549 -468
1115 -468 -698 522 628 -390 -139 615 -224 -921 229 894 -170 -406 560 105 -1025 -213 974 133
1133 133 -628 355 449 -900 -625 921 543 -657 36 701 -625 -1033 638 954 -487 -297 831 -145
1151 -145 -1259 164 1236 -133 -670 650 314 -1250 -391 1313 385 -859 278 708 -972 -964 1058
1168A058j78j701O21J139j396q70J900P12j804j43J564p89j594J386J584j453
1184C6r74J576N6k026N16K191o95j700J148R54j930n25K335L14k055L25J584j351
1202b21j497J960J379j881o32J819m48k125J060K193j189j539J531N86k224n1
1218a279K565j45k088P68J391j784j151K322J019k131k53J877q89k000J544K000
1234A766j626j311J784K54k303L78K570o18k066J155J275k026q66K492N81k261
1250h22J43J914j169j807J828J647j926r37J975q7k269P58K343j057j797J522
1266B59J014k170n17K481Q6k245O15J857j456j593J943J277k043n45K050l43k184
1283a514R09K095j246j472J630P97k096k47K215k17j955Q22J567j452j224J835
$$ plain form
1168 1058 880 -821 -200 939 -457 -1327 573 1285 -519 -662 902 113 -1481 -95 1489 36
1184 36 -938 638 694 -1332 -816 1375 680 -1020 128 1082 -848 -1373 962 1276 -779 -454 1130 -221
1202 -221 -1718 242 1621 -260 -892 927 479 -1646 -586 1607 418 -1121 410 996 -1228 -1279
1218 -1279 1286 1141 -947 -179 1212 -572 -1723 599 1618 -513 -766 1111 222 -1778 -234 1766
1234 1766 140 -1171 613 867 -1436 -1058 1512 894 -1172 -17 1258 -768 -1634 858 1439 -822
1250 -822 -679 1235 66 -1741 87 1734 -192 -1129 846 759 -1510 -752 1591 534 -1263 259
1266 259 1273 -897 -1414 1067 1153 -1092 -477 1380 -76 -1669 274 1551 -492 -1037 1013 670 -1514
1283 -1514 -605 1490 244 -1228 402 1199 -897 -1144 1071 854 -1101 -279 1288 -164 -1388 447
1299D47Q08j925j37J906n54j868J036J572j403j046J761N07j972j6J918n31j679
1316a176J063J348j472r51J676M37j719J65J697o50j529J021J135j363o46J603
1332F39K24j638K46J484p36j252J113R57j362n53J467O4j480L81J394o95j151
1349h98R76P54j259m15J396J15j300K99J085o99r14J001O89j089l62J086p6j086
1367f97M54J043o50q04P90M61j012j38J077r7r71L64P91o45o18Q28M23q74j39
1386d14Q25k17q00M31P61n19n07O14K06p60JP91j45o71L28M70m76l11N99J92o02
1407b04k1N40j92m93L14M04l55k41M34N9m65J0M16j10l08K09K05l20j22L61O6
1428A87k89K7K31j64k05K25J74k23q5K20Pk01P6J69j24j38J24P2j09k3J05oq8
$$ plain form
1299 447 1255 -670 -807 1099 545 -1323 -287 1285 -118 -1164 597 1104 -868 -884 1034 503 -1176
1316 -1176 -113 1235 -237 -1188 488 925 -794 -629 1068 418 -1111 -90 1045 -318 -964 639
1332 639 863 -775 -529 955 219 -1033 80 1037 -325 -878 589 653 -827 -446 948 253 -898
1349 -898 78 832 -427 -842 554 669 -631 -332 753 54 -860 141 830 -259 -621 465 389 -697
1367 -697 -243 800 150 -654 136 597 -415 -553 524 427 -544 -180 611 -34 -652 176 599 -275 -414
1386 -414 411 194 -606 -175 586 67 -440 174 380 -380 -379 412 267 -404 -76 394 -82 -393 206 398 -204
1407 -204 -225 315 123 -370 -56 348 -7 -248 186 245 -220 -210 206 96 -212 -3 202 -118 -240 121 187
1428 187 -102 -75 156 -8 -213 12 186 -37 -122 98 105 -96 -20 149 25 -113 11 83 -26 -49 56 50 -38
1451c8M4N6o8k5M6k0m4M8L6m2pN6j6n8L3K6m0m0N3J7k8L2L1k8k1K3j6k6K7J5l9
1482a3j3O5Ln2RN7m8o4L1Q6n7o2O2L8m2k4N9K1j08k2Q8L8o3k3P7Po6K1Q0l9r9
1513e3M0P2n1n8R2M3j02LJ13m0j55M7J50j11j10J91N8k57k8K96j8k64R7K48k58
1538e5k27L45K16l44j16L91l6m49J57M39k50l44L62K20n10j19N94Rn36J96M57
1559D00m71m75N92L99n87j23O64j83q00L60P89m58n45O57K42r33r9J043k1q83
1579d32L84O98q11o68R89N20r52q2J011l93j154O36J071p29o66J010J80j399K3
1598g64J469j52j147O56Q17j273p92J510O32j340j6J268p36j448J082J415j082
1615I9q04J323M3j828K76J973m04j480R86R12j792p43K090N52j815K16J563j225
$$ plain form
1451 -38 6 62 -6 -31 15 -5 -49 -1 35 -7 -14 42 26 -32 1 27 -13 -53 0 17 -11 21 52 24 3 26 10 -16 11 26 -13
1482 -13 -26 39 42 -10 -1 56 8 -56 -25 61 4 -58 4 42 0 -24 35 56 -52 -74 14 52 -11 -34 43 50 -16 5 85 46 -53
1513 -53 -13 59 8 -50 42 85 -17 -14 99 59 -96 -49 101 -10 -120 71 129 -128 -156 140 122 -142 -45 203 -55
1538 -55 -282 63 279 -65 -181 210 174 -275 -118 321 71 -273 89 309 -201 -320 274 283 -253 -57 400
1559 400 -71 -546 46 445 -142 -265 399 216 -584 -224 565 107 -438 219 461 -472 -571 472 451 -432
1579 -432 -48 650 -161 -829 160 680 -272 -354 657 264 -890 -254 817 88 -578 432 612 -787 -764
1598 -764 705 553 -594 62 879 -394 -1186 324 956 -384 -400 868 132 -1316 -234 1181 99
1615 99 -705 618 661 -1167 -891 1082 678 -802 184 1096 -696 -1439 651 1203 -612 -396 1167 -58
1633e8j716J700J653j640q16J802k36k381P27K491q50j766J421R62k400n98K775
1650A070L85k353M77J914j710j916K317J776k231q18K317m58k819J130K873j350
1666F04k051J959J001k926m93L331J62k823Q05K199k184k090K934J850k795p32
1682a249K742q03l150J668L234j896k282K419Q82l421q1L949k93l318J225K346
1698A972k756j934L689J632l488n14L129j262l302K410L371k653k327K911O05
1713A483l796N38M338r05l628J671K304l216j545M283J245l996k22L259j695l145
1729c027L116L250l290k250L178K67l838J190M494j556l810K047K132l450r99
1744b546M622O88m375J74L306k100k850L674K875l798j880L421j91l890J811M431
$$ plain form
1633 -58 -1774 -74 1579 -61 -877 925 689 -1692 -965 1526 676 -1090 331 1293 -1107 -1705 1070
1650 1070 1455 -898 -421 1493 -217 -2133 184 1960 -271 -1089 1228 770 -2049 -919 1954 604
1666 604 -1447 512 1513 -1413 -1906 1425 1587 -1236 -431 1768 -416 -2506 428 2278 -517 -1249
1682 -1249 1493 690 -2460 -792 2442 546 -1736 683 1565 -1856 -1937 2012 1719 -1599 -374 1972
1698 1972 -784 -2718 971 2603 -885 -1399 1730 468 -2834 -424 2947 294 -2033 878 1483
1713 1483 -2313 -1775 2563 1658 -1970 -299 2005 -1211 -2756 1527 2772 -1224 -1446 1813 118 -3027
1729 -3027 89 3339 49 -2201 977 1244 -2594 -1404 3090 1534 -2276 -229 1903 -1547 -2546
1744 -2546 2076 2764 -1611 -1437 1869 -231 -3081 593 3468 -330 -2210 1211 1020 -2870 -1059 3372
1760C372k160l611K523J740l799m75M895J16m475P19L167k567k548M068K434m087
1776f88j459L586n87l774K169M135k557l322K810J503l782j71M676k87m262J025
1792i85K977k636k228M008K045m039j150L424p50l416K351L725k703l060K719
1807B82J262l491K40M393o64m096J130K700k511j735L884J507l964q19L217q97
1823D38k981K436L194k778k540K686Q65l245N19L932r07l518J320K212k492j332
1839b191L579J051l488l98K768j066k496K302K534k546j907K434N08k775O19L202
1855B130j029k832J379J775k189r48K967N86k950n8K380j012j949J990J829k284
1871b15j373K133L40k214O95K450j142k204J295J387j804n22K361J27k405K14
$$ plain form
1760 3372 1212 -2399 124 1864 -1935 -2410 2485 2601 -1874 -1155 2012 -555 -3103 965 3399 -688
1776 -688 -2147 1439 852 -2922 -753 3382 825 -2497 313 1816 -1966 -2137 2539 2252 -2010 -985
1792 -985 1992 -644 -2872 1136 3181 -858 -2008 1416 666 -2750 -399 3326 623 -2437 282
1807 282 1544 -1947 -1707 2686 2022 -2074 -944 1756 -755 -2490 1394 2901 -1063 -1882 1335 438
1823 438 -2543 -107 3087 309 -2231 455 1320 -1925 -1406 2526 1619 -1899 -579 1633 -859 -2191
1839 -2191 1388 2439 -1049 -1447 1321 255 -2241 61 2595 49 -1858 576 1084 -1691 -1072 2130
1855 2130 1101 -1731 -352 1423 -766 -1714 1253 1839 -1111 -1169 1211 199 -1750 240 2069 -215
1871 -215 -1588 545 885 -1329 -634 1816 674 -1530 -235 1152 -652 -1174 1187 1314 -1091 -877
1887h77J878r46j387J743J211k007q71J801P3j733P62J842j112j622J190R54j494
1904e95k69J846m4j814L00J377q20r79J347Q01j478n15J310m5j263O20J256q60
1922A75j060R43N91j114j26J291j46j266L70R87o76o89R78M79j079k41J007p8
1940C46r08M39Q15o49o44P12L67p73n3Q24j73p76L24N86m80l71O34J92o95l4O29
1961C12j66n11L50M00m62k95M93J46m91M5M75j65m11K35L01l02j64L56O6l68K
1982a54L29j09k33J85J81k30j29K35M2k05L8J71j06j36J22J07j18n8J05qj05M5
2004c1J01m7p1M8J7m1ON3k4k5J4J0j5J1J4j7J1J3l2rM6j1l1J7L2n7l9Q1L2p7j
2035b2O6m3n3L2Q4p4n9R8L1r0jR2k7q6N8P9p4m9P0K1p8QQ1l2p9M1N9o2j6N8j0
$$ plain form
1887 -877 1001 55 -1332 411 1622 -385 -1256 545 618 -1115 -353 1489 377 -1245 -55 899 -595
1904 -595 -864 982 938 -876 -576 801 -19 -998 349 1150 -328 -843 467 422 -841 -221 1035 175
1922 175 -885 58 649 -465 -591 700 554 -712 -342 645 -31 -720 258 737 -342 -583 424 346
1940 346 -562 -123 692 43 -601 111 478 -295 -348 476 303 -473 -149 437 -43 -414 220 412 -283 -317 312
1961 312 146 -365 -15 385 -77 -372 121 267 -224 -179 296 131 -280 -45 256 -46 -210 146 212 -156 -154
1982 -154 175 66 -167 18 199 -31 -160 75 117 -88 -50 121 15 -121 1 108 -10 -68 37 29 -76 -31
2004 -31 70 23 -48 0 17 -24 -18 35 11 -14 0 10 -5 6 20 3 14 27 -5 -14 32 21 -10 7 39 -18 -57 24 56 -21 -22
2035 -22 44 1 -52 -20 64 -10 -69 29 60 -30 -31 61 34 -52 6 85 11 -38 32 53 -25 -17 64 32 -47 -6 53 -9 -25 33 23
2066B3o2J0N8j6m2K1L6m8j3M5K4m2k6M7K8k8l5K2L5k7l4M3M8p0n2Q8M0r7k5J05
2096E6k1j06M8J24q2j12J21P2j51m8J91k5j88R2J90j82j45K21Q6k38k3K97r1l09
2120b23J76K92k60k09L40J22m21%M26j06m15K38L72l53k96M48J40n04PN62j66
2141A70n37L00M26m61k73O03J42o97M9O62k71n84M95N05o40l56P38J22q24J34
2161b97Q59l52p56N65N48q05l65R84J71r84R3R01m86q38Q02P36r13m77J003M3
2181D32j125L23J195n38j021P82O56j127l53J365J37j339K30J146p51j031J151
2198A32R26j250n43J288r4j458N54J561p41j247R77O58j477k51J835Q7j680L11
2216d12J266j047j087J583J056j624n97J530k72j679Q52J842r92j417J215O55
$$ plain form
2066 23 -39 -29 29 13 -29 -8 28 -20 -33 12 36 -6 -32 15 43 15 -20 2 37 10 -24 19 67 -3 -55 33 73 -24 -49 56
2096 56 35 -71 -23 101 19 -93 28 100 -51 -99 92 67 -121 -29 161 -21 -166 55 141 -97 -120 177 86 -223
2120 -223 -47 245 -15 -224 116 238 -183 -183 243 137 -278 -40 332 -21 -317 131 271 -233 -226 336 170
2141 170 -367 -67 359 -102 -375 228 370 -327 -278 384 113 -471 24 529 -111 -467 271 393 -431 -297
2161 -297 562 210 -546 19 567 -238 -603 381 552 -432 -339 562 76 -762 40 776 -137 -614 389 432
2181 432 -693 -370 825 287 -734 48 704 -423 -776 589 726 -613 -383 763 12 -1019 132
2198 132 1058 -192 -735 553 459 -999 -445 1116 375 -872 105 763 -714 -965 870 957 -723 -412
2216 -412 854 -193 -1280 303 1359 -265 -862 668 396 -1283 -431 1411 419 -998 217 872
2232H72j817j85K187M5j877M59J342j389j190J942J148j809n10J625n45j905J175
2249d32K041j208j422J418M34k113R1K476j75k021P44J296j776j066K327R79k049
2266d56k21J766r87j961J586K038j519j213J673L3k379M93K684n15j962J068J007
2283A135k199p72K736P82k217N5J677j455j867K062K008j767j062J771l46k481
2299a940Q70K767p52j854J278P59k470n37K890N61k166M24J540j876j799K327
2315B2J837j858o54J865p88k623J168K716r73j588J603M68k754l04K933K44k067
2332g53Q15J478k134j641K407J466j936k47J988j032k518J323K370j241j243J814
2348I16K47k702n5K735j16j917J066J339k190j384K407J141j944k9J891j147k280
$$ plain form
2232 872 -945 -1130 1057 1102 -775 -316 1026 -363 -1553 389 1537 -272 -782 843 298 -1607 -432
2249 -432 1609 401 -1021 397 831 -1282 -1191 1285 1110 -911 -167 1129 -647 -1713 614 1593 -456
2266 -456 -677 1089 102 -1859 -273 1765 246 -967 706 739 -1640 -1147 1537 1022 -940 128 1135
2283 1135 -1064 -1836 900 1682 -535 -480 1197 -258 -2125 -63 1945 178 -884 887 541 -1940
2299 -1940 -1070 1697 945 -909 369 1128 -1342 -1879 1011 1572 -594 -170 1370 -506 -2305 22
2315 22 1859 1 -653 1212 424 -2199 -1031 1685 712 -876 727 1195 -1559 -1863 1070 1314 -753
2332 -753 62 1540 -594 -2235 172 1638 -298 -545 1443 411 -2107 -784 1586 345 -898 916
2348 916 1163 -1539 -1594 1141 1025 -892 174 1513 -677 -2061 346 1487 -457 -486 1405 258 -2022
2365b022J441K125j331j066J790P5k541J57K522l02j682J159J088k173j095K286
2381D31Q06j782K97J716j330k033J479J704j362o21J842k32k407L21K161n41j303
2398h54J430Q44k167q54K023M06j534O42J539j371j716J376J223j324k76J773
2414A160l35k079M26J682p22r90J443O83j875n91J667Q2j351P49J352j226j349
2431a274J213Q52j257q2J547l61j688M89J335p77p80J288M80j576k86J400j10
2448D13j142P15J066j074r60J083N59j117K1J281l77j310N01R62p38n15J130K80
2466G78j272j63J078k10q37O88P94r16o89Q50L40q68J24J012l46r88M18O70o11
2485a48l62Q92K44r40j16P44k06o15N41O02o23n11N81J75o18J49P33k64o74L07
$$ plain form
2365 -2022 -581 1544 213 -853 937 1012 -1529 -1372 1150 848 -834 325 1413 -760 -1855 431
2381 431 1237 -545 -248 1468 138 -1895 -416 1288 -74 -695 1147 915 -1492 -1171 990 449 -854
2398 -854 576 1420 -747 -1601 422 828 -706 -64 1475 104 -1612 -236 987 -337 -613 1160
2414 1160 825 -1254 -828 854 132 -858 585 1268 -607 -1198 469 551 -800 -51 1301 75 -1274
2431 -1274 -61 791 -466 -548 999 638 -1050 -561 774 -3 -783 505 985 -591 -877 523 413
2448 413 -729 -14 1052 -22 -982 101 660 -457 -436 845 468 -842 -341 621 -117 -632 498 778
2466 778 -494 -657 421 211 -626 62 856 -60 -749 101 441 -427 -303 709 363 -625 -207 463 -148
2485 -148 -510 382 626 -314 -430 314 108 -507 34 636 13 -498 83 258 -360 -211 522 258 -416 -109
2505a09L97m49j80O42Q9o47PN08k22l83M05L58m62k77M49N8m42J28M70j99l94
2526b53K32K24l21r2L86L8l46J4K70j58j76K47J60k79j00K14pk08J30K02j48j82
2548a53J67Q2j74k1J96j5j75M8J24p2r5J02Q1j00k8O7jr5L5P3ql6qKj7PK7Pk0
2577@Kj9%L8J4l4jOj4j0M1J2l3LPj8%N6k3n9K2N3k7o4O3K4o0k8R3Kq5J5O1k6n8
2612d7N0L6m3k3O4qn2J3M8n0l0O5J8n5rN7j9m6M5L6n2k9N0J6m5lN3k7l7K2L0j9
2644Ij6KJ4l0PK0kONk4J0PLj1MJ2k8J7L5j1k2jK9k9j5N4k8n8L6O2n2n8Q6J4j14
2679f7K1J18l1j24O0J15j09p8J49M1j63rJ72p3j33J09J45j65q7J92K1k18N3K15
2703A54j21k01J98J52k71o7L17ll44J08K98k04k60K98J94l49j08L88rl81J33L55
$$ plain form
2505 -109 288 -161 -341 301 390 -257 -250 258 36 -347 58 416 -46 -323 126 184 -258 -130 340 141 -253
2526 -253 -21 203 -118 -210 176 214 -132 -118 152 -6 -182 65 225 -54 -154 60 53 -155 -25 177 29 -153
2548 -153 14 96 -78 -99 97 82 -93 -45 79 7 -88 14 95 -5 -33 34 33 -62 -27 46 38 2 -6 -4 -21 -14 13 20 0
2577 0 2 -17 -17 21 35 1 0 6 -8 -18 23 35 2 5 12 -6 -6 50 27 -32 -10 43 16 -48 15 39 -21 -49 44 46 -39 -24 37 11 -47
2612 -47 3 39 -4 -27 37 29 -23 -10 38 -12 -42 23 41 -14 -23 34 15 -31 14 50 -2 -31 19 35 -10 -13 40 13 -24 -2 28 9
2644 9 -7 -5 9 -21 -14 6 4 10 15 -9 1 8 11 0 4 16 -12 5 40 29 7 6 35 6 -9 45 17 -41 -5 57 5 -53 33 47 -67
2679 -67 -46 72 41 -83 -23 92 -17 -95 54 95 -68 -77 95 22 -111 -2 143 -22 -109 83 104 -114 -61 154
2703 154 33 -168 30 182 -89 -156 161 158 -186 -78 220 16 -244 54 248 -101 -209 179 170 -211 -78 277
2725B77k51l25L51K17l91q8M41n5m73J83M26k91l11M14J95n33q6N69n1n17K54
2746d5M70m44m21N18K76n51o7O27j48o50K55N70l98l80N97K02p10q0O98j13n97
2767c91L99N43n95m76O68K38o98O4P78l03p83M32O11n65l63P79J33r19K0Q69k42
2788A99o96N57N51q15m36Q95K20q56J38Q23m79q17O66O68p37l27R13l0j083K10
2808d36J024l84p28P45M59j087l61J134J51r29L32Q37q02r05R12P23q51j65J019
2827F88l10j269M05J132n13o38R41K96j342k40J290j0r50O05Q32j064r05J092
2845D0O10j000N1J171m96j353N63J118p10n54J118K02j474r7J360j59r84P30P89
2864I25j211p85J264N28j113R3J152o43j269P83J131q33n60J105M7j471J04J448
$$ plain form
2725 277 26 -299 52 269 -122 -210 231 176 -297 -114 312 21 -290 124 319 -214 -300 269 218 -299 -45
2746 -45 425 -19 -440 78 354 -197 -264 363 215 -435 -180 390 -8 -388 209 411 -299 -379 319 206 -391
2767 -391 8 551 -44 -520 148 386 -312 -248 530 227 -556 -124 487 -78 -441 338 471 -448 -428 441 199
2788 199 -497 60 611 -204 -640 255 475 -381 -243 580 101 -716 -50 618 -119 -446 467 437 -646 -436
2808 -436 588 204 -524 221 680 -407 -768 366 517 -412 -80 757 -45 -950 -38 685 -166 -331 688
2827 688 378 -891 -486 646 133 -505 436 732 -610 -850 440 430 -520 85 917 -147 -1052 40
2845 40 650 -350 -299 872 376 -977 -414 704 -6 -560 558 760 -714 -811 549 390 -594 136 925
2864 925 -286 -1071 193 721 -392 -299 853 210 -1059 -276 855 22 -538 567 614 -857 -753 695
2882F95k30j007P41O45j300o41J381M70j084J86J012q41j213R30J086q09l93J057
2900F85k00j505K55J438k96q15Q03M46j387m93J358L52r86L17R24r26j096R59
2918a67Q89q05k31J044k79j375L11J219l88o60Q53L36j298l46J225J68q85M09
2936B0P78r25q67R67O82q13j25R28l72j162N01J033m96n56P85J80j160q2J139
2955D55j4p83M26N51r06n74R76M87p64jP05m99r00O05Q51n07m04O67m8r77J34
2976e20J006j38o42M23L61q26l43Q87K91o84R4N88m89o71N81N83n10k53N97p4
2996B61p80J81P47k25m89M38K64o77k05O90J22n63J48M83m13m68N16L69m96j27
3016b24M98j04n70K21N50k89l49L89J58n32o3N77j6m64J61L27l59k73M73K17m16
$$ plain form
2882 695 465 -542 199 844 -456 -1097 284 754 -330 -144 868 27 -1186 -256 830 21 -372 685
2900 685 485 -1020 -765 673 377 -438 365 811 -576 -1069 289 641 -345 -28 896 -30 -1126 -167
2918 -167 722 -83 -314 730 451 -924 -613 606 218 -442 411 747 -551 -897 328 496 -389 20
2936 20 798 -127 -994 -27 655 -158 -283 645 273 -889 -388 645 149 -407 378 558 -602 -684 455
2955 455 441 -342 84 635 -271 -845 131 618 -146 -147 558 59 -841 -236 615 108 -296 371 323 -654 -520
2976 -520 486 348 -294 129 490 -336 -679 208 499 -185 -91 497 8 -663 -82 501 -9 -262 335 261
2996 261 -519 -338 409 184 -305 133 397 -280 -485 205 327 -236 -88 395 -18 -486 30 399 -97 -224
3016 -224 274 170 -400 -179 371 82 -267 122 280 -252 -315 262 246 -218 -57 270 -89 -362 111 328 -88
3037h8p4L61j38l93K58M02k80k64L03O4l91N2M41p4l58J49K08k87j49M04J10l52
3059i6k7K75j38k47K48K55k58j59K26Pk53Q2L07j25k62J42J41k15m1K61L7k64
3081a04K0J76j15j31J98J16k05n3J59k0j66J07J74j26j20J14M6j55L1J85n7j59
3103h5N1R8q3n3J43L4j50k2J11k0q6P2Q3r2n6O7K9o1J1O6m8m3L2K8m8J3L3Jn1
3132b6J5M7n0j9O8J9p5RM3k7k6L6K3k6k8J9J6k4J2J3j6j4NRj0J7J0k8oK9lj5J
3165bK2j9k4M2J1l2mK8mk1OJ3qj8J9mpJJ6k0j0J4Nk6KK7mk7K4J8rm0L7J3j8nK6
3202B2Jk3qK3J3l8J1J7j8j1L0rj2rK1jj5J1J7j5j3JK1k4oL9Om6nM0Qo2K4M8k8
3237A0l9L5K2n7qP0K4p4lL8j6m7P0O0p8m8N6Qp2M6J08o4j18M7P1p5j2J28J0j61
$$ plain form
3037 -88 -162 199 61 -332 -74 328 48 -216 87 151 -240 -188 253 179 -179 -30 178 -109 -258 146 256 -96
3059 -96 -123 152 14 -233 15 270 12 -147 79 86 -167 -85 222 97 -165 -23 118 -97 -138 123 160 -104
3081 -104 -84 92 -23 -154 44 160 -45 -98 61 41 -125 -18 156 30 -90 24 70 -85 -54 131 74 -85
3103 -85 -34 64 -19 -72 71 105 -45 -67 44 24 -62 10 93 1 -55 12 41 -20 -9 57 9 -34 -2 26 -22 -9 24 25 -26
3132 -26 -11 36 -14 -33 35 54 -21 -12 31 4 -22 14 37 11 -17 2 18 -6 6 19 3 -11 -6 3 -7 10 20 -8 -14 15 12 -3 -2
3165 -2 20 1 -23 19 30 -2 -6 22 18 -3 3 16 8 -10 9 5 -2 -1 15 -5 -15 -1 4 -22 -20 7 3 -24 0 18 9 -31 6 19 1 -4 22
3202 22 23 0 -8 15 28 -10 1 18 0 -11 19 10 -2 -11 10 9 -6 5 22 7 -6 -5 16 -8 -14 25 31 -15 -20 20 28 -34 -10 38 10
3237 10 -29 6 28 -29 -37 33 57 -17 -20 18 2 -45 25 85 7 -41 15 23 -49 -3 105 41 -77 -30 41 -34 -46 82 92 -69
3267f9nJ32m7r6J20R8j34j20J42M4j35M7J70o5j83N4J03j09j8K06J3k31m2J66
3291D1o4p3J87J26k47j56J56M9j27J36K32j60k98R0J68j30K0K86rl44p6J98m0
3314c5q0K73J53l09k08J55L7j41K15K99k19l56Q2J24j57J10M01n4m41o3J98j13
3336a29k4M07J59m43k46K17Pj51L21L20l25l86J54J21k05J87M38j53m89J8K19
3357A7j82J0N02Q6n46j77K78q8j51M63L50m97m44K51P0k16K96N67k84o57P4K65
3379a3k25J18O23J4p05j90L44j29r9N87L16o17m34L03L4k82M41O07l92o71J45
3400b25K02l19J73P50k6p55j35L11k27r5P12L44o94m13L10l0k65M90O13m52o53
3421c84K00J72l35J90P51j07p50m0L46k58j03O95K54o86l39L99q1k99M89N64n00
$$ plain form
3267 -69 -74 58 11 -85 35 133 -1 -121 21 65 -70 -23 147 82 -101 -47 56 -53 -71 135 148 -83 -125 41
3291 41 -23 -96 91 217 -30 -186 -30 19 -108 28 260 100 -198 -108 60 -70 -50 236 227 -117 -193 5 -35
3314 -35 -115 158 311 2 -206 -51 -14 -155 60 359 140 -216 -134 -10 -167 -57 344 290 -151 -214 -16 -129
3336 -129 -153 254 413 -30 -276 -59 -52 -203 118 438 113 -273 -119 2 -203 -16 422 269 -220 -202 17
3357 17 -165 -155 347 433 -113 -290 -12 -100 -251 212 562 65 -379 -128 -58 -274 22 589 305 -352 -278 -13
3379 -13 -238 -120 503 517 -188 -378 -34 -163 -262 325 641 24 -410 -107 -73 -355 86 693 301 -370 -225
3400 -225 -23 -342 -169 581 555 -200 -335 -24 -251 -346 366 710 16 -397 -87 -117 -382 108 721 269 -384
3421 -384 -184 -12 -347 -157 594 487 -263 -303 43 -215 -318 377 631 -55 -394 5 -76 -375 114 678 178
3442A78n72K56J81l62K18O91j73p32M5L35k70m7O65J76p21k34L79q8k65N20M47
3463F27n22n02L17J15l56K51O34k37o53J36K67l29k5O73R1o37j28L53j96k49N30
3484A60L92m98l47L18j4l91L10N98k69n20K04J91m04PO34L3n73oL42k63k67N02
3506A39L23m96k14L84o9m07K72M77k84l88L00J39m29J5N47n5m66J26L27l30k32
3527c21M68K07m58q8L91j17l86K51L80l07k61L44J00m05NM37r0l71K17K68l31
3548f7j93L51J17l48L1L54j43l46J82K69k30j50L48M6l89k5L45q0k52K14K40l03
3570b9k14K81R6k66N4L21j48k98J25K13j90q1K99L5l29l2K60q4j63K18J71k69
3592c0j56K23L5j91J02K49j37k60J23J39j61k1K41K2k81%J76p2j20J91J29k16
$$ plain form
3442 178 -394 -138 43 -319 -101 590 417 -315 -270 65 -205 -252 413 589 -132 -366 13 -75 -340 180 627
3463 627 105 -397 -80 35 -321 -70 564 327 -326 -190 77 -252 -277 396 487 -150 -278 75 -121 -370 160
3484 160 552 54 -293 25 11 -380 -70 528 259 -261 -57 134 -270 -263 371 404 -169 -175 167 -96 -363 139
3506 139 462 -34 -248 136 67 -340 -68 409 125 -263 37 176 -253 -238 309 254 -212 -86 241 -89 -321
3527 -321 147 354 -104 -192 199 82 -304 -53 327 20 -241 103 203 -202 -197 240 150 -221 -4 264 -67
3548 -67 -260 91 208 -140 -109 245 102 -244 -62 207 -23 -173 175 221 -168 -193 152 72 -180 34 274 -29
3570 -29 -243 38 134 -132 -78 243 95 -203 -78 135 -55 -136 163 198 -131 -163 97 13 -150 68 239 -30
3592 -30 -186 37 72 -119 -17 232 95 -165 -42 97 -64 -85 156 178 -103 -103 73 1 -119 72 201 -15
3614a5j38J71J1j32J00J83j27j90Q7J06j13PJ80rk02kJ16n5p7J74Q5j75q0J12
3638A7Kr8R3J33j04j32O4N3p4K2J30j3j37lP7m1l6R6N1j08m7P1j4n2O1P3p0p1
3666e7O2J8n4J9P9j3q8NM9l0j8O6J9o3l4M9%j2K3L0l8n2L3K8k3nL3j4k9rK9jq
3699fJ5J2j7j1K0J3l6J5J8pj0j1K4j9%RRk0JNmpJ5J0j3plJ4nlJJ6k2JMK0k0kP
3738FJ4j3lJ8j7mKQj5J6j3MpjQ%KJ0j2nlJ1%rOnJ8k3QMk3J8jKQmO%nooNJ8lj2
3783BJ3Mj5NMNk0J4%j1j1K6Ok2j6K9J0j8kJ4k0k6K4J6rKJ2j5k8J6L8rk3K8j0l8
3819b5lN4J2m4J4J6k5l6L4M0l8j1N5l5m9J8M6j0k7N6Qq6j1O7Rk7K5J9n8l6N2M7
3851E1k9j8M3m9o3M7O4k9k9M6qn8PO0qk6K0Ro2k9O8M0l5nL9o6m9L9P4j7k3M0m3
$$ plain form
3614 -15 -153 18 29 -103 -3 180 53 -137 -50 56 -57 -50 130 121 -81 -83 33 -22 -99 75 160 -15 -95 17
3638 17 19 -79 14 147 43 -89 -25 28 -46 -24 106 93 -44 -47 30 -11 -47 49 100 -8 -55 16 2 -50 11 84 14 -57
3666 -57 5 23 -31 -12 67 54 -34 -29 20 -10 -28 38 57 -6 -40 9 9 -3 20 50 12 -40 -7 21 -2 -7 26 12 -17 -26 3 2 -6
3699 -6 9 21 4 -7 13 26 -10 5 23 16 6 -5 19 0 0 9 18 -2 -1 4 0 -7 8 18 5 -2 -5 9 4 1 2 18 -4 -3 1 21 1 -1 6
3738 6 20 7 4 22 5 1 3 11 -4 12 -1 3 -4 -5 3 3 5 15 3 -2 -5 6 6 -3 3 -2 16 -7 1 5 -18 0 -1 1 9 5 11 11 6 0 -6 -1 17 14 2
3783 2 15 19 4 9 13 18 -2 12 12 1 -10 16 22 0 -16 13 23 5 3 17 -3 -29 -5 11 2 4 16 1 -27 -11 27 18 -5 23 13 -25
3819 -25 -28 26 38 -6 8 24 -1 -37 -3 37 -1 -12 43 8 -41 -23 23 13 -14 42 50 -36 -47 20 29 2 27 46 -12 -48 4 51
3851 51 22 4 47 -2 -65 -18 46 17 -12 34 26 -32 -25 35 27 1 21 30 -32 -61 7 47 12 7 46 -20 -69 -30 44 27 4 44 1
3884Aq1K0R5J8k9L0j1j10k2J09M6m2K8Jq7o0P7P0k5j4M6n4r8K0Q9mkN8k3j04l6
3915i4R6J6k1P0K6j20p1Q2N1m1L9N9p0j18L7R7k9rP4l8j05oJ04nm4O3L0r7m7P4
3945CL5m7J9O3o5q4N4O5l7oP5k1j17nP7J7l6N2L5j22n4Q4N5m0L0N3q0q5M7P0k6
3976IJ3N0l4r7QQ3j3l9O0K4q6m2N7K6l4M7M7n9o1J9M2l1J4P7m5q5J4N8j6j5N8
4007D9K1r5k0N2j2k1M2M0o0l4M0Pm2K3O2j7p8L9J9l9PP6op6lM2k1k4P1K8p1l9
4039d0M7jk9L5O5n4p3L7K3k6J3O2k1p6J5M9k8k8N9K5p2k9N5Om0K5N4m8o1O1L0
4070C5m1RM0k4n9J6N2j0k8L6J3o5k7Q1%l3L0K1n3n6N2L8k4oM3j7q8K7N6Lk1M5
4102D5Lp2k0N3Mk5L7L4n2m9K4L7ppM5rp7%L5JpM0Rn4n3M8M6l1J6K0j4n5J4N9k3
$$ plain form
3884 1 -80 -60 35 53 24 54 43 -67 -89 20 66 24 52 53 -34 -94 -17 53 28 14 60 6 -92 -72 17 13 11 69 46 -58 -94
3915 -94 2 18 -3 67 93 -27 -98 -16 35 -6 33 92 22 -96 -59 38 9 0 74 36 -69 -75 29 24 -20 43 73 -24 -71 3
3945 3 38 -9 10 73 8 -76 -22 43 6 0 75 54 -63 -68 9 26 -10 42 77 -45 -99 -15 40 0 30 83 3 -82 -35 35 9
3976 9 22 72 38 -59 -51 32 19 -20 40 64 -22 -64 -7 19 -15 32 79 20 -41 -22 20 -11 3 80 35 -50 -36 22 6 -9 49
4007 49 70 -25 -45 7 -5 -26 16 56 -4 -38 2 9 -33 -10 52 35 -43 -4 15 -24 -17 59 53 -23 -26 16 -5 -29 42 70 -1 -40
4039 -40 7 6 -23 12 77 23 -50 -13 10 -16 -3 59 38 -38 -23 26 -2 -30 29 54 -18 -47 8 14 -26 -1 53 5 -56 5 35
4070 35 -6 3 43 19 -40 -24 28 18 -10 26 39 -26 -53 28 28 -5 25 46 -7 -63 -11 27 3 -3 40 23 -65 -38 18 21 0 45
4102 45 48 -24 -44 9 13 -12 25 59 7 -42 -18 19 12 5 50 41 -36 -36 -1 0 -7 33 42 -12 -65 -17 29 -2 14 34 20 -35 -21 38 15
4137A5nJ8j1m2lM4Ok3J6Ol1k8M1K7j7mRl2l8L5N2ok1J6j1n2pN7J7kj9Rm0k5M3
4172fN5k2pkk4l7L2M3oj4J1j2l4J2K6J2j2J1j1k8j4J9RK1j5J4k9j5QK3MjPKk6
4207fj5J3K8j4%Ojj8QJ5JkMj3k1MJ4MmJ0nj8mK4Pkj6Pj6LJ5NJj3Rj3oJ7KMk0J7
4249A1j7O%J2Kj2mmPk2J5RPMlqn%J0nnJ1lqMMLJj0KllPJ0j4jJ0loRPRk4J7j0l
4295DrJ4%orJ0j8RPnJlRj2QMjMqRmKMjnLPrQnjjKmJkqPOkMj4JP%JmLJlJNlmKQ
4351A1Oj7kJ4j1NoJ7kj7OJLRmpojmJ6j6J4MrkJNj2J2KmojQj7LJ5Oj4mjJ0%kJ4
4396A7jj3j3J6rMJ3J2j7j4K0j3j9K4J9j6k5LRkNK1nj7j0J0j1j0M1K6k4j1kqOJ2
4432A8L0k0l0LPj2KL5nk8oJ3j0rL4J3l6oK%KJ8K3j9k4Loj1J7M1lm8lJJJL5K9n6
$$ plain form
4137 15 10 28 17 -25 -28 16 22 -1 15 21 -10 -38 3 30 13 9 18 -14 -52 -17 35 29 8 24 13 -39 -46 11 28 26 7 16 -24 -49 -6
4172 -6 49 27 20 18 -6 -43 -11 32 26 12 23 11 -23 -11 15 27 15 26 15 -13 -27 -8 1 22 7 21 -8 -23 -15 8 12 11 18 20 -6
4207 -6 -21 -8 20 6 6 12 11 -7 1 16 17 15 19 6 -15 -11 3 7 3 13 8 -10 -14 10 17 15 -1 6 -10 -7 8 13 14 1 10 -3 -9 8 10 14 -6 11
4249 11 -6 0 0 12 14 2 -2 -6 1 -21 -6 3 10 14 11 3 -2 -2 8 3 -2 9 6 -2 2 6 9 10 0 2 -1 -4 3 13 -1 -2 8 5 -1 8 15 24 0 17 7 4
4295 4 -5 9 9 3 -6 4 -14 -5 2 -3 -2 -5 4 -8 0 4 3 7 -1 8 4 6 10 9 4 7 14 5 13 8 7 6 8 4 5 3 -5 2 8 6 10 -4 -3 4 4 5 1 4 5 2 3 8 5 1 3 11
4351 11 17 0 -2 12 1 6 0 17 15 -2 4 5 8 17 13 6 0 -1 -5 11 -5 9 13 4 2 3 8 -4 8 10 6 0 -1 7 -10 -7 8 14 0 -4 -5 5 5 3 17
4396 17 16 3 -10 6 -3 1 14 26 9 -5 15 2 -17 7 26 10 -15 -12 -3 -5 0 21 16 -1 -11 -1 -12 -22 19 45 21 10 8 0 6 18
4432 18 48 28 -2 1 8 -4 -2 33 28 0 -6 7 -3 -12 22 35 -1 -7 -5 -5 -3 15 38 19 -5 -2 -8 -19 -2 39 36 -12 -15 -14 -13 -12 23 52 -4
4471dj1J0Lj7M6L4l2m8RPk2L7L3rm7LRk7J3N0Om6k4M2l0k2M5N2n0k8J8Qm0L0O4
4506F2k8o7L7J0l8kO0J8p5J4L3l2l2O4L3p1j6N0pm8K3Q2m0p1N1K8n3k6R8qp8J3
4538a6O7m7n4O6N2p8k4P0k1p5M2P1n6m0N4L8p0k2R3j6q8L6Q0m8n7P4K4r6j0R8
4568D7lp6K0P5p2n4Q5O2q9j9Q2n1q3N1R6n5l3N0Nj03NJ23Oq3K3M8r3m7J00O8p7
4599Hk3O7n0r7P6J00o1n1N8rq7K8J15j7p9K4L8o4l2J10L6j02k1N4l9n6P5Q9o1
4628B9o2L8np4N5J12l1r9L1J5p2RJ27K5j03j3M6o2m9J01Q8p2o1N5k6r4O3J14k8
4657E7o4J7jq5%J34L9q4rK6o4n1J01Q6n8m2M3m4q6N2J15k2p3L5qq5RJ03K7p0k
4688dK6p1k4R3N6o6j9L7m7o3N8R2k3m8Ono2K5R3J1p7j7L3n7lR3L8n7l2J9l4l5
$$ plain form
4471 -4 -15 -5 -2 -19 27 61 29 -19 -10 -3 -25 12 45 36 -11 -8 1 -26 -13 37 43 -3 -27 15 -15 -37 8 60 10 -18 0 8 -32 -2 62
4506 62 34 -33 4 14 -24 -26 34 52 -23 -9 24 -8 -40 24 57 -14 -30 20 13 -35 -12 70 30 -41 10 38 -15 -41 57 49 -29 -16
4538 -16 51 4 -50 16 68 -10 -34 36 15 -60 -18 53 -3 -43 11 49 -21 -43 50 34 -54 -18 62 14 -43 31 55 -41 -51 47
4568 47 44 -32 -12 63 -9 -63 22 84 -5 -24 58 7 -76 -25 71 16 -17 33 38 -65 -60 63 69 -14 9 57 -36 -83 17 85 8
4599 8 -15 52 2 -95 -19 81 20 -31 27 18 -69 -41 74 57 -22 2 40 -24 -56 54 90 -12 -33 21 -18 -74 1 90 29
4628 29 -33 5 0 -74 -19 93 62 -37 -6 9 -63 -54 73 98 -5 -18 28 -34 -83 18 106 34 -27 28 2 -92 -29 85 57
4657 57 -7 10 9 -76 -76 58 97 13 4 30 -34 -85 16 102 44 2 45 1 -85 -33 82 60 -13 22 14 -71 -62 41 68 -2 -4
4688 -4 22 -49 -73 20 76 10 -9 28 -19 -82 -24 68 45 -3 3 -2 -64 -39 54 65 -12 -29 4 -53 -56 37 75 18 -14 5 -29 -64
4720f4O5O7k3n6Qjn4M2O2Pn7nPm7LP3K6m9k7L6k5l4M2N0l0j8Rll6J3N5qm3K4q
4755Am2J4M3J3l3PK0k9l0N1K6m5kJ3j2k4K4L9k1l1K5jj3%L8k1j8J1klj9K8J2k4
4789eQNj7qJ4K2k3rJ0%k9K8K3j1qNnnpJ4J1j6J2mj4kJ3NkjoNmQRj6%J9j4mLOm
4832Fk1ONjJ0J0j9KlLkNjo%oJ8qj1K1okOpLJ1kkojJ4rmJNrJQ%qrJ2OkMjqnMRo
4883EOlm%JkkpQKqJ0K%j2N%NJRj1lkLJ0j6J2r%J2Rj2rnPkjLNmpKJ2qJMppJ1Rr
4934DrK7j8j2PJ1J1k9PJ3k5JJ7Nk6OJ6lm%Rqj7J8J8k0lK9j8j7J5RJ2k7QJ0j8j4
4972a5K2mj6%K6j2j6K4K1l7KJ7Jj9J2J8j8l1J1K0j7LL4j6k2oL4j2k1J5J0k0kM0
5006B6j1k9J4J9j9rK6J1l2k4M5Rl3PK7l1j3L0J4l9mK8Ll9K7L0l9j5K6Rl3J4L1
$$ plain form
4720 -64 1 68 45 -11 -3 -4 -58 -16 46 53 -4 -9 -2 -49 -46 27 53 4 -23 13 -12 -46 -4 46 16 -2 7 4 -32 -19 36 28 -15 9 1
4755 1 -41 -27 16 29 -4 3 23 -6 -36 15 41 -4 -6 7 -5 -29 -5 34 13 -18 7 6 -7 -7 31 10 -8 3 1 -2 -21 7 19 -5
4789 -5 3 8 -9 -17 -3 19 -4 -13 -3 -3 -32 -4 19 8 0 5 0 -5 -12 2 13 -3 9 5 -9 -11 2 7 5 4 -2 3 -1 7 16 0 0 19 5 1 4 10 6
4832 6 -15 -9 -4 -5 5 15 -4 -2 -5 -2 -4 1 0 -6 -6 -12 6 -2 -13 8 2 0 6 -1 2 13 11 9 3 2 16 7 3 4 9 0 1 9 9 1 -8 4 10 8 12 11 3 -2 2 11 5
4883 5 11 8 4 4 5 3 1 -6 2 4 -4 6 8 8 -4 1 1 6 7 16 5 2 0 3 13 -3 9 0 0 12 21 9 0 -5 2 0 -1 2 7 3 -4 -2 10 2 3 7 0 -7 4 13 4
4934 4 -5 22 4 -8 -1 10 21 -8 -1 12 -13 -12 5 10 -16 -10 6 3 -1 -1 8 0 -17 1 19 -1 -4 25 7 -10 5 14 26 -1 7 17 -1 -15
4972 -15 7 3 -13 -13 13 1 -15 9 30 -7 -5 12 13 -6 6 24 6 -25 -14 6 -11 -8 26 10 -12 -18 16 4 -17 -2 8 -12 -14 26
5006 26 15 -14 0 19 0 -9 17 28 -4 -28 17 26 -7 0 27 -4 -17 13 27 -12 -16 12 15 -24 3 33 -6 -21 5 14 -19 -5 26
5039B6j3n2K7L6j7j3L5j4n4K8M1j5m4M8J9o5j7P0j0n2M4N3n8n3O7K2n0J1P4m0
5069C4r2L5N6l3j5O5Kj02kR2j4p0P1M9j10m5J04K3q2J5J01q0p5O7O4p0l1Q6%j14
5099g1L5J18m9q3O9M0j20nJ24Lj04L9O7r6p2J28N4r7j9R4l2j11O2J14o1q7R4K4
5127E8j31jJ50j4j21O9O7j15p4J43L5j23L0J20o5j33P5J21q5n9J24Oj56J9J36
5152G6k8j10J00O7j53p8J67L4j23M0J14r7j37J17J05j04l9J30l0j74M5J84o0j11
5176f5J08N7j92m0K03K0j41L7J05j31j17J63J25j39n2J31m9j68R0J80q6j16J17
5199D0M2j85kK10j1j66O5J14j37j15J78R3j71k4J46m1j79J15J66j46j03J56M0
5222H5j76J0J84l6j77Q8J29j37p4J57M5j74%J65n7j47R9J37j39q7J51K7j73L2
$$ plain form
5039 26 13 -39 -12 24 7 -6 29 15 -39 -11 30 15 -29 19 38 -27 -44 26 16 -36 8 61 3 -50 17 39 -11 0 74 34
5069 34 -58 -23 33 0 -15 50 52 -50 -52 40 26 -44 27 76 -34 -79 25 48 -34 -19 82 2 -73 -6 58 -12 -43 43 43 -71
5099 -71 -36 82 33 -50 19 59 -61 -66 58 61 -43 -4 63 -33 -105 23 77 -20 -39 55 23 -88 -26 88 27 -60 34 58
5127 58 -73 -74 76 62 -59 10 77 -38 -112 31 66 -57 -27 93 28 -105 -30 91 6 -53 71 77 -79 -60 76
5152 76 48 -62 38 105 -48 -126 41 75 -48 -8 106 9 -128 -11 94 -10 -49 81 51 -123 -78 106 46 -65
5176 -65 43 100 -92 -132 71 91 -50 -13 92 -39 -156 7 132 -7 -59 72 23 -145 -55 125 39 -77 40
5199 40 82 -103 -105 105 94 -72 -7 107 -30 -145 33 126 -45 -69 77 36 -143 -28 138 -8 -111 45 85
5222 85 -91 -81 103 67 -110 -22 107 -30 -104 53 98 -76 -76 89 32 -115 -16 121 -18 -105 46 73 -100 -68
5246f8J79n9j61R1J15j38o1J76J5j54OJ41n7j19J16J06j40q1J40J8j52L6J66q1
5270C4j32R0R3j36l5J71Nj63J3J27o3q5J07R2j45p6J40J1j14M2J27q4j41J07Q5
5295G0j21nJ48j7j55K9J22o1p7J15P1j72l9J30Pj07O8R9j02j04Q1P2q9qJ31l5
5321E1j50N5J04o2o1J10K6j31j9J20j2q5N7R5j13o8Q9N8j15J9J04l1j21N4P5n9
5347a0n4J14J9j19j2R4Kq3P1N3q5n6Q7J7o8K3P7n1p4M7N9o3k4Q0jr5K3N9k0n3
5377d3N0M5p9k2O4Rm9J6N7m1n3M2K9l5j0M5No0NN4k8k4L7K5m6j8M9mm9K8K4k5
5409bk3K4L0l8MK0mk1QJ8k1qK0Lk6qK6mj5J4Mj6%J8Qj8PNJj2J6Nk3RJ0Mk3J1Q
5448A1j0nOJ0j6%K4rk3NJ8j4j9J5J3lj6K5pj6J3J5j1j1QQl8J0L5kl9L1J6l3j2
$$ plain form
5246 -68 111 52 -109 -18 97 -41 -102 74 89 -65 -59 82 25 -94 22 128 -12 -93 47 65 -87 -51 115 34
5270 34 -98 -8 85 -51 -86 85 90 -73 -60 67 4 -81 26 118 -27 -103 37 48 -66 -24 103 19 -122 -15 70
5295 70 -51 -56 92 75 -80 -51 71 10 -67 48 119 -53 -92 38 45 -62 6 105 3 -101 -20 52 -37 -45 86 51
5321 51 -99 -44 60 -2 -63 47 73 -58 -77 43 31 -54 3 98 -15 -83 6 64 -51 -32 72 41 -80 -26 49 -10
5347 -10 -64 50 69 -50 -62 32 34 -49 22 75 -10 -66 21 38 -30 -7 70 19 -55 -8 51 -12 -36 44 43 -52 -29 30 10 -43
5377 -43 7 52 -27 -49 15 24 -25 -9 48 7 -46 -4 25 -10 -20 25 30 -30 -25 29 1 -23 14 39 -7 -25 24 20 -29 -1 23 -2
5409 -2 -25 -1 29 -9 -5 15 11 -10 -2 16 -5 -13 7 10 -16 -24 2 -2 -17 -3 1 -15 -15 3 11 -7 0 5 6 -6 10 15 -8 1 11 15 -8 3 11
5448 11 1 -4 2 12 -4 -4 20 11 -12 -7 11 -3 -22 -7 6 3 -13 12 5 -11 2 17 6 -5 3 11 -27 -17 18 16 -23 8 24 -9 -21
5483b1L3Kl6MN2j8m3J8L3l7j8M7K6n8j3N3lm5K4M0l9m3N3J6m7qO4k4n7L9M7m6
5515em6P9J3p4%Q4k9p0M5N4n7m6P7J2p7J1P1k3q2O1N3o2l5P2Pq1J5J01l3p7M4
5546BO3q9k6J04Mj11J8R7n6q6J02Q1j25m5J13rj17N0J20q2j01J07N9j33k3J70
5572H7k8j45O1J36j29j13J72Q3j69l5J71m4j83J06J81j38j18J48O2k09JK37l7
5595I7k19R8J63j76j27K48P4k46j6K31p5k54J80K27k12j49K29N4l04M4L27r2k61
5618a59J41J76k52j23L39P4l00kK64j47k54K49K57k80j44K68Pl42J01L79j47l03
5640a98K06J87l28j06L94P1l80O1K95k16k85L33K50l20j36L27l9l93J51M05j91
5661H8k93K70J34l97o1M58J6l82J14K89k99k61L84K20l57q5L64r7m22K09M00k40
$$ plain form
5483 -21 12 14 -22 -18 34 16 -27 -9 24 -13 -31 16 42 -16 -29 24 21 -24 0 40 1 -42 11 27 -20 -28 36 12 -45 -6 41 -5
5515 -5 -51 28 41 -33 -33 51 22 -48 -3 51 -6 -52 25 37 -40 -29 42 19 -63 -2 51 -11 -46 26 33 -48 -33 68 35 -42 2
5546 2 65 -24 -50 54 58 -53 -35 62 6 -80 22 103 -22 -67 46 37 -80 -30 90 8 -93 14 73 -60 -83 87
5572 87 59 -86 -25 111 -18 -131 41 124 -45 -80 91 47 -136 -30 151 13 -105 43 105 -104 -103 134 97
5595 97 -122 -24 139 -37 -164 84 158 -88 -104 127 52 -202 -22 205 -7 -156 73 127 -177 -133 194 102 -159
5618 -159 -18 158 -94 -217 122 196 -104 -106 158 11 -243 6 263 -17 -161 107 114 -228 -127 252 105 -198
5640 -198 8 195 -133 -239 155 226 -154 -93 202 -14 -299 34 284 -36 -172 155 116 -277 -126 279 88
5661 88 -205 65 199 -198 -259 199 215 -167 -53 236 -63 -324 60 280 -77 -162 202 105 -317 -108 292 52
5683E2k59L24J04m52j0M75m4l77J81K67l60k40M26J93l83j7L59j88m21K97L90
5704C17k84k24L59J0m78O7N05r0l62K17K22m41j81M96J60m12K6L53k67l96L56
5725d7L74l17j73L61n2m94J13N16j29l18K68J59m79j46N15J17l88Q6L24l43l62
5746d15L83L31l16j08L74j22m91J66M55j60k69L13J17m98r5M98M9l66J69K97l86
5767g4l32M13K69l51j6L71j89m69K16M30k28k17L48N8m99k3M67ol19K07K36m03
5789a11k53M18J74l04L7L25k45m15K51L74k31j40L23k4m66L5M16l2k55K12J63
5810B52m06j80L86J49k81O1K91k70l41K67K70k17p5L12p4m19O9L64r2k00K58J05
5832B29l99j16L59O6k48J15K62k76k97K75K08k30k2K83r8l62J06L09j31j65K46
$$ plain form
5683 52 -207 117 221 -231 -241 234 190 -187 -6 261 -99 -339 87 280 -103 -120 239 51 -370 -73 317
5704 317 33 -191 168 178 -300 -233 272 182 -180 37 259 -182 -363 133 293 -119 -93 260 -7 -403 -47
5725 -47 327 10 -163 198 146 -348 -235 281 152 -166 102 261 -218 -364 151 268 -120 -34 290 -53 -415
5746 -415 -32 299 -17 -125 249 127 -364 -198 257 97 -172 141 258 -240 -335 163 212 -154 15 312 -74
5767 -74 -406 7 276 -75 -91 280 91 -378 -162 268 40 -177 171 229 -270 -293 174 168 -151 56 292 -111
5789 -111 -364 54 228 -76 -39 286 41 -374 -123 251 20 -120 203 179 -287 -252 164 132 -123 89 252
5810 252 -154 -334 52 201 -80 -19 272 2 -339 -72 198 -19 -94 218 144 -275 -206 158 66 -134 124 229
5832 229 -170 -286 73 139 -109 6 268 -8 -305 -30 178 -52 -74 209 111 -251 -145 164 33 -132 114
5853A14Q3l57n5L01K4k28J42K01k66k18K63J44k12NK53j30l01J33K67j52j21K35
5875A25K4k95l7K99l6j86J34J60k43j48K28J06j94K7K01j33k19J49J70j49q3K14
5897A14Ok54J5K24o9j36J43R2k07q5K05M3j67L9J62j13j67J36J17j31l9J74m0
5920F2j71M0J59p1j01J17O6j59l9J51Kj26M0J30r9j02J08P3j13j6J14k2j21N0
5944b8Q9n7o1R3L7j05k3J10k8q4M9P3p7n3Q6K1p3jP3k9p4N8M7n0m0N5K0o8J7N5
5974C2j3n5N1K4n1k6O3Jm8JN7l3m4N1K0m8oN6j0o0K1N2k7l6L4K3n1OM4ln2J8K5
6007A6jm4M0J0m4QL1j3k5J7L9l7l5N4J0l9kM4om1PM0k4l5M7J0m0lM7Mo1K3L7l0
6041Dl6M1L6n8j4O4nn9K1M8l8l9M9K6o4%Q1l9n6K7O5o4k9P2Qq4jQ3k5o5N0N8o1
$$ plain form
5853 114 197 -160 -215 86 110 -118 24 225 -41 -259 4 148 -64 -59 194 64 -237 -104 163 11 -110 125
5875 125 149 -146 -183 116 80 -106 28 188 -55 -203 25 131 -63 -36 165 32 -187 -38 132 -17 -100 114
5897 114 120 -134 -119 105 36 -100 43 135 -72 -157 48 91 -76 -37 125 12 -155 -19 98 -33 -72 102 62
5920 62 -109 -69 90 19 -82 35 101 -58 -97 54 56 -70 -30 100 1 -101 7 80 -33 -49 65 43 -78 -28
5944 -28 61 4 -57 36 73 -32 -55 55 27 -57 -8 65 -12 -65 21 42 -31 -32 41 12 -62 -4 43 -7 -47 8 28 -40 -23 32
5974 32 19 -36 15 39 -12 -38 25 26 -22 -21 36 3 -41 10 30 -18 -24 32 22 -38 -17 35 8 -28 6 29 -22 -16 28 25 -27 -9 16
6007 16 15 -29 11 21 -23 -15 16 3 -22 -5 34 -3 -38 16 26 -13 -15 29 23 -18 -11 29 5 -30 17 27 -13 -16 31 35 -26 -3 34 4
6041 4 -32 9 45 -13 -27 37 32 -27 -6 42 4 -35 14 40 -24 -24 57 18 -38 -11 54 -10 -39 33 41 -43 -44 39 14 -51 -1 57 -4
6074dn6Q8J7q1J8Q9l9r3O1P9q7m3J11J2j30J7J20o3r2R2P6j22o0J28J7j38O6J31
6102A14r9j24J11J02j39m5J70j6j81N2J62q8j32J62Q0j92n6K07oj99Q4J96j37
6125B6j76J75R7k10j4K51l7k58P7K07j54j42K60Q8k87n4K60l9k30J62K33k35k16
6148b16K40J03k54JL40r8l15J27K38k16j53L48R1l72n1L30q0k76K24K78k87k47
6170b45L05R0l29O8L86j39l82J96K49k85j36M07P1m23j7L68j44k87L12K75l70
6191c0k32L52O3l80J35M28k41l87K46K60l55q1M81Kn00N1L90k06k89M04K67m81
6213a03j99M38j4m08K30M66l32m30L51K10m15rN63q9n51J17M16k94k72N12K33
6234D20n71j47M52n5m27L23M67m11m09L94J79m75O8N93j51n82J99L95l67k20N63
$$ plain form
6074 -4 -60 28 45 -36 -18 71 32 -61 0 79 -8 -51 60 72 -58 -41 79 16 -76 16 92 -30 -90 38 55 -83 -17 114
6102 114 15 -109 2 104 -35 -80 90 74 -107 -55 107 19 -113 49 129 -63 -119 88 82 -117 -33 163 26
6125 26 -150 25 122 -88 -102 149 112 -146 -69 138 -16 -158 102 190 -97 -151 109 70 -160 2 235 0 -216
6148 -216 24 127 -127 -126 214 116 -199 -72 166 -50 -203 145 236 -136 -187 143 63 -213 11 289 2 -245
6170 -245 60 150 -179 -111 275 136 -246 -50 199 -86 -222 185 256 -167 -184 184 40 -247 65 340 -30
6191 -30 -262 90 153 -227 -92 336 95 -292 -46 214 -141 -222 259 261 -239 -188 202 -4 -293 111 378 -103
6213 -103 -302 136 122 -286 -56 410 78 -352 -1 209 -206 -215 348 259 -292 -175 241 -53 -325 187 420
6234 420 -151 -298 154 99 -328 -5 462 51 -358 36 215 -260 -192 401 250 -332 -133 262 -105 -325 238
6255B38J70o24p4N24j57m50M02M49m98l69M81J41n32J25O22k42o07L18L90m51
6275a44j87O38Q1o72LN64k29m28M62M05n88l14N49P4n48J96O16l26n81L75L68
6296C14m83j39O50J9o88Q6N31k74l90N09L27n94k53N61J9n35K38N83l80n37M18
6317a8L23m96q2O33n3o58J44N23l15l46N15K77o44j63N65j5n17K69N13m27m59
6338d31M63K63m98l7N99j21o04J98M97l37l13N09J84n98r7N54p8m65K98M27m39
6359b6l80M66K06m75J3N34j67n43K50M17l37k43M78J24n53k5M96j07l81K80L37
6380C64m25k76M27J60m34N3M37j95m51K74L29l07j89M17O4m83J5M44j25l27K72
6401D4K52l99j92M06Q8l64P6L55k17l49K71K65k94j25L56Qm14O7L77j53k60K59
$$ plain form
6255 238 408 -216 -290 234 77 -373 29 478 -20 -389 92 233 -299 -174 448 206 -401 -83 307 -144
6275 -144 -331 307 388 -284 -281 283 54 -374 88 493 -95 -409 140 214 -334 -138 478 152 -429 -54 314
6296 314 -169 -308 342 361 -327 -241 290 16 -374 135 462 -132 -385 176 195 -340 -102 481 101 -436 -18
6317 -18 305 -191 -273 360 307 -351 -207 316 1 -345 170 447 -197 -360 205 190 -327 -58 455 28 -431
6338 -431 32 295 -203 -240 359 238 -366 -168 329 -8 -321 188 372 -226 -323 231 153 -312 -14 413 -26
6359 -26 -406 60 266 -209 -196 338 171 -372 -122 295 -42 -285 193 317 -236 -261 235 128 -253 27 364
6380 364 -61 -337 90 250 -184 -131 306 111 -340 -66 263 -44 -233 184 248 -235 -220 224 99 -228 44
6401 44 296 -103 -295 111 199 -165 -89 266 49 -300 -29 236 -58 -183 173 181 -233 -166 211 58 -202 57
6423E7J72l41j16L47M3l13R6K86k07k62K48J87k58p3K85k5l17R4K68j38j89K14
$$ plain form
6423 57 229 -112 -228 119 162 -151 -55 231 24 -238 10 197 -61 -134 151 126 -191 -97 171 33 -156 58
$$ [...]
8191I
##END NTUPLES=NMR FID
##END=
