##TITLE=31P_DE-80H_X3
 64 sc D2O
 26.2.2025
##JCAMPDX= 6.0         $$ Bruker NMR JCAMP-DX V2.0
##DATA TYPE= NMR SPECTRUM
##DATA CLASS= NTUPLES
##ORIGIN= UXNMR, Bruker Analytische Messtechnik GmbH
##OWNER= root
$$ XWIN-NMR		Version 3.5
$$ Wed Mar 19 14:53:44 2025 Russian Standard Time (UT+4h)  Yarkov@DPX200
##.OBSERVE FREQUENCY= 81.013821
##.OBSERVE NUCLEUS= ^31P
##.ACQUISITION MODE= SIMULTANEOUS
##.ACQUISITION SCHEME= undefined
##.AVERAGES= 64
##.DIGITISER RES= 17
##SPECTROMETER/DATA SYSTEM= spect
##.PULSE SEQUENCE= zgpg30
##.SOLVENT NAME= CDCl3
##.SHIFT REFERENCE= (INTERNAL, CDCl3, 0, 198.062)
##AUDIT TRAIL= $$ (NUMBER, WHEN, WHO, WHERE, WHAT)
$$ ##TITLE= Audit trail, XWIN-NMR		Version 3.5
$$ ##JCAMPDX= 5.01
$$ ##ORIGIN= Bruker BioSpin GmbH
$$ ##OWNER= Yarkov
$$ C:/Bruker/XWIN-NMR/data/yarkov2/nmr/P31/2/pdata/1/auditp.txt
$$ ##AUDIT TRAIL=  $$ (NUMBER, WHEN, WHO, WHERE, WHAT)
(   1,<2025-03-19 14:52:43.31 +0400>,<Yarkov>,<DPX200>,
      <created by zg, POWCHK disabled, PULCHK disabled
       configuration hash MD5:
       00 E9 B6 7A A2 85 ED C7 34 08 36 98 17 FE 4E 26
       data hash MD5: 32K
       85 60 4F E2 11 ED 39 76 60 D6 4E 6A 86 8E C8 D0>)
(   2,<2025-03-19 14:52:50.70 +0400>,<Yarkov>,<DPX200>,
      <Start of raw data processing
       efp BC_mod = 2 LB = 1.5 FT_mod = 6 PKNL = 1 PHC0 = 1784.45 PHC1 = 6.895418 SI = 64K 
       data hash MD5: 64K
       8C FB 5B C9 1F D5 DF 24 49 C6 15 5E 45 CE A4 B6>)
(   3,<2025-03-19 14:53:08.95 +0400>,<Yarkov>,<DPX200>,
      <pk PHC0 = 25.0025 PHC1 = 0 
       data hash MD5: 64K
       07 0C 3C 24 59 EC EF 8D CD FF 6A 03 E0 78 59 6E>)
$$ ##END=
$$ 
$$ hash MD5
$$ 5B F6 02 AC E3 52 E5 48 00 D7 FE 1A C0 23 23 3F
##$RELAX= 
##$RELAX= 
##$RELAX= 
##$RELAX= 
##$RELAX= 
##$RELAX= 
##$RELAX= 
##$RELAX= 
$$ Bruker specific parameters
$$ --------------------------
##$DU= <C:/Bruker/XWIN-NMR>
##$EXPNO= 2
##$NAME= <P31>
##$PROCNO= 1
##$TYPE= <nmr>
##$USER= <yarkov2>
##$AMP= (0..31)
100 100 100 100 100 100 100 100 100 100 100 100 100 100 100 100 100 100 
100 100 100 100 100 100 100 100 100 100 100 100 100 100 
##$AQSEQ= 0
##$AQ_mod= 1
##$AUNM= <au_zg>
##$AUTOPOS= <>
##$BF1= 81.014009
##$BF2= 200.13
##$BF3= 200.13
##$BF4= 200.13
##$BF5= 200.13
##$BF6= 200.13
##$BF7= 200.13
##$BF8= 200.13
##$BYTORDA= 1
##$CFDGTYP= 0
##$CFRGTYP= 5
##$CHEMSTR= <none>
##$CNST= (0..31)
1 1 145 1 1 1 1 1 1 1 1 1 1 1 1 1 1 1 1 1 1 1 1 1 1 1 1 1 1 1 1 1 
##$CPDPRG= <waltz16>
##$CPDPRG1= <>
##$CPDPRG2= <waltz16>
##$CPDPRG3= <>
##$CPDPRG4= <mlev>
##$CPDPRG5= <mlev>
##$CPDPRG6= <mlev>
##$CPDPRG7= <mlev>
##$CPDPRG8= <mlev>
##$CPDPRGB= <>
##$CPDPRGT= <>
##$D= (0..31)
0 1 0 0 0 0 0 0 0 0.06 0 0.03 2e-05 3e-06 0 0 0.0002 0 0 0 0 0 0 0 0 0 
0 0 0 0 0 0 
##$DATE= 1742381562
##$DBL= (0..7)
120 120 120 11 120 120 24 19 
##$DBP= (0..7)
150 150 150 150 150 150 150 150 
##$DBP07= 0
##$DBPNAM0= <>
##$DBPNAM1= <>
##$DBPNAM2= <>
##$DBPNAM3= <>
##$DBPNAM4= <>
##$DBPNAM5= <>
##$DBPNAM6= <>
##$DBPNAM7= <>
##$DBPOAL= (0..7)
$$ [...]
##$SUBNAM2= <"">
##$SUBNAM3= <"">
##$SUBNAM4= <"">
##$SUBNAM5= <"">
##$SUBNAM6= <"">
##$SUBNAM7= <"">
##$SUBNAM8= <"">
##$SUBNAM9= <"">
##$SW= 400.765351723535
##$SWIBOX= (0..15)
0 1 3 0 0 0 0 0 0 0 0 0 0 0 0 0 
##$SW_h= 32467.5324675325
##$TD= 32768
##$TD0= 1
##$TE= 0
##$TE2= 300
##$TE3= 300
##$TEG= 300
##$TL= (0..7)
0 120 53 12 22 120 120 120 
##$TP= (0..7)
150 150 150 150 150 150 150 150 
##$TP07= 0
##$TPNAME0= <>
##$TPNAME1= <>
##$TPNAME2= <>
##$TPNAME3= <>
##$TPNAME4= <>
##$TPNAME5= <>
##$TPNAME6= <>
##$TPNAME7= <>
##$TPOAL= (0..7)
0.5 0.5 0.5 0.5 0.5 0.5 0.5 0.5 
##$TPOFFS= (0..7)
0 0 0 0 0 0 0 0 
##$TUNHIN= 0
##$TUNHOUT= 0
##$TUNXOUT= 0
##$USERA1= <user>
##$USERA2= <user>
##$USERA3= <user>
##$USERA4= <user>
##$USERA5= <user>
##$V9= 5
##$VALIST= <valist>
##$VCLIST= <CCCCCCCCCCCCCCC>
##$VD= 0
##$VDLIST= <DDDDDDDDDDDDDDD>
##$VPLIST= <PPPPPPPPPPPPPPP>
##$VTLIST= <TTTTTTTTTTTTTTT>
##$WBST= 1024
##$WBSW= 4
##$XGAIN= (0..3)
0 0 0 0 
##$XL= 0
##$YL= 0
##$YMAX_a= 18706
##$YMIN_a= -21707
##$ZGOPTNS= <>
##$ZL1= 120
##$ZL2= 120
##$ZL3= 120
##$ZL4= 120
##$ABSF1= 0
##$ABSF2= 0
##$ABSG= 0
##$ABSL= 0
##$ALPHA= 0
##$AQORDER= 0
##$ASSFAC= 0
##$ASSFACI= 0
##$ASSFACX= 0
##$ASSWID= 0
##$AUNMP= <proc_1d>
##$AZFE= 0.1
##$AZFW= 0.5
##$BCFW= 0
##$BC_mod= 2
##$BYTORDP= 0
##$COROFFS= 0
##$CY= -3
##$DATMOD= 1
##$DC= 0
##$DFILT= <>
##$DTYPP= 0
##$F1P= 0
##$F2P= 0
##$FCOR= 1
##$FTSIZE= 65536
##$FT_mod= 6
##$GAMMA= 0
##$GB= 0
##$INTBC= 1
##$INTSCL= 9.790993e-09
##$ISEN= 30
##$LB= 1.5
##$LEV0= 0
##$LPBIN= 0
##$MAXI= 10000
##$MC2= 0
##$MEAN= 0
##$ME_mod= 0
##$MI= 50
##$NCOEF= 0
##$NC_proc= -4
##$NLEV= 6
##$NOISF1= 182.463
##$NOISF2= 159.3651
##$NSP= 0
##$NTH_PI= 0
##$NZP= 0
##$OFFSET= 198.0616
##$PC= 4
##$PHC0= 1809.452
##$PHC1= 6.895418
##$PH_mod= 1
##$PKNL= yes
##$PPARMOD= 0
##$PSCAL= 0
##$PSIGN= 0
##$REVERSE= no
##$SF= 81.0140089999434
##$SI= 65536
##$SIGF1= 159.3651
##$SIGF2= -187.1042
##$SINO= 113.3802
##$SIOLD= 16384
##$SREGLST= <1H.CDCl3>
##$SSB= 0
##$STSI= 65536
##$STSR= 0
##$SW_p= 32467.5324675325
##$SYMM= 0
##$S_DEV= 0
##$TDeff= 32768
##$TDoff= 0
##$TI= <>
##$TILT= no
##$TM1= 0
##$TM2= 0
##$TOPLEV= 0
##$USERP1= <user>
##$USERP2= <user>
##$USERP3= <user>
##$USERP4= <user>
##$USERP5= <user>
##$WDW= 1
##$XDIM= 65536
##$YMAX_p= 437015577
##$YMIN_p= -9558362
$$ End of Bruker specific parameters
$$ ---------------------------------
##NTUPLES= NMR SPECTRUM
##VAR_NAME=  FREQUENCY,     SPECTRUM/REAL,   SPECTRUM/IMAG
##SYMBOL=    X,             R,               I
##VAR_TYPE=  INDEPENDENT,   DEPENDENT,       DEPENDENT
##VAR_FORM=  AFFN,          ASDF,            ASDF
##VAR_DIM=   65536,         65536,           65536
##UNITS=     HZ,            ARBITRARY UNITS, ARBITRARY UNITS
##FACTOR=    0.49542278885378, 1,            1
##FIRST=     16045.7642231865, 0,            0
##LAST=      -16421.768244346, 0,            0
##MIN=       -16421.768244346, -9558362,     0
##MAX=       16045.7642231865, 437015577,    0
$$ Real data points
##PAGE= N=1
##DATA TABLE= (X++(R..R)), XYDATA
$$ [...]
41973 -793475 -426047 -46789 -21578 -305873 -536056 -484084 -248544 -26856 100221 129492
41963 129492 72084 4511 32032 121720 108094 -55368 -192644 -152955 -23915 23901 -27879
41952 -27879 -112530 -254544 -491315 -707580 -755759 -693871 -695736 -748035 -657572 -373751 -79684
41941 -79684 94647 236620 431756 572659 525986 348993 196741 118437 77483 80025 143242
41930 143242 199135 158151 31901 -94201 -154174 -100252 90078 311867 362130 209001
41920 209001 106747 258606 475128 407866 64613 -179595 -96997 131036 232154 180182
41910 180182 103043 63203 74033 170270 308905 327479 148636 -78326 -175698 -175561 -221021
41899 -221021 -328292 -403772 -419326 -406180 -334415 -170046 -14629 -12502 -126540 -169126 -65267
41888 -65267 66779 113604 91224 35544 -76981 -223578 -274507 -140423 88817 236944
41878 236944 234663 166267 157534 256348 395794 453357 373338 228703 120480 38956 -93686
41867 -93686 -250114 -278340 -95985 183932 375928 408573 346151 286292 278745 291022 223038
41856 223038 18178 -217872 -300276 -211492 -158168 -297679 -503951 -527297 -323922 -84550
41846 -84550 39588 86448 135792 158910 101672 23434 38533 148270 233490 226213 199861
41835 199861 238113 282491 208191 37375 -40510 83448 261464 259274 49277 -182889 -300461
41824 -300461 -349126 -411533 -465990 -455448 -390474 -302361 -176691 -18409 88063 78189 17473
41813 17473 24624 125446 264789 417635 587800 718666 705627 510019 208366 -59038
41803 -59038 -153154 -10153 271195 466548 445069 315852 268667 325940 373682 385751 451612
41792 451612 587185 688456 706404 712733 741012 713674 601393 513412 528877 558523 491538
41781 491538 383368 365423 429813 433085 287290 47317 -166439 -245101 -123372 166861
41771 166861 481091 674713 726860 706927 657860 578646 478979 366649 211622 10088
41761 10088 -142029 -135925 303 130145 181768 199791 221021 198658 85993 -72867 -173339
41750 -173339 -138768 22745 212243 311145 311473 341662 489663 643242 615617 403697 186433
41739 186433 66351 -33997 -181309 -297240 -301768 -259277 -266106 -286203 -220338 -76241 46365
41728 46365 100815 120961 131339 118468 70120 -24321 -172532 -311679 -310157 -139554 15999
41717 15999 -44599 -269560 -425154 -421356 -400642 -476223 -554478 -502917 -356299 -234168 -141826
41706 -141826 13128 236390 389192 327570 49243 -291719 -486610 -420051 -160195 115110
41696 115110 297258 408592 478299 454677 311181 156538 126959 206274 261386 238234 212742
41685 212742 243319 277934 236380 103823 -84704 -280539 -416499 -437288 -367987 -295102 -259639
41674 -259639 -232710 -207965 -227178 -279648 -272455 -160095 -19549 67971 121714 169207 147638
41663 147638 15995 -111857 -94909 14557 34768 -72223 -153781 -115937 -55624 -77072 -117855
41652 -117855 -62271 65083 122903 16421 -234686 -531798 -736505 -747159 -616637 -529651
41642 -529651 -580952 -644099 -554263 -347413 -192450 -141218 -97646 -16503 25676 -21642 -107605
41631 -107605 -192541 -302139 -410860 -403490 -249924 -116729 -183297 -401350 -551170 -512134
41621 -512134 -373477 -276127 -237075 -165023 620 205545 330043 317240 245816 247218 344077
41610 344077 417377 362210 225737 140148 161046 239060 319777 383569 390613 287593 112398
41599 112398 12125 77505 194999 150070 -116464 -427600 -572993 -525182 -397675 -251190
41589 -251190 -54250 170247 292457 235550 90334 -19164 -98521 -191378 -205080 -15417
41579 -15417 263976 328453 78392 -205527 -208685 32257 244971 312458 344742 402362 377215
41568 377215 211012 55389 89178 265429 359658 236241 -26346 -261221 -372927 -352967
41558 -352967 -218263 -5279 203287 328707 393041 494440 637698 661005 426607 40826
41548 40826 -242905 -332597 -360745 -408426 -344812 -61843 265501 328561 48179 -351082 -600049
41537 -600049 -595134 -385655 -100959 99444 130992 78172 106224 267726 464277 583299
41527 583299 586275 480738 307226 148733 59800 -2098 -88578 -147068 -112589 -59752 -101218
41516 -101218 -167734 -85618 123888 236543 159065 57116 73406 128373 111410 71478 77926
41505 77926 73374 28134 76886 312622 577232 655418 571893 498740 460807 345412 142353
41494 142353 -36079 -142034 -214866 -251685 -228016 -198897 -198494 -106034 168443 425940 379545
41483 379545 103080 -18234 164415 360531 291836 68022 -48448 -8785 88281 221771
41473 221771 377239 411538 244016 80476 189463 504608 693016 607050 432971 363701
41463 363701 352738 279482 169483 115352 97773 26557 -97186 -182439 -198597 -230423 -364068
41452 -364068 -570479 -725471 -725854 -576990 -381237 -253157 -242412 -320865 -422147 -491321 -519412
41441 -519412 -543547 -597053 -647942 -606949 -414235 -105640 213694 438283 502054 398788
41431 398788 199879 16824 -103845 -230054 -435525 -649334 -685229 -460539 -138676 22708
41421 22708 -25662 -50777 167601 518682 660663 455447 158183 72353 141011 64422 -232530
41410 -232530 -481957 -463110 -292711 -206774 -229884 -234480 -203802 -220475 -242532 -112371 177617
41399 177617 403563 365923 104864 -205921 -465597 -652826 -716624 -596062 -341902 -116624
41389 -116624 -33542 -38120 20220 217698 480871 669451 700026 575214 330435 12176
41379 12176 -288698 -451025 -421603 -274366 -136667 -78545 -98408 -174992 -282066 -373950 -402714
41368 -402714 -338231 -152441 165254 530427 763780 758508 620632 556533 638735 769793
41358 769793 855858 898804 905363 829935 666199 505484 434250 431418 424973 399740 391389 412761
41346 412761 443259 470675 501511 539439 569699 548549 418124 179455 -58799 -177804 -197328
41335 -197328 -237816 -323946 -346006 -259336 -182291 -201477 -210656 -85755 80424 93214 -53347
41324 -53347 -187081 -230900 -265105 -307411 -247987 -78266 8995 -128984 -378248 -539728 -579870
41313 -579870 -567593 -480216 -259692 1151 123847 89474 52514 95181 118300 13672 -180601
41302 -180601 -340666 -372580 -242296 573 198883 201359 42111 -94271 -112096 -84088
41292 -84088 -63795 14480 169948 278969 268691 256466 345466 422854 347191 209581 177856
41281 177856 176261 -1119 -290087 -372418 -141390 131084 198847 157687 204492 306447 318925
41270 318925 273063 317777 463052 581449 608676 570493 469980 329361 296327 503867
41260 503867 820548 927889 688390 291568 -2658 -127650 -172193 -216262 -286735 -384976
41250 -384976 -472070 -466532 -309191 -19936 301707 500784 445421 177787 -47496 -5129
41240 -5129 222397 341778 235950 100895 150099 341527 491074 522850 485449 420625 350335
41229 350335 331062 393355 461336 435879 325485 202491 73523 -96667 -263164 -324224
41219 -324224 -266437 -182160 -135654 -110259 -101197 -157883 -293889 -433380 -494112 -473708 -425892
41208 -425892 -400530 -425543 -491965 -538270 -510283 -453188 -466911 -540872 -528885 -354271 -147662
41197 -147662 -73292 -84407 4829 221024 365310 293724 124720 64988 122133 122761 -20800
41186 -20800 -196195 -260225 -217686 -186415 -250556 -391777 -523829 -567316 -526460 -500148 -563488
41175 -563488 -635253 -548232 -282361 -32760 17829 -92884 -209984 -284258 -363523 -414882 -315161
41164 -315161 -35832 283286 476602 479921 309767 37410 -177551 -154158 114781 402107
41154 402107 463948 278969 16153 -177232 -274192 -291017 -214323 -37933 172177 296131
41144 296131 266557 159792 146810 312051 539852 630609 511925 277719 51514 -95527
41134 -95527 -115306 -6929 110529 87967 -42731 -85448 24779 96328 -32982 -225368
41124 -225368 -224029 -7949 216583 318182 341007 329649 257185 152971 117908 154107 135769
41113 135769 18537 -68858 -29167 43876 22978 -54357 -83866 -97062 -192792 -309221 -256249
41102 -256249 -9471 190551 120865 -148968 -365032 -399370 -339331 -307009 -317347 -325948 -303895
41091 -303895 -223664 -68071 88444 101828 -51516 -188146 -133695 41330 140121 137913 175276
41080 175276 264815 230549 9218 -203566 -240367 -207378 -263703 -315987 -174143 78840 140695
41069 140695 -88263 -368946 -447139 -316688 -113184 62612 142376 91362 12959 98037
41059 98037 355627 529570 412509 128121 -39974 -4126 99749 169162 237729 332473
41049 332473 396351 396378 390769 429875 468004 436101 363587 371593 536190 773425 887057 765428
41037 765428 521266 373742 382162 382211 223840 -33009 -243745 -396206 -561897 -694846 -658163
41026 -658163 -454092 -257130 -167957 -82828 110680 333409 418015 321350 121730 -116759
41016 -116759 -342763 -435460 -290022 4613 217653 250785 245069 361366 565152 706177
41006 706177 715460 625711 474104 300553 188645 180884 180261 62429 -128129 -227440 -196554
40995 -196554 -166476 -211973 -244026 -197073 -163506 -225232 -282633 -198246 -19588 92790 94443
40984 94443 62613 20680 -85511 -255626 -421379 -552850 -651746 -669923 -580391 -494027 -526535
40973 -526535 -568166 -399736 -58393 148297 70269 -75026 -51015 52551 10598 -163311
40963 -163311 -257004 -182570 -47853 49441 110223 136242 113767 96375 158401 255129 249948
40952 249948 86112 -168821 -424307 -590905 -542037 -229410 144627 249707 1172 -320470
40942 -320470 -408061 -270588 -135725 -111403 -97678 -13988 38472 -80745 -314395 -425408
40932 -425408 -285682 -65430 -29128 -168418 -193630 51564 336306 358642 183297 120430
40922 120430 214584 154804 -218804 -593958 -575514 -214647 103511 205786 280152 468541
40912 468541 591595 422792 56186 -192230 -174777 -28378 76430 132120 203014 281472
40902 281472 317996 297340 196880 -43360 -395406 -657462 -641607 -421978 -241841 -174872
40892 -174872 -57588 195286 402479 365214 151011 -31389 -125987 -212102 -269403 -177140
40882 -177140 55544 253107 308488 300204 327760 371205 377565 364854 363950 350647 303724 250891
40870 250891 201670 119597 20518 10573 149076 341446 443712 419960 334426 249151 199890
40859 199890 215275 276794 297051 214352 86196 29290 89855 216718 319987 305550 112202
40848 112202 -196004 -406312 -326771 8228 364250 541683 527075 412645 244730 973
40838 973 -315334 -612867 -764081 -712392 -517928 -300556 -155851 -122129 -173305 -202850 -72938
40827 -72938 232324 528542 604835 466505 296542 187093 66162 -73374 -63390 189344
40817 189344 484562 542921 371900 237907 290463 382978 301388 40920 -208116 -277506
40807 -277506 -171886 -33909 17694 14826 70234 172477 149388 -81184 -319818 -294097 -19250
40796 -19250 211200 199750 55423 -5633 73792 193908 252895 218558 123045 56171 104019
40785 104019 240539 336792 316887 237718 178373 136113 88159 71356 121784 200226 257640
40774 257640 318669 414329 476555 397523 185146 -13700 -50800 95418 306751 410521
40764 410521 319217 120335 -22471 -85455 -213794 -474357 -690592 -648705 -390928 -152269
40754 -152269 -52251 -17184 11980 -12287 -96399 -149792 -145384 -169854 -229188 -177822 30857
40743 30857 191047 125341 -14399 38274 223690 201532 -149538 -537310 -647559 -510968
40733 -510968 -352460 -266084 -217772 -232404 -363131 -533168 -603126 -580551 -593644 -659325 -648923
40722 -648923 -513487 -378438 -347473 -351224 -280922 -162995 -98270 -107336 -138847 -171451 -204683
40711 -204683 -194158 -106471 -18199 -50606 -197953 -316747 -314096 -267868 -314985 -476663 -647431
40700 -647431 -724125 -691199 -593006 -482871 -417215 -445592 -549451 -608978 -501601 -252620 -26280
40689 -26280 63441 60361 34761 -51673 -226157 -331478 -169227 183768 408777 358773 241502
40678 241502 275072 350784 225150 -89231 -351116 -441248 -461474 -503116 -529218 -505712 -458933
40667 -458933 -370092 -195549 -33799 -74433 -299268 -425848 -273580 -20614 60622 -14530
40657 -14530 -20417 106231 191987 119100 -7051 -43796 -17975 -45499 -121354 -102573 94791
40646 94791 354448 470890 392169 286118 320220 437396 451607 331905 238479 252473 249546
40635 249546 143062 84919 246211 509538 598114 465855 331711 318533 294656 152286
40625 152286 24082 70621 209034 237529 135437 49139 30557 -6360 -63516 -3422 196832
40614 196832 303950 92555 -332827 -635902 -646864 -524015 -501819 -605266 -677555 -603499
40604 -603499 -421705 -254340 -189987 -214481 -220509 -123568 647 -35008 -280682 -532640 -574034
40593 -574034 -464376 -437124 -547463 -619768 -571571 -573442 -771231 -1021689 -1069433 -873087 -581818
40582 -581818 -272177 90443 455708 656062 610912 418039 201345 -6544 -191823 -298973
40572 -298973 -306566 -262753 -186414 -26351 223686 465997 624839 741148 862605 927992
40562 927992 861878 713595 588282 490331 357417 219120 186474 276781 374422 403993 438271
40551 438271 574822 779706 917146 887344 688304 392058 113504 -44581 -83721 -119667
40541 -119667 -237320 -362383 -352797 -201664 -55445 -16160 -20626 38323 154462 242292 262106
40530 262106 223041 112341 -65033 -193753 -122757 132963 363554 387093 228608 38941
40520 38941 -79686 -111576 -79435 -44192 -88535 -208183 -268846 -166006 16168 108738 81162
40509 81162 37554 14259 -66206 -213256 -288278 -184833 12082 130284 103597 -10800 -139077
40498 -139077 -230442 -244096 -193527 -179428 -286485 -449817 -508026 -406705 -275778 -264943 -357894
40487 -357894 -412402 -360627 -291960 -313360 -393627 -411210 -321645 -192588 -81152 20803 98613
40476 98613 92812 28387 42265 173264 241160 95174 -105138 -63964 229077 472468 464004
40465 464004 318455 222551 198989 216735 318952 479295 501155 249456 -129373 -386052
40455 -386052 -462505 -443924 -334071 -87859 204152 381034 432621 462701 459424 308675 35900
40444 35900 -173769 -232496 -240758 -273353 -252838 -111509 71975 187898 235616 274897 331220
40433 331220 404484 482778 509369 429508 293046 201373 138425 -4653 -204919 -272578 -115348
40422 -115348 109962 202560 143837 26461 -104325 -217566 -223852 -77125 128984 285488
40412 285488 412088 563370 674447 635578 468582 307214 238338 255037 309917 319647 187525
40401 187525 -66239 -262499 -268551 -179901 -173543 -254059 -298692 -296110 -357387 -500162 -593499
40390 -593499 -541807 -388607 -216903 -66263 37118 82417 114916 163008 129376 -111265
40380 -111265 -495127 -790278 -864373 -798686 -703527 -572010 -390308 -255796 -268481 -380155
40370 -380155 -453453 -429041 -355303 -278932 -174227 11432 261854 450646 431264 207211
40360 207211 -27537 -84520 17076 120242 152982 166466 182923 150288 59906 -19207 -46140
40349 -46140 -36887 17208 131657 224534 180953 46726 -159 87652 154195 82911 -57598
40338 -57598 -177288 -288357 -366274 -280110 -13596 203008 159466 -48987 -166474 -103954
40328 -103954 40419 184065 294501 295292 136560 -67871 -141185 -65112 34713 85484 105415
40317 105415 89580 19546 -36874 7764 108534 149060 133334 163036 243422 279382 258673
40306 258673 262777 281724 196884 -10647 -194508 -237228 -174065 -88730 -29819 -62385 -235387
40295 -235387 -437784 -454222 -254932 -84738 -161182 -411557 -614066 -673651 -630530 -504436
40285 -504436 -287820 -40329 147152 259457 327805 331738 241967 138438 161835 320629
40275 320629 436080 332384 43051 -216452 -275762 -177462 -98989 -130740 -192179 -181228 -118375
40264 -118375 -69909 -7991 128862 279724 313813 234869 185254 228032 275616 272957 289904
40253 289904 352756 331008 108689 -228585 -482988 -550105 -460471 -302064 -180653 -168886
40243 -168886 -208292 -142827 68934 261112 261531 92427 -113302 -283845 -386158 -349263 -163067
40232 -163067 24544 63274 -888 -18740 36082 86120 130779 225563 312729 264797 104626
40221 104626 7010 55149 155038 222231 290721 384263 435331 408176 368007 343188 242862
40210 242862 13776 -226704 -333503 -333827 -360816 -437558 -456689 -360071 -215647 -97499 2226
40199 2226 96074 130360 74898 23537 92059 226667 241246 89741 -26221 68755 242875
40188 242875 219579 -22510 -215105 -189664 -92149 -118634 -226582 -254023 -177269 -81505 10539
40177 10539 105759 137229 82788 96290 301624 522347 468568 173038 -26177 32266 139082
40166 139082 86406 -29265 -28066 47440 47524 -13073 -7976 66569 107349 105549 150743 246957
40154 246957 286760 226476 152380 134400 123563 53448 -34251 -42753 28670 57294 -56217
40143 -56217 -249005 -353036 -297614 -203807 -235472 -394430 -526044 -507827 -364158 -204412
40133 -204412 -121108 -148955 -248500 -317246 -281669 -188624 -149575 -200706 -285088 -357029 -414715
40122 -414715 -435702 -380807 -273186 -184496 -139140 -118668 -138071 -196674 -178736 28279 304795
40111 304795 377662 184996 -19420 -15220 100755 96392 -74338 -260132 -306721 -150130 165213
40100 165213 449695 478068 261802 86318 145796 280499 233202 18927 -160096 -235908
40090 -235908 -270110 -222473 3506 316112 497026 511896 517190 544146 441192 199243 73841
40079 73841 238473 504089 542762 267037 -143853 -484158 -654203 -641713 -515535 -407156
40069 -407156 -397456 -436911 -431840 -364612 -271439 -155417 2380 172719 282273 281054 179482
40058 179482 41956 -41080 -14673 84951 169799 201441 206641 194970 135659 35602 -37268
40047 -37268 -45992 -33641 -40672 -37331 13328 80389 104711 68853 -18751 -160041 -326211 -415863
40035 -415863 -331817 -110012 75004 61354 -147803 -392915 -523954 -545955 -570003 -628236
40025 -628236 -613829 -450971 -248281 -186770 -294164 -433889 -494425 -474192 -387911 -226486
40015 -226486 -42922 49377 27938 10781 84565 168862 134928 1545 -70693 40612 290487
40004 290487 494907 474651 221340 -65255 -166902 -83716 -3474 -32824 -83876 -69517 -64957
39993 -64957 -171375 -337216 -449656 -515701 -599281 -640841 -521392 -298223 -193773 -296883
39983 -296883 -425128 -375382 -200500 -116481 -192103 -263542 -169435 30391 126767 2869 -252022
39972 -252022 -444782 -432011 -181672 225893 604636 738607 550786 196088 -77766 -157718
39962 -157718 -100277 22401 195188 369769 435684 354884 231045 157614 71302 -137779
39952 -137779 -415276 -557644 -438561 -136477 165960 332872 322837 180348 28427 7233
39942 7233 149830 332556 398372 328730 249326 254629 278345 187015 -28701 -236455 -346692
39931 -346692 -427809 -582935 -783472 -908529 -900742 -786287 -578488 -286627 -17106 71590
39921 71590 -37606 -177562 -205501 -165640 -179270 -253968 -289197 -225457 -104395 5742 83482
39910 83482 146528 197728 190827 71319 -126692 -263106 -230672 -81292 57883 152658 241176
39899 241176 287346 210362 60417 -6710 31180 19999 -109343 -209181 -142167 18317 131847
39888 131847 187761 224513 191766 52622 -88698 -125270 -118733 -172115 -228988 -179314 -80886
39877 -80886 -72965 -121390 -54251 170052 420266 605599 743652 810953 713122 444268 130010
39866 130010 -121315 -290080 -364646 -324652 -216925 -125035 -60936 422 10552 -83640 -192312
39855 -192312 -173279 -51972 22399 12696 -17460 -125686 -444644 -882155 -1130097 -1053494 -830822
39844 -830822 -619336 -343680 41680 334208 332403 116319 -114982 -314780 -498203 -553538
39834 -553538 -391160 -164233 -92785 -140452 -94331 91560 257699 303981 272318 186021 26393
39823 26393 -125708 -132646 -12100 73568 61640 45751 69858 60329 7416 16400 103976 135406
39811 135406 68285 74759 273226 490705 478498 266892 105971 96224 78119 -92129 -333053
39800 -333053 -474371 -472662 -394591 -274351 -106786 53211 105114 36263 -49025 -76379 -108698
39789 -108698 -246408 -467299 -637631 -663350 -569867 -450862 -400184 -467271 -594328 -614955
39779 -614955 -424113 -157042 -78735 -259112 -477202 -504652 -361839 -207354 -94418 33029
39769 33029 183718 301283 364445 386392 347745 239582 136063 109179 103992 16416 -138480
39758 -138480 -262823 -343406 -429703 -467252 -338849 -97165 30775 -55686 -186205 -172458
39748 -172458 -69255 -66770 -229616 -466434 -672648 -769339 -663107 -323262 99593 351549
39738 351549 304860 51045 -229666 -418704 -477824 -406264 -234921 -34576 116393 188661
39728 188661 223760 285397 374490 410808 334927 211339 167220 226146 278115 236834 143351
39717 143351 69256 6448 -67432 -89294 10465 164104 220222 145987 74151 121625 245088
39706 245088 320361 303127 255537 243679 259420 247043 186058 132004 156762 242937 271751
39695 271751 147498 -92963 -330121 -483854 -533747 -467323 -306057 -163800 -159330 -249664
39685 -249664 -267093 -165889 -107220 -213004 -350129 -292948 -28847 246626 399882 461784
39675 461784 464387 355419 138889 -46947 -94844 -75100 -118221 -224221 -281538 -213715 -21279
39664 -21279 251979 493006 533723 329067 79332 29034 162772 251993 196326 137641 196377
39653 196377 285801 293712 290430 402685 578493 637779 510278 283905 46624 -181817 -365971
39642 -365971 -438087 -400176 -345292 -336335 -332874 -271080 -158376 -56420 -11401 -22561 -47015
39631 -47015 -29431 34977 67310 -14866 -173708 -258308 -164408 40158 173994 120253 -57196
39620 -57196 -175406 -125442 -463 12133 -127774 -255368 -225410 -104772 -55483 -105424 -158781
39609 -158781 -177657 -197590 -182906 -43976 169744 264614 165994 41148 60172 160061 170213
39598 170213 72242 -11720 -29255 -44526 -90887 -106387 -26300 154153 404214 647190 734045
39587 734045 549282 175881 -146152 -272873 -288709 -345942 -461751 -542726 -537411 -475308 -396810
39576 -396810 -331541 -318946 -358950 -352990 -193495 71905 261911 286333 255232 294568 341018
39565 341018 238087 -6403 -198001 -203715 -95942 94 88356 242252 440995 576004
39555 576004 594512 550218 521533 543328 598927 615643 496745 235316 -27464 -144496 -145077
39544 -145077 -176742 -275420 -313413 -196950 5395 182021 318885 451630 568072 641516
39534 641516 691325 726513 692028 566637 462973 512077 659715 693571 506960 251866
39524 251866 170182 310066 469808 430926 208292 25829 44280 176350 224908 147136
39514 147136 71519 71234 73014 42737 106260 354047 627827 674423 483916 312267 345216
39503 345216 478880 497367 370339 288064 436753 797449 1159702 1310318 1213424 1005446
39493 1005446 813779 625668 376978 113647 -34622 -32176 14174 6358 -40511 -86853 -168433
39482 -168433 -325420 -484202 -502946 -336243 -100253 36216 4751 -107630 -135867 13692
39472 13692 267531 450332 456595 331016 170430 4014 -177904 -321344 -324947 -172096
39462 -172096 16290 92786 15218 -146007 -287489 -331992 -254392 -103272 21602 64574
39452 64574 77735 136562 199685 130578 -110478 -365357 -428391 -258190 12392 231674 322773
39441 322773 262163 69284 -173781 -371765 -499661 -578831 -590341 -510319 -421628 -452713 -569113
39430 -569113 -566367 -342885 -48156 135187 222203 309799 365029 315970 257568 338166 478594
39419 478594 447258 232240 90711 149027 190037 -12287 -334131 -473650 -365025 -216914
39409 -216914 -191483 -237235 -244389 -211041 -213463 -302645 -453612 -561216 -509299 -322135 -208829
39398 -208829 -338446 -581966 -616741 -323805 45223 172524 52210 -34091 125958 440694
39388 440694 639758 566398 313140 93975 25578 59096 99972 117007 97817 -18630 -259250
39377 -259250 -501822 -570579 -462881 -366444 -415386 -541959 -624306 -657482 -680965 -648925 -517101
39366 -517101 -386942 -391924 -462807 -387885 -138894 38146 -52809 -282318 -372872 -258560 -115612
39355 -115612 -75556 -73327 -11216 65522 49433 -44999 -86926 -15361 68460 42184 -51379 -38438
39343 -38438 149897 348726 340880 142892 15535 158623 467670 648822 528665 194334
39333 194334 -133267 -296973 -295944 -250061 -274326 -352019 -354613 -225010 -85846 -82172 -161169
39322 -161169 -133918 44780 196627 168596 39823 -6431 73038 174323 231453 288112 382194
39311 382194 454138 414083 265266 128310 136152 296763 468427 504325 419258 360489 407451
39300 407451 478943 476715 436616 459426 549221 611073 578176 457001 269563 40056 -166750
39289 -166750 -277185 -289965 -268749 -261065 -285290 -373414 -532288 -664551 -636170 -455036 -289592
39278 -289592 -265641 -330409 -372778 -386606 -421164 -436194 -337004 -151513 -50869 -137912 -292465
39267 -292465 -310063 -166362 -54087 -134779 -328141 -413709 -302743 -120130 -15968 3961
39257 3961 12765 19214 -15396 -70254 -92285 -121040 -262680 -498671 -626874 -483957 -177062
39246 -177062 2260 -103443 -357129 -508591 -475110 -381430 -348310 -337254 -253337 -127381
39236 -127381 -85290 -146073 -170167 -52092 138711 279912 364603 447857 509041 509580 542421
39225 542421 751334 1081196 1267701 1147704 861955 660855 601013 545719 413794 299729
39215 299729 328066 474700 587407 557583 426010 310521 265620 256290 255181 288198 349057
39204 349057 345891 215443 47357 -1256 96020 206851 207562 100699 -32806 -120805 -137769
39193 -137769 -128785 -189284 -340895 -440675 -312369 33719 408672 657754 744170 642815
39183 642815 336952 -30220 -186011 -24994 252351 403819 425796 453624 511287 525563
39173 525563 502409 501017 464269 261002 -75705 -302603 -226442 73675 334824 362071 154302
39162 154302 -162192 -455411 -643139 -683696 -576240 -390706 -243643 -183885 -134830 -19891
39152 -19891 97079 103151 34510 36877 130936 186325 155118 140298 171128 121985 -32034 -89508
39140 -89508 83449 323536 428805 464667 573222 646393 497257 252370 229409 448580
39130 448580 602166 540015 456400 512066 588486 561062 533827 611299 672234 592559 505376
39119 505376 589225 726793 639745 307083 -1241 -113869 -160231 -320734 -547873 -650922
39109 -650922 -569437 -443104 -418808 -475333 -485114 -408213 -340988 -352753 -368607 -296304 -192547
39098 -192547 -172742 -198684 -119027 78481 230529 256325 278093 399959 522808 495627 328444
39087 328444 134431 -32654 -156894 -174389 -54379 98434 158075 144854 157346 191969
39077 191969 165383 76530 2813 -50938 -162148 -338995 -477468 -496854 -431602 -367489 -352225
39066 -352225 -375076 -376638 -285266 -99334 83156 167185 157606 101218 -967 -134557 -195535
39055 -195535 -106045 31557 42579 -65394 -99949 49247 279220 441051 505540 511108 469140
39044 469140 393807 331833 291579 218628 101351 22622 41298 92515 73619 -29721 -161410
39033 -161410 -272294 -314716 -231959 -43782 105292 79008 -87972 -234414 -259615 -197554
39023 -197554 -126092 -77675 -34309 49612 208649 395929 480829 393658 245278 199880 238680
39012 238680 181195 -26004 -184676 -104701 123860 260848 255478 282911 434555 545939
39002 545939 423649 125809 -112122 -177979 -178418 -234969 -303879 -253204 -49450 201039 373258
38991 373258 430234 405624 322816 168433 -50323 -255206 -350102 -332013 -302673 -339001 -392342
38980 -392342 -362171 -234260 -83615 34023 116638 152968 114797 27714 -34987 -61383 -127347
38969 -127347 -271378 -414490 -459433 -405576 -300309 -137643 101989 340134 431775 331568
38959 331568 164264 92706 143313 191925 119122 -41255 -134760 -77807 23200 -814 -155671
38948 -155671 -266615 -196669 4024 198660 323573 388516 397181 352042 290004 234987 151221
38937 151221 13638 -114227 -151788 -126382 -150445 -280930 -454655 -552008 -493315 -310249
38927 -310249 -154459 -171961 -320647 -393282 -289694 -165467 -203008 -338952 -378015 -301749
38917 -301749 -266061 -318593 -330783 -239803 -162948 -205210 -316390 -412818 -491126 -542367 -503377
38906 -503377 -392459 -352734 -442289 -507087 -396483 -194586 -87377 -92073 -85403 -32631 -5039
38895 -5039 -1139 63931 186557 269029 316896 468476 755798 988738 986507 811489 648291
38884 648291 534470 361237 107557 -86885 -118007 -63752 -62566 -127503 -171377 -172143 -210302
38873 -210302 -337930 -495695 -588800 -580074 -474506 -281370 -52867 96004 94824 26469 45766
38862 45766 187382 325547 332511 210651 57946 -27203 10446 158240 316018 359977 267071
38851 267071 136450 70767 91533 179710 308296 395052 324987 102734 -92463 -98417 38103
38840 38103 154107 197661 243029 314810 339923 283696 196164 80243 -154671 -517166 -806394
38829 -806394 -785881 -462180 -90729 102223 124817 128239 190326 257967 274350 279443 346029
38818 346029 456195 500785 409811 242131 118274 86511 90531 66222 31952 54396 136699
38807 136699 183623 110458 -33639 -106454 -45899 63356 134557 212278 370022 531777 535997
38796 535997 375224 219608 157786 73621 -117314 -256091 -139134 151543 315699 224965
38786 224965 63357 41980 140926 216260 224116 214713 190223 108728 4781 -16033 75518
38775 75518 169560 135480 -39014 -248418 -376211 -380664 -299439 -199496 -126052 -87694 -75027
38764 -75027 -78510 -84321 -64428 15016 164046 334559 417625 311623 32486 -255310 -364294
38753 -364294 -253960 -51774 89268 110579 28238 -130078 -315241 -429327 -384851 -199307
38743 -199307 9858 130515 130486 40721 -82096 -160848 -120277 39620 202333 222936 87523
38732 87523 -43145 6989 228702 434268 484361 451843 495731 608527 599996 365498 67862
38721 67862 -43595 54052 138330 37815 -154727 -209411 -32084 242134 389306 292844
38711 292844 38588 -147908 -98407 122020 274612 222726 92626 95511 251821 398439
38701 398439 431317 402469 370450 305421 202759 159335 238362 353684 393334 376958 373916
38690 373916 341524 197661 13833 -37972 57340 116985 23463 -120510 -177833 -185620 -266012
38679 -266012 -423608 -559221 -630781 -677571 -712405 -707452 -682628 -696981 -731616 -677291 -481343
38668 -481343 -238264 -86581 -62527 -99524 -135056 -167016 -217512 -281609 -317033 -272362 -137022
38657 -137022 24630 114299 104526 79757 123406 175865 85537 -164347 -366469 -326323 -144874
38646 -144874 -125640 -378021 -656756 -681640 -493828 -352145 -354655 -349988 -219750 -59354 -4202
38635 -4202 -15769 48365 224188 395645 424587 269291 10948 -197230 -250677 -192178 -139302
38624 -139302 -108769 -12676 143523 198942 62424 -128101 -205164 -227166 -361637 -574702
38614 -574702 -638702 -458035 -204991 -77302 -73415 -92255 -130581 -257303 -449215 -570386
38604 -570386 -523428 -358851 -215510 -177174 -201249 -184411 -80845 71626 233498 405464
38594 405464 557324 591678 457091 247353 97379 16430 -77193 -189121 -238360 -202299
38584 -202299 -138962 -50831 133503 395098 573068 554462 415120 294209 222162 161683
38574 161683 133574 187720 295076 371849 388700 376659 352486 318190 311851 375147 473301
38563 473301 512601 438228 273828 88174 -31470 -17224 94904 156869 74433 -52816
38553 -52816 -71770 -36112 -169602 -524924 -833473 -809936 -506323 -226711 -151179 -200834 -259191
38542 -259191 -346329 -502702 -640519 -639343 -526738 -443664 -453786 -493680 -505540 -506971 -500335
38531 -500335 -412436 -189988 97878 309498 360540 283573 195658 214717 345615 432217 302716
38520 302716 -4263 -251819 -294596 -245432 -263825 -300132 -207033 -25558 38824 -85765 -253190
38509 -253190 -340913 -394438 -464964 -472193 -339958 -142913 2166 94055 174448 184405 39937
38498 39937 -194305 -352086 -377941 -369051 -404642 -457328 -494146 -537346 -564465 -459607 -169474
38487 -169474 152219 274984 162915 19214 38270 200616 361896 460904 541601 612533
38477 612533 611462 525847 434617 382239 313470 203208 150108 232491 348612 336814 212483
38466 212483 139871 180981 223143 176041 97037 72499 99943 151478 246779 390301 520820
38455 520820 585783 585077 490763 229515 -171543 -515088 -618034 -510139 -356770 -238971
38445 -238971 -114174 38944 148225 134136 4077 -151882 -230389 -188093 -63716 85279
38435 85279 250326 420887 496228 372619 141585 58138 233629 482599 572639 509718
38425 509718 450758 437714 379673 240631 85737 -36305 -122310 -146381 -90133 -24653 -37266
38414 -37266 -86362 -49996 87315 215025 258541 240088 179015 59440 -86621 -183773 -224881
38403 -224881 -268928 -307653 -252400 -93163 34821 -3660 -203114 -445512 -593048 -548921
38393 -548921 -332089 -117216 -94936 -253329 -390452 -371535 -264711 -181059 -104788 32923
38383 32923 203577 304854 290581 209144 145027 160227 248927 323526 299966 211152 160596
38372 160596 152952 79384 -92047 -236069 -253121 -214965 -224912 -235564 -140716 16734 76698
38361 76698 -15783 -147160 -201526 -186053 -169764 -179788 -190253 -164750 -90500 1164 55338
38350 55338 64853 92792 173388 222373 123693 -101438 -293073 -338118 -289615 -268877 -303770
38339 -303770 -314729 -238820 -120463 -67123 -128616 -232698 -250175 -125533 72107 234884
38329 234884 325851 375162 391484 336936 209112 97208 97584 179251 193378 47468 -174214
38318 -174214 -315684 -341251 -342448 -361707 -318028 -153033 50315 180336 250269 331659 393407
38307 393407 342534 203997 116937 131979 135920 15790 -205183 -430544 -590507 -645534 -595089
38296 -595089 -524226 -533753 -577729 -491345 -245313 -40374 -48681 -183622 -254871 -241650 -247531
38285 -247531 -264638 -184939 -31752 15923 -124197 -314354 -391984 -366175 -342585 -354931 -369730
38274 -369730 -392410 -458840 -537701 -531855 -395141 -194512 -38114 17731 -28805 -166418 -357762
38263 -357762 -503268 -499109 -370630 -290048 -395628 -624948 -796247 -825858 -775953 -706447 -602608
38252 -602608 -474839 -406070 -428626 -441994 -331152 -109526 109621 222627 180811 18353
38242 18353 -119762 -96260 1357 -95028 -455393 -766125 -704576 -381938 -185693 -252660 -360064
38231 -360064 -327660 -246101 -238491 -254431 -228742 -227190 -272042 -206854 63869 333077 313919
38220 313919 36002 -197789 -227492 -196834 -268296 -372900 -341296 -157857 31077 106522
38210 106522 88576 86087 194742 427254 694937 860435 840097 661859 421432 199829
38200 199829 34105 -57281 -57258 31818 166905 275953 297194 209078 31760 -177405 -321270
38189 -321270 -296927 -91201 160981 280314 234525 173251 233633 366920 422446 361017 294895
38178 294895 324636 429905 546633 667779 806698 906946 858983 612248 245928 -74367
38168 -74367 -219341 -209255 -204731 -332366 -506538 -496407 -216368 119400 212199 6745 -282136
38157 -282136 -438456 -434079 -356406 -273012 -215017 -198425 -194154 -139712 -39445 2591 -92436
38146 -92436 -271302 -422229 -500239 -517315 -469679 -362728 -266757 -253799 -298614 -319644 -289389
38135 -289389 -225046 -116825 21262 66844 -92986 -350328 -435620 -236986 70322 270520
38125 270520 345773 379517 359011 226581 53469 -5797 69128 123959 35283 -139914 -260275
38114 -260275 -273251 -237269 -208853 -168209 -66576 85139 209101 247380 227745 220306 253366
38103 253366 303862 341849 337741 258676 125998 47670 105254 228482 287143 291199 360119
38092 360119 482561 477578 263923 7633 -108187 -121655 -165385 -225746 -202835 -131316 -151100
38081 -151100 -280836 -387338 -381922 -302360 -192761 -44653 116361 217867 262231 354094
38071 354094 553522 785677 942055 993103 952099 804786 550059 272700 102520 92944
38061 92944 170461 213762 170860 83625 -2488 -112883 -282069 -450536 -513879 -475431 -441492
38050 -441492 -439195 -369074 -202465 -86489 -138885 -254969 -256905 -140237 -25409 44126 86460
38039 86460 51756 -82613 -143110 70510 440014 588948 345688 -55073 -302412 -344860
38029 -344860 -298962 -209316 -54672 119055 222109 231650 187525 120050 42075 -35518 -120666
38018 -120666 -218802 -279567 -242318 -141490 -62830 13781 191245 440533 563396 446744
38008 446744 217127 47173 -63726 -198800 -327167 -347702 -275033 -249044 -369147 -597597
37998 -597597 -807020 -871511 -750433 -531046 -347550 -230414 -99493 76372 217549 275664
37988 275664 318572 396284 434861 366628 269760 257352 298235 273998 170894 96424 121554
37977 121554 197585 217666 94874 -192806 -565599 -867165 -977513 -885298 -635518 -272559
37967 -272559 125081 428011 542124 476950 305651 121204 43668 162163 417529 633164
37957 633164 705285 669091 561493 371033 174499 140451 288826 410480 351735 218114
37947 218114 152842 90151 -73745 -218122 -149832 77906 239211 264821 267625 292381 281340
37936 281340 262628 328537 423212 385980 226783 132130 164473 185278 132100 138494 279327
37925 279327 401407 333595 108107 -137903 -331276 -421685 -325467 -61432 162438 150197
37915 150197 -46578 -202431 -175658 -6382 176114 243456 117103 -161968 -421139 -492252
37905 -492252 -370013 -203158 -139635 -198146 -266254 -208974 -4280 226744 351679 364679
37895 364679 341453 297516 189309 38405 -68700 -123509 -218399 -381371 -490703 -414510
37885 -414510 -161845 147661 392932 501859 481674 439226 486808 592428 616766 531293
37875 531293 475459 528111 552291 390750 126967 2701 104186 261275 269607 114206
37865 114206 -57728 -117606 -64898 14771 58060 70809 71295 26601 -105967 -285618 -398672
37854 -398672 -378190 -264940 -136922 -33712 27668 24346 -32701 -61579 33516 259417 505898
37843 505898 632543 593511 473944 383963 327748 227276 70739 -51535 -87633 -95246 -114055
37832 -114055 -86932 -3334 11260 -101047 -156267 40638 369114 522692 419971 245804
37822 245804 111431 -38887 -153389 -26567 339489 603215 506745 224392 89747 153233
37812 153233 231178 247629 269606 275983 144684 -122951 -354482 -415261 -343525 -270730 -305337
37801 -305337 -478483 -705579 -821175 -743220 -576503 -470538 -423447 -329550 -171756 -36613
37791 -36613 41829 122543 232238 311148 313139 278268 273057 309738 344657 324650 231418 101909
37779 101909 -1816 -44647 -6650 166117 504913 881163 1035646 834014 430515 98538
37769 98538 -48633 -99095 -169089 -278657 -364718 -346415 -204650 -38769 7856 -81862 -175665
37758 -175665 -185846 -193865 -309934 -498122 -630081 -637746 -526562 -312952 -43839 182729
37748 182729 303113 347072 363567 367254 393913 481998 543163 412881 121841 -61838 12191
37737 12191 169765 219744 250457 386554 461169 255809 -72592 -172243 -40188 -6572 -174818
37726 -174818 -265419 -102068 106899 127283 35984 7435 8597 -79714 -219870 -306232 -369318
37715 -369318 -502065 -664322 -709712 -551543 -217305 172733 419291 375059 155245 75342
37705 75342 268246 504255 512572 326003 146676 18671 -149443 -326490 -357787 -211142
37695 -211142 -36550 35344 11299 -56445 -146197 -227541 -256691 -244651 -256787 -327953 -428175
37684 -428175 -497031 -459872 -258385 44508 232061 130461 -159944 -344169 -268846 -80729
37674 -80729 -9841 -84902 -138044 -45444 120685 193667 118615 9577 -9658 22018 -46508
37663 -46508 -258129 -459891 -482619 -344931 -207715 -166260 -171983 -146181 -79339 7875 127565
37652 127565 288375 427144 443981 323038 173721 106774 89174 -10896 -221195 -387653
37642 -387653 -358952 -183982 -37217 2538 -14862 -61787 -160407 -248610 -195547 -29207 11932
37631 11932 -209811 -485961 -501343 -261008 -92745 -218068 -492591 -635950 -579500 -469832
37621 -469832 -406817 -326033 -153130 44506 140006 128652 133430 229723 351991 406738 394760
37610 394760 358190 281680 142366 3071 -62998 -106648 -221851 -337195 -249944 85342
37600 85342 443759 575169 446297 181958 -90535 -245747 -163546 114072 331115 291153
37590 291153 118804 87295 242226 378445 361058 268876 203110 150824 97596 98062 144278
37579 144278 118672 -10720 -85938 12674 148762 107851 -83815 -204922 -169150 -109046 -113245
37568 -113245 -86305 44405 163008 151474 113642 233188 473668 605988 520337 333216
37558 333216 164585 -11857 -229942 -408038 -477227 -506363 -570219 -595339 -487018 -334022
37548 -334022 -311431 -405906 -411398 -217447 47953 204549 221219 179687 152354 185040 306601
37537 306601 473177 565100 513543 388950 307549 292337 282999 246394 212666 213876 238390
37526 238390 252526 240360 212263 180996 140523 85323 45871 61689 101597 66702 -85319
37515 -85319 -273437 -402424 -474596 -524274 -519544 -434267 -345205 -318781 -256910 -26434 280368
37504 280368 405026 268125 79821 55484 181499 325678 421223 450519 382085 232646
37494 232646 100851 55646 65834 85925 111503 109250 16319 -135979 -224969 -217740 -209971 -227717
37482 -227717 -159752 22053 148426 84185 -76487 -173165 -187193 -155331 -44740 117496
37472 117496 152483 -27828 -219151 -182031 16239 143116 169611 233535 318066 266665 100275
37461 100275 30086 126750 239481 284981 351597 442513 379949 94887 -209923 -340480 -372244
37450 -372244 -464136 -564961 -498741 -254372 -13485 69204 -19664 -211608 -398455 -446286
37440 -446286 -302505 -94335 -12621 -81860 -137522 -51646 115607 239746 318883 434960
37430 434960 563761 554885 348594 110283 48981 156727 243568 201866 97197 -5409
37420 -5409 -141416 -316102 -431159 -442278 -455396 -542353 -583544 -448147 -229954 -120376 -110740
37409 -110740 -20112 200415 388714 420370 360435 312484 266660 182923 121478 193603 418288
37398 418288 675972 789019 653821 339639 51305 -54618 -10033 41154 20856 -37061
37388 -37061 -75074 -71296 -33472 7449 21689 30705 74458 99205 -19154 -278339 -496904
37377 -496904 -549095 -524937 -543729 -553267 -470056 -377526 -387511 -422782 -355953 -263883 -307277 -441940
37365 -441940 -500375 -483309 -494985 -456175 -200355 166818 338596 258681 170630 175016 94647
37354 94647 -121507 -223418 -61545 152625 192228 147195 193069 276514 273067 248540 310220
37343 310220 366410 283102 142228 101712 111631 10029 -176072 -247624 -109057 147360 385811
37332 385811 512081 479770 347935 266033 289019 298254 206029 103915 84196 76204 23689
37321 23689 52635 246712 407609 300965 41017 -41079 140659 353028 402830 325197
37311 325197 222057 148392 172983 334475 508278 510699 361604 264343 311823 400518 446923
37300 446923 476813 461963 294864 15614 -136129 -19677 209351 321194 298047 269750
37290 269750 281153 280560 274768 338072 471538 571692 560702 466298 346148 203022 30061
37279 30061 -97931 -61499 149848 385661 499963 527395 604813 738181 769243 599922
37269 599922 330832 119349 3533 -67145 -128824 -209344 -334070 -431533 -336229 -7530
37259 -7530 333245 416127 225057 -21854 -140399 -116777 -29873 36196 22888 -60035 -136689
37248 -136689 -167085 -193016 -227802 -194750 -61007 67764 89283 37929 -32500 -171908 -394340
37237 -394340 -543298 -482330 -320076 -250672 -261251 -209075 -105804 -86323 -149925 -178246 -171920
37226 -171920 -212679 -217826 -22234 278297 367926 169764 -14959 64137 293512 443401
37216 443401 485848 493860 433462 269108 134657 187932 373001 500144 508761 504974 572817
37205 572817 666611 673807 512588 202706 -110291 -259617 -232641 -172155 -167518 -148478 -46255
37194 -46255 60056 64985 18360 64808 243213 442646 532685 466159 279633 57150 -115537
37183 -115537 -194282 -169096 -36750 155256 262334 161318 -63193 -178623 -99520 8884
37173 8884 -1673 -32429 89069 306230 380754 223556 26602 29816 255541 519515 640661
37162 640661 589050 458869 351191 296700 262171 193412 52307 -143795 -302397 -326850
37152 -326850 -241204 -188751 -258293 -373786 -417971 -387385 -330339 -213176 9470 240984 323133
37141 323133 260927 214210 262571 333401 376165 439124 528159 550034 469177 390514 413137
37130 413137 508103 590847 598188 455861 120489 -277195 -485953 -431043 -316797 -316496 -304064
37119 -304064 -64961 322954 526482 372945 66294 -63332 71778 262635 275598 111665
37109 111665 -32918 -30660 39634 57503 57499 136764 234850 189767 17610 -51119 123586 406352
37097 406352 585364 614203 559361 441092 261156 104407 76246 168024 272707 305821
37087 305821 250463 126580 -20818 -135610 -199773 -238620 -253420 -197562 -46551 153455
37077 153455 324142 402431 360725 241460 153465 158399 184875 139051 56404 31463 47437
37066 47437 18438 -46537 -88648 -153929 -291991 -344131 -103873 299067 471211 283725 36201
37055 36201 -20404 -24541 -189482 -423582 -509812 -463411 -455491 -517309 -550616 -526308 -469666 -342120
37043 -342120 -120215 96777 216236 286515 360212 364250 277662 284496 527592 829702 902105
37032 902105 756888 680504 840093 1125172 1357755 1480236 1545552 1648163 1818773 1890873
37022 1890873 1595545 938222 338091 184987 372353 493493 389986 241443 190757 182024
37012 182024 166352 191241 241329 219329 139715 150232 311413 516746 660846 728368 695564
37001 695564 511662 224586 -8762 -80605 -8414 142307 307128 411693 418164 362468
36991 362468 265340 78361 -180334 -347783 -323677 -243491 -259771 -262245 -43987 337178 611440
36980 611440 654307 543228 318279 -23365 -316595 -329851 -124697 -26350 -157373 -263543
36970 -263543 -105493 211776 419241 397335 198902 -64880 -252192 -251911 -111078 16309
36960 16309 86974 186636 309641 318353 182919 61434 50244 40880 -61275 -142894 -46847
36949 -46847 183583 351666 333303 179553 50990 84734 259526 388695 328196 163890
36939 163890 80838 94572 66801 -53585 -188506 -298258 -390280 -387863 -214811 6382 87505
36928 87505 93324 243933 490578 522555 270766 58560 106933 215444 136250 -25671 -36673
36917 -36673 70040 92094 -4856 -91108 -103327 -70126 -5243 61771 55847 -3195 38815 234462
36905 234462 414909 453433 469963 589197 676498 547877 296816 155574 136677 75426
36895 75426 -40240 -51879 74452 181314 173517 137680 169823 248953 326028 403841 480828
36884 480828 513794 474998 384372 277193 189931 159810 183581 200600 163355 91384 22255
36873 22255 -33910 -57486 -16320 52766 46440 -58770 -139389 -61057 187523 522553 823422
36862 823422 938547 776330 450224 195666 84111 -25592 -195204 -276394 -189405 -115328
36852 -115328 -221199 -365689 -299717 -37536 196930 306562 377631 447948 435430 301564
36842 301564 121464 -23420 -112673 -161077 -210431 -301498 -381009 -324541 -141042 -32317 -118153
36831 -118153 -228775 -142433 79575 195756 141324 64313 49673 31582 -16604 -8133 103038
36820 103038 250958 375974 483378 557513 539986 430548 319510 295529 381778 546532
36810 546532 703667 737395 620336 479181 448917 493716 476031 374835 314877 375690 477102
36799 477102 487151 385968 296022 357339 555316 687046 575588 320070 212941 370201
36789 370201 583773 617124 499485 406519 383593 349996 290393 275425 332109 421589 505803
36778 505803 533152 419848 160070 -99799 -206172 -167587 -88578 -8866 82423 144723 127780
36767 127780 78290 100326 234061 437769 640230 759977 744190 633826 505879 332774
36757 332774 36616 -289220 -406418 -262121 -95403 -99061 -172984 -152277 -73059 -30470 36776
36746 36776 207909 382562 434121 426644 480320 555940 568206 568822 614038 601797 455299 309305
36734 309305 282098 231061 891 -245271 -241704 -34654 129392 215032 369258 570048
36724 570048 646117 600964 589921 603602 493815 299378 230286 323662 414179 448287 524427
36713 524427 611635 547440 362969 306294 464660 631880 634291 547729 508885 527381 562108
36702 562108 596407 580534 466293 321801 244338 166674 -61880 -413593 -691375 -774673
36692 -774673 -671516 -395196 -21924 202539 95935 -158680 -223729 -77486 28265 35296
36682 35296 144506 402442 591575 605018 589579 617870 539755 286506 38356 -44617 -16334
36671 -16334 35302 123088 221898 235949 195289 247043 368842 343394 112728 -99901 -136601
36660 -136601 -123585 -205760 -288453 -202674 45440 328545 561014 702453 724075 653621 557189
36649 557189 453524 352209 342585 487422 665474 695345 572656 411498 240189 68903
36639 68903 41790 245560 474543 498618 456680 622488 879533 859279 557766 350262
36629 350262 372517 358194 171990 48742 169319 412788 683494 1103669 1708678 2275899
36619 2275899 2607815 2708396 2599386 2265962 1837090 1494872 1180227 739893 341332
36610 341332 296342 473308 408338 68268 -53679 262135 631274 730743 735840 832974 832858
36599 832858 597963 390618 449924 613221 660617 654627 661291 535915 279907 213897 481553
36588 481553 745507 679643 417743 235317 144373 84409 156771 378818 535109 530750 563859
36577 563859 732951 843867 812957 848923 1008766 1005895 704506 372444 206027 58883
36567 58883 -121291 -82273 235069 479099 441076 340526 322743 220281 58969 185848
36557 185848 602097 817338 687895 699654 1051891 1228794 946930 733681 986272 1232495
36547 1232495 1001497 694954 835237 1114841 1001157 690610 636144 671855 448023 234315
36537 234315 436368 768147 753522 622816 858087 1249411 1266580 1010241 948225 1042594
36527 1042594 961681 825612 927431 1045181 833546 559935 657271 903182 841427 639084
36517 639084 711518 893683 819548 714408 953633 1257725 1202329 1084287 1377024 1793335
36507 1793335 1831440 1760013 2062796 2402979 2191551 1698284 1524704 1487933 1151096 910235
36497 910235 1331033 1933305 1915992 1574539 1672478 1949474 1684213 1212353 1352658 1801053
36487 1801053 1694229 1326319 1630205 2349690 2467525 2101727 2189793 2613362 2489240 2029779
36477 2029779 2196247 2763804 2699228 2206827 2363416 2988179 3011262 2676820 3106042 3945776
36467 3945776 3881986 3247235 3534285 4536967 4735583 4328343 4897086 6201629 6531054
36458 6531054 6175255 7065554 8960266 9788279 9889254 11724842 15102588 17292737 18365058
36449 18365058 21318112 26209675 29915307 32835843 39414373 50444885 62232360 75494282
36441 75494282 96328000 125444364 158021718 199990803 268710741 361624211 435015944
36434 435015944 437015577 363392843 263518447 187898127 145732325 118258173 93892943
36427 93892943 75252804 63352501 53107795 42856906 35984806 32728360 29090090
36420 29090090 24089114 20807225 19892258 18322016 15119396 12737940 12106693 11205182
36412 11205182 9298331 8173448 8339298 7955625 6418370 5449154 5744956 5787629 4853549
36403 4853549 4219486 4488909 4460823 3561011 2913783 3125565 3259276 2799410 2530615 2747744
36393 2747744 2597991 1877160 1565571 1937046 1973650 1272555 753024 875271 903131 533052
36383 533052 531435 1111670 1346338 876248 611832 1035712 1345867 1020844 761065 1089943
36373 1089943 1395893 1167019 904040 1020456 1036362 635018 376850 602071 715121 317950
36363 317950 12310 309170 718257 687715 543603 745401 1040317 1070658 1048887 1174378
36353 1174378 1131371 778758 589623 813932 951763 643543 339374 486148 768474 760351
36343 760351 647381 707128 727006 524774 427458 669578 904743 830328 695700 703666 553452
36332 553452 96808 -204384 -35439 173549 -26828 -371492 -432997 -325576 -283988 -109837
36322 -109837 354223 719869 635166 402221 432953 548752 404796 171359 196149 375154
36312 375154 429114 450909 640872 835520 806099 701030 727877 737593 568081 436969 550309
36301 550309 692941 642527 598351 757742 881045 745017 608380 730069 840618 623930
36291 623930 331630 359770 568425 583928 453571 442987 487377 397549 320708 444510 526693
36280 526693 280743 -42428 -34634 162217 126719 -84311 -68291 194645 363024 385162
36270 385162 533698 822748 936794 768368 573968 560696 678509 813631 879236 773672
36260 773672 529298 396372 523118 723111 812427 922598 1175923 1363836 1338169 1399588
36250 1399588 1816997 2244751 2163642 1686052 1354143 1295079 1158877 804336 472369 296136
36240 296136 158075 41026 53010 100003 -23357 -217664 -175447 114114 363237 462571
36230 462571 546515 610922 500452 280969 205016 285747 297822 210098 223048 366525 456134
36219 456134 464226 538852 638759 558621 349163 291957 392108 313963 -72205 -467532 -596070
36208 -596070 -526328 -409314 -232528 635 132504 69768 -63792 -114945 -65904 53095
36198 53095 229331 397001 470249 455672 374766 144484 -243959 -524897 -440231 -163990
36188 -163990 -109103 -328720 -460768 -287208 10770 220005 370340 529259 622554 596746
36178 596746 526041 450399 312875 131379 28994 35244 50763 40465 60328 80184 1183
36167 1183 -132073 -152924 -17014 176618 379757 581784 654686 488355 243616 168011
36157 168011 186257 11400 -333514 -473822 -229820 139295 335007 347588 281510 160983
36147 160983 39589 30942 99748 63134 -95436 -157609 -12723 179896 272376 323040 399314
36136 399314 427921 365629 304991 299101 280598 241514 284326 412401 480929 431859 368699
36125 368699 342877 293932 245827 300321 378340 260386 -23688 -146192 45518 291374
36115 291374 309702 162790 59019 32064 10751 8299 50869 71927 33800 19245 86765
36104 86765 174251 229076 277465 305709 256191 189523 236750 341277 292979 83385 -39555
36093 -39555 42744 155556 157213 143031 192103 195558 95296 27093 62384 65631 -30167 -72830
36081 -72830 11510 41992 -104146 -266326 -287047 -257316 -265684 -179423 78393 296078 287687
36070 287687 203833 256623 365308 361889 322685 380878 414539 257274 43016 -5389 23824
36059 23824 -92770 -264401 -205442 57429 184959 40214 -139057 -132075 -11038 41615
36049 41615 -37523 -205363 -373502 -426541 -331201 -219762 -218319 -236902 -100797 164388 373301
36038 373301 458714 498796 498500 367407 122934 -84143 -171053 -187239 -175373 -132076 -106925
36027 -106925 -173076 -284902 -313712 -235563 -146714 -93562 -29189 56679 102930 85124 37156
36016 37156 -40081 -173371 -313039 -346096 -232363 -46138 119333 221482 261599 273960
36006 273960 294534 292328 192074 19628 -66486 26886 188784 260240 237200 211422 205271
35995 205271 188899 175389 170246 104321 -57984 -221297 -288188 -295695 -302282 -250100 -94868
35984 -94868 27422 -53489 -286764 -451791 -419204 -228041 30271 263547 377478 358877
35974 358877 305848 276541 208141 86512 38454 99907 65927 -211172 -527807 -594472 -473124
35963 -473124 -451179 -553196 -505707 -196713 129211 203832 33468 -204498 -375663 -438780
35953 -438780 -436029 -478125 -620730 -757324 -756657 -665017 -616782 -596058 -481539 -298248 -211173
35942 -211173 -259116 -289020 -182206 14585 194867 281144 219131 38853 -93453 -36887
35932 -36887 135842 255699 302555 363339 425047 422188 421700 520534 613681 525309 328607 247894
35920 247894 265332 146152 -122462 -256849 -127805 29036 -13105 -159134 -202747 -118524
35910 -118524 6575 129853 194602 96108 -151608 -365345 -422836 -398902 -387210 -354086 -261499
35899 -261499 -164893 -92817 4491 99770 63282 -107431 -211668 -110540 95040 247237
35889 247237 318334 320018 220507 78537 80334 299009 558434 649740 542808 307989 19332
35878 19332 -172789 -100535 151963 260025 99710 -47491 77635 307040 313245 91757
35868 91757 -102366 -160831 -177727 -188595 -135125 -53113 -51037 -115010 -138354 -121925 -152446 -206735
35856 -206735 -170774 -46063 37779 16220 -52475 -108956 -134154 -97600 -5376 36782 -42321
35845 -42321 -118546 -5246 277678 523646 606803 574535 495297 380722 256214 153396
35835 153396 32523 -142353 -270095 -226333 -103806 -141855 -381263 -579696 -540599 -360625
35825 -360625 -264369 -336730 -511855 -694682 -780605 -662681 -350906 -25538 136919 151204
35815 151204 153420 196117 215437 173767 125977 132237 186471 252867 306297 305252 185283 -60211
35803 -60211 -314774 -415578 -311801 -117005 8124 -937 -97720 -215523 -332073 -451082
35793 -451082 -553102 -580318 -478036 -268443 -72797 -11450 -70043 -122213 -105989 -99479 -174107
35782 -174107 -263422 -264272 -189193 -106302 5243 200866 412442 495582 426833 318812 246104
35771 246104 190590 148164 141353 132755 86747 109533 334608 651708 767577 598388 388814
35760 388814 350928 398627 368266 296308 296745 320615 240985 81506 -23327 -38202 -47999 -112571
35748 -112571 -216889 -321793 -378467 -352974 -299740 -317793 -373244 -295697 -38066 204770 250935
35737 250935 164702 111041 126878 182794 315938 515258 603513 434820 115159 -149062
35727 -149062 -309326 -402177 -366319 -176951 -43775 -187114 -477142 -581307 -441500 -316387
35717 -316387 -349110 -392717 -318074 -208923 -145449 -41588 160703 329413 328803 230576 197924
35706 197924 253262 280897 201719 58450 -37661 -3523 134651 248772 243061 156691 69626
35695 69626 -34029 -196522 -337948 -330853 -197708 -80137 -32804 -11823 -41936 -191736 -373408
35684 -373408 -385629 -210802 -68552 -96700 -166605 -110642 40366 160332 219007 251713 265376
35673 265376 286427 381225 514697 508065 270480 -23845 -130348 -38950 46602 -16853 -187506
35662 -187506 -361237 -492512 -578201 -610698 -587592 -537670 -513386 -546789 -600678 -586143 -468483
35651 -468483 -332017 -282548 -312765 -339748 -344273 -370523 -409804 -408024 -381262 -385170 -363264 -187931
35639 -187931 104254 281588 204265 6854 -98173 -75887 -20345 42244 168522 368097
35629 368097 565472 669980 629557 464057 294006 271911 424330 611260 681806 611439
35619 611439 465665 326540 297868 466112 770696 1003252 1025744 914892 807450 688198
35609 688198 445839 83444 -250938 -432923 -467398 -423352 -336933 -200919 -15424 174004
35599 174004 301519 353410 379830 390187 287211 -1323 -359275 -576981 -604146 -572904
35589 -572904 -566632 -533784 -468417 -480948 -580065 -548045 -191734 373324 824983 960695 824839
35578 824839 591029 429457 425760 516183 535978 406042 221989 105009 50779 -2677 -57297
35567 -57297 -98729 -161561 -245298 -255820 -144197 -16753 15122 10431 88746 218622 260865
35556 260865 169055 8674 -173751 -360722 -485683 -484717 -396730 -293688 -164211 3522
35546 3522 98480 24278 -89450 -16000 238936 440634 473263 472461 552675 606801 492568
35535 492568 269001 118710 129065 253226 407048 508047 485811 351608 220419 191841
35525 191841 239041 262636 209239 89692 -65498 -204984 -250256 -158736 18795 185582
35515 185582 287687 327840 324737 303827 306921 361666 444399 510514 562860 653065 794784
35504 794784 897067 824006 542796 194550 -20866 -38072 28134 40439 -3042 -3791 80443
35493 80443 171895 167655 62135 -41333 -41899 30583 19527 -179466 -450573 -546413 -373799
35482 -373799 -109712 26199 34787 76674 205360 294626 237791 97040 -1043 -33496 -60961
35471 -60961 -78921 9006 232948 438634 417409 160743 -102268 -176377 -133029 -173095 -312197
35460 -312197 -354545 -192934 17308 56323 -96510 -276896 -331997 -229514 -44346 91905
35450 91905 89863 5357 -24792 16801 2559 -110908 -170278 -48257 152235 254236 251038
35439 251038 230288 154369 -79205 -403063 -608761 -615755 -546208 -519739 -523351 -503773 -449625
35428 -449625 -350874 -192785 -20175 82491 84855 10247 -127171 -287482 -358806 -281997 -180530
35417 -180530 -208909 -304559 -275859 -125535 -71273 -206250 -353065 -342191 -248913 -236499 -315396
35406 -315396 -389401 -426100 -449049 -439679 -367206 -269133 -212193 -206899 -213792 -187521 -83185 107278
35394 107278 286983 307212 139835 -77948 -212751 -267823 -310041 -361791 -419865 -491701 -555012
35383 -555012 -562467 -531814 -539605 -581818 -546783 -378222 -151203 67632 295039 484473 463098
35372 463098 159126 -226223 -437344 -473348 -515917 -614495 -631791 -494280 -324256 -277204
35362 -277204 -359082 -448127 -428243 -281050 -100883 -21584 -82413 -180826 -197658 -125611 -17868
35351 -17868 122844 300792 420295 357547 145932 -24629 -23705 89611 177412 178670 113278
35340 113278 3484 -141254 -284385 -357995 -312476 -168691 -17944 49420 28149 -10156
35330 -10156 -18259 -26087 -73104 -145701 -224032 -326100 -433814 -436753 -260621 -27715 34692
35319 34692 -132430 -341764 -393187 -292562 -180187 -124660 -78059 8066 119824 231223
35309 231223 338265 425247 455599 417355 328596 182351 -46796 -302077 -426068 -326036
35299 -326036 -111046 32760 70234 103938 158175 140311 44102 5717 65547 52738 -143778
35288 -143778 -344841 -320380 -139428 -43813 -52758 28146 220412 293737 137726 -56526 -95976
35277 -95976 -31154 23127 80275 133465 41025 -216991 -347589 -77919 421185 702074 580588
35266 580588 279360 70842 21610 96378 268438 447364 482521 339572 154740 45114
35256 45114 -26101 -136693 -266447 -340320 -321733 -199352 30526 287781 388146 207888
35246 207888 -144922 -405634 -414528 -254431 -110752 -42911 46740 222539 377614 356778
35236 356778 173377 -481 -57749 -54898 -57607 -18884 103048 208340 156943 -41888 -238867
35225 -238867 -310405 -244200 -110400 -23459 -75521 -221574 -283506 -154601 55030 162981
35215 162981 136824 71446 18323 -32843 -53468 6851 127952 253131 373238 469811 444682
35204 444682 248220 14596 -91028 -99729 -131573 -127456 69142 374146 477210 264769
35194 264769 -3599 -49454 84538 165610 77626 -126770 -341522 -448927 -358391 -118863
35184 -118863 97139 205073 297887 447340 546746 459662 214076 -55960 -254297 -314377
35174 -314377 -184188 49833 151302 3323 -211331 -252993 -142066 -55522 -9535 124088
35164 124088 328476 411068 288020 96331 -27332 -102513 -175611 -198815 -136162 -69887 -94346
35153 -94346 -175868 -200729 -111797 58628 240287 365566 414472 455970 580013 748761 791826
35142 791826 612690 336379 177422 208943 338824 465466 545946 517864 283316 -153336
35132 -153336 -593201 -780826 -645536 -362500 -166367 -141550 -206841 -254497 -251203 -221699 -198224
35121 -198224 -204933 -248202 -295397 -292215 -224069 -135530 -70908 -23888 36146 120407 219920 305289
35109 305289 307628 164330 -68242 -213402 -163592 -24957 15030 -76519 -182951 -249333 -344633
35098 -344633 -496015 -612564 -642206 -672771 -774363 -848656 -766025 -579680 -458718 -446202
35088 -446202 -426908 -318571 -150423 46213 266773 427209 398367 216170 103423 187030
35078 187030 336301 392967 404126 461893 460191 252815 -25461 -71479 146362 318045 219865
35067 219865 -22660 -190974 -266262 -326602 -347464 -284347 -211806 -202165 -184554 -102235 -92218
35056 -92218 -296077 -575813 -651211 -484382 -300857 -235458 -189196 -74896 17428 -11131 -109834
35045 -109834 -189309 -253122 -317388 -313514 -180207 19311 155289 154484 21213 -189221 -370818
35034 -370818 -420237 -346162 -263303 -241902 -234173 -173607 -53311 125654 369546 596959 642868
35023 642868 448935 169800 5911 -1259 63661 142470 223029 267657 236160 167500 156242
35012 156242 239919 347523 357714 205685 -36286 -197773 -190475 -127832 -168881 -268321 -232947
35001 -232947 -35696 116105 91247 16330 29209 41471 -77868 -239439 -271221 -209552 -217864
34990 -217864 -281340 -230454 -53843 56001 3146 -88130 -118089 -175033 -339739 -487733 -437172
34979 -437172 -208745 -4433 42088 1319 42292 242567 498910 612223 481955 214341
34969 214341 5861 -58139 -30226 40357 167098 330785 432454 397125 259967 107652
34959 107652 -10550 -81689 -99367 -74486 -31749 27192 106825 152246 77143 -103147 -233722
34948 -233722 -170726 68932 338919 489176 428331 143773 -254146 -549049 -576917 -382272
34938 -382272 -171078 -109549 -203632 -354214 -467046 -502632 -478865 -458375 -500870 -593648 -643189
34927 -643189 -563799 -371789 -173474 -64456 -60232 -119323 -198714 -271347 -320766 -349033 -371404
34916 -371404 -374603 -304960 -143045 26629 79425 -12644 -159371 -268152 -318423 -311901 -229679
34905 -229679 -84401 44689 86684 57235 21355 9715 7106 -8049 -46612 -104474 -154182
34894 -154182 -171170 -172076 -174436 -119789 74690 360669 549570 510977 301089 53251 -155754
34883 -155754 -274334 -241986 -94619 4274 -34093 -79455 25344 216099 309683 280592 252489
34872 252489 262536 236001 182847 211899 323500 384953 362416 382652 478631 459674 177417
34861 177417 -207233 -387614 -288890 -145522 -205351 -448707 -626555 -541756 -266181 -56881
34851 -56881 -56336 -146438 -156452 -122301 -200963 -382680 -474968 -381254 -211496 -72159 70625
34840 70625 237752 318005 219223 8540 -204945 -396369 -521467 -439637 -115723 206891
34830 206891 232368 -33809 -323450 -452051 -446075 -352441 -138572 161170 376915 389639
34820 389639 284878 228063 258149 289880 267370 222811 196369 171620 104344 -25221 -200197
34809 -200197 -376886 -492407 -490438 -375056 -236509 -183058 -222112 -238035 -127554 61333
34799 61333 176204 139782 23994 -65500 -116899 -191010 -317704 -455574 -534164 -512031 -414126
34788 -414126 -326665 -325803 -392554 -423547 -339384 -156622 49704 211285 283812 255209 172740
34777 172740 123239 145244 181787 151866 50970 -47948 -78773 -35236 58578 195042 365020
34766 365020 495414 463659 239407 -13779 -78306 56045 175412 132790 35849 55873
34756 55873 170211 233590 211520 174192 122456 5832 -121406 -154512 -134274 -192870 -305496
34745 -305496 -304472 -156953 -6298 96627 253480 435690 412473 110949 -188135 -209562
34735 -209562 -52907 230 -110258 -231161 -282752 -305704 -295988 -206291 -73284 30319 129406
34724 129406 279145 418946 448136 392787 345328 295954 178887 27916 -72137 -130936
34714 -130936 -192403 -197911 -82054 64368 116208 132213 241811 373082 335784 151662 48606
34703 48606 110857 178326 130588 33755 -50753 -167976 -298058 -307034 -176201 -80743 -123488
34692 -123488 -177073 -118226 -40458 -84434 -212668 -315410 -407833 -546273 -650765 -595540 -419759
34681 -419759 -286120 -262097 -277529 -268892 -235526 -169523 -52838 69641 109737 39844 -90394
34670 -90394 -236696 -392446 -540003 -632212 -635303 -556165 -427004 -286029 -161701 -54865
34660 -54865 52123 162637 267394 376251 501001 599225 593489 470701 313914 213725
34650 213725 193748 233849 300812 329380 243400 49507 -129747 -162383 -32883 148952 241295
34639 241295 183057 58430 33959 171535 323122 288886 60417 -188641 -329799 -364513
34629 -364513 -290224 -66410 217062 312182 94850 -227228 -331280 -150806 86173 145378
34619 145378 -1940 -226599 -381693 -385524 -256861 -103362 -33016 -56792 -91085 -45406 104949
34608 104949 303266 442387 439617 312770 169018 105284 136774 218287 291924 301715 202277
34597 202277 -17706 -317634 -592634 -685663 -497573 -143824 89119 49564 -96316 -116101
34587 -116101 -47367 -81704 -189502 -147096 47577 102223 -110282 -309467 -218846 20998
34577 20998 99811 15336 10771 134406 164023 -34709 -329430 -543373 -651654 -688017 -620075
34566 -620075 -420077 -178270 -65521 -194409 -516886 -836151 -956901 -867666 -731802 -667319
34556 -667319 -623091 -529443 -449309 -463389 -507249 -468022 -369880 -317945 -325129 -346500 -414756 -562898
34544 -562898 -669294 -587933 -412954 -395510 -575002 -700839 -577863 -304605 -92581 -15651
34534 -15651 -32542 -109465 -199043 -202310 -77098 69810 93727 -16130 -138558 -166711 -110710
34523 -110710 -77074 -164026 -351318 -499325 -496364 -385901 -293864 -266003 -256943 -242134 -231673
34512 -231673 -191311 -64989 127831 321678 509862 693397 753479 550367 171755 -90202
34502 -90202 -69412 106472 224057 205884 68179 -167401 -414184 -519296 -444964 -337859
34492 -337859 -312757 -293285 -189160 -95076 -140287 -236970 -178293 46549 217924 175677 -2850
34481 -2850 -139183 -149889 -75920 -11342 -36036 -148213 -239751 -197229 -41232 91196 113433
34470 113433 81719 104116 207513 321426 361509 303569 189623 80882 9412 -29453 -58754
34459 -58754 -115450 -240769 -426900 -582560 -610368 -519479 -400318 -294807 -181098 -90951
34449 -90951 -114575 -231994 -264466 -101845 106565 111549 -131854 -431461 -594890 -585632 -462223
34438 -462223 -288297 -132272 -65744 -111836 -226827 -345033 -421808 -455659 -503799 -637636
34428 -637636 -830140 -934193 -847910 -658051 -526127 -472345 -392970 -267565 -194162 -195305 -151452
34417 -151452 -4868 112934 77738 -16323 -2792 65346 -35501 -344562 -595702 -542246
34407 -542246 -269048 -51586 9514 52857 182610 308945 320555 275850 306924 408819
34397 408819 449914 369015 250444 192301 188818 173446 119036 64526 72735 167340 286233
34386 286233 321514 251524 192908 242826 309549 220632 -9295 -161634 -98021 76911 198486
34375 198486 253130 312123 370611 373920 324619 252028 152032 68923 140241 399839 610309
34364 610309 497879 143089 -71968 52097 296670 356632 219108 67172 -43576 -202357
34354 -202357 -397822 -477610 -390449 -291818 -317103 -379585 -321574 -179220 -126884 -174693 -114367
34343 -114367 152204 393999 330700 48651 -74386 128661 393531 397671 181548 38219
34333 38219 90665 177445 138581 29030 -8300 44109 75167 -4312 -170266 -322889 -390529
34322 -390529 -408333 -476927 -608935 -661524 -507468 -244265 -105590 -148833 -174323 -27376
34312 -27376 154332 132417 -71586 -175740 900 316822 488279 382671 79767 -258384
34302 -258384 -491348 -544064 -456585 -370930 -380856 -407515 -310727 -109210 23326 -5661 -106144
34291 -106144 -190965 -319204 -541531 -725679 -710802 -572788 -538262 -637752 -643460 -405386 -70143
34280 -70143 131684 171367 178074 226600 304627 409495 537311 621994 608615 554098 544672
34269 544672 547853 461610 285070 122030 28298 -24936 -36476 51579 236020 407882 466647
34258 466647 412299 303991 194460 120534 91012 65903 2533 -75159 -110438 -102997 -88600
34247 -88600 -45145 80954 249555 333291 276212 154278 51916 -26739 -93094 -126634 -145851
34236 -145851 -228262 -385762 -497374 -445160 -259224 -57986 94908 192784 199118 65705
34226 65705 -166018 -362575 -417133 -333343 -193889 -84407 -48401 -81944 -155889 -243110 -319346
34215 -319346 -351382 -319577 -253857 -208868 -197117 -186864 -170407 -184372 -252056 -359121 -496169
34204 -496169 -656968 -771079 -719300 -475619 -180084 -5221 23337 26237 115410 279710
34194 279710 408642 408113 310604 264257 362391 494434 456992 227799 12659 -34006 -8243
34183 -8243 -71858 -182191 -167837 -17740 88233 51235 -3228 85880 298723 483696 544695
34172 544695 499712 398516 260309 90158 -85285 -208480 -220141 -122478 -13713 -15528
34162 -15528 -142621 -275740 -290017 -188441 -90186 -113257 -288945 -555105 -784042 -829388
34152 -829388 -611785 -202067 200329 418673 445280 417506 442061 479812 434963 319207
34142 319207 254693 308686 395258 378466 225033 10724 -183867 -322426 -377163 -318142 -166734
34131 -166734 -21324 12463 -76928 -191406 -222597 -163228 -100432 -98578 -129244 -139744 -134529
34120 -134529 -124662 -45229 169370 436950 574070 517393 384892 276631 145496 -52837
34110 -52837 -209798 -196823 -64679 32616 58337 91278 137757 101164 -59669 -280324 -507810
34099 -507810 -731208 -880439 -848321 -669782 -545186 -606558 -763343 -849400 -816319 -698708
34089 -698708 -498618 -228911 -3398 49449 -52538 -163299 -173131 -81645 65685 225392
34079 225392 346032 386188 351986 275295 174051 82803 85912 240018 472632 629745 623414
34068 623414 474834 233921 -52805 -290364 -353663 -212941 9446 149520 141871 38447
34058 38447 -64560 -95263 -45569 25452 50410 26373 -3350 -41332 -152274 -358578 -567864
34047 -567864 -651264 -577277 -440935 -372696 -429240 -552136 -622693 -573512 -441526 -293203 -137747
34036 -137747 17906 65670 -120049 -462750 -677364 -572506 -272420 -44300 17245 22252
34026 22252 70939 151608 226447 270193 210689 -28677 -374820 -597670 -522413 -192405 203399
34015 203399 491614 586679 505654 367536 304263 323911 325617 271638 242757 281567 308321
34004 308321 277445 290308 420748 533370 449830 239174 150268 257965 364035 295224
33994 295224 130441 42971 52222 54870 19881 22047 107508 228011 309617 317588 254702 156894
33982 156894 95428 126177 217156 267800 223063 133649 71758 19514 -97546 -264614 -343391
33971 -343391 -245609 -93857 -109480 -333324 -557551 -583052 -459271 -387441 -443694 -501865 -420761
33960 -420761 -219939 -48138 -24251 -124107 -207831 -172568 -83162 -97776 -244404 -363629 -336920
33949 -336920 -263678 -287869 -338978 -227932 28005 176759 71394 -126086 -156967 41497
33939 41497 332653 565814 678791 685436 636504 559561 417295 182077 -55838 -159612
33929 -159612 -137756 -142189 -242662 -334182 -318288 -238063 -161896 -70797 47233 121202 120098
33918 120098 127920 185028 187684 84040 36716 204124 452934 495537 273714 13713 -86265
33907 -86265 -42107 48964 149139 236990 257976 188457 83881 36129 121657 354148 610535
33896 610535 657744 378118 -48366 -300341 -242618 -2999 230175 347875 291527 63299
33886 63299 -203054 -323467 -259860 -131635 -21688 102300 253386 348877 317468 180813
33876 180813 -170 -160080 -203937 -76063 125154 233648 239752 284022 400484 438229
33866 438229 303651 109111 -18300 -118547 -263335 -374028 -325865 -144049 44661 187511
33856 187511 302682 361529 313490 202659 138562 153216 176469 151786 106177 101133 155561
33845 155561 215735 194943 73514 -52818 -90598 -93632 -177814 -301416 -294176 -136568 -14975
33834 -14975 -15956 20040 189984 285494 94469 -207250 -250814 11952 275020 336074 298184
33823 298184 281594 226922 97746 29496 108288 186590 106424 -29270 -13253 117077 103885
33812 103885 -156265 -445238 -495798 -310914 -121825 -90343 -153567 -168845 -128629 -158552 -319871
33801 -319871 -501474 -552524 -459241 -318468 -181206 -19308 168559 325613 429072 519476
33791 519476 609851 655077 647415 649496 681008 667563 575840 506171 540648 566579 393687 38685
33779 38685 -237238 -212832 56025 317754 374740 219450 -11113 -165100 -194875 -180084
33769 -180084 -207066 -226125 -98352 190374 450133 492894 353059 213052 158632 122782
33759 122782 53991 7546 36254 101389 151026 198558 250995 229344 51054 -236230 -471572
33748 -471572 -519128 -356818 -69298 201119 340185 352775 336507 334643 283698 155093 49915
33737 49915 50768 61857 -64415 -288906 -426539 -414618 -391125 -482887 -640927 -720973 -631551
33726 -631551 -387010 -110625 13237 -94371 -275582 -284407 -75485 174270 324750 393160
33716 393160 398917 280404 47606 -142182 -165874 -77654 2752 22289 -45711 -222127 -417971
33705 -417971 -467224 -368864 -338597 -493725 -643906 -552858 -274008 -53951 -10087 -75694 -177465
33694 -177465 -301865 -446269 -624855 -836496 -938479 -719156 -237856 108456 69792 -99937
33684 -99937 -35425 185003 229696 116134 189351 526440 801659 814564 744609 745816 669610
33673 669610 400234 147233 145119 289606 318627 179314 -7469 -187184 -348408 -392800
33663 -392800 -263065 -113339 -133854 -259291 -244723 -1304 305596 467600 404698 158153
33653 158153 -149595 -358272 -383511 -286991 -174096 -70803 30259 78031 19880 -104025
33643 -104025 -218874 -317268 -414871 -462832 -405004 -281066 -184939 -156478 -178379 -222598 -237773
33632 -237773 -170090 -69735 -80860 -233280 -350414 -285358 -142555 -106823 -138178 -33712
33622 -33712 237606 462118 472357 347182 260188 249442 219837 112665 -67 7954 162898
33611 162898 333399 368084 278932 204762 190167 135129 11634 -38532 58910 135593 22809
33600 22809 -155482 -153777 9165 84887 -4884 -58548 72117 271423 375556 407867 473721
33589 473721 557842 559131 448185 287212 144632 56376 20141 -15130 -91954 -149519 -75495
33578 -75495 108014 218080 144366 12308 12813 143900 245612 250834 254772 312544 306977 122345
33566 122345 -118215 -131402 180706 576264 748569 676148 578236 578591 594879 573555 621513
33555 621513 794310 929214 854984 645315 484538 379785 210815 -459 -99010 -60547
33545 -60547 -25005 -45607 -15029 107681 193886 150047 60398 38073 76293 130683 213917
33534 213917 319358 372237 344277 308956 312683 309193 284597 302838 345080 269513 54894
33523 54894 -76290 54461 299391 381799 284363 237248 370860 582405 732744 787016
33513 787016 747457 617363 462478 359635 255412 26841 -277163 -421337 -298963 -117273
33503 -117273 -139524 -341056 -470021 -395754 -232919 -113258 4316 209280 429098 476727
33493 476727 296232 54530 -41185 57013 251760 426921 488780 356846 38690 -295023
33483 -295023 -423298 -294110 -61723 103135 158384 138759 69981 -13171 -51523 -32661 -20162
33472 -20162 -58616 -100340 -67949 59513 241677 384309 343193 45819 -337556 -481849
33462 -481849 -270450 39130 129028 -3132 -118340 -85234 24199 126135 211101 246952
33452 246952 184893 90625 102860 214902 247884 101776 -102817 -204724 -198656 -163148 -101348
33441 -101348 30300 191799 259374 142568 -137933 -447588 -589409 -439903 -93775 192936
33431 192936 265853 216183 205336 233150 183475 39181 -80286 -91127 -45311 -35902 -81093
33420 -81093 -130206 -129136 -56584 63572 170863 220879 230702 237701 224835 141763 353 -115222
33408 -115222 -154565 -159791 -184006 -200053 -142161 -15052 90722 97825 30582 -2261 92179
33397 92179 297400 484851 517259 365471 116872 -118852 -273211 -295531 -152933 82892
33387 82892 212548 86744 -191147 -345365 -248893 -75775 -71486 -248972 -405521 -391353
33377 -391353 -245244 -72766 84843 215261 268281 210103 102118 49783 81833 129965
33367 129965 122855 61533 5693 15715 100010 189626 176663 18314 -193497 -297462 -206367
33356 -206367 30292 293834 486436 554438 482670 315493 162668 126610 202790 281894
33346 281894 276845 227219 237729 317160 337181 194065 -24864 -110078 22820 219285 265216
33335 265216 139044 18068 43175 156167 209409 175197 161641 228856 285562 224316 97517
33324 97517 67472 191207 340505 355269 204781 -29440 -251860 -383842 -374542 -265678
33314 -265678 -199584 -275922 -427042 -512355 -500789 -464341 -422094 -318980 -169474 -93270 -155821
33303 -155821 -270808 -322968 -315125 -334644 -430163 -569205 -668942 -639794 -464081 -262878 -204430
33292 -204430 -298846 -366231 -269940 -98614 -36089 -123108 -244598 -299788 -281950 -222392 -156363
33281 -156363 -131322 -161475 -180390 -116427 -10829 15347 -79355 -190576 -175798 4543 247570
33270 247570 382261 307507 90569 -99067 -178093 -216686 -279634 -286058 -124719 143005 314467
33259 314467 279588 137972 76912 190150 402533 517114 367989 185 -325370 -376174
33249 -376174 -173181 82938 245868 291063 221521 54010 -123245 -222974 -288071 -414303
33239 -414303 -546750 -508942 -264132 2372 113437 78642 -11850 -130680 -264744 -342704
33229 -342704 -316283 -236993 -171766 -116873 -62429 -52075 -95991 -109076 -28122 81833 130075
33218 130075 138904 179663 230974 208848 95881 -59199 -229550 -395828 -485951 -450034 -375550
33207 -375550 -399719 -497205 -477683 -239243 69852 203868 77478 -179729 -381710 -440517
33197 -440517 -380290 -257933 -104941 57395 178128 192622 89954 -61758 -174724 -210793
33187 -210793 -189212 -158562 -173158 -259616 -382892 -470374 -479794 -411914 -264145 -43028 160583
33176 160583 201021 46207 -149324 -212104 -137224 -33267 60022 185138 320081 348435
33166 348435 218411 45010 -10579 74684 173714 168516 80872 33637 105340 256377 405200
33155 405200 528284 630624 654405 520495 278080 109331 128953 261517 378353 462427
33145 462427 543114 553879 393608 93788 -205949 -430683 -590451 -646585 -523055 -284085
33135 -284085 -133014 -143439 -128301 93761 399665 491083 284983 12103 -90378 -32387
33125 -32387 47176 115180 228035 351074 356852 217417 62495 -6568 -39792 -86293 -32344
33114 -32344 250141 637394 814758 638807 300265 72517 23856 52855 83670 102031
33104 102031 71748 -51702 -242623 -426447 -553759 -586533 -468346 -208795 43806 128745
33094 128745 59458 -11411 8687 94338 221665 407470 603284 672691 534833 259611
33084 259611 -13529 -184834 -210028 -103200 33949 67296 -32922 -167458 -248963 -294225
33074 -294225 -341896 -366384 -335692 -282204 -243962 -195076 -112681 -64966 -142778 -322904 -475803
33063 -475803 -501927 -399685 -214356 4384 189841 281344 295921 324410 409813 463731 365877
33052 365877 147410 12693 133072 445718 711529 766707 656084 512504 395972 311009
33042 311009 297875 386966 488935 456984 282347 123082 93107 112470 34868 -141408 -272982
33031 -272982 -256843 -148614 -93648 -174135 -324062 -387371 -282849 -115965 -82755 -244092
33021 -244092 -449998 -527605 -490866 -497921 -631546 -801642 -869678 -800386 -660190 -515540 -383178
33010 -383178 -261782 -156381 -56708 62902 184519 223459 127372 -18717 -73988 -39729
33000 -39729 -68190 -221885 -342571 -269462 -88311 -4790 -32573 -4504 114237 142234 -25908
32989 -25908 -238523 -308223 -256108 -209021 -196183 -198639 -273140 -440615 -545510 -439474 -255057
32978 -255057 -266668 -477309 -578108 -381327 -76327 64556 53195 90866 233309 354523
32968 354523 398573 466319 617653 743112 712467 554749 402744 315956 250570 181098 152468
32957 152468 183872 195824 95979 -94107 -262100 -346284 -386967 -425003 -425871 -358293 -288676
32946 -288676 -305810 -364681 -303409 -53104 240421 369638 307362 228183 289118 448593 530933
32935 530933 433684 230708 81019 73183 166128 252827 261373 206309 158094 160435 179687 154802
32923 154802 92911 68561 107247 129326 69670 5305 67691 239621 349138 293692 166396
32912 166396 98856 68664 -43599 -259762 -464984 -541340 -461272 -271927 -71488 17819
32902 17819 -47667 -154881 -155021 -71193 -70963 -195862 -249641 -55811 268834 435033 335024
32891 335024 137867 36272 43793 88424 170353 320195 483176 569200 583660 590328 554206
32880 554206 349136 -41468 -436957 -635129 -602608 -437068 -227890 -45674 1197 -161452
32870 -161452 -439936 -617885 -571762 -380252 -200509 -98062 -26419 79600 233146 396179
32860 396179 524590 611940 678557 712922 666585 537439 399251 290974 150933 -37401
32850 -37401 -110091 97965 461216 649958 549314 394866 399264 437562 265001 -100401
32840 -100401 -419300 -574672 -661259 -753061 -784888 -703888 -578550 -491742 -439629 -397578 -391240
32829 -391240 -434644 -466636 -414360 -278444 -109516 59654 210009 288612 217805 -26453
32819 -26453 -346532 -553400 -513215 -290545 -103203 -92042 -176421 -188774 -97047 -5814 22728
32808 22728 27516 25893 -44559 -213385 -398782 -506055 -541066 -559082 -544407 -414958 -138624
32797 -138624 210526 523748 751825 907304 990631 956204 781716 548169 393481 376753
32787 376753 440823 518708 599695 656208 604654 428820 270592 281158 414544 480576 388688
32776 388688 234404 152643 195125 356987 605934 845755 943947 851108 646893 447869
32766 447869 314748 243979 182451 50336 -179490 -420066 -548015 -531082 -420466 -261761
32756 -261761 -108079 -68183 -197454 -359290 -349353 -163876 4343 38950 -1379 -64191 -170385
32745 -170385 -246995 -124385 179690 375312 251617 -56169 -301896 -450752 -576681 -613906
32735 -613906 -469581 -276693 -260481 -397890 -466931 -416880 -427693 -577497 -709949 -708913 -672585
32724 -672585 -696329 -680488 -512408 -298584 -238799 -338672 -402677 -296370 -103200 -13329 -125797
32713 -125797 -370878 -589739 -677308 -645628 -548493 -395657 -199934 -52612 -29032 -34379 100901
32702 100901 335441 397152 155380 -134748 -133092 122968 261668 79962 -198005 -244841
32692 -244841 -52326 114002 93896 -11197 -58311 -67834 -126225 -205944 -213781 -161449 -149082
32681 -149082 -193004 -207000 -165633 -139250 -126778 -18796 180170 255042 59932 -231729 -347860
32670 -347860 -297657 -304121 -402077 -369457 -103942 178915 239820 118515 5854 -33086 -50076
32659 -50076 -39796 53479 205311 322034 352681 298608 170331 32345 15608 158756 300402
32648 300402 274423 161464 173953 311588 332283 114496 -133787 -137889 91915 294622
32638 294622 278100 93663 -76487 -109517 -20118 83069 100447 25772 -69942 -137876 -197944
32627 -197944 -267415 -292882 -206354 -28983 131290 186148 140767 62794 -179 -71188 -216197
32616 -216197 -448164 -656497 -676715 -464448 -167119 20095 41582 -23616 -115055 -244061
32606 -244061 -385484 -421912 -270290 -9803 201920 321613 442703 612536 716057 608587
32596 608587 322634 60558 -26124 14864 40624 10796 11546 93795 169530 116442 -57894
32585 -57894 -220193 -270302 -236088 -199381 -184739 -156275 -86349 14263 113185 170159 157509
32574 157509 101481 72909 87190 43220 -161350 -453200 -599874 -437091 -35064 379676
32564 379676 617927 628440 478925 293356 169001 105184 35544 -47358 -54005 68652 222319
32553 222319 254901 148130 31847 19641 99839 188988 223494 184392 94791 22936 44085
32542 44085 164573 301934 360151 318887 248884 245548 330396 406948 348124 150895 -45210
32531 -45210 -137425 -193095 -319526 -457380 -438645 -246024 -69766 -59438 -145925 -188443 -188427
32520 -188427 -241941 -349503 -409343 -387953 -378811 -461133 -579237 -605463 -483000 -277153 -110478
32509 -110478 -65248 -127291 -205042 -210286 -129500 -17349 69137 114651 129596 115591 67409
32498 67409 8172 -2891 69095 166610 178940 79639 -20405 -15005 38685 -5480 -152571
32487 -152571 -217073 -49519 268294 516850 566567 447552 255135 83940 30334 152609
32477 152609 398149 628373 740994 734412 655243 543288 447538 432230 508400 581418 523159
32466 523159 310261 64814 -55525 3060 158657 271312 238670 54606 -174942 -291094
32456 -291094 -227988 -110740 -128874 -278587 -326434 -109750 213066 336084 172189 -104506
32446 -104506 -347536 -571756 -766578 -788733 -568316 -274036 -123068 -124597 -153265 -182234
32436 -182234 -267856 -357735 -309141 -109465 82354 150346 150246 188605 288778 417370 535243
32425 535243 572340 452856 212380 13690 -19615 69812 157796 184258 158532 83773 -43557
32414 -43557 -181841 -251943 -195802 -12070 235652 430919 475113 381030 258310 181073 121482
32403 121482 47397 19626 122555 333415 530855 623259 617990 575765 545772 540447 530445
32392 530445 462640 313990 127898 -19921 -77063 -20794 153123 402378 622376 716573
32382 716573 685080 604305 525126 439687 348362 295245 303136 316931 261842 144762 54332
32371 54332 55241 114614 146656 104099 1495 -132987 -287761 -443753 -558216 -599347 -577624
32360 -577624 -519797 -431993 -316644 -203800 -124283 -65451 -3217 26064 -54701 -252455 -460292
32349 -460292 -552323 -488666 -306880 -53883 233253 504766 699078 766768 688345 495208
32339 495208 282486 153902 117533 72788 -54017 -190472 -189766 -10282 226919 358276
32329 358276 313435 136668 -73023 -223421 -265202 -196450 -39270 168288 344616 376088
32319 376088 225016 18914 -41490 111035 343098 474994 445653 305929 128235 -18055
32309 -18055 -67804 -23623 20903 12954 60959 299385 634820 781725 619932 376692 323945
32298 323945 397603 302974 -32140 -320221 -295473 -59921 81827 19249 -100753 -161164
32288 -161164 -237896 -424318 -633353 -691622 -581413 -478554 -535693 -704028 -813566 -780361
32278 -780361 -662179 -522863 -339787 -94696 130813 255311 344625 522407 740330 797833
32268 797833 637292 452107 399127 368287 209747 57264 177417 535614 771268 656585
32258 656585 364622 194049 218218 327807 452553 571768 612858 516440 354051 237611
32248 237611 150276 3815 -163707 -194530 -31731 178796 236644 69842 -225395 -452552
32238 -452552 -440377 -198900 48934 85546 -48660 -121873 -35787 46118 -50783 -254021 -343036
32227 -343036 -241624 -94534 -59427 -117942 -130632 -28030 111166 178950 191898 270841 459739
32216 459739 628923 613298 407508 154851 -31534 -153152 -244224 -306497 -347505 -391948
32206 -391948 -415364 -348853 -201120 -99117 -137290 -242329 -260303 -137232 55592 237416
32196 237416 378340 460023 452700 344569 159322 -48812 -201262 -244584 -235785 -314028 -509224
32185 -509224 -638157 -507602 -193358 16284 -35223 -212018 -294901 -214705 -19288 251317
32175 251317 541720 727970 719831 573843 405211 238898 53590 -86630 -88045 8835
32165 8835 66311 50483 54080 110719 144732 140154 187546 288613 288993 129350 4995 100589
32153 100589 285093 286111 106684 31099 200153 399841 354670 65912 -248818 -433600
32143 -433600 -494041 -493182 -466672 -430647 -404987 -416139 -475870 -529728 -456121 -204728 67956
32132 67956 120787 -72972 -260701 -211092 20538 210425 257167 244929 277436 364780 451461
32121 451461 465059 352878 144306 -42510 -121617 -142072 -207880 -328098 -417034 -416033 -343467
32110 -343467 -245253 -163242 -134628 -161791 -197161 -199058 -169272 -104612 16922 144468 136979
32099 136979 -68654 -344332 -522668 -582035 -570551 -451289 -191968 69640 153541 93573
32089 93573 61243 62543 -52508 -272591 -382531 -301484 -202635 -188393 -109253 124766 294109
32078 294109 167244 -126671 -276609 -216972 -118716 -48393 78321 233357 249076 90144
32068 90144 -84251 -181717 -281954 -415972 -460796 -362645 -269130 -298493 -341776 -257788 -127662
32057 -127662 -122079 -209149 -210120 -108681 -82927 -201449 -292597 -207831 -55182 -37274 -160334
32046 -160334 -253644 -225011 -141647 -62190 58902 250552 430942 511873 507483 455794 316786
32035 316786 61708 -196988 -302990 -261557 -210171 -187774 -89928 107705 241047 167064
32025 167064 -36094 -183254 -202575 -135440 -7901 163887 301783 340761 342970 404531 474785
32014 474785 410986 208236 29386 -13863 27663 78332 140531 196743 150143 -28420 -195560
32003 -195560 -203027 -106988 -80274 -149561 -163136 -39608 85548 43525 -123578 -222337 -192976
31992 -192976 -202052 -389850 -629425 -664250 -445280 -179867 -30113 73116 239073 401057
31982 401057 437351 389714 373969 341908 142632 -195089 -452097 -512349 -461846 -349099 -74607
31971 -74607 366224 734097 815910 707197 646300 669287 617688 424611 202665 67578
31961 67578 39882 117076 288340 460834 506427 411638 277339 162007 40985 -69094
31951 -69094 -83875 -1465 34884 -101515 -366780 -606415 -704800 -633655 -425817 -162971 56984
31940 56984 192523 271362 311228 279328 161551 21737 -49024 -15310 83970 162089 133623
31929 133623 6003 -70106 66849 368205 575853 507687 266884 91341 66790 94727
31919 94727 99335 130916 241170 361963 375971 264512 128095 72315 118134 232091 399668
31908 399668 616022 811005 860656 727934 539828 442546 411295 308231 121330 16328
31898 16328 111628 321480 491894 584792 633597 607667 441164 145678 -209353 -577097
31888 -577097 -887469 -983636 -759756 -356234 -71594 -44721 -132406 -132659 -23318 70936 61785
31877 61785 -19728 -82667 -78019 -57670 -124499 -288294 -405658 -334535 -117480 77711 163326
31866 163326 160340 62466 -151333 -357145 -340261 -89088 142047 175872 152966 277970 467983
31855 467983 457195 177149 -170291 -392689 -470044 -433544 -271691 -28013 140640 102638
31845 102638 -99039 -284004 -294595 -116705 115427 241116 242448 266128 424396 623054
31835 623054 677010 560303 430291 415051 486661 547332 534849 430814 262391 109662
31825 109662 23477 -63139 -244726 -474474 -602397 -576298 -469673 -311709 -61270 214382
31815 214382 323003 199632 16558 -62099 -83977 -146082 -186118 -109040 -4994 -39183 -183373
31804 -183373 -250723 -179277 -105655 -148794 -274689 -401180 -501035 -558518 -533212 -417463 -254698
31793 -254698 -71022 138258 326705 374701 198811 -145007 -489435 -676974 -667924 -549824
31783 -549824 -419527 -255796 18769 329290 430490 200186 -151472 -309088 -220994 -92096
31773 -92096 -72589 -139298 -251947 -408233 -518720 -441056 -212589 -61065 -84622 -91715 110167
31762 110167 406714 512449 323623 -9194 -296798 -461004 -509186 -493214 -491391 -536317
31752 -536317 -560310 -477347 -301844 -126617 -11475 41474 31873 -42146 -136611 -169244 -81902
31741 -81902 119123 353961 483062 390003 98935 -229661 -451882 -538596 -505703 -347658
31731 -347658 -106720 84100 124606 54615 -40791 -153616 -279708 -309544 -140483 142097
31721 142097 341432 391913 390122 394303 341026 184547 -12084 -164238 -239378 -220944 -114242
31710 -114242 -18519 -66793 -237000 -336012 -239866 -48152 73270 99522 104415 108734 95234
31699 95234 110367 209008 314676 266926 32182 -231284 -355074 -332983 -272387 -237561 -202359
31688 -202359 -132732 -58273 -46133 -119980 -215852 -225910 -97503 110515 282649 360013 382196
31677 382196 408740 426508 376548 273606 241133 373028 583303 666753 527784 288732
31667 288732 139431 140994 230235 353291 499050 625189 657261 580288 452999 312386
31657 312386 143461 -27998 -101446 -23524 119031 200692 205581 196624 173829 69092 -110616
31646 -110616 -240024 -231669 -161914 -158037 -199492 -139102 66360 257508 274037 173136 137952
31635 137952 215661 286881 291086 312278 375089 324693 55788 -255245 -334915 -176792 -29839
31624 -29839 -35656 -78012 -28398 61678 109062 166042 296128 401494 332209 106313 -111034
31613 -111034 -203265 -164991 -25831 154450 251892 186762 64947 79225 258140 437771
31603 437771 499062 494904 497363 462422 340638 211539 185286 234650 246534 206839 213493 309364
31591 309364 414518 446126 405411 306397 118201 -143545 -342296 -350449 -232151 -185276 -284903
31580 -284903 -389012 -349554 -221062 -164711 -208610 -234318 -195788 -214821 -398485 -659534 -809605
31569 -809605 -778114 -646349 -494378 -320533 -123902 36831 127846 216305 374635 531554
31559 531554 518148 297213 66217 47573 208871 295925 161404 -47186 -100466 -3939
31549 -3939 20032 -160958 -432656 -606670 -628182 -549078 -397027 -179398 29235 118834 79423
31538 79423 34164 103493 265292 375808 328739 185308 126429 253120 454942 526997 409410
31527 409410 239589 155237 133109 70260 -53678 -169145 -217688 -184363 -67836 107201
31517 107201 274217 386601 468587 546228 568321 470824 285170 101546 -42229 -145287
31507 -145287 -153545 -4542 241017 429042 489174 475871 419342 268077 38715 -99268
31497 -99268 -512 250401 410662 344159 149395 28256 75914 208821 278472 241237 193436
31486 193436 223048 273546 223832 77260 -30131 -23712 8476 -46186 -168190 -245452 -206107
31475 -206107 -55633 160605 368972 485259 482068 414295 342711 272028 197366 157093 189207
31464 189207 275939 371894 444206 458332 392134 303766 304823 409182 493924 479405 447502
31453 447502 481037 493065 367811 195059 177120 328469 460343 477569 493549 584719 611852
31442 611852 409194 35387 -286824 -407947 -331905 -135216 81933 213419 226337 202787
31432 202787 221557 228628 113140 -109688 -283093 -274966 -90271 168301 373795 421523 296900
31421 296900 113393 8417 -8900 -30299 -71624 -41463 72998 119505 -12907 -191446
31411 -191446 -185417 23472 225663 281115 273820 311670 324611 194805 -5162 -74131 34651
31400 34651 154497 166060 168967 298416 477771 492786 279321 10664 -115562 -80173 -831
31389 -831 30179 8926 -33223 -81679 -139505 -207839 -273915 -319700 -349454 -392391 -449232 -456709
31377 -456709 -363567 -238530 -221928 -337068 -429973 -365680 -222209 -189530 -302464 -389034 -303779
31366 -303779 -106578 48922 121417 184228 263575 284096 193905 61503 -3061 18629 52061
31355 52061 45127 33772 81164 182160 251997 208993 62701 -83509 -126617 -64711 11008
31344 11008 35594 56718 166127 356152 496488 472870 310581 134869 44677 59285 147581
31333 147581 240120 222548 6254 -342150 -588510 -523795 -184131 162310 277983 191807
31323 191807 144261 300157 560580 697380 641752 556370 595611 678506 590031 277049 -63157
31312 -63157 -213180 -170027 -101775 -135298 -255845 -381251 -457950 -480265 -469348 -451484 -433143
31301 -433143 -392639 -310180 -194261 -61580 82423 211650 261494 197777 82492 5615
31291 5615 -35852 -112376 -217558 -250726 -178235 -111062 -150241 -236201 -243704 -163527 -80521 -15267
31279 -15267 82967 198489 242278 204474 181742 205048 167760 2239 -187174 -270573 -275033
31268 -275033 -297810 -318944 -254664 -150656 -144821 -231300 -235088 -77296 84678 75819 -51747
31257 -51747 -113349 -68286 -75042 -266197 -549204 -669594 -468694 -77258 177108 105666 -124658
31246 -124658 -198571 -59737 30027 -126460 -387146 -493062 -427266 -380109 -433914 -475229 -411440
31235 -411440 -299310 -217220 -143774 -27748 105495 174404 127766 -5005 -117439 -104665
31225 -104665 8131 63220 -22841 -113676 -40262 124347 157044 37826 2841 194221 450986
31214 450986 542983 447348 276990 79392 -152592 -372311 -514734 -569845 -529226 -356488
31204 -356488 -103616 65926 90364 119364 268337 397722 320167 103119 -60050 -179221
31194 -179221 -398692 -656615 -719154 -568226 -446551 -440225 -321033 43028 387413 383256
31184 383256 88580 -158787 -173718 -32850 150704 329590 438088 419274 347880 364258
31174 364258 473696 546855 519124 450520 384326 294756 198498 168125 184119 116521 -63643
31163 -63643 -177557 -60040 189237 305188 184456 -874 -33516 94826 211823 197139
31153 197139 110619 78367 116785 135506 94815 71685 137283 245869 308809 318784 318959 297594
31141 297594 217332 120710 83633 63942 -68170 -310193 -470483 -412046 -245730 -172806 -212470
31130 -212470 -212783 -93700 52780 107733 54875 -64986 -232225 -425037 -578345 -623549 -541498
31119 -541498 -346770 -63651 236915 419695 388605 223196 146144 295599 544621 608771
31109 608771 360559 -8248 -191814 -110791 32475 39033 -60268 -128289 -162709 -273422 -463321
31098 -463321 -594335 -590513 -523239 -440951 -267345 25833 277276 322199 238744 240823 369544
31087 369544 466349 436676 349850 256521 113203 -34825 -826 262169 482745 370036
31077 370036 8796 -236248 -172233 49836 206530 256226 274289 292316 293242 274941 240977
31066 240977 180954 104774 48035 18448 -12448 -55956 -104641 -176967 -281124 -344551 -289902
31055 -289902 -183310 -172705 -256183 -269709 -161737 -103155 -210847 -328844 -255792 -63858
31045 -63858 18514 -31293 -17233 129057 210812 45828 -275880 -505327 -503814 -325106 -108588
31034 -108588 38514 99762 137666 197232 225787 153274 43866 63418 262000 479963 521172
31023 521172 348570 64225 -223164 -440032 -518505 -418064 -177028 99402 302584 368895
31013 368895 301610 162268 9936 -155100 -345679 -495630 -494313 -340165 -183987 -168063
31003 -168063 -270684 -349784 -293916 -98185 150483 318531 310714 163788 18660 -33827
30993 -33827 -24655 7350 109489 307199 470860 421320 169939 -50059 -25643 223607 495797
30982 495797 606790 502587 228625 -128902 -453401 -611195 -531614 -291458 -70258 13403
30972 13403 -13548 -81605 -192925 -357134 -482363 -459418 -326106 -201619 -64766 217304
30962 217304 589240 739977 479366 42874 -155582 -846 255381 355895 301953 257422
30952 257422 326489 457427 490468 301264 -42624 -301634 -312799 -167667 -56241 -11501
30942 -11501 52050 109929 33845 -166921 -300315 -252490 -145864 -151893 -258399 -316361 -243552
30931 -243552 -95207 29540 92610 145180 265452 439982 526476 402052 137270 -57822
30921 -57822 -56114 97597 296613 458445 510267 423797 289113 234640 253580 232686 160087
30910 160087 141523 175936 104868 -128157 -346937 -393917 -354096 -380544 -433213 -365277 -173604
30899 -173604 7090 89439 58011 -116434 -415743 -679621 -744982 -652682 -565403 -522669 -444932
$$ [...]
##END NTUPLES=NMR SPECTRUM
##END=
