##TITLE=C13_BAU-j-OCH3N
 CDCl3, 450 sc

 29.4.2019
##JCAMPDX= 6.0         $$ Bruker NMR JCAMP-DX V2.0
##DATA TYPE= NMR SPECTRUM
##DATA CLASS= NTUPLES
##ORIGIN= UXNMR, Bruker Analytische Messtechnik GmbH
##OWNER= root
$$ XWIN-NMR		Version 3.5
$$ Mon Apr 29 16:38:20 2019 Russian Standard Time (UT+4h)  she@DPX200
##.OBSERVE FREQUENCY= 50.3278965144739
##.OBSERVE NUCLEUS= ^13C
##.ACQUISITION MODE= SIMULTANEOUS
##.ACQUISITION SCHEME= undefined
##.AVERAGES= 450
##.DIGITISER RES= 17
##SPECTROMETER/DATA SYSTEM= spect
##.PULSE SEQUENCE= zgpg30
##.SOLVENT NAME= CDCl3
##.SHIFT REFERENCE= (INTERNAL, CDCl3, 0, 225.262)
##AUDIT TRAIL= $$ (NUMBER, WHEN, WHO, WHERE, WHAT)
$$ ##TITLE= Audit trail, XWIN-NMR		Version 3.5
$$ ##JCAMPDX= 5.01
$$ ##ORIGIN= Bruker BioSpin GmbH
$$ ##OWNER= she
$$ F:/spectra/data/she/nmr/c13/1/pdata/1/auditp.txt
$$ ##AUDIT TRAIL=  $$ (NUMBER, WHEN, WHO, WHERE, WHAT)
(   1,<2019-04-29 16:37:12.42 +0400>,<she>,<DPX200>,
      <created by zg, POWCHK disabled, PULCHK disabled
       terminated by command 'halt'
       configuration hash MD5:
       00 E9 B6 7A A2 85 ED C7 34 08 36 98 17 FE 4E 26
       data hash MD5: 32K
       8F 38 2E 3A 78 18 20 1A D0 A6 60 61 B5 F8 78 8F>)
(   2,<2019-04-29 16:37:13.84 +0400>,<she>,<DPX200>,
      <Start of raw data processing
       efp BC_mod = 2 LB = 1 FT_mod = 6 PKNL = 1 PHC0 = -380.0025 PHC1 = 38.40641 SI = 32K 
       data hash MD5: 32K
       FF A0 48 2B 59 84 0D 59 47 2C C5 33 28 94 9C 17>)
(   3,<2019-04-29 16:37:16.51 +0400>,<she>,<DPX200>,
      <abs ABSG = 5 
       data hash MD5: 32K
       AA B3 38 49 93 52 69 50 B8 32 26 B0 57 86 C4 D9>)
(   4,<2019-04-29 16:37:35.90 +0400>,<she>,<DPX200>,
      <pk PHC0 = 6.632263 PHC1 = -7.8 
       data hash MD5: 32K
       C2 35 43 FD 32 C4 E9 19 1B EB 16 71 D7 A0 1A A5>)
(   5,<2019-04-29 16:37:38.65 +0400>,<she>,<DPX200>,
      <abs ABSG = 5 
       data hash MD5: 32K
       B4 84 BC 12 3C 27 EB B4 FA 62 7B F6 89 FE EA C6>)
$$ ##END=
$$ 
$$ hash MD5
$$ CA 4F A0 A4 47 09 B3 09 D9 D4 A4 DE F0 41 E6 37
##$RELAX= 
##$RELAX= 
##$RELAX= 
##$RELAX= 
##$RELAX= 
##$RELAX= 
##$RELAX= 
##$RELAX= 
$$ Bruker specific parameters
$$ --------------------------
##$DU= <F:/spectra>
##$EXPNO= 1
##$NAME= <c13>
##$PROCNO= 1
##$TYPE= <nmr>
##$USER= <she>
##$AMP= (0..31)
100 100 100 100 100 100 100 100 100 100 100 100 100 100 100 100 100 100 
100 100 100 100 100 100 100 100 100 100 100 100 100 100 
##$AQSEQ= 0
##$AQ_mod= 1
##$AUNM= <au_zg>
##$AUTOPOS= <>
##$BF1= 50.322709
##$BF2= 200.13
##$BF3= 50.322709
##$BF4= 500.13
##$BF5= 500.13
##$BF6= 500.13
##$BF7= 500.13
##$BF8= 500.13
##$BYTORDA= 1
##$CFDGTYP= 0
##$CFRGTYP= 5
##$CHEMSTR= <none>
##$CNST= (0..31)
1 1 145 1 1 1 1 1 1 1 1 1 1 1 1 1 1 1 1 1 1 1 1 1 1 1 1 1 1 1 1 1 
##$CPDPRG= <waltz16>
##$CPDPRG1= <>
##$CPDPRG2= <waltz16>
##$CPDPRG3= <>
##$CPDPRG4= <mlev>
##$CPDPRG5= <mlev>
##$CPDPRG6= <mlev>
##$CPDPRG7= <mlev>
##$CPDPRG8= <mlev>
##$CPDPRGB= <>
##$CPDPRGT= <>
##$D= (0..31)
$$ [...]
##$SUBNAM4= <"">
##$SUBNAM5= <"">
##$SUBNAM6= <"">
##$SUBNAM7= <"">
##$SUBNAM8= <"">
##$SUBNAM9= <"">
##$SW= 239.972172938263
##$SWIBOX= (0..15)
0 1 3 0 0 0 0 0 0 0 0 0 0 0 0 0 
##$SW_h= 12077.2946859903
##$TD= 32768
##$TD0= 1
##$TE= 0
##$TE2= 300
##$TE3= 300
##$TEG= 300
##$TL= (0..7)
120 120 120 120 120 120 120 120 
##$TP= (0..7)
150 150 150 150 150 150 150 150 
##$TP07= 0
##$TPNAME0= <>
##$TPNAME1= <>
##$TPNAME2= <>
##$TPNAME3= <>
##$TPNAME4= <>
##$TPNAME5= <>
##$TPNAME6= <>
##$TPNAME7= <>
##$TPOAL= (0..7)
0.5 0.5 0.5 0.5 0.5 0.5 0.5 0.5 
##$TPOFFS= (0..7)
0 0 0 0 0 0 0 0 
##$TUNHIN= 0
##$TUNHOUT= 0
##$TUNXOUT= 0
##$USERA1= <user>
##$USERA2= <user>
##$USERA3= <user>
##$USERA4= <user>
##$USERA5= <user>
##$V9= 5
##$VALIST= <valist>
##$VCLIST= <CCCCCCCCCCCCCCC>
##$VD= 0
##$VDLIST= <DDDDDDDDDDDDDDD>
##$VPLIST= <PPPPPPPPPPPPPPP>
##$VTLIST= <TTTTTTTTTTTTTTT>
##$WBST= 1024
##$WBSW= 4
##$XGAIN= (0..3)
0 0 0 0 
##$XL= 0
##$YL= 0
##$YMAX_a= 2632735
##$YMIN_a= -827622
##$ZGOPTNS= <>
##$ZL1= 120
##$ZL2= 120
##$ZL3= 120
##$ZL4= 120
##$ABSF1= 225.2625
##$ABSF2= -14.73494
##$ABSG= 5
##$ABSL= 3
##$ALPHA= 0
##$AQORDER= 0
##$ASSFAC= 0
##$ASSFACI= 0
##$ASSFACX= 0
##$ASSWID= 0
##$AUNMP= <proc_1d>
##$AZFE= 0.1
##$AZFW= 0.5
##$BCFW= 0
##$BC_mod= 2
##$BYTORDP= 0
##$COROFFS= 0
##$CY= -3
##$DATMOD= 1
##$DC= 0
##$DFILT= <>
##$DTYPP= 0
##$F1P= 0
##$F2P= 0
##$FCOR= 0.5
##$FTSIZE= 32768
##$FT_mod= 6
##$GAMMA= 0
##$GB= 0
##$INTBC= 1
##$INTSCL= 4.134877e-10
##$ISEN= 128
##$LB= 1
##$LEV0= 0
##$LPBIN= 0
##$MAXI= 10000
##$MC2= 0
##$MEAN= 0
##$ME_mod= 0
##$MI= 0.1934396
##$NCOEF= 0
##$NC_proc= -3
##$NLEV= 6
##$NOISF1= 120.0001
##$NOISF2= 80.00006
##$NSP= 0
##$NTH_PI= 0
##$NZP= 0
##$OFFSET= 225.2625
##$PC= 1.4
##$PHC0= -373.3702
##$PHC1= 30.60641
##$PH_mod= 1
##$PKNL= yes
##$PPARMOD= 0
##$PSCAL= 0
##$PSIGN= 0
##$REVERSE= no
##$SF= 50.3225993700027
##$SI= 32768
##$SIGF1= 140
##$SIGF2= 120
##$SINO= 11.81781
##$SIOLD= 32768
##$SREGLST= <13C.CDCl3>
##$SSB= 0
##$STSI= 32768
##$STSR= 0
##$SW_p= 12077.2946859903
##$SYMM= 0
##$S_DEV= 0
##$TDeff= 32768
##$TDoff= 0
##$TI= <>
##$TILT= no
##$TM1= 0
##$TM2= 0
##$TOPLEV= 0
##$USERP1= <user>
##$USERP2= <user>
##$USERP3= <user>
##$USERP4= <user>
##$USERP5= <user>
##$WDW= 1
##$XDIM= 32768
##$YMAX_p= 286673612
##$YMIN_p= -10461147
$$ End of Bruker specific parameters
$$ ---------------------------------
##NTUPLES= NMR SPECTRUM
##VAR_NAME=  FREQUENCY,     SPECTRUM/REAL,   SPECTRUM/IMAG
##SYMBOL=    X,             R,               I
##VAR_TYPE=  INDEPENDENT,   DEPENDENT,       DEPENDENT
##VAR_FORM=  AFFN,          ASDF,            ASDF
##VAR_DIM=   32768,         32768,           32768
##UNITS=     HZ,            ARBITRARY UNITS, ARBITRARY UNITS
##FACTOR=    0.368581032318806, 1,           1
##FIRST=     11335.7943870128, 0,            0
##LAST=      -741.500298977453, 0,           0
##MIN=       -741.500298977453, -10461147,   0
##MAX=       11335.7943870128, 286673612,    0
$$ Real data points
##PAGE= N=1
##DATA TABLE= (X++(R..R)), XYDATA
$$ [...]
15440i89119n63202j61775L28220J48794j98152j038944j779433J34551J829660
15431b289400J500617J556315J352295P32498J051129p61074k000371j598906
15423d56897k88348J158342L70609r1841l45963N8471M17293L36923J207458M79608
15413B845655q04886j070512j440378J195258J379708p08860j427704p60840j230597
15404b023156q11627j101378k393999P83285K020632J100276n0881j027092N37215
15395b966725J227951m5451j289861p72582O73327m78714L21041J477553K044849
15386A91388J086989p80138j783794r00058M14444p91609q94176M55728J336285
15377a664941K973540J118698j067459l36732l34473k25542j04222r60623j540434
$$ plain form
15440 -989119 -1552321 -1714096 -1385876 -1237082 -1435234 -2474178 -4253611 -4119060 -2289400
15431 -2289400 -788783 767532 2119827 2852325 3903454 3142380 1142009 -456897
15423 -456897 -745245 413097 783706 691865 345902 404373 821666 1158589 2366047 2845655
15413 2845655 2040769 970257 -470121 725137 2104845 1395985 -31719 -792559 -2023156
15404 -2023156 -2834783 -3936161 -6330160 -5546875 -3526243 -2425967 -2476848 -3503940 -2966725
15395 -2966725 -1738774 -1784225 -3074086 -3846668 -3173341 -3652055 -3331014 -1853461 191388
15386 191388 1278377 498239 -1285555 -2185613 -1771169 -2562778 -3456954 -3001226 -1664941
15377 -1664941 1308599 2427297 1359838 1023106 688633 463091 358869 -601754 -2142188
15368b142188m4354j18872N39529J564618m00862k08928j174072j259661P09155
15359b535635N07747n60222j101392k31677J27305O64897K37187j075837r84888
15350d952515J296007J114017L87045o78860r54471J055665J677566R36934J507214
15341A388602J251556q60466k737193k058959p39317K131692J896215j52478M22471
15332E42123L10163j41928n74657J475554L51606K54172R57417p36719j027243
15323A410488J403354l82756k126366j394741Q90755J501534M09049j852366k098248
15314b239297J74118J079295P45639j64136l52362O67686n6472J171765M12608
15305A438844j585184r50283L91067L28236q4564P2664M26496R06528O53627j4151
$$ plain form
15368 -2142188 -2186542 -2305414 -1765885 -201267 -602129 -811057 -1985129 -3244790 -2535635
15359 -2535635 -2027888 -2588110 -3689502 -3921179 -3793874 -3128977 -2891790 -3967627 -4952515
15350 -4952515 -3656508 -2542491 -2155446 -2834306 -3788777 -2733112 -1055546 -118612 1388602
15341 1388602 2640158 1779692 -957501 -3016460 -3755777 -1624085 272130 119652 542123
15332 542123 852286 710358 135701 1611255 1962861 2217033 3174450 2437731 1410488
15323 1410488 2813842 2431086 304720 -1090021 -199266 1302268 1711317 -141049 -2239297
15314 -2239297 -2065179 -985884 -240245 -404381 -756743 -89057 -145529 1026236 1438844
15305 1438844 -146340 -1096623 -705556 -377320 -461884 -389220 37276 943804 1597431 1583280
15295A583280j799974j482562R10924J501607n33712j277597j481756l34206J803222
15286a110774K806267j91280k552323j816456J611588K026452r44081j601249
15278a771856J378467M19828r30568L289164K898448r69857k455912l070179j161361
15269b373826O28505J979701J914718J035047N64059k21465j782597j207455M58835
15260I95522q61775k746962j265296N43849J912235L598816J835931j439112q96194
15251A677014q26548k019839j101795R25830J636074J719692K18047K2007j01603
15242B148879M18888j75254j467595J235359J114053J08417P38429O57796n77515
15233D201457K37587q1682k73772k939751l682888j115959l85925r08258L63220
$$ plain form
15295 1583280 -216694 -1699256 -788332 713275 179563 -1098034 -2579790 -2913996 -1110774
15286 -1110774 1695493 1504213 -1048110 -2864566 -1252978 773474 -170607 -1771856
15278 -1771856 -393389 26439 -904129 2385035 5283483 4313626 1857714 -1212465 -2373826
15269 -2373826 -1745321 234380 2149098 3184145 3748204 3526739 1744142 536687 995522
15260 995522 133747 -2613215 -3878511 -3334662 -1422427 2176389 4012320 2573208 1677014
15251 1677014 850466 -1169373 -2271168 -1345338 290736 2010428 2228475 2250482 2148879
15242 2148879 2567767 2392513 924918 2160277 3274330 3382747 4121176 4778972 4201457
15233 4201457 4439044 4357362 4083590 1143839 -2539049 -3655008 -4040933 -4949191 -4585971
15224d585971Q44024J802106J033215J10068N8968j813131M26335O01813p37611
15215b260184k46822J93026L94823R90762O61831l82276n72857K04130l98949
15206a416516m426K90926r42223j5858l72852L54095K371289L156083Q94983K55154
15196D570655Q13259k91491k107058j859242q97071r29864j798398j682831J326179
15187b855862K341208j98594J02235Q39921K301514K144165J63122o52489q34218
15178C351002p03398j337064j053274j987842j578295p52557J86904j299164j866526
15169g040214j383417l65067J007102J369914K05446J128898J680867L90528j8520
15160c024463m68681j349925O4042J915553K263806J013449q3761j251268k810907
$$ plain form
15224 -4585971 -3741947 -1939841 -906626 -796558 -737590 -2550721 -2124386 -1522573 -2260184
15215 -2260184 -2507006 -2313980 -1919157 -928395 -266564 -648840 -1221697 -1017567 -1416516
15206 -1416516 -1420942 -1130016 -2072239 -2088097 -2460949 -2106854 264435 3420518 4315501 4570655
15196 4570655 5383914 5092423 2985365 1126123 229052 -700812 -2499210 -4182041 -2855862
15187 -2855862 -514654 -713248 -611013 228908 2530422 4674587 4837709 4185220 3351002
15178 3351002 2647604 1310540 257266 -1730576 -3308871 -4061428 -3874524 -5173688 -7040214
15169 -7040214 -8423631 -8788698 -7781596 -6411682 -6206236 -5077338 -3396471 -3005943 -3024463
15160 -3024463 -3493144 -4843069 -4779027 -2863474 -599668 413781 330020 -921248 -3732155
15151c732155r15706K076844K934565J421234k86234K81611j999915r54071J966958
15142G93131K059612o51225k950344p44182R24773K34738J168419L133041J654991
15133E622954K82048j296759k098876j436591q24237r27316M1619m35249r88229
15124b060636j8473O20977J910840K112816q4090k65923j358625r49949K30897
15115A37834l16736j125207k60963o59422p95876J905655R85580R21115q84228
15106i2248j511018J092536J128747l47982j928733O70447K273685P38568j040361
15097I83641l64556O2703j261834j261294R04510q3102j020276J87840K002453
15088A50085L127729k2613j663909j687838p79531j33515r76439n52883L46799
$$ plain form
15151 -3732155 -4647861 -2571017 363548 1784782 1498548 1780159 -219756 -1173827 793131
15142 793131 2852743 2201518 -748826 -1493008 -568235 -333497 834922 3967963 5622954
15133 5622954 5905002 4608243 2509367 1072776 248539 -678777 -637158 -1072407 -2060636
15124 -2060636 -2079109 -1458132 452708 2565524 2481434 2215511 856886 -93063 137834
15115 137834 -178902 -1304109 -1565072 -2224494 -3020370 -1114715 -129135 791980 -92248
15106 -92248 -1603266 -510730 618017 270035 -1658698 -988251 1285434 2024002 983641
15097 983641 619085 681788 -580046 -1841340 -936830 -1019932 -2040208 -1852368 150085
15088 150085 3277814 3255201 1591292 -96546 -876077 -1009592 -1986031 -2538914 -2192115
15079b192115P6430r63533q3311n8078j80021n23102k77571J778986J145942K43691
15069a032682R64042m23135L02975O33239N62415J111055j95677j259550j506608
15060h43926o0492J463412P87398q18004j121630j243827j161421o33304J680208
15051a951586J579432J174653R04791q82410o99382j327785L54725J566484q48535
15042a29613m53741J29569J125231N91636q87115k485885j395411R1544J420165
15033a993620R43511p65433J741346J837937j20630J526418J381025m4021L39593
15024D846126J013967o38056l797382l209375j958018j424141J93816P22500J435747
15015b814816M373953L694501j72557q36731j21270L05006o79554R9820k28013
$$ plain form
15079 -2192115 -2115685 -3079218 -3162529 -3220607 -3400628 -3923730 -4201301 -2422315 -1276373 -1032682
15069 -1032682 -68640 -491775 -188800 444439 1006854 2117909 1922232 662682 -843926
15060 -843926 -904418 558994 1346392 528388 -593242 -1837069 -2998490 -3631794 -1951586
15051 -1951586 -372154 802499 1707290 824880 125498 -1202287 -847562 718922 -129613
15042 -129613 -583354 -453785 671446 1263082 375967 -2109918 -3505329 -3413785 -1993620
15033 -1993620 -1050109 -1815542 -74196 1763741 1643111 3169529 4550554 4506533 4846126
15024 4846126 5860093 5222037 1424655 -1784720 -3742738 -5166879 -4973063 -4250563 -2814816
15015 -2814816 1559137 5253638 5081081 4244350 4123080 4428086 3748532 3848352 3620339
15006C620339k449386l411398k137802N84389J472265Q16243m46305j263320k43388
14997c458363K180766j1629o61285l32127L56405P59140r1744j331614q4856P93359
14987a881948K167856K730609o79948o15993m25665j652185l208588L00372K890440
14978c75050J867751J361048r6660P08002J301244O3251p01243O67585r71490
14969C824438k902662q34482J760771k45427j186521l32832J29548L181290K339402
14960E733525k74165r21596j095903j862360k512458n89339j14973m43667Q07218
14951a273718P91111r30200j463727o0675O35158K464108J036315j16975J22313
14942A203710l2847r57249j411436r86581j293407J454932J028930L89636R61769
$$ plain form
15006 3620339 1170953 -2240445 -4378247 -3793858 -2321593 -1505350 -1951655 -3214975 -3458363
14997 -3458363 -1277597 -1289226 -1950511 -2282638 -1926233 -1167093 -1258837 -2590451 -2675307 -1881948
14987 -1881948 285908 3016517 2336569 1720576 1294911 -357274 -3565862 -3265490 -375050
14978 -375050 1492701 2853749 2757089 3465091 4766335 4829586 4128343 4795928 3824438
14969 3824438 921776 87294 1848065 1602638 416117 83285 212833 3394123 5733525
14960 5733525 5459360 4537764 3441861 1579501 -932957 -1522296 -1637269 -2080936 -1273718
14951 -1273718 -482607 -1412807 -2876534 -2937209 -2302051 162057 1198372 1081397 1203710
14942 1203710 1170863 213614 -1197822 -2184403 -3477810 -2022878 -993948 -604312 357457
14933C57457J033180J219816R18758J630999L68053r54092k43745J242502Q46896
14924F419824j387089p47092L66095j153219j086101K64005k404401j189206J110444
14915A93260J269060J079283O279l80580R89396O41746j087740l473568l617166
14906d380030o83947J348584K952545J065462j653874k160128o6092K78865k65880
14897c564495L7077J026485J744947N30365L37367J671201N28226k270781j247165
14888a206773K26377R14441J549484P94267J037622n71373j456931j060451K40643
14879D67306R18045q92393m72974O89465j736347k585184j61613O23912L6373
14870c113410k03798J500530O87811L61592J273281J477049J017404l23367o83263
$$ plain form
14933 357457 1390637 2610453 3529211 5160210 5528263 4574171 4330426 5572928 6419824
14924 6419824 5032735 4285643 4651738 3498519 2412418 2676423 272022 -917184 193260
14915 193260 1462320 2541603 2547882 2167302 3156698 3798444 2710704 -762864 -4380030
14906 -4380030 -5063977 -3715393 -762848 302614 -1351260 -3511388 -3577480 -3298615 -3564495
14897 -3564495 -3527418 -2500933 -755986 -225621 111746 1782947 2311173 40392 -1206773
14888 -1206773 -980396 -65955 1483529 2277796 3315418 2744045 1287114 226663 467306
14879 467306 1385351 492958 19984 709449 -1026898 -3612082 -3773695 -3149783 -3113410
14870 -3113410 -3317208 -1816678 -1128867 -767275 506006 1983055 3000459 2677092 1993829
14861A993829q87146N14988j059321j846901P25016p13713K33095K675581L93005
14852B028433r84994p55770m18022k506653l269486j939113j31168K424609K218343
14843c333821N59220K89566j22084J254782J175407R45771O73368r18025N29052
14834A053236J917250L92563r41440j431613o59095J243313P15557k18659p98073
14825A273039m24584J118046k120777k631281N75412k2078L94382J4006r13629
14816b737464k33401P15229j7683j084819n17441q10731j582740m64370J641845
14807e091575k60191Q27735J757207J035363K082217J560101k172684k968503
14799c230330l228395k417553J413634K217070Q38852J075534p32604k238150
$$ plain form
14861 1993829 1106683 1621671 562350 -1284551 -559535 -1273248 -1040153 1635428 2028433
14852 2028433 1043439 287669 -130353 -2637006 -5906492 -7845605 -7976773 -5552164 -3333821
14843 -3333821 -2774601 -2485035 -2607119 -1352337 -176930 768841 1442209 524184 1053236
14834 1053236 2970486 3363049 2421609 989996 330901 1574214 2289771 2071112 1273039
14825 1273039 848455 1966501 -154276 -2785557 -2210145 -2232223 -1837841 -1823835 -2737464
14816 -2737464 -2970865 -2255636 -2273319 -3358138 -3875579 -4686310 -6269050 -6733420 -5091575
14807 -5091575 -5351766 -4524031 -2766824 -1731461 350756 1910857 -261827 -3230330
14799 -3230330 -6458725 -8876278 -7462644 -5245574 -4406722 -3331188 -4063792 -6301942
14791f301942J112467J973729J334057k33402j479801o81231N09514J056138P30942
14782a979529J482795M02349n76867J093767J300334N4770o98194j051711M14928
14773D42642k01612m71797j145592j950325k061906j471984R46501L161372J755691
14764i97010k81970R58135j12283j483666o92917J05484J28877o11160j351645
14755d338155n21827J695735K990688J855581J121639J145356J931177Q02389
14747F682583j490450l203599k886909p31586J029538k20292k375829O88759K588745
14738H0960J181641l5114K69019o67330j45482R43362o74846o42495j213746j846811
14728b750842p19160M57880J109088J636208K345348J424214Q60777K29654k262125
$$ plain form
14791 -6301942 -5189475 -3215746 -1881689 -2115091 -3594892 -4276123 -3766609 -2710471 -1979529
14782 -1979529 -496734 -94385 -671252 422515 1722849 1777619 1079425 27714 442642
14773 442642 241030 -230767 -1376359 -3326684 -5388590 -6860574 -5914073 -2752701 -997010
14764 -997010 -1278980 -320845 -433128 -1916794 -2609711 -2504227 -2375350 -2986510 -4338155
14755 -4338155 -4859982 -3164247 -173559 1682022 2803661 3949017 5880194 6682583
14747 6682583 5192133 1988534 -898375 -1629961 -600423 -820715 -3196544 -2507785 80960
14738 80960 1262601 1227487 1496506 829176 683694 1627056 952210 309715 -904031 -2750842
14728 -2750842 -3470002 -3012122 -1903034 -266826 2078522 3502736 4363513 4593167 2331042
14719B331042k760922j342622o82146o30642P04327J127300N29159Q70000O97962
14710H43458L87155j90517k203327j127294J948759J10129L90093O5884j213116
14701i88776Q41071q65444j45153P02789J088879J235509m21440j380202J312758
14692A379991K984659J242985j765569k504424l255926k606850j673801L63110
14684e835825K606239J988165K64812J38849L60942j891107j991769J84079M39690
14675c735925m67206J687052K228694l51414k137483M88342K673170K18012Q9769
14666F93011K90177L9991J065172L75113k8051o32884k422424j430321N6852J041979
14656i51385J910206M75597o44684j922705o79827l5824R31606j16707k536864
$$ plain form
14719 2331042 -429880 -1772502 -2454648 -3085290 -2380963 -1253663 -724504 145496 843458
14710 843458 1230613 1040096 -1163231 -2290525 -341766 -231637 158456 224340 -988776
14701 -988776 -147705 -1013149 -1158302 -455513 633366 1868875 1447435 67233 1379991
14692 1379991 4364650 5607635 3842066 1337642 -1918284 -4525134 -6198935 -5835825
14684 -5835825 -3229586 -1241421 -976609 -837760 -476818 -2367925 -4359694 -4175615 -3735925
14675 -3735925 -4203131 -2516079 -287385 -638799 -2776282 -2287940 385230 603242 693011
14666 693011 983188 1023179 2088351 2463464 2435413 1802529 -619895 -2050216 -1993364 -951385
14656 -951385 958821 1434418 789734 -1132971 -1812798 -1848622 -917016 -1033723 -3570587
14647c570587r39568K217962j050321l224111o77864j146617K6894J955471L270173
14638c138568J817645m29496J887703L55200j028541m31842q19655J230847K464493
14629A907786M19000l618324k163258R24311K393124K695438J789325J46404j874810
14620B618996l192286P39412K222452P54655Q01712Q43546j556553n10599q36358
14611A884977j566670o24161j878618j448641J04944j57522J323647L416616K056931
14602C111503J060331J947150L9959j728118n36047q16674o78702q30745K51963
14593A820620J283908O17896L74574l30717K97121K299453K34014k679449j743257
14584B174163N8478J649078r1745j468794n72656N31083K944766M28460j628355
$$ plain form
14647 -3570587 -4510155 -2292193 -3342514 -6566625 -7244489 -8391106 -8364212 -6408741 -3138568
14638 -3138568 -1320923 -1750419 137284 492484 -536057 -967899 -1787554 -556707 1907786
14629 1907786 2326786 -1291538 -3454796 -2530485 -137361 2558077 4347402 4493806 2618996
14620 2618996 -573290 166122 2388574 3143229 3944941 4788487 3231934 2721335 1884977
14611 1884977 318307 -305854 -2184472 -3633113 -3528169 -3685691 -2362044 1054572 3111503
14602 3111503 4171834 6118984 6158943 4430825 3894778 3078104 2399402 1568657 1820620
14593 1820620 3104528 3722424 4096998 3766281 4063402 6362855 6596869 3917420 2174163
14584 2174163 2232641 3881719 3789974 2321180 1748524 2279607 5224373 5652833 4024478
14575D024478j559974l273444j732693K255328K970981J449023J491283Q77355
14567F502337j242544k987127j764928l70073j036017K80297L95347l04449k83412
14558h10569k113919j653241m02532N09870R2047R04536P05811K830292L177318
14549C239613J466152k070645k556085o35166r48062j026836O87101J217762j046054
14540a672220r47196k75147R21093O18887K686048K453534j42217q42391j677314
14531A123077k329075q31361n32324R3385l49513O12916k59623j120655j88996
14522c782169O06426K463423J891584q07264o86392j636571m45789J626908J056884
14513B87040O46119k07782o66591o92602J82420m63240j732046k13112J660739
$$ plain form
14575 4024478 2464504 -808940 -2541633 -286305 2684676 4133699 5624982 6502337
14567 6502337 5259793 2272666 507738 137665 -898352 -618055 -222708 -527157 -810569
14558 -810569 -2924488 -4577729 -4980261 -4470391 -4378344 -3473808 -2767997 62295 3239613
14549 3239613 4705765 2635120 79035 -556131 -1504193 -2531029 -1843928 -626166 -1672220
14540 -1672220 -2619416 -2894563 -1973470 -1354583 1331465 3784999 3642782 2800391 1123077
14531 1123077 -1205998 -2037359 -2569683 -2476298 -2825811 -2212895 -2472518 -3593173 -3782169
14522 -3782169 -3175743 -712320 1179264 372000 -314392 -1950963 -2396752 -769844 287040
14513 287040 933159 725377 58786 -633816 -451396 -914636 -2646682 -2859794 -1199055
14504a199055J131477K5052L21263K95010j563982n14669K80215n62805J85244
14495a602250J622107n28722k671974r40246J240401K381466K549202K399127
14487D449111j438406k871486r72042j248714J18711J771920j053231j017060
14479b261197R08415N37487j490460j583730k07310o24102m93485J264745K295195
14470a654442n29256J206217J235786N74884R21395P37572k54331j106535j639590
14461e08300k992277r30963M81326J202605J930515J203386K17688j366857j516438
14452b279315k300427j212455n82532K2364Q47823Q99852J618819q4704k06409
14443c276984j21902J950602K635508K549740J728090p18869k321370k380051
$$ plain form
14504 -1199055 -67578 -42526 278737 573747 -990235 -1504904 -1224689 -1787494 -1602250
14495 -1602250 19857 -508865 -3180839 -4121085 -2880684 -499218 2049984 4449111
14487 4449111 3010705 139219 -832823 -2081537 -1962826 -190906 -1244137 -2261197
14479 -2261197 -1352782 -815295 -2305755 -3889485 -4096795 -4720897 -5214382 -3949637 -1654442
14470 -1654442 -2183698 -977481 258305 833189 1754584 2492156 2237825 1131290 -508300
14461 -508300 -3500577 -4431540 -3950214 -2747609 -817094 386292 603980 -762877 -2279315
14452 -2279315 -4579742 -5792197 -6374729 -6352365 -5504542 -4604690 -2985871 -3070575 -3276984
14443 -3276984 -3398886 -1448284 1187224 3736964 5465054 4746185 2424815 44764
14435D4764j309872j207621k94176k5039j507109k96192m3072j83268l05854P48807
14425d378632N19366m6428q05n40865Q80087J283179J19156j140376n64658j019725
14415d889701j598902N28543J028990J271358K464246J784743P92111k062223
14407f80835j487955Q36004R69902k6492K92132j26567n60449l55334j996517
14398c136111m81267N38780P04676J076284j468330j077604J043939M21429J257281
14389a120923J101938L65761j714770j34652J236977J035203p72840q95940P6963
14380h22283O56381l6892j69126R58296J370240J650986j04424k625421k99521
14371E78236N73196k091353l804371j748778R68700K537934m94670k6469L445773
$$ plain form
14435 44764 -1265108 -2472729 -2766905 -2791944 -4299053 -4595245 -4638317 -4821585 -5127439 -4378632
14425 -4378632 -3859266 -3905694 -3906499 -4447364 -3567277 -2284098 -2164942 -3305318 -3869976 -4889701
14415 -4889701 -6488603 -5960060 -4931070 -3659712 -1195466 589277 1381388 -680835
14407 -680835 -2168790 -1332786 -362884 -389376 -97244 -223811 -784260 -1139594 -3136111
14398 -3136111 -3617378 -3078598 -2373922 -1297638 -2765968 -3843572 -2799633 -2378204 -1120923
14389 -1120923 -18985 346776 -1367994 -1502646 -265669 769534 -3306 -899246 -822283
14380 -822283 -165902 -202794 -371920 586376 1956616 3607602 3503178 877757 578236
14371 578236 1151432 -939921 -4744292 -6493070 -5524370 -2986436 -3481106 -3507575 -61802
14362f1802K573489j131634k982168l40152J936909J089579m93644j480935M77962
14353d12396K289124J503169J92552q68747j900482r87680R18423J893252R0939
14344B718154j993993q53756J851483J773209k070036j952200n56854l90079J256909
14335b17163J695191L33459j423122l946680j170234K624136K624956J223487
14327A744030M21285j036308k168791j258712R31390Q89459J566883K093878J495776
14318D678890p78261k344519k356718j34969P00945J388231Q21555Q8956N93441
14309B657551K64805k180419j234942j98529j576188k185862O0495J765664J918562
14300g08863J011192j355821k161001j567076l54930R01978K97548n33082Q10882
$$ plain form
14362 -61802 2511687 1380053 -1602115 -1942267 -5358 1084221 590577 -890358 -412396
14353 -412396 1876728 3379897 3572449 2703702 803220 -184460 733963 2627215 2718154
14344 2718154 724161 -129595 1721888 3495097 1425061 -527139 -1083993 -1474072 -217163
14335 -217163 1478028 1811487 388365 -3558315 -4728549 -2104413 520543 1744030
14327 1744030 2165315 1129007 -1039784 -2298496 -1367106 -477647 1089236 3183114 4678890
14318 4678890 3900629 1556110 -800608 -935577 -234632 1153599 1975154 2064110 2657551
14309 2657551 2922356 741937 -493005 -691534 -2267722 -4453584 -4393089 -2627425 -708863
14300 -708863 302329 -1053492 -3214493 -4781569 -5136499 -4234521 -3936973 -4470055 -3659173
14291c659173L28531M14463J601708M57649O34982K204707l9499k91240O51128
14282B303256L0880j334588j664503J94058k69562m42829K045537J908519R3737
14273B864505r89068j066824j69885k494337j230889L24615r86841O66275K415236
14264f67213J879763L24370m943Q47570J827559j385624k888942j606559o38226
14255b312245J029366J881873K58335n80814J204895N28131l98357k60691k506681
14246a156188l249916j39456J134951r65254n35560K023017J115015K491224L676863
14237D394696K97547l468531j257705J103699R30394j970072j962365o29936n89572
14228c151845j265158o43219J311043J993197N76441r47458j807447m52795J161138
$$ plain form
14291 -3659173 -3330642 -2916179 -1314471 -856822 -221840 1982867 1943368 1652128 2303256
14282 2303256 2334136 999548 -664955 -470897 -740459 -1183288 862249 2770768 2864505
14273 2864505 1875437 808613 638728 -1855609 -3086498 -2761883 -3748724 -3082449 -667213
14264 -667213 1212550 1536920 1531977 2379547 4207106 2821482 -67460 -1674019 -2312245
14255 -2312245 -1282879 598994 857329 276515 1481410 2009541 1611184 1350493 -1156188
14246 -1156188 -4406104 -4545560 -3410609 -4375863 -4911423 -2888406 -1773391 717833 4394696
14237 4394696 4692243 1223712 -33993 1069706 2000100 30028 -1932337 -2562273 -3151845
14228 -3151845 -4417003 -5060222 -3749179 -1755982 -1179541 -2126999 -3934446 -4387241 -3226103
14219c226103J116257J196364J065223P46486R58331J279906P31884j028975j379949
14210A459424o4925k304772k789420J023008L042301P49906Q68046P34250M58041
14201C175859l96231j050185K41243k043372j976362m65138O33459K99302q43170
14192b424595j294258p9481O77562J080094Q54028J328840K089141J732051l47700
14183C615682j547863k372426j520476j479528j90565K062870J077959J822147
14175A467800K92191k220266j369933j083994j33725J359845m15644q51510j192075
14166d147311j388002M92186Q47706Q59536K547490M768529J68809l347389k829524
14157b027970j261581J788713J340500N74522J150642J734510j391701j911889
$$ plain form
14219 -3226103 -2109846 -913482 151741 898227 1856558 3136464 3868348 2839373 1459424
14210 1459424 1394499 -910273 -3699693 -2676685 365616 1115522 1983568 2717818 3175859
14201 3175859 2779628 1729443 1970686 -72686 -2049048 -2514186 -1880727 -1581425 -2424595
14192 -2424595 -3718853 -3798334 -3120772 -2040678 -1186650 142190 2231331 3963382 3615682
14183 3615682 2067819 -304607 -1825083 -3304611 -3495176 -1432306 -354347 1467800
14175 1467800 1759991 -460275 -1830208 -2914202 -3047927 -1688082 -2103726 -2955236 -4147311
14166 -4147311 -5535313 -5043127 -4195421 -3335885 -788395 3980134 4148943 801554 -2027970
14157 -2027970 -3289551 -1500838 -160338 414184 1564826 3299336 1907635 -4254
14149d254j88925J094812N42088K82477o66854R49265O30339J27796j710044k086843
14139a030143k440585o31357J068994J148801J247647j081545j573846O0941K963068
14130b68025L792351j40176k524419k97884J219009n51n56101j620013M37504
14121D1695J330646o87537k395660j023099l12035j270673m5854J423457R82920
14112a956140O25392L07007l72639j066137j96893R04965J326519J821777N40665
14103A934516K12706J45209J515346j51997k542934r55108k69147j579002j962009
14094c652420p8600n9107n24773l68425L35096K716388m40419q41552j48841j363430
14084d426083q09357J468442K444968K273575K74966j567703m93435M98192k44357
$$ plain form
14149 -4254 -193179 901633 1443721 1726198 1059344 2008609 2638948 2766744 1056700 -1030143
14139 -1030143 -3470728 -4102085 -3033091 -1884290 -636643 -1718188 -3292034 -3231093 -268025
14130 -268025 3524326 3384150 859731 561847 1780856 1780305 1224204 -395809 41695
14121 41695 1372341 684804 -1710856 -2733955 -3045990 -4316663 -4362517 -2939060 -1956140
14112 -1956140 -1330748 -1023741 -1396380 -2462517 -2659410 -1754445 -427926 1393851 1934516
14103 1934516 2147222 2292431 3807777 3655780 1112846 157738 -111409 -1690411 -3652420
14094 -3652420 -3731020 -3790127 -4314900 -4683325 -4348229 -1631841 -2072260 -2913812 -3062653 -4426083
14084 -4426083 -5235440 -3766998 -1322030 951545 1226511 -341192 -834627 -336435 -580792
14075e80792l68041R01153N45797k25588p42120j137740k131054m00204J602563
14066b536026J612699m7466j062363n648M52898r94561Q7228r3659o45164J440595
14056a791467J719725p78057j296579N89940J627839J248984J04259M77921j059564
14047H43001j772207n43211L54183r59699o55260j518939k519943n29165J903532
14038e397708K645657L004783J695527J368548J335809j82912j243139k47961
14030B978604j866462k076180m33071J200809J632785o59671j229956N57624j744937
14021a640455k240264J53330J814898P32480J010707q43417j358927L32232R15462
14012a123954L36959j30263N72814R05374J085826L15157o55432o34794j701617
$$ plain form
14075 -580792 -948833 -47680 498117 272529 -469591 -1607331 -3738385 -4138589 -2536026
14066 -2536026 -923327 -970793 -2033156 -2038804 -1585906 -2580467 -2493239 -2586898 -3232062 -1791467
14056 -1791467 -71742 -849799 -2146378 -1556438 71401 1320385 1424644 1902565 843001
14047 843001 -929206 -1472417 -1118234 -2077933 -2733193 -4252132 -6772075 -7301240 -5397708
14038 -5397708 -2752051 252732 1948259 3316807 4652616 4469704 3226565 2978604
14030 2978604 1112142 -964038 -1397109 -196300 1436485 776814 -453142 104482 -1640455
14021 -1640455 -3880719 -3727389 -1912491 -1180011 -169304 -1012721 -2371648 -2039416 -1123954
14012 -1123954 -786995 -917258 -344444 560930 1646756 1961913 1306481 671687 -1029930
14003a029930q53529P35920J445426J334656j231931j226656J432110K250051
13995B856117l90578j137741k26561p19054j460395j32370L34869M89975j879115
13986b264853o92434m79370k08988q94559N07751K917429P70050j74096M38958
13977h0112q6550M11458K76263O88255O27877j330543k847729O62609J964581
13968B86109L41390Q13049J022923J120526O57055l19219p26743j050514j754064
13959C90512j180580J723720K579144K958158K35799o66602j634822j503212r82016
13950A920101j405982j129575L30292O24962j187175o61535L94174P00736p06824
13941a120826N91765L52294J132045K375457j67595k422672j041163l43197o7975
$$ plain form
14003 -1029930 -1883459 -1147539 297887 1632543 400612 -826044 606066 2856117
13995 2856117 2465539 1327798 1101237 382183 -1078212 -1210582 -875713 -385738 -2264853
13986 -2264853 -2957287 -3436657 -3645645 -4540204 -4032453 -1115024 -344974 -519070 -80112
13977 -80112 -166662 244796 521059 1209314 1837191 506648 -2341081 -1678472 286109
13968 286109 627499 1440548 2463471 3583997 4241052 3921833 3195090 2144576 390512
13959 390512 -790068 933652 3512796 6470954 6706753 6040151 4405329 2902117 1920101
13950 1920101 514119 -615456 -285164 339798 -847377 -1508912 -1114738 -414002 -1120826
13941 -1120826 -529061 -176767 955278 3330735 3163140 740468 -300695 -643892 -711867
13932g11867J9346L06503J616269J516218p00629n63929J143517J460079M51627
13923D537134j711832m92376n04133j236792n89552p39198p2875q59784j023375
13914b692783n78905o76100p56928l00021q86443J51736J035532l59882J65943
13905d897851P38383P53428R12666J025065j771706N59024K048459J14455l05785
13896h23862j302218l03579J493952K684666K144101N53459p99745p63270m15878
13887B467626J55289K313683M96417k504721j655187P16828N92845J475830K478494
13878F537104O16094k411441m693647k580704Q72586K091816L89672k901703j711429
13869c791652L930562M257802R98975j125307j724125j674548J008346J664130
$$ plain form
13932 -711867 -692521 -386018 1230251 2746469 2045840 1481911 2625428 4085507 4537134
13923 4537134 2825302 2332926 1828793 592001 2449 -736749 -809624 -1669408 -2692783
13914 -2692783 -3271688 -3947788 -4704716 -5004737 -5891180 -5739444 -4703912 -5063794 -4897851
13905 -4897851 -4159468 -3406040 -2493374 -1468309 -3240015 -2680991 -632532 -518077 -823862
13896 -823862 -2126080 -2429659 -935707 1748959 3893060 4446519 3646774 2883504 2467626
13887 2467626 2622915 4936598 5433015 2928294 1273107 1989935 2582780 4058610 6537104
13878 6537104 7153198 4741757 48110 -2532594 -1660008 431808 821480 -2080223 -3791652
13869 -3791652 138910 4396712 5395687 4270380 2546255 871707 1880053 3544183
13861C544183p02386k086898j202172K8085L66776k28127j117018m49333j227951
13852c074841j447048K074313L405297J543164k67663n19561p78406K037408K388527
13843E361190j477296j765797k42587l98727j64840L98332k88478k03147o82407
13834E36243l94303k110888n01849K161204J393710j698825k170969J173749J317075
13825b94853j825981l314638l67432J472128J506572J513874J327298L7334j622212
13816a567910k409887j563051j736961J66899J658677J211953J04364r7020J570978
13807b661958K363901q71981j076987p40656j973483p40798q6055L52588M44818
13798d990611K19204j478318M46551M30761j496557n28503J344115K113296J020834
$$ plain form
13861 3544183 2841797 754899 -447273 -419188 -52412 -280539 -1397557 -1846890 -3074841
13852 -3074841 -4521889 -2447576 957721 2500885 2233222 1713661 935255 2972663 5361190
13843 5361190 3883894 2118097 1875510 1476783 1311943 1710275 1421797 1218650 536243
13834 536243 141940 -1968948 -2470797 -309593 1084117 -614708 -2785677 -1611928 -294853
13825 -294853 -2120834 -5435472 -5802904 -4330776 -2824204 -1310330 16968 54302 -1567910
13816 -1567910 -3977797 -5540848 -7277809 -7110910 -5452233 -4240280 -4135916 -4232936 -2661958
13807 -2661958 -298057 -1170038 -2247025 -2987681 -4961164 -5701962 -5788017 -5435429 -4990611
13798 -4990611 -4771407 -6249725 -5803174 -5372413 -6868970 -7397473 -6053358 -3940062 -2919228
13789b919228l46295J111760L53212q65630K37542R00308J258039J335141j196140
13780a31291k370559j95325J003431J88306K077518L326960K456289P20563j634678
13771E441214p41174j830043j308740k33943j503033j107917M86406J045865n06593
13762b57958o22237o91938k655594j779918j23949J065777J189461K234421J964930
13753C22995K252146R37694m47087n25804j439908k573060K37711J230336j538067
13744a543044K12010J602911J815027J364138L95637l59029j277134k20555O32321
13735B622282P9295j62823n12067j22939k44639j341206r84564j916243j891115
13726d474019r58763K966840K356263J460709J699886k97045j677195k230557
$$ plain form
13789 -2919228 -3265523 -2153763 -1800551 -2666181 -2428639 -1528331 -270292 1064849 -131291
13780 -131291 -2501850 -2697175 -1693744 -1505438 572080 3899040 6355329 7075892 5441214
13771 5441214 4700040 2869997 1561257 1327314 -175719 -1283636 -797230 248635 -257958
13762 -257958 -880195 -1572133 -4227727 -6007645 -6131594 -5065817 -3876356 -1641935 322995
13753 322995 2575141 3512835 3065748 2539944 1100036 -1473024 -1235313 -4977 -1543044
13744 -1543044 -1331034 271877 2086904 3451042 3846679 3487650 2210516 1989961 2622282
13735 2622282 2701577 2538754 2026687 1903748 1659109 317903 -666661 -2582904 -4474019
13726 -4474019 -5432782 -2465942 -109679 1351030 3050916 2753871 1076676 -1153881
13718a153881j428534k81822J008565M67908o38125M06204K190665N95966j580180
13709d13234k069636p18529K23791J570956J453328l76968l43495l17220j629367
13700b620374K39301J116111J130258J330767j254908j121235K76615J615541
13692G12076l67400j454649j319395j471548o196J237856m181m82419J334593
13683a821263P46515m04738k997890j904369l78526N68031J911772K225589K287219
13674B32340J165100R21669J255671J85104k085274k501838j035087K50592J88338
13665a423385L08480J223829J844341J92136j854562j134586L04577K302494K111163
13656C874487P79014k75215P04855n00923K7681M82294j892469k802003k047615
$$ plain form
13718 -1153881 -2582415 -2864237 -1855672 -1387764 -2025889 -1619685 570980 1166946 -413234
13709 -413234 -2482870 -3201399 -2977608 -1406652 46676 -330292 -673787 -991007 -2620374
13700 -2620374 -2381073 -1264962 -134704 1196063 -58845 -1180080 -903465 712076
13692 712076 344676 -1109973 -2429368 -3900916 -3907112 -2669256 -2673437 -3155856 -1821263
13683 -1821263 -1074748 -1479486 -4477376 -6381745 -6760271 -6192240 -4280468 -2054879 232340
13674 232340 1397440 2319109 3574780 3759884 1674610 -827228 -1862315 -1611723 -1423385
13665 -1423385 -1114905 108924 1953265 2145401 290839 -843747 -539170 1763324 3874487
13656 3874487 4653501 4378286 5083141 4582218 4609899 5092193 3199724 397721 -1649894
13647a649894r6973P09339q46633L38499J128440n80718n6952K22390k73896Q9342
13637a017056K73429J75396J428851J558968o1504j496336L17910K254336o50195
13628B783799r36597l17733j91268L36784J97941p30958J200485L665824K496714
13619H504991J88718k56618k06846k318938l821909k726653k567486j413830J928959
13610b689612K15065k423096L3422K295312M5008R03310K066058J434219j154197
13601G25489k997908j278276L39554k95201j15594m63340L8591P54081j445478
13592d738082j31361J105936R34695J257311L55080M76509L9019M33156j296928
13583a564665j093949J063340M4300k50154K295567J647369r49994m89859J479778
$$ plain form
13647 -1649894 -1746867 -1037528 -1884161 -1545662 -417222 -997940 -1054892 -832502 -1106398 -1017056
13637 -1017056 -743627 -568231 860620 2419588 2358084 861748 1179658 3433994 2783799
13628 2783799 1847202 1529469 1338201 1674985 1872926 1141968 2342453 6008277 8504991
13619 8504991 8693709 8437091 8230245 5911307 2089398 -637255 -3204741 -4618571 -2689612
13610 -2689612 -2474547 -4897643 -4864221 -2568909 -2523901 -1620591 445467 1879686 725489
13601 725489 -2272419 -3550695 -3211141 -3506342 -3621936 -4085276 -4046685 -3292604 -4738082
13592 -4738082 -4869443 -3763507 -2828812 -1571501 -1216421 -739912 -700893 -267737 -1564665
13583 -1564665 -2658614 -1595274 -1550974 -1801128 494439 2141808 1191814 701955 2181733
13574B181733K363312O13612j533267k810740j330691K63962J377978J780333
13566B906232m66933k909803j526431o55703J51510J311329J086619J276349M68412
13557A641581o02176J214034J097797P9876j048365j765708L95997J842796j49586
13548B706246j617164j735915n61510J187654K132339J496595J812226L11985
13540E732456n88730R74961r2386l51742n75565j289777j047368J473070J644890
13531E879809l35111j142445r97438p79606j953495k437066j138068k92039O62770
13522b532689L385968J437983j411135j954293k20489J76718q31895q28469J323139
13513a455162R8687j788563q6906J307428J257401K022531K565892R66269p8427
$$ plain form
13574 2181733 4545045 5158657 3625390 814650 -516041 -252079 1125899 2906232
13566 2906232 2439299 -470504 -1996935 -2652638 -2501128 -1189799 -103180 1173169 1641581
13557 1641581 1039405 2253439 3351236 3431112 2382747 617039 1013036 2855832 2706246
13548 2706246 1089082 -646833 -1208343 -20689 2111650 3608245 5420471 5732456
13540 5732456 5143726 6118687 6026301 5674559 5098994 3809217 2761849 4234919 5879809
13531 5879809 5544698 4402253 3404815 2625209 671714 -1765352 -2903420 -3195459 -2532689
13522 -2532689 853279 2291262 880127 -1074166 -1294655 -1117937 -1949832 -2778301 -1455162
13513 -1455162 -1356475 -3145038 -3231944 -1924516 -667115 1355416 3921308 4887577 4809150
13504D809150k099150j630181p62933K59592j043695M90838j37174k79639J488208
13495A095016J395581M3944j973347m123207k085707K3897J43987K50310m22718
13486e652244O5682J483256K500369L185570L175627N33973j050468j255765j219914
13477A766086j106972r19389q6535R68844k05883j899381M71343L768123J585589
13468D341825p65712K09949o12013k121761j442680m86714q94335K73955K736631
13459A239145K255870K01106j551318l16627r62335j851872j23934P80137J792128
13450A462300J357907j29110j053390o1588r49411m333680k325793J0997J79131
13441e842637M96815K350472K765922O18765j425461j255397R31290J135654J67302
$$ plain form
13504 4809150 2710000 1079819 316886 576478 -467217 23621 -113553 -393192 1095016
13495 1095016 2490597 2534541 561194 -3562013 -5647720 -5623823 -5479836 -5229526 -5652244
13486 -5652244 -5586562 -4103306 -1602937 1582633 4758260 5292233 4241765 2986000 1766086
13477 1766086 659114 -260275 -346810 622034 416151 -1483230 -1011887 2756236 4341825
13468 4341825 3576113 3786062 3174049 1052288 -390392 -877106 -1771441 -1497486 1239145
13459 1239145 3495015 3696121 2144803 1828176 865841 -986031 -1109965 -329828 1462300
13450 1462300 2820207 2691097 1637707 1576119 626708 -3706972 -6032765 -6021768 -5842637
13441 -5842637 -5345822 -2995350 -229428 389337 -1036124 -2291521 -1360231 -224577 -57275
13432e7275R07513R30270q45803q42276J097832Q93904n72852j765825j803415
13423b057927q65075q85395P60804K271716K128023O67378l700077k496277J027128
13414c149702K084253o41011k029008K67299J826689J492644J176209J973590
13406C000963p02965k22679O77180k15630k369329j259548M37576n47477l80445
13397a582354R71987O09741q20327K84609K231109J497876L14391j067413K97703
13388B737322l71998j000091K113243K826976j501710j670920J95459j532897
13380A795384k24175P57843j4313n73177L64002Q46078r34010j530882J661764
13371B148514J240662j225525m10710q2067j257628j932572k259236j18026J827983
$$ plain form
13432 -57275 850238 1780508 934705 92429 1190261 2084165 1511313 -254512 -2057927
13423 -2057927 -2923002 -3808397 -3047593 -775877 1352146 2019524 -1680553 -4176830 -3149702
13414 -3149702 -1065449 -1706460 -3735468 -3468169 -1641480 -148836 1027373 3000963
13406 3000963 2297998 2075319 2752499 2536869 167540 -1092008 -654432 -1201909 -1582354
13397 -1582354 -610367 -626 -820953 -536344 1694765 3192641 3507032 2439619 2737322
13388 2737322 2365324 1365233 3478476 6305452 4803742 3132822 3328281 1795384
13380 1795384 1571209 2329052 2314739 1741562 2105564 2951642 2017632 486750 2148514
13371 2148514 3389176 2163651 1752941 1670874 413246 -1519326 -3778562 -3896588 -2068605
13362b068605J097619J394717K408491J370563N8624r53463k658654k756650j389957
13353c497315j725078j360094K92132Q75471M59065j6651J71816J018565o5004
13344c847093n14826L42274J514076M218623J723116j521014k645952l240639
13336c971435j843645Q41065L266298L363619R34418P8723q65020j832706j380403
13327a409086l70556j459918l063378j339966P06497K772378J226896N22278R1813
13318b323042q12567O05670J036746J816677R96749q92193J6756j599391j782924
13309b937519n48676l7937j47785P37079J934136k99248j90325J486077m05610
13300d09808p01645n59768J550248K440367K117363J531117m7284k411397j873503
$$ plain form
13362 -2068605 -970986 423731 2832222 4202785 4261409 3307946 649292 -2107358 -3497315
13353 -3497315 -5222393 -6582487 -6290355 -5414884 -4955819 -4972470 -4800654 -3782089 -3847093
13344 -3847093 -4361919 -4019645 -2505569 1713054 3436170 1915156 -730796 -3971435
13336 -3971435 -5815080 -4974015 -1707717 1655902 2590320 2669043 1804023 -28683 -1409086
13327 -1409086 -1779642 -3239560 -6302938 -7642904 -6936407 -4164029 -2937133 -2414855 -2323042
13318 -2323042 -3135609 -2529939 -1493193 323484 1320233 428040 444796 -1154595 -2937519
13309 -2937519 -3486195 -3524132 -3671917 -2934838 -1000702 -1299950 -1490275 -4198 -409808
13300 -409808 -1111453 -1671221 -120973 2319394 4436757 5967874 5920590 3509193 1635690
13291A635690j43443j179323O72098J816010J659508K59749j043793J180896J516392
13282F373784N1397l9464j620341k493250p79492j0396o35797M37813K337590
13273C621844J093738k197549j012680k75895k95535m55434J571656K05080l212368
13264i57143p04136J746172J246449R41998q62148k758070j574329J558827K465125
13255A102745J736657J919646K730078J484489l08703j565556j750888k725923
13247B622545k606416k662606j485141l86911k09714J028214J354719J343360
13239a001950J066366l07547n56692L90274R52688k43542j789718O19301j19229
13230i90049q0653J170340q49011k915456k305203N64880J989033J361686J52434
$$ plain form
13291 1635690 1492247 312924 985022 2801032 4460540 4720289 3676496 4857392 6373784
13282 6373784 6425181 6385717 4765376 2272126 1492634 1482238 846441 1284254 3621844
13273 3621844 4715582 2518033 1505353 1229458 933923 478489 2050145 2255225 -957143
13264 -957143 -1661279 84893 1331342 2273340 1411192 -1346878 -2921207 -1362380 1102745
13255 1102745 2839402 4759048 7489126 8973615 8664912 7099356 5348468 2622545
13247 2622545 16129 -2646477 -4131618 -4518529 -4728243 -3700029 -2345310 -1001950
13239 -1001950 64416 -243131 -799823 -409549 543139 299597 -1490121 -870820 -990049
13230 -990049 -1070702 99638 -749373 -3664829 -5970032 -5405152 -3416119 -2054433 -1901999
13221a901999k10069k235063q27549L413686J460263o97516p06830q16367O57077
13212a864367J711507O96206j865246j438805M1329J631781K545607J286797L89629
13203C134438M28393m0619o68785k006893k594254N8794N80094R35973l46803
13194e19662j935773M95695J18338j161842j89394J3433k49087K02329M50057
13185b775906Q52826J101517Q03847J558636J084597j348668j797282o34885m95918
13176a651236j691565j739217J241454J59735j543741Q18338J111776m17327o25768
13167d337551K49241Q18813J730952K389823J251604J004930p24080k051726j95678
13158A36328N60347j277814n71052R42052J78417j769011P5860J811129J179513
$$ plain form
13221 -1901999 -2112068 -4347131 -5174680 -1760994 -300731 -998247 -1705077 -2521444 -1864367
13212 -1864367 -152860 543346 -1321900 -2760705 -2719376 -1087595 1458012 2744809 3134438
13203 3134438 3562831 3522212 2853427 846534 -1747720 -1688926 -1108832 -172859 -519662
13194 -519662 -2455435 -1959740 -1841402 -3003244 -3192638 -3179205 -3428292 -3225963 -2775906
13185 -2775906 -1923080 -821563 -17716 1540920 2625517 1276849 -520433 -1155318 -1651236
13176 -1651236 -3342801 -5082018 -3840564 -3680829 -5224570 -4406232 -3294456 -3711783 -4337551
13167 -4337551 -4088310 -3269497 -1538545 851278 2102882 3107812 2383732 332006 136328
13158 136328 696675 -581139 -1152191 -210139 -31722 -1800733 -1724873 86256 1265769
13149A265769J087369N94228J653841O43739k028503k124399j539429P76126J672882
13140B001623R35762m81550l87966M62651K60382l76915q63376m15123k34085
13131I01403j35211J67105L24811N20105P41480j86451k031628k477225n04711
13122b680322J062194Q16646O13606n77225k517710J69967K026464j880194j304818
13113d271392M13779L14199K67466J817410K523437P77609J182462J142231M0371
13104D207572j41558Q1946n63954j519158o52004l89906n31435K32111j347365
13095f23751k643215j928019l29294J846887J196467Q91465J454382P03782P87651
13086A356355P8462q2945J614639L39520j97779L245550J033798j851726J090148
$$ plain form
13149 1265769 2353138 2947366 4601207 5244946 3216443 1092044 -447385 328741 2001623
13140 2001623 2937385 2455835 2067869 2530520 2790902 2413987 1550611 1135488 901403
13131 901403 766192 933297 1258108 1778213 2519693 2333242 301614 -2175611 -2680322
13122 -2680322 -1618128 -801482 -187876 -765101 -3282811 -3112844 -1086380 -2966574 -4271392
13113 -4271392 -3857613 -3543414 -3275948 -1458538 1064899 1842508 3024970 4167201 4207572
13104 4207572 4066014 4147960 3584006 2064848 1412844 1022938 491503 723614 -623751
13095 -623751 -3266966 -5194985 -5524279 -3677392 -2480925 -1589460 -135078 568704 1356355
13086 1356355 1434817 1351872 2966511 3306031 3108252 6353802 7387600 5535874 6626022
13077F626022J08854j811979j053694m3253N01115L54310O09188j176815k412690
13068A701058p09978Q58864n0630O54723m12306j887941R94676J515604L63327
13059C027397k67174p08981k15815j304460n37387J496613J630666l96240l10170
13050B414449Q65425J264382M0438j931851r7375K322706J186809j0031p34804
13041E320148k595403k85779K202359l23031k344100k242690m67547N5623J49460
13032e30960M40006J039024J332828M34397J24690M32130K009378J018254j004408
13023E295339r40744q74367L71697J026759l06757j655443l08018J638485J166571
13014E413522j64379m53561l4709R97053P05451r09547k943561j705599L83716
$$ plain form
13077 6626022 6734876 4922897 3869203 3825950 4327065 4681375 5290563 4113748 1701058
13068 1701058 991080 1849944 1799314 2454037 2041731 153790 1148466 2664070 3027397
13059 3027397 2760223 2051242 1835427 530967 -6420 1490193 3120859 2724619 2414449
13050 2414449 3279874 4544256 4584694 2652843 2555468 4878174 6064983 6054952 5320148
13041 5320148 2724745 2438966 4641325 4318294 1974194 -268496 -736043 -680420 -530960
13032 -530960 -90954 948070 2280898 2715295 2839985 3272115 5281493 6299747 5295339
13023 5295339 4354595 3480228 3851925 4878684 4571927 2916484 2608466 4246951 5413522
13014 5413522 5249143 4795582 4760873 5757926 6463377 5553830 2610269 904670 1288386
13005A288386J390330m2988o97725J93518k8287J986160J963391K596979K373265
12996A1023029N52546R96646J057663k5756m1468M8368N22702K279281K670247
12987A9083258K353398J771419K267093N172423P092906P637005P466713R937267
12979F2781482J4476321J7311000K2443501K9623823L9792942M5374807L6412613
12972B68216489P155188k7342478m4509367m4214471l6438536k8022151j9684952
12965G5159722j4704115j0751369p253840n729688m733956l090164m775901n261173
12957A8859516k939542j788046j187734j358324L09985l96458k821913l465222
12949E212262k275578M40308K595264K089555Q9944l1406k178193j551193k179042
$$ plain form
13005 1288386 2678716 2635728 1938003 2131521 2103234 4089394 6052785 8649764 11023029
12996 11023029 11575575 12572221 13629884 13604128 13562660 13611028 14133730 16413011 19083258
12987 19083258 21436656 23208075 25475168 30647591 37740497 45377502 52844215 62781482
12979 62781482 77257803 94568803 117012304 146636127 186429069 231803876 268216489
12972 268216489 275371677 248029199 203519832 159305361 122866825 94844674 75159722
12965 75159722 60455607 49704238 42450398 36720710 31986754 28896590 24120689 18859516
12957 18859516 15919974 14131928 12944194 11585870 11895855 11499397 8677484 5212262
12949 5212262 2936684 3376992 5972256 8061811 8151755 8120349 5942156 4390963 2211921
12940B211921j328210K197056K619440J323530K09051P45988k85339j533530j354887
12931D805020j092574O33540J188252m62446j208524j391609R54213K351052Q12786
12922F589710j51478P94042K416937L471517J561730j176022j009941M7135K006914
12913A4550544J993806M85624M12301j065163l629864j889555K326961O34438
12905A3819092k37356K020576L097798K710611K020694N82821K079741M532385
12897C0626362L636386M885633O893016Q669136J1270882J2956787J9620494K7172721
12889A25731417L7017801M5858224M7524521L0541649n306490l6693774m9079653
12882A95593695m4565467l4823974k6172798j7330696j1865904j0117884r178757
$$ plain form
12940 2211921 883711 3080767 5700207 7023737 7232788 7978776 7693437 6159907 4805020
12931 4805020 3712446 4345986 5534238 5071792 3863268 2471659 3425872 5776924 6589710
12922 6589710 6438232 7232274 9649211 13120728 14682458 13506436 12496495 12543630 14550544
12913 14550544 16544350 17029974 17442275 16377112 12747248 10857693 13184654 13819092
12905 13819092 13581736 15602312 18700110 21410721 23431415 24014236 26093977 30626362
12897 30626362 34262748 39148381 46041397 54710533 65981415 78938202 98558696 125731417
12889 125731417 162749218 208607442 256131963 286673612 281367122 244673348 195593695
12882 195593695 151028228 116204254 90031456 72700760 60834856 50716972 41538215
12875D1538215p756558o032277l539255k683126k252462k032769k212408j774871
12867A3254489j740116j605251k057704m85117K3402L623518J794175o31684n59433
12858A1616279l86725k217804j456322P9949J4154j834211m056579j614208p08582
12849e64049M62358P81340J126137J86544R82401K050295J778060k85341j71159
12840F346586p7193j278225k814241j822387m45949J025339J992955l4486p96342
12831B096057r08494n93232R40513J167891p3381J988731L458072K899882Q32161
12822A1808200N90306J469669O17891m49550m49011J584952K492670J648689N32939
12813A9846755j057047J878494O455363P530331P949062O764377Q106767J1728634
$$ plain form
12875 41538215 33781657 27749380 24210125 21526999 19274537 17241768 15029360 13254489
12867 13254489 11514373 9909122 7851418 7366301 7389703 11013221 12807396 12175712 11616279
12858 11616279 11229554 9011750 7555428 7635377 7649531 5815320 1758741 144533 -564049
12849 -564049 -101691 679649 1805786 1992330 2974731 5025026 6803086 6517745 6346586
12840 6346586 6269393 4991168 2176927 354540 -91409 933930 2926885 2892399 2096057
12831 2096057 1187563 594331 1534844 2702735 2629354 4618085 8076157 10976039 11808200
12822 11808200 12398506 13868175 14486066 14036516 13587505 15172457 17665127 19313816 19846755
12813 19846755 18789708 20668202 27123565 34653896 42602958 49367335 57474102 69202736
12805F9202736J5681876K1734195K9092558L8936606M7155892M3139709K0007624
12798B84951196j3978099m0379124m8794574m1719326k9134496k0516146j6052968
12791G4376463j3252499j0450283r041380o385010m750817m240865j980499j206080
12783B3069030r26047n03226l087036m389314l008165j085498m32440j565937
12775H071367q87239R36783O42266p25799j600376p17081J99980M38572n24617
12766E833856p39815n0870j158418k034886m40740K13731R49298J174340N01869
12757D248365M71670K56725j829035j988752j287117N40204J572813J317151m24826
12748B877198m87821R2116j623438k348612j998842q48037n90794K347776L699655
$$ plain form
12805 69202736 84884612 106618807 135711365 174647971 221803863 264943572 284951196
12798 284951196 270973097 230593973 181799399 140080073 110945577 90429431 74376463
12791 74376463 61123964 50673681 41632301 35247291 30496474 26255609 24275110 23069030
12783 23069030 22142983 21639757 18552721 14163407 11155242 10069744 9637304 8071367
12775 8071367 7184128 8120911 8763177 8037378 6437002 5719921 5919901 6358473 5833856
12766 5833856 5094041 5043171 3884753 1849867 1409127 1622858 2572156 3746496 4248365
12757 4248365 4720035 4976760 3147725 1158973 -128144 412060 1984873 3302024 2877198
12748 2877198 2389377 2481493 858055 -1490557 -3489399 -4337436 -4928230 -2580454 1119201
12739A119201J460121j167174k861527j598791O29605J383686N71023q35994m33772
12730a733622j158466j141223K15394K25337J214165L116869J234813q57584J220153
12721B335836J389382j630318k492691l41327J032999l26919l029431o80522K376357
12712a366634J244320l48515m91053J522333K585782O64840J752223P28566j070975
12703E220887r38435j469712o51803n45005J3816j201581r38371K67152O30858
12694C87806J597978J818786N78270L65789j240596k960898k447855J70927K787656
12685A057863J130684m13553k53483p76504J225607K662119r50201k308701m45259
12676I28572O81050M64663J389269r38356j169783r82422j230253j144922q90745
$$ plain form
12739 1119201 2579322 1412148 -1449379 -3048170 -2418565 -1034879 -463856 -1299850 -1733622
12730 -1733622 -2892088 -4033311 -3817917 -3592580 -2378415 738454 1973267 1115683 2335836
12721 2335836 3725218 2094900 -397791 -739118 293881 -33038 -3062469 -3742991 -1366634
12712 -1366634 -122314 -470829 -961882 560451 3146233 3811073 5563296 6291862 5220887
12703 5220887 4282452 2812740 2160937 1615932 1629748 428167 -510204 -243052 387806
12694 387806 1985784 3804570 4382840 4748629 3508033 547135 -1900720 -1729793 1057863
12685 1057863 2188547 1774994 1521511 745007 1970614 4632733 3682532 1373831 928572
12676 928572 1609622 2074285 3463554 2525198 1355415 372993 -857260 -2002182 -2892927
12667b892927J843346N52183l26095P19140J549426J742558m68947j918508j303654
12658e03478j088027K27269J077363R24347K91823l39767j978509j099042k04526
12649b692547Q96542q15195j225710k21203J651892K385987J178761N0723N47452
12640A756702J38158n30370j119218j560625m05253J373937J919389K74636J93567
12631B040923J328609j65636M83391L79189j539725j19599j23821k77927j762507
12622B42897j345420j7833j20123q2283J795795K636313J499457P64239j345756
12613D027286k407566J94976j31392j840737j987466j775513j804935q64293K180320
12604d409320K009721J016310K795020J806677j808287l85908r2634j560423k46764
$$ plain form
12667 -2892927 -1049581 -497398 -823493 -104353 1445073 3187631 2718684 800176 -503478
12658 -503478 -1591505 -1364236 -286873 637474 929297 589530 -1388979 -2488021 -2692547
12649 -2692547 -1796005 -2611200 -3836910 -4058113 -2406221 -20234 1158527 1209250 1756702
12640 1756702 1894860 1364490 245272 -1315353 -1720606 -346669 1572720 1847356 2040923
12631 2040923 3369532 3203896 3687287 4066476 2526751 2407152 2283331 2005404 242897
12622 242897 -1102523 -1120356 -1240479 -1322762 473033 3109346 4608803 5373042 4027286
12613 4027286 1619720 1814696 1683304 -157433 -2144899 -3920412 -5725347 -6589640 -4409320
12604 -4409320 -2399599 -1383289 1411731 3218408 1410121 1024213 931579 -628844 -875608
12595h75608N57874O03351K21315J043211k87276k397004r71807j187188p52872
12586d046004R29898J080680J013248J985166J087062o37182j00234q13708R6541
12577E95467J965844J085616k006663k572827j695278q79726l64504j430754J1242
12568e291583J153698K331133J409991N35569n005Q21215P82291o27o4087p79986
12558H92609q70396l33355M61142Q4896R1356k66036J775288j007477r06186K023989
12548A945830P07636j637497j277817Q64815m02197n60603k67668j273160m68300
12539b368961P84170r49483l43559K938132L994842K406704q62534j312089j887810
12530B399412j361954k853211j379115J685882K53308j711723K36515J173957
$$ plain form
12595 -875608 -317734 285617 506932 1550143 1262867 -1134137 -2105944 -3293132 -4046004
12586 -4046004 -3116106 -2035426 -1022178 962988 2050050 1412868 1312634 498926 595467
12577 595467 2561311 3646927 1640264 -932563 -2627841 -3507567 -3872071 -5302825 -5291583
12568 -5291583 -4137885 -1806752 -396761 138808 133803 955018 1737309 1736682 1672595 892609
12558 892609 22213 -311142 150000 234896 326252 60216 1835504 828027 -78159 1945830
12548 1945830 2653466 1015969 -261848 602967 200770 -359833 -627501 -1900661 -2368961
12539 -2368961 -1584791 -2534274 -2877833 60299 4055141 6461845 5599311 4287222 2399412
12530 2399412 1037458 -1815753 -3194868 -1508986 -1255678 -2967401 -2730886 -1556929
12522a556929L73452J135837J065585N08315k648739j735924m7117r59047N92408
12513c272159K178455l45899p23040K475726J452823K28065j903772k304080o35151
12504b849032m01252J80211R48030J452795J427861J470544M91350L81061N92754
12495C694322k97043j250113j675608j796730j996123j123067j02116L377022
12487a169456K881107Q631j142289p50733q12025o34997J067947J188245J119275
12478A755705K087862J024916j685279l155823l136361r92766J592016K530229
12470B0499K793373R45695j857479j128562J548201J445717J91308J428645M41326
12461E828723q98545k409763n78385j033339j594805J49133p85439j018964p53003
$$ plain form
12522 -1556929 -1183477 -47640 1017945 1526260 -1122479 -2858403 -2905520 -3864567 -3272159
12513 -3272159 -1093704 -1439603 -2162643 313083 1765906 1993971 90199 -2213881 -2849032
12504 -2849032 -3250284 -3070073 -2122043 -669248 758613 2229157 2720507 3101568 3694322
12495 3694322 3397279 2147166 471558 -1325172 -3321295 -4444362 -4546478 -1169456
12487 -1169456 1711651 1720282 577993 -172740 -984765 -1619762 -551815 636430 1755705
12478 1755705 3843567 4868483 3183204 27381 -3108980 -4101746 -2509730 20499
12470 20499 2813872 3759567 1902088 773526 2321727 3767444 3958752 5387397 5828723
12461 5828723 4930178 2520415 1942030 908691 -686114 -536981 -1322420 -2341384 -3094387
12452c094387K19061K903288P23945m76904J801159J933898k54009j707557r1116
12443A957378j047759j238724o40135j942998N83766J334301K028950J320195
12435B354974k66460j091726j681519m10257j057079k009735k036349L82050M766281
12426a049820K038594r65453O56003J109407L78230R42522Q7510M91954l8727
12417C650220j227954j440079J96335R52238j023872m83191O1147r80403k386848
12408b682407k209012k35302M09284L65459J930623J294836L50980R33746J20434
12399B78641j062052j11287L0627j057013P92047N51042K26494n64785j021437
12390a937723J022054K94709R71824n62756J57361K022258K574k22436J222268
$$ plain form
12452 -3094387 -2875326 27962 751907 275003 2076162 4010060 3756051 2048494 1957378
12443 1957378 909619 -329105 -969240 -2912238 -2328472 -994171 1034779 2354974
12435 2354974 2088514 996788 -684731 -1094988 -2152067 -4161802 -6198151 -5816101 -1049820
12426 -1049820 988774 23321 679324 1788731 2166961 3109483 3196993 3688947 3650220
12417 3650220 2422266 982187 1178522 2130760 1106888 623697 684844 -295559 -2682407
12408 -2682407 -4891419 -5126721 -4717437 -4351978 -2421355 -1126519 -775539 158207 278641
12399 278641 -783411 -894698 -864071 -1921084 -1129037 -577995 -351501 -916286 -1937723
12390 -1937723 -915669 -620960 350864 -211892 -54531 1967727 1970301 1747865 2970133
12381B970133j99328j168275L58517r76891k414261j426045l07325R37132J196869
12372a029474M55007M1452l8318J38919p82804p12744K54258J23182k78880J140508
12362f88894J494741q4349Q71248j00666j802958j314366J715536J269790K71973
12353A632055J187669J31321k983476j336742J116089l63794o04699l38650O07698
12344i52529k239695l6690K806959N19173k61172m5821P8989k44335j91044N23224
12334d2941o09309j032605K36872j04586O47426K032550K070039O34402J82901
12325D014749Q68035l15053j123507j694639q28511O26083p26190K78204J213465
12316B312636k854394k854375J538414J140629j372009p85022R16861m17867j437616
$$ plain form
12381 2970133 2770805 1602530 1961047 984156 -1430105 -2856150 -3163475 -2226343 -1029474
12372 -1029474 -574467 -533015 -571333 -432414 -1215218 -1927962 -1673704 -1550522 -1829402 -688894
12362 -688894 805847 721498 1592746 1492080 -310878 -1625244 90292 1360082 1632055
12353 1632055 2819724 2951045 -32431 -1369173 -253084 -616878 -1221577 -1560227 -952529
12344 -952529 -3192224 -3228914 -421955 97218 -163954 -209775 -130786 -375121 -566165 -42941
12334 -42941 -652250 -1684855 -1447983 -1552569 -905143 1127407 3197446 3831848 4014749
12325 4014749 4882784 4567731 3444224 1749585 921074 1547157 820967 1099171 2312636
12316 2312636 -541758 -3396133 -1857719 -717090 -2089099 -2874121 -1957260 -2375127 -3812743
12307c812743k54788J65777J245679K273335J349358j765330j617881J000205
12299a416388K00173O33250o534N81659J093338R4453O5332r17510j979299o10351
12289b261877R37748J364180J126749R76086j026212j192643J71713m31982j228237
12280a564475j35720K13949L21340J135363q8926j210805R22994R88873M16064
12271I98657k63459j942470P41642R91754k365864k20571J526972J650416K029335
12262C146412J454086m2692P05064L83055j749661k167892J4050r8754L83121
12253B026789j00682k551772k841220j139722j81983J22318J456501K271485J145443
12244B07157l73796p03217M21905J175600R65991M20886p81061j316088k054850
$$ plain form
12307 -3812743 -4067531 -3901754 -2656075 -382740 966618 -798712 -2416593 -1416388
12299 -1416388 -1216215 -582965 -589499 -7840 1085498 1179951 1245283 327773 -1651526 -2261877
12289 -2261877 -1324129 40051 1166800 2142886 1116674 -75969 95744 -336238 -1564475
12280 -1564475 -1700195 -1486246 -1164906 -29543 -118469 -1329274 -406280 582593 998657
12271 998657 735198 -1207272 -465630 526124 -1839740 -2060311 -533339 1117077 3146412
12262 3146412 4600498 4557806 5262870 5645925 3896264 1728372 1742422 1643668 2026789
12253 2026789 1926107 -625665 -3466885 -4606607 -4788590 -4666272 -3209771 -938286 207157
12244 207157 -166639 -869856 -447951 727649 1693640 2114526 1333465 17377 -2037473
12235b037473k529132j145309J249011J283747K717819K400869K625705J277647
12227E842884j536592r85238Q59258J74932j414563k182256p49485J356739m15917
12218I49762r47614r31007o81881k73573k91932Q46550J911908K400329J078856
12209D061398j043331k298119j145346L95471k45139j453244j049133q54017j554087
12200e185547N0932J701573J875640K560553Q67803j261268k25119P52541o54485
12191D82623J51129K24962j200130k522199n16060J68667p8987K255923K498108
12182A464036J424252J49286j437068l127221k049528j04695P94790J000918J211105
12173f74125K182503J431042J319926O6041n29029j374433j713271K46683Q67376
$$ plain form
12235 -2037473 -4566605 -5711914 -4462903 -3179156 -461337 1939532 4565237 5842884
12227 5842884 4306292 3321054 4180312 4355244 2940681 758425 8940 1365679 949762
12218 949762 2148 -928859 -1610740 -1884313 -2176245 -1329695 582213 2982542 4061398
12209 4061398 3018067 719948 -425398 -29927 -275066 -1728310 -2777443 -3631460 -5185547
12200 -5185547 -5134615 -3433042 -1557402 1003151 1870954 609686 384567 1137108 482623
12191 482623 633752 858714 -341416 -2863615 -3379675 -3211008 -3289995 -1034072 1464036
12182 1464036 2888288 3037574 1600506 -1526715 -3576243 -3680938 -2886148 -1885230 -674125
12173 -674125 1508378 2939420 4259346 4325387 3796358 2421925 708654 955337 1822713
12164A822713M88714o47235j001066p54666J00823l3113R13391R29415J443612
12155C262588J498288N38804j137869j998199j721609j362987r21845k356551
12147d199380j096386L06142o43505j704378j164828K74968L66674K354614R00632
12138d605447o06516j936296j997078J171726N68964Q95323N34518J459807J622023
12129b892976O2723J197693K082659K476759m225j820776R19496K28159p97400
12120A452112j565350q2974K13109j479190j311358J335369J343023L66808n67273
12111b95724L33214K45163m34275q02480r6192o30906O61799J186557J225862
12102A393018P0148j637978l92867K83876l69003L24347J988640L292421K805826
$$ plain form
12164 1822713 2311427 1664192 663126 -91540 9283 -23830 889561 1818976 3262588
12155 3262588 4760876 5299680 4161811 2163612 442003 -920984 -1842829 -4199380
12147 -4199380 -5295766 -4989624 -5633129 -7337507 -8502335 -8227367 -7860693 -5506079 -4605447
12138 -4605447 -5211963 -7148259 -9145337 -7973611 -7404647 -6509324 -5974806 -4514999 -2892976
12129 -2892976 -2830253 -1632560 450099 2926858 2922633 1101857 2021353 2249512 1452112
12120 1452112 -113238 -196212 16897 -1462293 -2773651 -1438282 -95259 271549 -295724
12111 -295724 37490 282653 -151622 -954102 -1050294 -1681200 -1019401 167156 1393018
12102 1393018 1463166 -174812 -567679 -283803 -652806 -328459 1660181 4952602 7758428
12093G758428j951896k273971j865272j7182r0348M25215K64320j3482j364274
12084H71538k710224j408609K056374K120300K25224p19420p02954j223898j566420
12075c058089j414963p60184l6104K365641K140270J416896L315738R0523k146485
12066A913243k779699j784950P03351K737543J805507k72646j99270n38522r67706
12057F16851j388218j940156l52078p92434j5392J611207K255734K151994K109547
12048D257055K170391J144123j383345k275423k358186k464854j75040J555715
12040D70436N00037o44357j120L1582J0913J925859K585596K362575l22829l358260
12030C560432j433797N75007j150969l071741j620148n59860p86613J871585L954206
$$ plain form
12093 7758428 5806532 3532561 1667289 1650107 1559759 1984974 2249294 2235812 871538
12084 871538 -1838686 -3247295 -1190921 929379 1154603 435183 -267771 -1491669 -3058089
12075 -3058089 -4473052 -5233236 -5269340 -2903699 -763429 653467 3969205 4059728 1913243
12066 1913243 -866456 -2651406 -1948055 789488 2594995 2322349 2123079 1584557 616851
12057 616851 -771367 -2711523 -3063601 -3856035 -3871427 -2260220 -4486 2147508 4257055
12048 4257055 6427446 7571569 6188224 3912801 1554615 -910239 -1085279 470436
12040 470436 970473 326116 324996 356578 367491 2293350 4878946 7241521 6918692 3560432
12030 3560432 2126635 2701642 1550673 -1521068 -3141216 -3701076 -4487689 -2616104 1338102
12021A338102K246293j32336l59998Q42323o46549j857035o75084n11943k52861
12012i088N06381J103938R63809n43254M66085J208594N87787k10886j076521
12003B996845q11165r55659l95402J214372K115522K575741J427212q83860k39072
11994G044534r00465m19085m64102M88665Q91383J18341q35748r69515o12188
11985D341820J05942m22897k095186k128602J05206p28024m18202K083573K404843
11976C248473J011749j094094r67495J07338j114004j525545k40418J426063M030488
11967D882555J413018k451200j497404M36657Q09669O10475J896706L083402j304545
11958G879333k182298M00165j38525j566520k782222j336913o18658j108315O0138
$$ plain form
12021 1338102 3584395 3452059 3092061 3934384 3287835 1430800 755716 243773 -9088
12012 -9088 497293 1601231 2565040 2021786 2487871 3696465 4284252 4073366 2996845
12003 2996845 2185680 1230021 834619 2048991 4164513 6740254 8167466 7283606 7044534
11994 7044534 6144069 5724984 5260882 5749547 6640930 6759271 5923523 4954008 4341820
11985 4341820 4447762 4024865 1929679 -198923 -93717 -821741 -1239943 843630 3248473
11976 3248473 4260222 3166128 2198633 2305971 1191967 -333578 -573996 852067 4882555
11967 4882555 6295573 3844373 2346969 2783626 3593295 4203770 6100476 9183878 7879333
11958 7879333 5697035 6097200 5958675 4392155 1609933 273020 -345638 -1453953 -1393815
11949a393815J377806j49402n96511o371K89653K418030J546220K75649n4357
11940C706902k459209k154501R27942O9705J695725J049800j586945m11001m44139
11931C94279q78314q45040l522921l528342R5097K182873J725466J27011m09328
11922d659219J23052N03526o50618R2637J472585J093979J236773o11635M87665
11913i11255K9606q30032k136611M49792M136987K373162P33797J269739j87276
11904D927909j126600N76171L09728q42646j024417j725236J25658J522891P72746
11895C516204j504181k039800p57878k9822O51125P1063j34182J47891j17401
11886a96981k71829j187339j092906L28836Q87111J456195K692234J653812k393820
$$ plain form
11949 -1393815 -16009 -165411 -761922 -768293 -478640 1939390 3485610 3761259 3706902
11940 3706902 1247693 -906808 21134 90839 1786564 2836364 1249419 838418 394279
11931 394279 -484035 -1329075 -4851996 -8380338 -8285241 -6102368 -4376902 -4249891 -4659219
11922 -4659219 -4536167 -4032641 -4683259 -4590622 -3118037 -2024058 -787285 -1398920 -911255
11913 -911255 -881649 -1711681 -3848292 -3398500 738487 3111649 3845446 5115185 4927909
11904 4927909 3801309 4377480 4687208 3844562 2820145 1094909 1220567 2743458 3516204
11895 3516204 2012023 -27777 -785655 -815477 -164352 -93289 -227471 -79580 -196981
11886 -196981 -468810 -1656149 -2749055 -2420219 -1533108 -76913 2615321 4269133 1875313
11877A875313k226725J178708O36261L88951K44830p42007j971812k052762p80068
11868c449311J080011K072984J080667k63407n92683J37722N19682J70188j880165
11859a124312j252901P81029J802944K858126K36820j387122J63605j259418j862517
11850a043746j558787j667874j502872M13492J564920N43887l72246O24610J417376
11841a581240L9146R72951P41709m80206j057378k02342K91211P31760Q03359
11832B58970L85450O18417J568046J023430k773514l098321J307846L84493k175313
11823b500496R65425K362065J890319J13265n51038j055740j970708K81415J747227
11814A281734P66177j403801j096839j72112N23185N0988o4018j53546p10569
$$ plain form
11877 1875313 -351412 827296 1463557 1852508 2097338 1355331 -616481 -2669243 -3449311
11868 -3449311 -2369300 -296316 784351 520944 -71739 65983 585665 755853 -1124312
11859 -1124312 -2377213 -1596184 206760 3064886 3301706 1914584 2078189 818771 -1043746
11850 -1043746 -2602533 -4270407 -5773279 -5359787 -3794867 -3250980 -3623226 -2998616 -1581240
11841 -1581240 -1542094 -569143 172566 -307640 -1365018 -1567360 -1276149 -544389 258970
11832 258970 644420 1262837 2830883 3854313 1080799 -2017522 -709676 -325183 -2500496
11823 -2500496 -1535071 826994 2717313 2830578 2279540 1223800 -746908 -465493 1281734
11814 1281734 2047911 644110 -452729 -624841 -101656 -50668 -114686 -268232 -978801
11805i78801O95697J182874J32859J817388L309612Q71994r16569K38444K58381
11796F611879N03667K34028l100645j990626R56569J424931P60653k003734l770919
11787c74197j364013J468932J400655L47165P07518R66623J49255p9199k829885
11778C92854k605250j39129R60924J114662J73665J757938K141912O50694r19590
11769C528680l196009l031852j358026O96168J735059J551582L05773r47971M77127
11760b39469K73597J01469J548062O79036m71640j677429j145449r64773j26831
11751b023427J322629J414045N45199J52765J755029J672328M93108j768157k666729
11742H96790j430801O33612Q16615o24056j688380k35248r889L07303K00892o57476
$$ plain form
11805 -978801 -283104 899770 1032629 2850017 6159629 7031623 6115054 6353498 6611879
11796 6611879 7115546 7349574 4248929 2258303 3214872 4639803 5400456 3396722 -374197
11787 -374197 -1738210 -269278 1131377 1478542 2186060 3152683 3301938 3222739 392854
11778 392854 -2212396 -2351525 -1390601 -275939 -102274 1655664 3797576 4448270 3528680
11769 3528680 332671 -2699181 -4057207 -3361039 -1625980 -74398 231375 -716596 -239469
11760 -239469 34128 135597 1683659 2362695 1891055 213626 -931823 -1896596 -2023427
11751 -2023427 -700798 713247 1258446 1411211 3166240 4838568 5331676 3563519 896790
11742 896790 -534011 99601 916216 292160 -1396220 -1631468 -1641357 -1334054 -1133162 -1790638
11732a790638K56689J859810K321275L09551M84229j352467m387959j872596Q21590
11723c350516J292553r46639q32361J293764R13027j662324j971680j207952P12159
11714e759969K358988Q08589o07612l62751J012125J950706R57362q15999r86196
11705a444757M02821k970937M544729P247006k908577k527076r07110k222892
11697g86793j978977J86542K036345K43044j326964n10496J541663L15416j877156
11688b157376n41920j18027P55459K485141Q86990j585018r25748J75439j778854
11679b803914k661477M69767K033476N77721M91920J897123K196553J644415J469219
11670E314803P42987J454720k033386k498342j308028j077891l79975r32466K6513
$$ plain form
11732 -1790638 -1533949 325861 2647136 2956687 3440916 2088449 -2299510 -4172106 -3350516
11723 -3350516 -2057963 -3004602 -3836963 -2543199 -1630172 -3292496 -5264176 -6472128 -5759969
11714 -5759969 -3400981 -2592392 -3200004 -3562755 -2550630 -599924 357438 -458561 -1444757
11705 -1444757 -1041936 -4012873 531856 7778862 4870285 2343209 1436099 -786793
11697 -786793 -2765770 -2579228 -542883 -299839 -1626803 -2137299 -595636 -280220 -2157376
11688 -2157376 -2699296 -2817323 -2061864 423277 1310267 -274751 -1200499 -1025060 -2803914
11679 -2803914 -5465391 -4995624 -2962148 -2384427 -1892507 4616 2201169 3845584 5314803
11670 5314803 6057790 7512510 5479124 2980782 1672754 594863 214888 -717578 -691065
11661f91065J16640n05843q52061K64936J825038K439238J079051j808686j690641
11652A76607K69499J302225j01941j136068o26454m95969j023960j801031N78727
11643b858365J293483J125434K915161J491310j01097j486573o03163J596879
11635C373069o38498j603273K3346J769552P18671l329518l966324o69002J637684
11626b684293Q70461k68553r05632R40372J014914J245095r08066r33690J65699
11617a463693P26489Q06108J490994R76480j378805k340278j160244j15342O44156
11608a814135O40260K314735Q56104k52891J070995j021566k31367J32616m21766
11599A272985M23393n26950j482447J2485n11814J645018J786893Q80100r87586
$$ plain form
11661 -691065 -574425 -1080268 -1932329 -1667393 157645 2596883 3675934 1867248 176607
11652 176607 446106 1748331 1646390 510322 -116132 -612101 -1636061 -3437092 -2858365
11643 -2858365 -1564882 -439448 2475713 3967023 3865926 2379353 1776190 3373069
11635 3373069 2734571 1131298 1154644 2924196 3642867 313349 -3652975 -4321977 -2684293
11626 -2684293 -1813832 -2082385 -2988017 -2047645 -1032731 212364 -695702 -1629392 -1463693
11617 -1463693 -737204 68904 1559898 2536378 1157573 -1182705 -2342949 -2458291 -1814135
11608 -1814135 -1173875 1140860 1996964 1744073 2815068 1793502 1562135 1694751 1272985
11599 1272985 1696378 1169428 -313019 -300534 -812348 832670 2619563 3499663 2512077
11590B512077l943013k545227Q16437K142892P83691k020965n42158L452366J951343
11581B607443j393429l550962j694757J161558J611360O10617L98892P38784P44872
11572A234378O75715M21847n39194J767065J156027j353559j18183m1052r3197
11563C109847j87642j396470n32269n47187j470485M6980k71456j681021l135823
11554f065526p02565P79744J697616J329192M93836J005427K87454r87937J49061
11545b013698K236915J345491N02699R57574K54021l94051K4647l70810n16137
11536B026651j068606k707401j353493j640034M0528Q97607M63160K178288J552886
11527C89586m61704j281112m29348P97708N57512k201616l821170K43156L121546
$$ plain form
11590 2512077 -1430936 -3976163 -3159726 -1016834 -233143 -2254108 -2796266 656100 2607443
11581 2607443 1214014 -2336948 -4031705 -2870147 -1258787 -648170 -249278 489506 1234378
11572 1234378 1910093 2331940 1792746 3559811 4715838 3362279 3244096 3203044 3109847
11563 3109847 2922205 1525735 993466 446279 -1024206 -977226 -1248682 -2929703 -6065526
11554 -6065526 -6768091 -5988347 -4290731 -2961539 -2467703 -1462276 -1174822 -2162759 -2013698
11545 -2013698 223217 1568708 2071407 3028981 3283002 2888951 2913598 2542788 2026651
11536 2026651 958045 -1749356 -3102849 -4742883 -4702355 -3804748 -3341588 -1163300 389586
11527 389586 -72118 -1353230 -1782578 -984870 -427358 -2628974 -6450144 -6206988 -3085442
11518c085442J265355j676666l85694J435590K384797J989437K64361l94339p84886
11509A012513j655486m33305j066599j241804p02039N10942J642310L306349K228296
11500C601177k7059j755485K72105P22485L75578J75356j391081k123528j236480
11491a386932J369551J596859M64504p02983k565172j860553N47417O72610K07665
11482a657034M98018M98342K0362j782459q14574J255951J922970K093516J403583
11473C438675L94883q09534j409934q97973o45348K76865p58593k058199O22826
11464a846332J850124Q48155n19753J97465N29865M32906j604378k884080j872117
11455d868145J585478J993487k40465N40529J492975J057874r5989j126277O02625
$$ plain form
11518 -3085442 -1820087 -3496753 -3882447 -2446857 -62060 1927377 2191738 1797399 1012513
11509 1012513 -642973 -1076278 -2142877 -3384681 -4086720 -3575778 -1933468 1372881 3601177
11500 3601177 3574118 1818633 2090738 2813223 3188801 3364157 1973076 -150452 -1386932
11491 -1386932 -17381 1579478 2043982 1340999 -1224173 -3084726 -2537309 -1864699 -1657034
11482 -1657034 -1159016 -660674 -640312 -2422771 -3237345 -1981394 -58424 2035092 3438675
11473 3438675 3833558 3024024 1614090 716117 70769 347634 -410959 -2469158 -1846332
11464 -1846332 3792 851947 332194 529659 1059524 1492430 -111948 -2996028 -4868145
11455 -4868145 -3282667 -1289180 -1529645 -989116 503859 1561733 1465744 339467 942092
11446I42092J577208l06794O76792k029188l317449r05398J130848J623234O35218
11437B6563P76567N34213k19971j122732k400175j98636J380349K102222P53869
11428A632269q95348o07677o7392j703690k520363O1800R76335J242730P84894
11419a096442J223371K626000N15007k236044q16291O24715l20670k449962k512739
11410d443055Q19495K433970K11250L45143Q43708k00830j20622R24925J852922
11401B666906M74810P54730J660131m73181k336409l539971k673575o25947Q75265
11392c217241K13463P26773K45691o43240j258210K416218L081196q44685k219339
11383a499374l635052n55729J562444K775752J612201j558596J65446P40623k30197
$$ plain form
11446 942092 2519300 2212506 2889298 860110 -2457339 -3362737 -2231889 -608655 26563
11437 26563 803130 1337343 1117372 -5360 -2405535 -2604171 -1223822 878400 1632269
11428 1632269 736921 129244 61852 -1641838 -4162201 -4100401 -3124066 -1881336 -1096442
11419 -1096442 126929 2752929 3267936 1031892 215601 840316 519646 -1930316 -4443055
11410 -4443055 -3623560 -1189590 -978340 -633197 210511 9681 -110941 813984 2666906
11401 2666906 3141716 3896446 5556577 5083396 2746987 -792984 -3466559 -4092506 -3217241
11392 -3217241 -3003778 -2277005 -2031314 -2674554 -3932764 -1516546 1564650 719965 -1499374
11383 -1499374 -5134426 -5690155 -4127711 -1351959 260242 -1298354 -1132908 -392285 -622482
11374f22482R13799M3177K0377L79744L5864R28335M93855J13948j675858j068393
11364d37634j27770O98647L075214K836826Q88895o58678j879815k713071j402687
11355B79927P34413N91087O95566J577277L30861j236786j008921p79897r7625
11346A085902j462810q43110o84952p05841L96964P64288p14182n4788K020484
11337a98045j52491r87271n1411k88332j462850j280643r62830L28407K677813
11328b377653O64921k330882j794573K37522K176418L679176J549040k21630K6259
11319A608598M34865N34010o75993n64921J134022J652285L59427j300317n43028
11310B638948K52486M36862N15800q88116j622552j982054j206776p10747j440930
$$ plain form
11374 -622482 291317 334494 354871 734615 770479 1698814 2192669 2306617 630759 -437634
11364 -437634 -565404 133243 3208457 6045283 6934178 6275500 4395685 1682614 279927
11355 279927 1014340 1605427 2300993 3878270 4209131 2972345 1963424 1183527 1085902
11346 1085902 -376908 -1220018 -1904970 -2610811 -2213847 -1449559 -2163741 -2218529 -198045
11337 -198045 -350536 -1337807 -1389218 -1677550 -3140400 -4421043 -5383873 -5055466 -2377653
11328 -2377653 -1712732 -4043614 -5838187 -5600665 -3424247 254929 1803969 1582339 1608598
11319 1608598 2043463 2577473 1901480 1336559 2470581 4122866 4482293 3181976 2638948
11310 2638948 2891434 3328296 3844096 2955980 1333428 -648626 -1855402 -2566149 -4007079
11301d007079k34551J919464J803892J205054k63539j467228L20197J840468J160288
11292B276966p17479j649696p52516P08655K18046k90824J0319K68228J842771
11283A914470J713459j014838l64241o04447j033223m18067J399664m0590j421043
11274A31144j109875j002217j32069j160894O01263K445374k40996m88466L59376
11265e97360N09291k38341N00141P2493O53837J181089n86362m73719J204151
11256B225220K006923o36215k218257k947081j663925N01057K56431P74243J812006
11247A10402P53991J55684J099716o48956j493816j608859j554187j907308n31716
11238e625049R57107K97589j709077k192239J780717K556439J176424J546175
$$ plain form
11301 -4007079 -4241630 -2322166 -518274 686780 423241 -1043987 -723790 1116678 2276966
11292 2276966 1559487 -90209 -842725 -134070 83976 -206848 -196529 71699 1914470
11283 1914470 3627929 2613091 2248850 1644403 611180 193113 1592777 1552187 131144
11274 131144 -978731 -1980948 -2113017 -3273911 -2672648 -227274 -468270 -956736 -597360
11265 -597360 -88069 -326410 173731 246224 900061 2081150 1494788 1021069 2225220
11256 2225220 4232143 3595928 1377671 -1569410 -3233335 -2732278 -2475847 -1701604 110402
11247 110402 864393 1020077 2119793 1470837 -22979 -1631838 -3186025 -5093333 -5625049
11238 -5625049 -4667942 -4370353 -6079430 -8271669 -6490952 -3934513 -2758089 -1211914
11230a211914R02886Q52651k46557K81589J512723M59287l03083o04235P10753
11221B354100L92471j807941j297210L84100j206918j075724j51898m6587j386129
11212c841736j302206J988465K695953J383025L95966q75521R23754J149911j391387
11203A126224j734531M7537J874999k71673j152490P6872P00233J833925M43226
11194B944322r31839Q26362J424307M64205j289424k306171o98132N5041J25823
11185F14494R0318K46895K54715J908867Q79579J09071p80438Q5364P19295M41653
11175D569813k736171m057024O0832R55065P05971P62614J187271j46077R12845
11166B215139K286996M88983k717744k747456R8770j459629j868192K31254P79912
$$ plain form
11230 -1211914 -309028 543623 297066 578655 2091378 2550665 2247582 1643347 2354100
11221 2354100 2746571 938630 -358580 25520 -1181398 -2257122 -2409020 -2455607 -3841736
11212 -3841736 -5143942 -3155477 -459524 923501 1319467 443946 1367700 2517611 1126224
11203 1126224 -608307 -560770 1314229 1042556 -109934 -33062 667171 2501096 2944322
11194 2944322 2012483 2838845 4263152 4727357 3437933 1131762 433630 488671 614494
11185 614494 704812 951707 1206422 3115289 3994868 4103939 3323501 3408865 4128160 4569813
11175 4569813 1833642 -2223382 -2162550 -1207485 -501514 261100 1448371 1302294 2215139
11166 2215139 4502135 4991118 2273374 -474082 -375312 -1834941 -3703133 -3471879 -2691967
11157b691967K326379K097134p83738k136223j645373L39021r39362J551064J565603
11148c17462n06352j449961j843245K39727P38490N66927K492777K236424j043840
11139A113485o36598K183607L625314J954261j139643j803098k611163k997671
11131c11506m29108l25533j396644k804724j665241K644234L362627Q55680o69005
11122g39220K92027P77658r40497j841550Q9232J068012j82688n28097Q86689
11113a118434M05808j035310O29116J825113k58351j299933j568459j648453J118490
11104b950413J724860N03197k214552j432898J335377J116201q71244M63849J305574
11095a020049p62895r8225J707805K69365O874K67364J87381J04151n02069j88827
$$ plain form
11157 -2691967 -365588 1731546 947808 -1188415 -2833788 -2494767 -3434129 -1883065 -317462
11148 -317462 -823814 -2273775 -4117020 -3877293 -3138803 -2571876 -79099 2157325 1113485
11139 1113485 476887 2660494 6285808 8240069 7100426 5297328 2686165 -311506
11131 -311506 -740614 -1066147 -2462791 -5267515 -6932756 -4288522 -925895 -70215 -739220
11122 -739220 -447193 330465 -610032 -2451582 -2362350 -1294338 -1477026 -2005123 -1118434
11113 -1118434 -712626 -1747936 -1118820 706293 447942 -851991 -2420450 -4068903 -2950413
11104 -2950413 -1225553 -722356 -2936908 -4369806 -3034429 -1918228 -2789472 -2325623 -1020049
11095 -1020049 -1782944 -1881169 -173364 96001 102875 370239 557620 661771 159702 -29125
11085b9125J135332J012729O5160j503907r31361k77784o19317j86058o52970
11076a987301L27007K132772J752801M03409J237599J142207n06150o65524o30568
11067C206252k283271o7582O10142N33989l05027j472378j708249J540180K522827
11058B576883N45322q58286n23600j343516P081J421444j60792j31735J16734
11049A649535k012173m27386K270492J330430l10464N9590N04129n74348L23169
11040B812974k82492n24582k76986p50001n94350m70682n28993r15424p67441
11031b297977q74339p83430J140359r1111l60739K177421J471453J27940j495364
11022i85787j704870j325307p70291N4574k8961J058288K696204Q99628k46943
$$ plain form
11085 -29125 1106207 2118936 2184096 680189 -251172 -528956 -1148273 -1334331 -1987301
11076 -1987301 -1660294 472478 2225279 2628688 3866287 5008494 4502344 3836820 3206252
11067 3206252 922981 855399 1465541 1999530 1694503 222125 -1486124 54056 2576883
11058 2576883 3122205 2263919 1740319 396803 403884 1825328 1664536 1532801 1649535
11049 1649535 -362638 -790024 1480468 2810898 2500434 2560024 3064153 2489805 2812974
11040 2812974 2530482 2005900 1728914 978913 384563 -86119 -615112 -1530536 -2297977
11031 -2297977 -3172316 -3955746 -2815387 -2906498 -3267237 -1089816 381637 509577 -985787
11022 -985787 -2690657 -4015964 -4786255 -4731681 -4760642 -3702354 -1006150 -106522 -353465
11013c53465O82596R41052j30383k278067k549193j441128j22348J333810K049554
11004a867572J012239J440989N61997J656868K876j126429r8820J051438K615015
10995E248601L275066J158141J935952M639306O133779N990483J0397533J8839845
10987E7618706K6662739K1787136n451410k4322964k2668529j6134726r983586
10980B7507366m499360q76364J568295O259646J0091913J4652494K0642021K1726664
10972I7072675L297537k2892428k5993818j6746412j0905967p344076m258808
10965A2228703j315731q08906j210500j27378j443669k126245j985067j206290
10957B004917j506564j950106n14614N49037r48521r61260K90166J238627Q20361
$$ plain form
11013 -353465 329131 1270183 1139800 -1138267 -3687460 -5128588 -5250936 -3917126 -1867572
11004 -1867572 -855333 585656 1147653 2804521 2807397 1680968 1582148 2633586 5248601
10995 5248601 8523667 9681808 11617760 16257066 22390845 28381328 38778861 57618706
10987 57618706 84281445 106068581 100617171 76294207 53625678 37490952 27507366
10980 27507366 23008006 22131642 23699937 29959583 40051496 54703990 75346011 97072675
10972 97072675 100370212 77477784 51483966 34737554 23831587 16487511 12228703
10965 12228703 10912972 10104066 8893566 8766188 7322519 5196274 3211207 2004917
10957 2004917 498353 -1451753 -1966367 -1417330 -2365851 -3327111 -3036945 -1798318 -977957
10948i77957J710m59341J262145J477609J358761k59721l043349j539601k295313
10939d475057j552230J32489R97616K131187J201365l44312O49678k84488p75431
10930b319183N45240J72896J192856j66052N66590P35086o28468l77967l30328
10921f09330L05107J181269l95210k327123r32610K541795K542233j342616k639964
10912a676449j367772j70812k55408L10541n71054K21977J041714m3810l8902
10903b549975o89129K157784K755382j364098q65160J491504j054238k179593
10895b297523j382522k06019J450403Q08476J168521p55059j428470J631771J208235
10886A97813n59924J97028Q75335M70699k524869m048085j027195J999240K350387
$$ plain form
10948 -977957 -976247 -1435588 -173443 1304166 2662927 2403206 -640143 -2179744 -4475057
10939 -4475057 -6027287 -5894798 -4897182 -2765995 -1564630 -1908942 -1259264 -1543752 -2319183
10930 -2319183 -1773943 -1601047 -408191 -574243 -7653 727433 98965 -279002 -609330
10921 -609330 -304223 877046 481836 -1845287 -2777897 -236102 2306131 963515 -1676449
10912 -1676449 -3044221 -3215033 -3470441 -3159900 -3730954 -3508977 -2467263 -2511073 -2549975
10903 -2549975 -3239104 -1081320 1674062 309964 -555196 936308 -117930 -2297523
10895 -2297523 -3680045 -3886064 -2435661 -1627185 -458664 -1213723 -2642193 -1010422 197813
10886 197813 -362111 -165083 710252 1180951 -1343918 -5392003 -6419198 -4419958 -2069571
10877b069571M09542K59447p92534r54783o00895j70617J82326k0707q53050k368398
10867f979240p16874J598799J817200N88828O22662q85257p06691K090961L848584
10858A278972n20199J78511K119423L20409L10521N59396O18576Q8335q16622
10849D137322k249552l004219k125103R3937K116168O11168o45300n08904j646976
10840c221459k27615J693817J84980j634805j346426k13767N23946K160501J039830
10831a040998O41977J355090J005521j008321p63706j265874j893453l69309P35166
10822b603907N5039r9373n8424j084167j856648j338414O21940o53818q09486
10813g827258J051664M61717j87544k01288O60727J618462J110173M05351J118206
$$ plain form
10877 -2069571 -1660029 -1400582 -2193116 -3147899 -3748794 -3919411 -3737085 -3757792 -4610842 -6979240
10867 -6979240 -7696114 -6097315 -4280115 -3691287 -3068625 -3953882 -4660573 -2569612 1278972
10858 1278972 758773 937284 3056707 3377116 3687637 4247033 4865609 4953944 4137322
10849 4137322 1887770 -1116449 -3241552 -3147615 -1031447 -420279 -1065579 -1574483 -3221459
10840 -3221459 -3449074 -1755257 -1570277 -3205082 -4551508 -4765275 -4241329 -2080828 -1040998
10831 -1040998 -399021 956069 1961590 953269 189563 -1076311 -2969764 -3339073 -2603907
10822 -2603907 -2548868 -2648241 -2706665 -3790832 -5647480 -6985894 -6363954 -7017772 -7827258
10813 -7827258 -6775594 -6313877 -6501421 -6702709 -6041982 -4423520 -3313347 -2907996 -1789790
10804a789790K585692O53531J41050q85148j328517j262310r81030O64197J595939
10795f06386l6605O01399P43220J325380M69839l502935l194724m88587J537442
10786c151957J937376K97649j86419r42359j603461k504978k43401N84220n71658
10777f384988O23014J339332J0904o1601P78113J103338J753494J123443J080895
10768A365944l17660k116197j282050Q52118J254375R78346l24029N3780J475802
10759A940429J077805j7299L27886j88321N69588L95719k175937r96728L96715
10750A329857j66887j050321j136420r4098m12605K37183L82507k62377n41397
10741a714558Q49054P64935J085769L63452J9080J091949j25683j621767p80182
$$ plain form
10804 -1789790 795902 1449433 1590483 705335 -623182 -1885492 -2866522 -2202325 -606386
10795 -606386 -642991 -41592 701628 2027008 2496847 -1006088 -4200812 -4689399 -3151957
10786 -3151957 -1214581 -916932 -1103351 -2045710 -3649171 -6154149 -6397550 -5813330 -6384988
10777 -6384988 -5761974 -4422642 -4411738 -4473339 -3695226 -2591888 -838394 285049 1365944
10768 1365944 1048284 -1067913 -2349963 -1497845 -243470 734876 410847 464627 1940429
10759 1940429 3018234 3000935 3328821 3140500 3710088 4105807 1929870 933142 1329857
10750 1329857 1162970 112649 -1023771 -1117869 -1530474 -1293291 -910784 -1173161 -1714558
10741 -1714558 -865504 -100569 985200 1348652 1367732 2459681 2333998 712231 -67951
10732f7951N49862j020053P53767L251172K253469j540559k323297o69521k062140
10723h75251k101874j612231m3438L2204j107092P56563J515449L913451L664682
10714D142463J10750j469267j334348J080899J682720J802064N68151j443106
10706E140326j458056l9900j241478l139950o80978R35432J303588J073077O07716
10697B499777j02553n60688Q80599K12838j706600k015357j141073M53839J344673
10688a34545Q35550j15385O1363J122449K632989N2787j425167j874392j433441
10679b77792R07079J109034O13742L35939q72255q05741M77780J342975k054891
10670G75870k663477O38626J158152K035113N11602j946797k264600j071054O8438
$$ plain form
10732 -67951 481911 -538142 215625 3466797 5720266 4179707 1856410 1186889 -875251
10723 -875251 -2977125 -4589356 -4632794 -4600590 -5707682 -4951119 -3435670 477781 4142463
10714 4142463 4253213 2783946 1449598 2530497 4213217 6015281 6583432 5140326
10706 5140326 3682270 3642370 2400892 -739058 -1420036 -484604 818984 1892061 2499777
10697 2499777 2397224 1836536 2717135 2929973 1223373 -791984 -1933057 -1479218 -134545
10688 -134545 701005 585620 646983 1769432 4402421 4455208 3030041 1155649 -277792
10679 -277792 629287 1738321 2352063 2688002 1815747 1010006 1487786 2830761 775870
10670 775870 -1887607 -1248981 -90829 1944284 2455886 509089 -1755511 -2826565 -2758127
10661b758127J625669J076473j221744m76444M99675j94571j617883o09166J180349
10652b495769N46307O3153n76575l82484K253456K057119L3922j749076k950L73766
10642A20869r02242J29819R61617J526414N41595n36118R4662l32149K39380K95211
10632B139058K43260k720130j948335L44969N44228j544448j906129L8304J609425
10623c199798J918529k80829J55683Q89117m07306j567819k35045j59423M62745
10614b424146J772585J927519k62363r71275k84963R5024J188146R4678r2581
10605A042624O10183q37750j537423j090865j375981j911158n98225R8764L69265
10596e230566J591522K126730P05783O55163L13482K30916p4906k014011k289839
$$ plain form
10661 -2758127 -1132458 -55985 -1277729 -1754173 -1254498 -1449069 -3066952 -3676118 -2495769
10652 -2495769 -1949462 -1886309 -2462884 -2845368 -591912 1465207 1499129 -249947 -252897 120869
10642 120869 -781373 -651554 310063 1836477 2378072 1841954 1936616 1604467 1843847 2139058
10632 2139058 2382318 -337812 -2286147 -1941178 -1396950 -2941398 -4847527 -4809223 -3199798
10623 -3199798 -1281269 -1562098 -1406415 -517298 -924604 -2492423 -2727468 -2886891 -2424146
10614 -2424146 -651561 1275958 1013595 42320 -242643 -147619 1040527 1135205 1042624
10605 1042624 1652807 815057 -722366 -1813231 -3189212 -5100370 -5698595 -5599831 -5230566
10596 -5230566 -3639044 -1512314 -806531 -151368 162114 393030 318124 -1695887 -3985726
10587c985726j475708J347655L767134J932508R95000j226786o09190j228047
10579d83160q68893R23279j9059q52272k98849q74957Q42935O23324j807421j351129
10569d166202l48098P86830N66190L02464j18761j084326j49772L96437J071893
10560b743345J885656K431039K047466J236079J112601p2981o44930q12091j122409
10551C317085k744796j028085R90390j64495l58632m1140l70564j648513j854835
10542c903585o76641j660124m22707N35026M65492J945781J903348R33228j23611
10533a003793j154448p24883J312358K306843O13381k48111j770549j744094O03128
10524a810168J382295J149313j93230J21430M56588m63056l04000J74848j927533
$$ plain form
10587 -3985726 -5461434 -4113779 -346645 1585863 2580863 1354077 744887 -483160
10579 -483160 -1352053 -428774 -447833 -1300105 -1598954 -2473911 -1630976 -1007652 -2815073 -4166202
10569 -4166202 -4514300 -3727470 -3161280 -2858816 -2977577 -4061903 -4211675 -3815238 -2743345
10560 -2743345 -857689 1573350 3620816 4856895 5969496 5896515 5251585 4439494 3317085
10551 3317085 572289 -455796 534594 370099 11467 -29673 -400237 -2048750 -3903585
10542 -3903585 -4580226 -6240350 -6663057 -6128031 -5662539 -3716758 -1813410 -880182 -1003793
10533 -1003793 -2158241 -2883124 -1570766 736077 1349458 1101347 -669202 -2413296 -1810168
10524 -1810168 -427873 721440 528210 649640 1106228 643172 339172 514020 -1413513
10515a413513k454028k76047K771994K272933o10265j529057o46712q04284l35500
10506c024479J148312Q13404j263516j020671J053376J619257j84707j393433
10498b252457j568237k079007j295711J640361J748731R66304J156644J127621
10490e55751m3013M37089P16727o9967k591522r40329J397801O17456J964871
10481I33362J028390m72421j566299q73683J273391J820257Q06040j179430j839771
10472g0164p21877N71188J471361k60969K151942L580835O79174k384609j177732
10463C839149J104415J340240n7415j146819j733254j320202n93916q34211q88530
10454b90543P83362O93k251579m25881J584434K961716O29354n86869N00617J196158
$$ plain form
10515 -1413513 -3867541 -4143588 -1371594 901339 291074 -1237983 -1884695 -2688979 -3024479
10506 -3024479 -1876167 -1062763 -2326279 -3346950 -2293574 -674317 -859024 -2252457
10498 -2252457 -3820694 -5899701 -7195412 -5555051 -3806320 -2840016 -1683372 -555751
10490 -555751 -598764 -161675 555052 485085 -2106437 -3046766 -1648965 -1031509 933362
10481 933362 1961752 1489331 -76968 -950651 322740 2142997 2949037 1769607 -70164
10472 -70164 -792041 -220853 1250508 989539 3141481 6722316 7401490 5016881 3839149
10463 3839149 4943564 6283804 6226389 5079570 3346316 2026114 1432198 597987 -290543
10454 -290543 492819 493512 -1758067 -2183948 -599514 2362202 2991556 2404687 2905304 4101462
10444D101462J734155m37018r28738J45133J6565q24627j737755j803805o67077
10435d01705l78382n91191m26628Q24m33468O01984N57181M10614j58053j234939
10425b053763K30000R25720L20342L23232r86132k219338j276918N43886J728577
10416b464394R38524L48341R7749M37543R25128K83335J663913n78144r73242
10407F78753k03473k56931j041166k274080L05462J763807K150649K096027k02090
10398C016958j096707j415656k57303J864574L35920j641949R3796J162307R82172
10389C044112p9752k58787P46940o87878l294576k732962M45308O22528N8263
10380b136804R85308J689989J159023k13423P1580m32926j020731j171301o04419
$$ plain form
10444 4101462 5835617 5398599 4469861 4614994 4631559 3806932 2069177 265372 -401705
10435 -401705 -780087 -1371278 -1797906 -1797082 -2230550 -1628566 -1071385 -660771 -818824 -2053763
10425 -2053763 -1823763 -898043 -577701 -254469 -1240601 -3459939 -4736857 -4192971 -2464394
10416 -2464394 -1525870 -1177529 -1079780 -642237 282891 566226 2230139 1651995 678753
10407 678753 475280 218349 -822817 -3096897 -2791435 -1027628 1123021 3219048 3016958
10398 3016958 1920251 504595 247292 2111866 2447786 805837 899633 2061940 3044112
10389 3044112 2964360 2705573 3452513 2764635 -529941 -3262903 -2817595 -2195067 -2136804
10380 -2136804 -1151496 538493 1697516 1484093 1555673 1122747 102016 -1069285 -1673704
10371a673704J164625J899097j77564j03586J359977k0908q48367k33128r02048
10362D64394j534381k46962J476096L032303R05499q58010k507883j486501P74558
10353A9113Q47689q62937k044024j501145j14618J206228J004335M97710P93807
10344a53842J223378Q72166j066994j023246K800039K723939Q80672r03410r78879
10335D373823j527974o94490J46906J877450J570856o08687k590229r98740K89750
10326A838665n48996n22644N33695j101781k440363q22285O69982K490144J208391
10317A304808j7941k47918k32613l27369q70748j377869n9671J544301J829616
10308A544596P4910j604777j553398l32701J218587Q56419j696064p05725Q27263
$$ plain form
10371 -1673704 -509079 1390018 1212454 1108868 2468845 2447937 1599570 1366442 464394
10362 464394 -1069987 -1316949 159147 3191450 4096949 3238939 731056 -755445 19113
10353 19113 866802 3865 -2040159 -3541304 -3655922 -2449694 -1445359 -947649 -153842
10344 -153842 1069536 1941702 874708 -148538 2651501 5375440 6256112 5352702 4373823
10335 4373823 2845849 2151359 2298265 4175715 5746571 5137884 2547655 1548915 1838665
10326 1838665 1289669 767025 1300720 198939 -2241424 -3063709 -2393727 96417 1304808
10317 1304808 1286867 1038949 806336 478967 -391781 -1769650 -1829321 -285020 1544596
10308 1544596 1619506 14729 -1538669 -1871370 -652783 203636 -1492428 -2198153 -1370890
10299a370890j544810j357648J3277L48459J194714J295473Q22827j563767j16668
10290b279033O80608O9327j266731j315531q96548J93146J017143K015086R82830
10281g99703J75142M23315K51870j559823r97363J041305K178594N45372p21944
10272E36765Q91333M9162O59716K170421Q79047k657108l881482j567279M16757
10263b502668J908582L117326O96176o82820K0774j87576k43358k544691j062596
10254a480851k1620N79246K264332J167930j665547j635894R50895J559111m36411
10245A281191k740686k724938p24658J59528Q55617J883811j038670l62078j17385
10236c528268J98198j152205n79927J166291J060831J859877J274609M9922l06191
$$ plain form
10299 -1370890 -2915700 -4273348 -4260071 -3911612 -2716898 -1421425 -598598 -2162365 -2279033
10290 -2279033 -1598425 -1529098 -2795829 -4111360 -5007908 -4814762 -3797619 -1782533 -799703
10281 -799703 -624561 -201246 50624 -1509199 -2506562 -1465257 713337 1258709 536765
10272 536765 1428098 1477260 2136976 4307397 5186444 2529336 -1352146 -2919425 -2502668
10263 -2502668 -594086 2523240 3219416 2536596 2557370 2369794 2126436 -418255 -1480851
10254 -1480851 -1502471 -923225 1341107 2509037 843490 -792404 158491 1717602 1281191
10245 1281191 -1459495 -4184433 -4909091 -4749563 -3893946 -2010135 -3048805 -3410883 -3528268
10236 -3528268 -3330070 -4482275 -5062202 -3895911 -2835080 -975203 299406 349328 43137
10227D3137J015275l07758k019189j325797J181631K409528Q10752p73175j306035
10218b71631j739709M84043K459517Q92792l89441n53487o72917j062536o35638
10209a489007k111335r38047K548888K557681J418398J111175j79163j282095
10201A636495j823198j915149j035068M76564N94383n28912r96742Q95172J995853
10192g00602J381685J787854j24401r25713M60772P28256m61471p66943o58678
10183G20759j734918k269840o39136R50652K408120K114277l4622n47926K022278
10174B989644J084098j544795k045572j224642M0287l77831o54028N78744J364210
10165B10115K88469n8865P85565O75781K60587j183703K96733J734943M82042
$$ plain form
10227 43137 1058412 750654 -1268535 -2594332 -1412701 996827 1807579 1034404 -271631
10218 -271631 -2011340 -1527297 932220 1825012 1435571 882084 209167 -853369 -1489007
10209 -1489007 -3600342 -4538389 -1989501 568180 1986578 3097753 2918590 1636495
10201 1636495 -186703 -2101852 -3136920 -2660356 -2065973 -2594885 -3591627 -2696455 -700602
10192 -700602 681083 2468937 2344536 1418823 1879595 2607851 2146380 1379437 720759
10183 720759 -1014159 -3283999 -3923135 -2972483 -564363 1549914 1515292 967366 2989644
10174 2989644 4073742 2528947 483375 -741267 -700980 -1078811 -1732839 -1154095 210115
10165 210115 498584 439719 1225284 1901065 2161652 977949 1274682 3009625 3491667
10156C491667m48189j033143j258907o22758j43702O129P48576M50482O83218
10147A873373P14078J49804R1093j079467j622441k782080m86824K552959K898591
10138B309086J355264j102855k416967j088321q45497j171038k20136J903944
10130a276520L105724J92045j979471m61548P00395P08221J61993Q40584J493378
$$ plain form
10156 3491667 3043478 2010335 751428 128670 -15032 -8903 739673 1190155 1873373
10147 1873373 2587451 2737255 2828348 1748881 126440 -2655640 -3142464 -589505 2309086
10138 2309086 3664350 2561495 144528 -943793 -1789290 -2960328 -3180464 -1276520
10130 -1276520 1829204 2021249 41778 -419770 280625 988846 1150839 1991423 3484801
$$ [...]
##END NTUPLES=NMR SPECTRUM
##END=
