##TITLE=C13_BAU-j-NN 
 CDCl3, 1600 sc

 29.4.2019
##JCAMPDX= 6.0         $$ Bruker NMR JCAMP-DX V2.0
##DATA TYPE= NMR SPECTRUM
##DATA CLASS= NTUPLES
##ORIGIN= UXNMR, Bruker Analytische Messtechnik GmbH
##OWNER= root
$$ XWIN-NMR		Version 3.5
$$ Mon Apr 29 16:00:37 2019 Russian Standard Time (UT+4h)  she@DPX200
##.OBSERVE FREQUENCY= 50.3278965144739
##.OBSERVE NUCLEUS= ^13C
##.ACQUISITION MODE= SIMULTANEOUS
##.ACQUISITION SCHEME= undefined
##.AVERAGES= 1600
##.DIGITISER RES= 17
##SPECTROMETER/DATA SYSTEM= spect
##.PULSE SEQUENCE= zgpg30
##.SOLVENT NAME= CDCl3
##.SHIFT REFERENCE= (INTERNAL, CDCl3, 0, 225.262)
##AUDIT TRAIL= $$ (NUMBER, WHEN, WHO, WHERE, WHAT)
$$ ##TITLE= Audit trail, XWIN-NMR		Version 3.5
$$ ##JCAMPDX= 5.01
$$ ##ORIGIN= Bruker BioSpin GmbH
$$ ##OWNER= she
$$ F:/spectra/data/she/nmr/c13/1/pdata/1/auditp.txt
$$ ##AUDIT TRAIL=  $$ (NUMBER, WHEN, WHO, WHERE, WHAT)
(   1,<2019-04-29 15:59:05.59 +0400>,<she>,<DPX200>,
      <created by zg, POWCHK disabled, PULCHK disabled
       terminated by command 'halt'
       configuration hash MD5:
       00 E9 B6 7A A2 85 ED C7 34 08 36 98 17 FE 4E 26
       data hash MD5: 32K
       00 22 32 7D 14 F7 AD 1B 00 88 F6 11 D4 28 29 44>)
(   2,<2019-04-29 15:59:23.35 +0400>,<she>,<DPX200>,
      <Start of raw data processing
       efp BC_mod = 2 LB = 1 FT_mod = 6 PKNL = 1 PHC0 = -376.8376 PHC1 = 38.40641 SI = 32K 
       data hash MD5: 32K
       4C EB 1E 4B CB 8C 1F BD 87 5F F8 02 24 D1 76 A6>)
(   3,<2019-04-29 15:59:26.21 +0400>,<she>,<DPX200>,
      <abs ABSG = 5 
       data hash MD5: 32K
       61 1E 30 D1 11 35 4F 67 CC 38 06 62 3A 05 54 3A>)
(   4,<2019-04-29 15:59:43.45 +0400>,<she>,<DPX200>,
      <pk PHC0 = -3.164939 PHC1 = 0 
       data hash MD5: 32K
       60 4E 52 8E CB B3 59 A3 D5 33 F5 54 FE DD 1B EC>)
(   5,<2019-04-29 15:59:46.95 +0400>,<she>,<DPX200>,
      <abs ABSG = 5 
       data hash MD5: 32K
       A1 4C 17 74 25 42 52 D1 27 C4 9B 98 49 F7 D8 2F>)
$$ ##END=
$$ 
$$ hash MD5
$$ 3D FA 56 3D D7 08 7F 27 81 A3 B4 86 5E F2 B6 D4
##$RELAX= 
##$RELAX= 
##$RELAX= 
##$RELAX= 
##$RELAX= 
##$RELAX= 
##$RELAX= 
##$RELAX= 
$$ Bruker specific parameters
$$ --------------------------
##$DU= <F:/spectra>
##$EXPNO= 1
##$NAME= <c13>
##$PROCNO= 1
##$TYPE= <nmr>
##$USER= <she>
##$AMP= (0..31)
100 100 100 100 100 100 100 100 100 100 100 100 100 100 100 100 100 100 
100 100 100 100 100 100 100 100 100 100 100 100 100 100 
##$AQSEQ= 0
##$AQ_mod= 1
##$AUNM= <au_zg>
##$AUTOPOS= <>
##$BF1= 50.322709
##$BF2= 200.13
##$BF3= 50.322709
##$BF4= 500.13
##$BF5= 500.13
##$BF6= 500.13
##$BF7= 500.13
##$BF8= 500.13
##$BYTORDA= 1
##$CFDGTYP= 0
##$CFRGTYP= 5
##$CHEMSTR= <none>
##$CNST= (0..31)
1 1 145 1 1 1 1 1 1 1 1 1 1 1 1 1 1 1 1 1 1 1 1 1 1 1 1 1 1 1 1 1 
##$CPDPRG= <waltz16>
##$CPDPRG1= <>
##$CPDPRG2= <waltz16>
##$CPDPRG3= <>
##$CPDPRG4= <mlev>
##$CPDPRG5= <mlev>
##$CPDPRG6= <mlev>
##$CPDPRG7= <mlev>
##$CPDPRG8= <mlev>
##$CPDPRGB= <>
##$CPDPRGT= <>
##$D= (0..31)
$$ [...]
##$SUBNAM4= <"">
##$SUBNAM5= <"">
##$SUBNAM6= <"">
##$SUBNAM7= <"">
##$SUBNAM8= <"">
##$SUBNAM9= <"">
##$SW= 239.972172938263
##$SWIBOX= (0..15)
0 1 3 0 0 0 0 0 0 0 0 0 0 0 0 0 
##$SW_h= 12077.2946859903
##$TD= 32768
##$TD0= 1
##$TE= 0
##$TE2= 300
##$TE3= 300
##$TEG= 300
##$TL= (0..7)
120 120 120 120 120 120 120 120 
##$TP= (0..7)
150 150 150 150 150 150 150 150 
##$TP07= 0
##$TPNAME0= <>
##$TPNAME1= <>
##$TPNAME2= <>
##$TPNAME3= <>
##$TPNAME4= <>
##$TPNAME5= <>
##$TPNAME6= <>
##$TPNAME7= <>
##$TPOAL= (0..7)
0.5 0.5 0.5 0.5 0.5 0.5 0.5 0.5 
##$TPOFFS= (0..7)
0 0 0 0 0 0 0 0 
##$TUNHIN= 0
##$TUNHOUT= 0
##$TUNXOUT= 0
##$USERA1= <user>
##$USERA2= <user>
##$USERA3= <user>
##$USERA4= <user>
##$USERA5= <user>
##$V9= 5
##$VALIST= <valist>
##$VCLIST= <CCCCCCCCCCCCCCC>
##$VD= 0
##$VDLIST= <DDDDDDDDDDDDDDD>
##$VPLIST= <PPPPPPPPPPPPPPP>
##$VTLIST= <TTTTTTTTTTTTTTT>
##$WBST= 1024
##$WBSW= 4
##$XGAIN= (0..3)
0 0 0 0 
##$XL= 0
##$YL= 0
##$YMAX_a= 10189081
##$YMIN_a= -2572419
##$ZGOPTNS= <>
##$ZL1= 120
##$ZL2= 120
##$ZL3= 120
##$ZL4= 120
##$ABSF1= 225.2625
##$ABSF2= -14.73494
##$ABSG= 5
##$ABSL= 3
##$ALPHA= 0
##$AQORDER= 0
##$ASSFAC= 0
##$ASSFACI= 0
##$ASSFACX= 0
##$ASSWID= 0
##$AUNMP= <proc_1d>
##$AZFE= 0.1
##$AZFW= 0.5
##$BCFW= 0
##$BC_mod= 2
##$BYTORDP= 0
##$COROFFS= 0
##$CY= -3
##$DATMOD= 1
##$DC= 0
##$DFILT= <>
##$DTYPP= 0
##$F1P= 0
##$F2P= 0
##$FCOR= 0.5
##$FTSIZE= 32768
##$FT_mod= 6
##$GAMMA= 0
##$GB= 0
##$INTBC= 1
##$INTSCL= 4.134877e-10
##$ISEN= 128
##$LB= 1
##$LEV0= 0
##$LPBIN= 0
##$MAXI= 10000
##$MC2= 0
##$MEAN= 0
##$ME_mod= 0
##$MI= 0.1934396
##$NCOEF= 0
##$NC_proc= -2
##$NLEV= 6
##$NOISF1= 120.0001
##$NOISF2= 80.00006
##$NSP= 0
##$NTH_PI= 0
##$NZP= 0
##$OFFSET= 225.2625
##$PC= 1.4
##$PHC0= -380.0025
##$PHC1= 38.40641
##$PH_mod= 1
##$PKNL= yes
##$PPARMOD= 0
##$PSCAL= 0
##$PSIGN= 0
##$REVERSE= no
##$SF= 50.3225993700027
##$SI= 32768
##$SIGF1= 140
##$SIGF2= 120
##$SINO= 11.81781
##$SIOLD= 32768
##$SREGLST= <13C.CDCl3>
##$SSB= 0
##$STSI= 32768
##$STSR= 0
##$SW_p= 12077.2946859903
##$SYMM= 0
##$S_DEV= 0
##$TDeff= 32768
##$TDoff= 0
##$TI= <>
##$TILT= no
##$TM1= 0
##$TM2= 0
##$TOPLEV= 0
##$USERP1= <user>
##$USERP2= <user>
##$USERP3= <user>
##$USERP4= <user>
##$USERP5= <user>
##$WDW= 1
##$XDIM= 32768
##$YMAX_p= 504181668
##$YMIN_p= -13154109
$$ End of Bruker specific parameters
$$ ---------------------------------
##NTUPLES= NMR SPECTRUM
##VAR_NAME=  FREQUENCY,     SPECTRUM/REAL,   SPECTRUM/IMAG
##SYMBOL=    X,             R,               I
##VAR_TYPE=  INDEPENDENT,   DEPENDENT,       DEPENDENT
##VAR_FORM=  AFFN,          ASDF,            ASDF
##VAR_DIM=   32768,         32768,           32768
##UNITS=     HZ,            ARBITRARY UNITS, ARBITRARY UNITS
##FACTOR=    0.368581032318806, 1,           1
##FIRST=     11335.7943870128, 0,            0
##LAST=      -741.500298977453, 0,           0
##MIN=       -741.500298977453, -13154109,   0
##MAX=       11335.7943870128, 504181668,    0
$$ Real data points
##PAGE= N=1
##DATA TABLE= (X++(R..R)), XYDATA
$$ [...]
$$ plain form
15443 1805996 1324645 340195 -396024 -1340700 -42995 182166 -611976 -933542 -1307432
15434 -1307432 -1474215 -1363512 -1028889 540916 2325828 1761854 1014490 1208020 -852701
15425 -852701 -2672782 -1916098 -34786 -247497 -2864367 -3773768 -1405401 879532 708089
15416 708089 -355897 -1294234 -1447567 -691897 -1455 34364 -955015 -793026 468935
15407 468935 291657 -516749 -2244932 -3455481 -2758492 -1032122 54610 25650 -1246418
15398 -1246418 -4095628 -4908014 -4180083 -3997760 -3865831 -2617041 -922500 -213675 -918721
15389 -918721 -2870590 -4176921 -3681784 -3816610 -4040150 -2258665 -1593619 -2341777 -1436131
15380 -1436131 465262 -166344 -1587167 -1887396 -2351470 -3394060 -4741422 -4836428 -3489398
$$ packed form
15443A805996m81351r84450p36219r44676J297705K25161p94142l21566l73890
15434a307432j66783J10703L34623J569805J784912n63974p47364J93530k060721
15425h52701j820081P56684J881312k12711k616870r09401K368367K284933j71443
15416G08089j063986r38337j53333P55670O90442L5819r89379J61989J261961
15407D68935j77278q08406j728183j210549O96989J726370J086732k8960j272068
15398a246418k849210q12386P27931J82323J31929J248790J694541P08825p05046
15389i18721j951869j306331M95137j34826k23540J781485O65046p48158R05646
15380a436131J901393o31606j420823l00229m64074j042590j347362r5006J347030
$$ plain form
15371 -3489398 -544966 742460 1271855 555165 -2422993 -4989226 -6184644 -5525713 -3762896
15362 -3762896 -2754875 -2753166 -2907246 -1854956 -337012 -618330 -673799 -442841 545150
15353 545150 1277675 2923987 3325398 2213502 518494 -740534 -1873298 -1921934 -721073
15344 -721073 905090 -274014 -1697513 -16232 1168082 729391 494118 -384125 -1184392
15335 -1184392 -418739 108565 -1113575 -790458 1007679 2071484 1554425 2008478 3688579
15326 3688579 3210195 1904698 1677057 1578172 1132822 835886 1162676 2098591 2329853
15317 2329853 1871585 -281175 -2573668 -4514249 -5182300 -3332637 702081 3355882
15309 3355882 3725456 4172397 4982467 3601681 3328725 3879577 3370456 2681530 2509897
$$ packed form
15371c489398K944432J287426N29395p16690k978158k566233j195418O58931J762817
15362c762896J008021J709j54080J052290J517944k81318n5469K30958R87991
15353E45150P32525J646312M01411j111896j695008j259028j132764m8636J200861
15344g21073J626163j179104j423499J681281J184314m38691k35273q78243q00267
15335a184392P65653N27304j222140L23117J798137J063805n17059M54053J680101
15326C688579m78384j305497k27641r8885m45350k96936L26790R35915K31262
15317B329853m58268k152760k292493j940581o68051J849663M034718K653801
15309C355882L69574M46941Q10070j380786k72956N50852n09121o88926j71633
$$ plain form
15300 2509897 1035332 -933709 -2061425 -2348226 -1025197 965633 1507877 1684555 1801242
15291 1801242 1432356 1115220 1892255 2176717 2767243 4025525 3666641 2355609 633299
15282 633299 -1700263 -3289339 -3172666 -4076884 -4184573 -2338859 -2608616 -3023420 -3445726
15273 -3445726 -3856267 -3212237 -1941919 -2208623 -1621092 248315 1486332 1825566 2019774
15264 2019774 2891003 3801218 1963421 -909092 -2472514 -2663933 -1772732 -1143344 -2306192
15255 -2306192 -3779660 -3490257 -2939301 -1178501 -193012 -2102842 -2769364 -1134510 -79645
15246 -79645 -103400 441157 -56356 -170619 -572095 -1018872 -161006 557111 -186727 -685376
15236 -685376 -1061702 -2433386 -2139030 -2871300 -3489152 -4198653 -3227735 -1174899 -1949812
$$ packed form
15300B509897j474565j969041j127716k86801J323029J990830N42244J76678J16687
15291A801242l68886l17136P77035K84462N90526J258282l58884j311032j722310
15282F33299k333562j589076J16673r04218j07689J845714k69757m14804m22306
15273c445726m10541O44030J270318k66704N87531J869407J238017L39234J94208
15264B019774Q71229R10215j837797k872513j563422j91419Q91201O29388j162848
15255b306192j473468K89403N50956J760800R85489j909830o66522J634854J054865
15246g9645k3755N44557m97513j14263m01476m46777Q57866P18117p43838m98649
15236f85376l76326j371684K94356p32270o17852p09501R70918K052836p74913
$$ plain form
15227 -1949812 -749997 1516675 1957762 3038808 3622794 2285440 380602 -249359 232686
15218 232686 1549713 4204778 5538184 4057440 3356718 3688378 3815700 3118946 1808344
15209 1808344 1504349 1622314 1211667 1808350 1943488 1260891 -92320 -2219804 -2571992
15200 -2571992 -2722955 -3657378 -1507087 -323978 80147 683389 1531685 443347 353116
15191 353116 1597309 1233564 1282925 1836301 785707 559581 843893 699366 2229381
15182 2229381 2978537 2580933 447151 362908 1488887 1340141 595237 -121433 1119307
15173 1119307 1676179 1291866 1662489 2806338 3235732 2892494 1474524 1314939 667694
15164 667694 -1015765 -815357 888334 -109971 -2061617 -3073788 -3697226 -1682174 462679
$$ packed form
15227a949812J199815K266672M41087J081046N83986j337354j904838o29961M82045
15218B32686J317027K655065J333406j480744p00722L31660J27322o96754j310602
15209A808344l03995J17965m10647N96683J35138o82597j353211k127484l52188
15200b571992j50963r34423K150291J183109M04125O03242Q48296j088338r0231
15191C53116J244193l63745M9361N53376j050594k26126K84312j44527J530015
15182B229381P49156l97604k133782q4243J125979j48746p44904p16670J240740
15173A119307N56872l84313L70623J143849M29394l43238j417970j59585o47245
15164F67694j683459K00408J703691r98305j951646j012171o23438K015052K144853
$$ plain form
15155 462679 1823782 3167175 1840951 -874860 -3912759 -5000217 -3337937 -915231
15147 -915231 782372 2399510 2404225 370388 -846008 -1080518 516550 897670 594215
15138 594215 1098610 1773340 825260 -324967 12703 1844361 3420797 2830498 -162101
15129 -162101 -621050 1161488 1454909 1612882 2809368 2423444 1491473 2206232 2132648
15120 2132648 1029122 -319110 -663777 674328 3033767 3494256 1169524 761662 3115759
15111 3115759 2883988 1673504 1112529 606984 -98895 -504200 -1182003 -1356954 -109483
15102 -109483 206053 -363346 -875491 -1960048 -1883724 -1265314 -1756275 -2480125 -3345689 -5129305
15092 -5129305 -3512709 -361194 1235765 2042686 3231374 3318904 228202 -2808993 -4816010
$$ packed form
15155D62679J361103J343393j326224k715811l037899j087458J662280K422706
15147i15231J697603J617138M715k033837j216396k34510J597068L81120l03455
15138E94215N04395O74730r48080j150227L37670J831658J576436n90299k992599
15129a62101m58949J782538K93421J57973J196486l85924r31971P14759p3584
15120B132648j103526j348232l44667J338105K359439M60489k324732m07862K354097
15111C115759k31771j210484n60975n05545p05879m05305o77803j74951J247471
15102a09483L15536n69399n12145j084557P6324O18410m90961p23850q65564j783616
15092e129305J616596L151515J596959Q06921J188688Q7530l090702l037195k007017
$$ plain form
15083 -4816010 -5293841 -5520125 -4750895 -2260403 -1441310 -2297705 -2584394 -711071 -147679
15074 -147679 -451962 -902915 -1849535 -2767763 -2270699 -682817 1297725 1900676 1512014
15065 1512014 -304133 -1186163 -147413 -407708 -663421 128476 -397657 -743663 629120
15056 629120 535491 -469421 -769432 -1203156 25243 1674909 2306366 2657889 2300674
15047 2300674 1561567 1027504 2274473 3326489 3599898 4056164 3699890 5085395 6395221
15038 6395221 4780150 1933249 358094 -158317 -116801 864658 741574 1100789 1318083
15029 1318083 3345405 5276117 5641827 5665152 5802074 6602573 7394840 7109989 4491350
15020 4491350 1169060 -523955 -31019 291684 761179 1246456 769064 7426 -549247
$$ packed form
15083d816010m77831k26284P69230K490492Q19093q56395k86689J873323N63392
15074a47679l04283m50953r46620r18228M97064J587882J980542O02951l88662
15065A512014j816147q82030J038750k60295k55713P91897n26133l46006J372783
15056F29120r3629j004912l00011m33724J228399J649666O31457L51523l57215
15047B300674p39107n34063J246969J052016K73409M56266l56274J385505J309826
15038F395221j615071k846901j575155n16411M1516R81459j23084L59215K17294
15029A318083K027322J930712L65710K3325J36922Q00499P92267k84851k618639
15020D491350l322290j693015M92936L22703M69495M85277m77392p61638n56673
$$ plain form
15011 -549247 -733480 -1535865 -1870248 -775581 -212425 -854777 -461369 -1908695 -4523250
15002 -4523250 -4216513 -883978 2831675 4449920 2603577 7249 -2221690 -3033775
14994 -3033775 -2723698 -1629915 -220779 617138 839578 -74444 -653945 238387 593671
14985 593671 217192 506461 -71182 -75870 687473 1226924 968444 270948 957441 2499387
14975 2499387 3874822 2860422 947179 -325795 -190599 -751220 -2652127 -1730255 183266
14966 183266 -731861 -455582 732270 1155669 1689087 1867627 617764 458130 395397
14957 395397 -322875 -536039 -455390 -682407 -1400980 -2760394 -3489215 -3557829 -3620841 -2530690
14947 -2530690 -2071607 -4834418 -8724669 -7710066 -3628874 -1749775 -2035979 -1258690 1010662
$$ packed form
15011e49247j84233q02385l34383J094667N63156o42352L93408j447326k614555
15002d523250L06737L332535L715653J618245j846343k596328k228939q12085
14994c033775L10077J093783J409136Q37917K22440r14022n79501Q92332L55284
14985E93671l76479K89269n77643m688P63343N39451k58480o97496O86493J541946
14975B499387J375435j014400j913243j272974J35196n60621j900907R21872J913521
14966A83266r15127K76279J187852M23399N33418J78540j249863j59634o2733
14957C95397p18272k13164Q0649k27017p18573j359414p28821o8614o3012J090151
14947b530690M59083k762811l890251J014603M081192J879099k86204P77289K269352
$$ plain form
14938 1010662 2170621 1769508 132479 -1422116 -1144294 276114 1648060 1876702 1820231
14929 1820231 2598973 3463952 3246205 905169 256907 1096449 778394 -2153931 -4661489
14920 -4661489 -5146411 -6182785 -6197014 -4877685 -2635776 -1799281 -3160246 -2917252 -1787509
14911 -1787509 -650051 -182742 26970 -363554 -1097979 -296296 1738116 2916722 1305747
14902 1305747 -158962 1776500 2712582 1603778 2148169 4771301 6464463 6834103 7718744
14893 7718744 8332273 7854011 4910023 445772 -2460205 -1698586 23318 818040 379683
14884 379683 -786897 -4101097 -5361306 -4560196 -4201484 -3815342 -2827897 -1005004 203423
14875 203423 670171 863031 1141006 550409 -898635 -2735804 -3110112 -2259577 -715788
$$ packed form
14938A010662J159959m01113j637029j554595K77822J420408J371946K28642n6471
14929A820231P78742Q64979k17747k341036o48262Q39542l18055k932325k507558
14920d661489m84922j036374j4229J319329K241909Q36495j360965K42994J129743
14911a787509J137458M67309K09712l90524p34425Q01683K034412J178606j610975
14902A305747j464709J935462R36082j108804N44391K623132J693162L69640Q84641
14893G718744O13529m78262k943988m464251k905977P61619J721904P94722m38357
14884C79683j166580l314200j260209Q01110L58712L86142R87445J822893J208427
14875B03423M66748J92860K77975n90597j449044j837169l74308Q50535J543789
$$ plain form
14866 -715788 110724 367260 -599424 -1347795 -1824528 -1240785 -558826 844063 2290632
14857 2290632 1470673 1120985 2897890 3187228 704252 1071 1525175 2509396 2299812
14848 2299812 2070985 2314667 3444442 4084659 3461855 2776219 1189566 435229 762689
14839 762689 117031 112060 107383 -104019 -2032982 -3905147 -2759467 -2228931 -2246560 -2017751
14829 -2017751 -3848933 -5268259 -4388491 -3623946 -2816831 -3085524 -3715523 -2175023 1109237
14820 1109237 1976100 510058 991589 4156746 7486802 7869221 6314354 6253300 7532703
14811 7532703 7880725 6661024 4354902 3304313 2620154 1746588 554175 495169 -1035496
14802 -1035496 -4837499 -5509597 -3922939 -2914331 -1993426 -1895135 -2779822 -1694209 -953486
$$ packed form
14866g15788Q26512K56536r66684p48371m76733N83743O81959J402889J446569
14857B290632q19959l49688J776905K89338k482976p03181J524104R84221k09584
14848B299812k28827K43682J129775O40217o22804o85636j586653p54337L27460
14839G62689o45658m971m677k11402j928963j872165J145680N30536j7629K28809
14829b017751j831182j419326Q79768P64545Q07115k68693o29999J540500L284260
14820A109237Q66863j466042M81531L165157L330056L82419j554867o1054J279403
14811G532703L48022j219701k306122j050589o84159q73566j192413n9006j530665
14802a035496l802003o72098J586658J008608R20905R8291q84687J085613P40723
$$ plain form
14793 -953486 -871122 -864477 -3459319 -4881288 -3334993 -2867765 -4289438 -3931009 -2070222
14784 -2070222 -1342866 1443938 2967629 1714792 -500655 586708 2716530 2845107
14776 2845107 1559056 215758 -607502 -1076899 858084 2297988 1768289 251795 -843402
14767 -843402 488936 3987363 6385091 7056051 6044131 6194670 6454542 4675148 4557440
14758 4557440 6182174 6312364 4456209 2782164 3508165 3390422 1838138 2027039 4670469
14749 4670469 5840851 5905646 3857150 1211298 686420 642699 97240 -1077568 -1806170
14740 -1806170 -2092738 -3214899 -4389408 -3711988 -2659326 -2941941 -4041125 -4396120 -4284586
14731 -4284586 -2911732 -1326649 -2020597 -1012588 484133 1975089 3860789 3283896
$$ packed form
14793i53486Q2364O645k594842j421969J546295M67228j421673L58429J860787
14784b070222P27356K786804J523691j252837k215447J087363K129822J28577
14776B845107j286051j343298q23260m69397J934983J439904n29699j516494j095197
14767h43402J332338L498427K397728O70960j011920J50539K59872j779394j17708
14758D557440J624734J30190j856155j674045P26001j17743j552284J88901K643430
14749D670469J170382O4795k048496k645852n24878m3721n45459j174808p28602
14740a806170k86568j122161j174509O77420J052662k82615j099184l54995J11534
14731d284586J372854J585083o93948J008009J496721J490956J885700n76893
$$ plain form
14723 3283896 619913 197525 1117783 1130497 -2528504 -6715555 -6439493 -4450229 -4921738
14714 -4921738 -5673793 -4532747 -4237244 -3818075 -2891085 -2107630 -1336965 -1546099 -2678933
14705 -2678933 -3068555 -3010230 -3798016 -4562669 -3504337 -997825 529706 -142423 -1505196
14696 -1505196 -1278523 -182531 2314357 4561754 4183184 1924901 68753 17112 -329782
14687 -329782 483018 2739889 3727448 2259303 -138020 -1587384 -1271734 -40626 1174797
14678 1174797 796326 585966 1060050 1299340 1351054 -282217 -2366246 -3190585 -2417223
14669 -2417223 -3099135 -3957676 -2121361 555868 1974035 1285748 132058 1380260 2022825
14660 2022825 -386344 -720667 1793441 3339790 1501313 310955 496347 1491990 2891974
$$ packed form
14723C283896k663983m22388R20258J2714l659001m187051K76062J989264m71509
14714d921738p52055J141046K95503M19169R26990P83455P70665k09134j132834
14705b678933l89622N8325p87786p64653J058332K506512J527531o72129j362773
14696a505196K26673J095992K496888K247397l78570k258283j856148n1641l46894
14687c29782Q12800K256871R87559j468145k397323j449364L15650J231108J215423
14678A174797l78471k10360M74084K39290N1714j633271k084029q24339P73362
14669b417223o81912q58541J836315K677229J418167o88287j153690J248202O42565
14660B022825k409169l34323K514108J546349j838477j190358J85392R95643J399984
$$ plain form
14651 2891974 3858021 3676502 3070004 3171695 724829 -1316374 -1390271 -536650 -152261
14642 -152261 664782 1858714 2767341 2927436 3152589 3931425 4650882 2934067 831994
14633 831994 -688570 -527890 256849 478639 -253727 -522273 811070 712345 -24413
14624 -24413 472619 -1023796 -792576 764173 569876 -1429054 -2382492 -270064 2580198
14615 2580198 3693092 2386584 -63992 -1514913 -3239486 -2913775 -1249929 100253
14607 100253 628820 -197107 -359306 -502142 -954021 -2339407 -5340789 -6431772 -3501534
14598 -3501534 -586507 1767514 1853930 1334832 1642762 2151453 3392466 3673992 2868375
14589 2868375 2733768 2133278 1930338 2728958 3280802 3783697 3829211 2978535 3041477 2831121
$$ packed form
14651B891974R66047j81519o06498J01691k446866k041203p3897Q53621L84389
14642a52261Q17043J193932R08627J60095K25153P78836P19457j716815k102073
14633H31994j520564J60680P84739K21790p32366k68546J333343r8725p36758
14624b4413M97032j496415K31220J556749j94297j998930r53438K112428K850262
14615B580198J112894j306508k450576j450921j724573L25711J663846J350182
14607A00253N28567q25927j62199j42836m51879j385386l001382j090983K930238
14598c501534K915027K354021Q6416n19098L07930N08691J241013K81526q05617
14589B868375j34607o00490k02940P98620N51844N02895M5514q50676O2942k10356
$$ plain form
14579 2831121 1559706 281599 -213208 -1564879 -2216947 -2253761 -531967 1096936 360357
14570 360357 -1339146 -1705315 -214785 251767 531751 649639 264923 1770603 2196947
14561 2196947 1485322 1671964 1093543 1167066 2871267 2988371 3726747 5381245 4365052
14552 4365052 2393759 1857102 1174724 968207 -150504 -3069529 -3292293 -3259220 -3431450
14543 -3431450 -3391766 -3699561 -3978956 -2231059 -1563974 -2628747 -3869675 -3256563 -2562837
14534 -2562837 -1902391 -1937134 -3524747 -3238923 -1497909 -793368 -1171072 -755940 -717795
14525 -717795 -965163 -1604063 -997671 1194844 2626824 2440057 3252744 3365685 2213387
14516 2213387 2078380 2304900 1430803 -297264 -2733525 -4303074 -3263978 -2613365 -2872817
$$ packed form
14579B831121j271415j278107m94807j351671o52068l6814J721794J628903p36579
14570C60357j699503l66169J490530M66552K79984J17888l84716J505680M26344
14561B196947p11625J86642n78421P3523J704201J17104P38376J654498j016193
14552D365052j971293n36657o82378k06517j118711k919025k22764L3073j72230
14543c431450L9684l07795k79395J747897O67085j064773j240928O13112O93726
14534b562837O60446l4743j587613K85824J741014P04541l77704M15132L8145
14525g17795k47368o38900O06392K192515J431980j86767Q12687J12941j152298
14516B213387j35007K26520q74097j728067k436261j569549J039096O50613k59452
$$ plain form
14507 -2872817 -3188394 -2411773 -483827 406548 -842339 -4019287 -5603660 -5503252 -4003576
14498 -4003576 -1938427 -1802672 -331432 1054041 589483 809838 2003725 1717435 2094846
14489 2094846 845349 -2342804 -3659987 -3548368 -3817095 -3622429 -2316896 -2625350 -4887395
14480 -4887395 -6867306 -6826188 -4882994 -3067865 -1732989 -1979470 -5087431 -6443336 -5672520
14471 -5672520 -4349180 -1962999 910295 730951 -272735 -165616 669865 -204186 -1542813
14462 -1542813 -3224624 -4232752 -2934845 -1836836 -1601877 -1506272 -1932625 -1728634 -2221770
14453 -2221770 -3144943 -4288482 -4342136 -3147306 -1918335 -407711 533465 671301 798224
14444 798224 694367 -1525763 -4029793 -3428802 -664677 1849351 2676959 2024233 2572472
$$ packed form
14507b872817l15577P76621J927946Q90375j248887l176948j584373J00408J499676
14498d003576K065149J35755J471240J385473m64558K20355J193887k86290L77411
14489B094846j249497l188153j317183J11619k68727J94666J305533l08454k262045
14480d887395j979911M1118J943194J815129J334876k46481l107961j355905P70816
14471e672520J323340K386181K873294j79344j003686J07119Q35481q74051j338627
14462a542813j681811j008128J297907J098009K34959R5605m26353K03991m93136
14453b221770r23173j143539n3654J194830J228971J510624R41176J37836J26923
14444G98224j03857k220130k504030O00991K764125K514028Q27608o52726N48239
$$ plain form
14435 2572472 3960731 3167957 1522985 -490940 -2135341 -3880186 -5245365 -5256165 -3336717
14426 -3336717 -2934758 -2645910 -20818 2325732 1852573 729563 -425423 230708 888140
14417 888140 -1087377 -1693097 -1128437 -1431303 -1443407 114257 673843 734730 304953 -252178
14407 -252178 -971466 -1537174 -1853670 -1344989 -297662 793871 290890 -3555950 -5500353
14398 -5500353 -4646473 -2594929 -994204 175445 776740 29296 -646360 -683722 -331645
14389 -331645 123962 1076382 1575949 2295925 3090582 1536348 -679126 -2288377 -4431183
14380 -4431183 -6968918 -6652126 -4461442 -3483034 -2009455 -94555 1068287 2442626
14372 2442626 981429 -807090 -2298229 -1849318 -1434968 -2305706 -3219232 -1893310 1253026
$$ packed form
14435B572472J388259p92774j644972k013925j644401j744845j365179j0800J919448
14426c336717M01959K88848K625092K346550m73159j123010j154986O56131O57432
14417H88140j975517o05720N64660l02866j2104J557664N59586O0887m29777n57131
14407b52178p19288n65708l16496N08681J047327J091533n02981l846840j944403
14398e500353Q53880K051544J600725J169649O01295p47444o75656l7362L52077
14389c31645M55607R52420M99567P19976P94657j554234k215474j609251k142806
14380d431183k537735L16792K190684R78408J473579J914900J162842J374339
14372B442626j461197j788519j491139M48911M14350q70738r13526J325922L146336
$$ plain form
14363 1253026 3377692 2928934 620643 -2853807 -4197629 -1985301 428923 1324897
14355 1324897 2219564 2755850 2132790 351566 -1664190 -3139568 -3992674 -3299779 -2112157
14346 -2112157 -915957 -1092721 453631 1307705 630740 -623964 -989062 -254193 134697
14337 134697 106486 684001 1040555 1653752 297673 -3283014 -4817588 -2948284 -462888
14328 -462888 -546127 -1398455 -1833999 -2615478 -2402864 -1166882 1799692 3158917 2894429
14319 2894429 1782578 406225 -964412 -1991956 -2939733 -1604184 316612 813948
14311 813948 1336373 2358815 3181318 2515828 2032913 3093681 1650557 -567887 719607
14302 719607 4058100 6298579 6828944 6433381 3922849 1431135 39707 1051142 1250198
$$ packed form
14363A253026K124666m48758k308291l474450j343822K212328K414224Q95974
14355A324897Q94667N36286o23060j781224k015756j475378q53106O92895J187622
14346b112157J196200j76764J546352Q54074o76965j254704l65098P34869L88890
14337A34697k8211N77515L56554O13197j356079l580687j534574J869304K485396
14328d62888q3239q52328m35544p81479K12614J235982K966574J359225k64488
14319B894429j111851j376353j370637j027544r47777J335549J920796M97336
14311H13948N22425J022442Q22503o65490m82915J060768j443124k218444J287494
14302G19607L338493K240479N30365l95563k510532k491714j391428J011435J99056
$$ plain form
14293 1250198 357292 -942543 -576238 1919701 4606612 3432877 1880656 929365 -947397
14284 -947397 -2881381 -3138556 -2637813 -1775985 448877 1690167 1607217 -252600 -713992
14275 -713992 511845 1443497 383762 -441131 120056 1035551 1240156 1766705 3855474
14266 3855474 5007380 3717667 -121801 -2826678 -2032745 -807244 272207 306599 126694
14257 126694 901750 2893900 3042475 -308782 -3284071 -1978495 973274 2374801 2575814
14248 2575814 4129298 4428005 4088154 4614240 4145892 2703683 1982344 2043467 3884173
14239 3884173 5122661 4205575 2642528 551496 -691132 858673 2395483 2010085
14231 2010085 1530543 2611852 4234786 5702636 6366559 7351716 6885932 4079024 1687863
$$ packed form
14293A250198q92906j299835L66305K495939K686911j173735j552221r51291j876762
14284i47397j933984k57175N00743Q61828K224862J241290q2950j859817m61392
14275g13992J225837R31652j059735q24893N61187R15495K04605N26549K088769
14266C855474J151906j289713l839468k704877P93933J225501J079451L4392j79905
14257A26694P75056J992150J48575l351257k975289J305576K951769J401527K01013
14248B575814J553484K98707l39851N26086m68348j442209p21339O1123J840706
14239C884173J238488r17086j563047k091032j242628J549805J536810l85398
14231B010085m79542J081309J622934J467850O63923R85157m65784k806908k391161
$$ plain form
14222 1687863 280005 -353150 -989301 -1067329 -933411 -2810319 -4235983 -4690320 -2211071
14213 -2211071 402217 1463730 -194761 -2225725 -2120634 -928982 435980 -353552
14205 -353552 -1855276 -2541738 -3136248 -3952823 -3386762 -2356698 -2826913 -2348126 -1969506
14196 -1969506 -2507650 -2222325 -840122 556403 2100244 2908425 2247644 371447 -2709239
14187 -2709239 -3291480 -1848854 -1120575 -1900409 -2335159 -1924873 -1125002 -1436421 -2376929
14178 -2376929 -3167466 -1770922 -229506 -636708 -1974999 -2962267 -4502466 -3992318 -3743806
14169 -3743806 -3251318 -1293217 232170 1100012 2383328 3022197 1810409 1152699 170762
14160 170762 -1476033 -2400573 -1132342 1217369 805650 -502238 -2265884 -2843202 -2076672
$$ packed form
14222A687863j407858o33155o36151p8028J33918j876908j425664m54337K479249
14213b211071K613288J061513j658491k030964J05091J191652J364962p89532
14205c53552j501724o86462n94510q16575N66061J030064m70215M78787L78620
14196a969506n38144K85325J382203J396525J543841Q08181o60781j876197l080686
14187b709239n82241J442626P28279p79834m34750M10286P99871l11419r40508
14178b376929p90537J396544J541416m07202j338291r87268j540199N10148K48512
14169c743806M92488J958101J525387Q67842J283316O38869j211788o57710r81937
14160A70762j646795r24540J268231K349711m11719j307888j763646n77318P66530
$$ plain form
14151 -2076672 -1888702 -463235 593346 569243 436986 -185488 -811513 -1734279 -1733774 -2425664
14141 -2425664 -3733254 -4075392 -5232073 -5336837 -4128661 -2550236 -1336606 -719445 -781528
14132 -781528 -816332 -28701 1917857 1947437 581218 -269667 -1282560 -1507124 -887145
14123 -887145 937043 3106563 2571581 143210 -3193776 -5196393 -5596483 -5738130 -5320226
14114 -5320226 -3625450 -1631065 -121990 710445 -165875 -2738157 -611654 3633678
14106 3633678 4381668 2071094 738932 1875605 2877621 1491194 -1768454 -3384228
14098 -3384228 -2238063 -290154 1107702 2029140 1419956 -1203296 -2653026 -1050918
14090 -1050918 -322536 -1658706 -1244472 -209660 -737669 -1483381 -1711327 604216 1776018
$$ packed form
14151b076672J87970J425467J056581k4103j32257o22474o26025r22766N05o91890
14141b425664j307590l42138j156681j04764J208176J578425J213630O17161o2083
14132g81528l4804P87631J946558K9580j366219q50885j012893k24564O19979
14123h87145J824188K169520n34982k428371l336986k002617m00090j41647M17904
14114e320226J694776J994385J509075Q32435q76320k572282K126503M245332
14106C633678P47990k310574j332162J136673J002016j386427l259648j615774
14098c384228J146165J947909J397856R21438o09184k623252j449730J602108
14090a050918P28382j336170M14234J034812n28009p45712k27946K315543J171802
$$ plain form
14081 1776018 616503 318937 -1776642 -3781413 -4020944 -3278092 -3464736 -4679910 -5379059
14072 -5379059 -4265630 -1739033 312775 456337 -923373 -2009380 -2936653 -2701872 -896818
14063 -896818 950345 1999111 865661 -525908 -2535979 -6153470 -8538962 -7590050
14055 -7590050 -3121542 1842892 3913078 3683612 2307588 904618 -626023 -2153318
14047 -2153318 -1157900 1204422 3603959 6871590 8653265 7821432 5633304 3914949
14039 3914949 3733354 3983278 6460213 6546861 3828745 1265921 -1161047 -3787144 -4182107
14030 -4182107 -1750176 815915 2239255 726224 -1648289 -3099972 -3151555 -2664844 -1237429
14021 -1237429 277687 42340 431324 -357986 -829808 -1232806 -873594 -554433 -907055
$$ packed form
14081A776018j159515k97566k095579k004771k39531P42852j86644j215174o99149
14072e379059J113429K526597K051808J43562j379710j086007r27273K34781J805054
14063h96818J847163J048766j133450j391569k010071l617491k385492R48912
14055g590050M468508M964434K070186k29466j376024j402970j530641j527295
14047b153318R95418K362322K399537L267631J781675q31833k188128j718355
14039C914949j81595K49924K476935Q6648k718116k562824k426968k626097l94963
14030d182107K431931K566091J423340j513031k374513j451683n1583M86711J427415
14021a237429J515116k35347L88984p89310m71822m02998L59212L19161l52622
$$ plain form
14012 -907055 -291273 -269039 -2612131 -4371306 -4800854 -4472490 -3120459 -2233890 -3208005
14003 -3208005 -3039922 -2573820 -3624944 -2699525 -1969595 -1749729 547544 2297824 3427678
13994 3427678 2080263 -450975 -1948769 -1676628 -1518152 -1543795 -1156467 196447 749597
13985 749597 -311551 -1370338 -1403828 -857733 -838789 -1090845 -1611715 -1531763 -2000727 -2099650
13975 -2099650 -795302 422757 -700539 -1843682 -315151 517465 -811521 -2109192
13967 -2109192 -1806149 -1833785 -3183348 -2389543 546041 1477840 1794062 3221730 3408740
13958 3408740 2050806 369042 -1302264 -1618300 -689829 77234 295580 295480 124072
13949 124072 -2158731 -4026520 -4321455 -5486061 -6297632 -5067491 -4259462 -3666544 -1652714
$$ packed form
14012i07055O15782K2234k343092j759175m29548L28364J352031Q86569r74115
14003c208005J68083M66102j051124R25419P29930K19866K297273J750280J129854
13994C427678j347415k531238j497794K72141J58476k5643L87328J352914N53150
13985G49597j061148j058787l3490N46095J8944k52056n20870P9952m68964r8923
13975b099650J304348J218059j123296j143143J528531Q32616j328986j297671
13967b109192L03043k7636j349563P93805K935584R31799L16222J427668J87010
13958C408740j357934j681764j671306l16036R28471P67063K18346j00j71408
13949A24072k282803j867789k94935j164606q11571J230141Q08029N92918K013830
$$ plain form
13940 -1652714 -585638 876643 2473236 2390782 2556220 3071528 2645968 1215330 -1875880
13931 -1875880 -3613905 -2781053 -1282148 867825 1682740 -7028 -2831034 -3991055
13923 -3991055 -3568627 -2789588 -487569 1419993 2013911 2912451 3246642 2502364 1387223
13914 1387223 628482 557681 894205 1862535 3602730 3383458 1508660 1402076 430606
13905 430606 -1770715 -1112670 -215771 -1099043 -828781 398163 377500 2223 -1758443
13896 -1758443 -4025107 -3287917 -1447442 -1285607 -2121901 -1138371 -909899 -792803 -1297327
13887 -1297327 -1635310 -2514994 -1319085 1064470 2326605 2582482 215556 -2520815 -2940975
13878 -2940975 -1024306 -1355106 -2874782 -2356598 -1066321 -41526 652146 714933 34349
$$ packed form
13940a652714J067076J462281J596593q2454J65438N15308m25560j430638l091210
13931a875880j738025Q32852J498905K149973Q14915j689768k824006j160021
13923c991055M22428P79039K302019J907562N93918Q98540L34191p44278j115141
13914A387223p58741p0801L36524R68330J740195k19272j874798j06584r71470
13905D30606k201321O58045Q96899q83272K70262J226944k0663l75277j760666
13896a758443k266664P37190J840475J61835q36294R83530K28472J17096n04524
13887a297327l37983q79684J195909K383555J262135K55877k366926k736371m20160
13878b940975J916669l30800j519676N18184J290277J024795O93672O2787o80584
$$ plain form
13869 34349 272930 1266551 42988 -1560586 -1876992 -1456171 784096 2088696 1227277
13860 1227277 1821348 3398340 4104100 4149485 2689621 2144759 2239314 888910 -130255
13851 -130255 382075 1421289 563734 -1430242 -494507 1470631 563260 550893 2133338
13842 2133338 2988237 1850410 554531 -1780765 -3329364 -4068202 -3530953 -2854988 -3194170
13833 -3194170 -2119429 32658 2905033 4517523 4183349 4198968 2601921 -99797 -2737600
13824 -2737600 -2861247 -1191247 -1558047 -2819390 -1484801 438148 1139114 1633535 1115508
13815 1115508 470999 562174 1489265 3612211 4701478 3307940 3012871 4387661 5309275
13806 5309275 4318676 2519803 1019434 -196401 -1593905 -1817164 -3418057 -3469997 -563202
$$ packed form
13869C4349K38581R93621j223563j603574l16406M20821K240267J304600q61419
13860A227277N94071J576992P05760M5385j459864n44862R4555j350404j019165
13851a30255N12330J039214q57555j993976R35735J965138r07371j2367J582445
13842B133338Q54899j137827j295879k335296j548599p38838N37249O75965l39182
13833c194170J074741K152087K872375J612490l34174J5619j597047k701718k637803
13824b737600j23647J670000l66800j261343J334589J922949P00966M94421n18027
13815A115508o44509R1175R27091K122946J089267j393538k95069J374790R21614
13806E309275r90599j798873j500369j215835j397504k23259j600893n1940K906795
$$ plain form
13797 -563202 2188926 2702981 3416151 6090049 5696089 3631572 2908956 1823297 -140757
13788 -140757 -868608 -415676 -1377508 -2298778 -2669758 -3010474 -1646907 148426 991162
13779 991162 1560459 -57132 -1520447 -351565 421747 -674801 -131434 1670236 1100841
13770 1100841 -1932877 -3350816 -3414578 -877119 1366727 387627 -1190358 -3058021 -2328758
13761 -2328758 -1585920 -940329 -1342258 -1472538 -1340970 -1946538 -2101245 -810448 525070
13752 525070 2015756 1794265 1121064 1660360 1340693 1041613 906286 -224471 -2208451
13743 -2208451 -4668495 -4865535 -3573730 -3075582 -3429282 -3130230 -3737056 -3861395 -3169007
13734 -3169007 -2649385 -1547524 -923157 253067 2526240 3474575 3455157 1761683 61238
$$ packed form
13797e63202K752128N14055P13170K673898l93960k064517p22616j085659j964054
13788a40757p27851M52932r61832r21270l70980l40716J363567J795333Q42736
13779I91162N69297j617591j463315J168882P73312j096548N43367J801670n69395
13770A100841l033718j417939o3762K537459K243846r79100j577985j867663P29263
13761b328758P42838O45591m01929j30280J31568o05568j54707J290797J335518
13752E25070J490686k21491o73201N39296l19667k99080j35327j130757j983980
13743b208451k460044j97040J291805M98148l53700K99052o06826j24339O92388
13734c169007N19622J101861O24367J176224K273173R48335j9418j693474j700445
$$ plain form
13725 61238 -1161373 -2883588 -2925467 -2855618 -4413654 -6710900 -7955848 -6760370 -5908758
13716 -5908758 -4967204 -4043288 -4172960 -4300641 -3438693 -1625660 -502302 -212015 132922
13707 132922 993706 2643418 1531652 1207274 2242232 1593375 1603833 918739 34678
13698 34678 245616 741643 -233300 -1152783 187567 1636921 2152766 2172207 2178099 635220
13688 635220 -833596 -2784125 -3330327 -1549201 -646099 -907235 -1245415 -1020665 -669981
13679 -669981 -307868 25251 590636 665159 555627 1518916 2037465 517782 -786463
13670 -786463 -3642053 -5648125 -4610820 -1636969 1796162 4507124 6110591 5034211
13662 5034211 3125919 2015563 1431759 2075803 2877121 2800495 1889167 2704075 5470388
$$ packed form
13725F1238j222611j722215m1879O9849j558036k297246j244948J195478Q51612
13716e908758R41554R23916j29672j27681Q61948J813033J123358K90287L44937
13707A32922Q60784J649712j111766l24378J034958o48857J0458o85094q84061
13698C4678K10938M96027r74943r19483J340350J449354N15845J9441N892j542879
13688F35220j468816j950529n46202J781126R03102k61136l38180K24750L50684
13679f69981L62113L33119N65385P4523j09532R63289N18549j519683j304245
13670g86463k855590k006072J037305K973851L433131K710962J603467j076380
13662E034211j908292j110356n83804O44044Q01318p6626r11328Q14908K766313
$$ plain form
13653 5470388 6716856 3860412 1147126 -429579 -1287447 -1696691 -2814450 -1873439 -1484761
13644 -1484761 -2279801 -3256136 -3359168 -3992455 -4222308 -1761547 -498059 -141429 545832
13635 545832 961395 1327483 545911 723882 773619 -103298 -2500456 -3636146 -2077465
13626 -2077465 -575072 -1774751 -4445769 -4249789 -3506216 -3165701 -2907783 -2351918 -1354817
13617 -1354817 -365690 18034 1870240 1099608 -402477 -1012325 -641096 -678277 -1687976
13608 -1687976 -758596 -954952 -1262088 -1437893 -1429999 -641507 34314 172099 -366308 23262
13598 23262 1902843 3235463 2622754 735105 -215758 -91880 -2944079 -6492151 -7062658
13589 -7062658 -5409121 -2624074 -246716 -166383 -2116524 -4302935 -3971069 -1722446 109806
$$ packed form
13653E470388J246468k856444k713286j576705q57868m09244j117759R41011L88678
13644a484761p95040r76335j03032o33287k29853K460761J263488L56630O87261
13635E45832M15563L66088p81572J77971M9737q76917k397158j135690J558681
13626b077465J502393j199679k671018J95980P43573L40515K57918N55865R97101
13617a354817R89127L83724J852206p70632j502085o09848L71229l7181j009699
13608a687976R29380j96356l07136j75805P894P88492O75821J37785n38407L89570
13598B3262J879581J332620o12709j887649r50863J23878k852199l548072n70507
13589g062658J653537K785047K377358Q0333j950141k186411L31866K248623J832252
$$ plain form
13580 109806 -219569 708774 1111003 -421117 -516844 -419253 -452059 -347341 -2028245 -2465231
13570 -2465231 -1212476 -1140446 -801271 660166 3052011 4791442 5980984 5923227 4319818
13561 4319818 2100380 -866718 -3433938 -2541648 -971676 -308508 -738095 -610989 195078
13552 195078 966676 177537 -47317 -1103987 -3132686 -3346288 -1680634 862962 834377
13543 834377 -166709 -358851 1962076 3806433 4005217 2772301 722855 -295420 -214353
13534 -214353 14978 804439 775332 205015 -54079 1245142 2139601 1978401 1904910 1694771
13524 1694771 -30280 -3015660 -5123177 -4916898 -2835333 -1651516 -1856614 -760814
13516 -760814 1748670 1973718 2094402 3238350 3532842 2979888 2755468 785518 -920724
$$ packed form
13580A09806l29375R28343M02229j532120r5727R7591l2806J04718j680904m36986
13570b465231J252755P2030L39175J461437K391845J739431J189542n7757j603409
13561D319818k219438k967098k567220Q92290J569972O63168m29587J27106Q06067
13552A95078P71598p89139k24854j056670k028699k13602J665654K543596k8585
13543H34377j001086j92142K320927J844357J98784j232916k049446j018275Q1067
13534b14353K29331P89461k9107n70317k59094J299221Q94459j61200p3491k10139
13524A694771j725051k985380k107517K06279K081565J183817k05098J095800
13516g60814K509484K25048J20684J143948K94492n52954k24420j969950j706242
$$ plain form
13507 -920724 1145549 4041386 3649710 2757044 3066728 1228805 -627254 -671309 -1538468
13498 -1538468 -1198161 -409778 993402 1964429 2911530 2110144 -299494 -2504172 -4282403
13489 -4282403 -5250099 -5437214 -4785616 -3989285 -2395559 -1078929 -808916 -576802 872275
13480 872275 2328399 1651708 -759072 -1320487 -1741533 -1510815 -995029 -430615 1028006
13471 1028006 123412 -2419662 -3424644 -2803621 -650 1949013 1146271 127683 -841467
13462 -841467 -1547155 -1746248 -754837 1278441 2531113 4150357 4575136 4158248 3782086
13453 3782086 2701065 1867685 1245059 1829913 2585664 1132436 -1355575 -1531002 -65209
13444 -65209 812682 1971446 1989162 1028192 -82478 -931836 -2022452 -814440 1138643
$$ packed form
13507i20724K066273K895837l91676q92666L09684j837923j856059m4055q67159
13498a538468L40307P88383J403180R71027R47101q01386k409638k204678j778231
13489d282403r67696j87115O51598P96331J593726J316630K70013K32114J449077
13480H72275J456124o76691k410780n61415m21046K30718N15786N64414J458621
13471A028006r04594k543074j004982O21023K802971J949663q02742j018588r69150
13462h41467p05688j99093R91411K033278J252672J619244M24779m16888l76162
13453C782086j081021q33380o22626N84854P55751j453228k488011j75427J465793
13444f5209Q77891J158764J7716r60970j110670q49358j090616J208012J953083
$$ plain form
13435 1138643 719753 -2725712 -4861888 -5907045 -4301739 -1738472 374752 1230325
13427 1230325 1031324 1357622 1053861 441548 602661 1959945 3073866 2192482 1669133
13418 1669133 1264023 -393680 -2193762 -3025278 -2385573 -1988803 -2131259 -1400055 -235370
13409 -235370 1094140 -254378 -2400330 -2367304 -1482228 -1344166 -2618376 -1629056 1142707
13400 1142707 2167159 1331214 2333311 3060753 3605038 3586120 2833832 1699813 2998260
13391 2998260 4154020 4664609 5140855 5583521 5356882 5269635 5790959 4219985 3389890
13382 3389890 3031612 1307831 -758296 53234 1370134 1811315 2070636 1434987 791373
13373 791373 1230731 2287611 2093983 81953 -1782234 -1706487 -2627501 -3654340 -3715942
$$ packed form
13435A138643m18890l445465k136176j045157J605306K563267K113224Q55573
13427A230325j99001L26298l03761o12313J61113J357284J113921q81384n23349
13418A669133m05110j657703j800082q31516O39705L96770j42456P31204J164685
13409b35370J329510j348518k145952L3026Q85076J38062j274210R89320K771763
13400A142707J024452q35945J002097P27442N44285j8918p52288j134019J298447
13391B998260J155760N10589M76246M42666k26639q7247N21324j570974q30095
13382C389890l58278j723781k066127Q11530J316900M41181K59321o35649o43614
13373G91373M39358J056880j93628k012030j864187P5747r21014j026839o1602
$$ plain form
13364 -3715942 -2191248 -483694 1034018 2029436 1406602 528273 -605409 -1917095 -2078269
13355 -2078269 -1767889 1654296 3576833 2021831 623295 -439536 -2616813 -3391511
13347 -3391511 -1783754 -1308910 -119427 1150913 2807985 1922746 -1708867 -2995840
13339 -2995840 -2423008 -1685682 -3633264 -3976798 -2195933 -2067593 -1703569 1454659 5109218
13330 5109218 4749989 3823146 1855298 -438069 -545995 66144 689189 1478788 1153797
13321 1153797 -270561 -1141822 -576034 110713 1843647 4041466 5352565 7050286 6966101
13312 6966101 5684260 6276586 6067847 4296418 2592339 692848 -1720114 -2369311 -1458927
13303 -1458927 -1432131 -1262447 737490 1209007 1067795 1795339 1153443 538849 407831
$$ packed form
13364c715942J524694J707554J517712R95418o22834q78329j133682j311686j61174
13355b078269L10380L422185J922537j555002j398536j062831k177277p74698
13347c391511J607757M74844J189483J270340J657072q85239l631613j286973
13339b995840N72832P37326j947582l43534J780865J28340L64024L158228L654559
13330E109218l59229r26843j967848k293367j07926O12139O23045P89599l24991
13321A153797j424358q71261N65788O86747J732934K197819J311099J697721q4185
13312F966101j281841N92326k08739j771429j704079j899491k412962o49197R10384
13303a458927K6796J69684J999937M71517j41212P27544o41896o14594j31018
$$ plain form
13294 407831 49397 -190197 -1074819 -1855301 -2332450 -3058489 -1752539 -16519 1338920
13285 1338920 1235804 849966 -195279 280301 393630 -1880282 -2887443 -1722308 -556504
13276 -556504 -574957 -1419283 -1823807 -892051 94510 1395317 3512736 3911375 2742184
13267 2742184 946242 -155026 411135 809016 2888573 3837468 2181327 -6383 -1821129
13258 -1821129 -1612213 -1008836 476194 1884405 1360748 2279407 2517162 -224893 -1642921
13249 -1642921 -1010864 266063 852075 529162 906861 -228253 -1479281 -1763811 -2447576
13240 -2447576 -2084425 -681613 304238 444960 103266 49183 -112826 -416059 -1475971
13231 -1475971 -1837262 863254 4034305 4973562 4966967 4849292 5549237 5685817 4053082
$$ packed form
13294D07831l58434k39594q84622p80482m77149p26039J305950J736020J355439
13285A338920j03116l85838j045245M75580J13329k273912j007161J165135J165804
13276e56504j8453q44326m04524R31756R86561J300807K117419L98639j169191
13267B742184j795942j101268N66161L97881K079557R48895j656141k187710j814746
13258a821129K08916O03377J485030J408211n23657R18659K37755k742055j418028
13249a642921O32057J276927N86012l22913L77699j135114j251028k84530o83765
13240b447576L63151J402812R85851J40722l41694n4083j62009l03233j059912
13231a475971l61291K700516L171051R39257o595j17675O99945J36580j632735
$$ plain form
13222 4053082 2086479 2293016 3708811 5126010 5827267 6449329 5999078 3869641 1435754
13213 1435754 -288366 -84919 -193034 342272 1513698 1769560 137853 -2129509 -2408347
13204 -2408347 -976285 1202531 1670424 1153654 2792332 2411017 -255708 -2339724 -2766415
13195 -2766415 -1842594 -1124348 232617 704360 977020 2729585 3121777 1828600 1723080
13186 1723080 2109607 1548156 1055794 490302 -734538 -951006 -1601272 -1482735 284379
13177 284379 297970 1444695 2901209 2719320 2555309 1598879 -988251 -1088763 -618489
13168 -618489 -904290 -1794799 -2796252 -2957500 -3693695 -4755828 -4441022 -2936611 -2241424
13159 -2241424 -3187343 -4384482 -3960274 -4138510 -4898203 -3405495 -2016641 -1702369 -879049
$$ packed form
13222D053082j966603K06537J415795J417199P01257O22062m50251k129437k433887
13213A435754j724120K03447j08115N35306J171426K55862j631707k267362k78838
13204b408347J432062K178816M67893n16770J638678l81315k666725k084016m26691
13195b766415R23821P18246J356965M71743K72660J752565L92192j293177j05520
13186A723080L86527n61451m92362n65492j224840k16468o50266J18537J767114
13177B84379J3591J146725J456514j81889j64011r56430k587130j00512M70274
13168f18489k85801q90509j001453j61248p36195j062133L14806J504411O95187
13159b241424r45919j197139M24208j78236p59693J492708J388854L14272Q23320
$$ plain form
13150 -879049 -355767 650380 1282083 3690925 5211685 3751044 1559212 -855401 -2162585
13141 -2162585 -3199837 -2299253 -3217142 -3097206 -140298 1945989 4147478 3707834 2750484
13132 2750484 3131639 4015204 4951849 5207393 4983515 3634921 2977577 2930655 2059137
13123 2059137 1085336 2190188 2344085 1189521 -184342 220697 641672 -405650 -593742
13114 -593742 1073203 4574795 5941003 4220566 2288264 3033823 3764965 4073388 4656626
13105 4656626 4251853 4249633 3163286 1473561 1340792 2326123 3081505 4680006 5654766
13096 5654766 4907720 2502833 1633122 885033 -675520 -2090095 -1335849 871723 1316772
13087 1316772 2805865 5009475 6180359 6117263 5527455 4849422 5059244 5351621 5201968
$$ packed form
13150h79049N23282J006147O31703K408842J520760j460641k191832k414613j307184
13141b162585j037252R00584r17889J19936K956908K086287K201489m39644r57350
13132B750484L81155Q83565R36645K55544k23878j348594o57344m6922q71518
13123B059137r73801J104852J53897j154564j373863M05039M20975j047322j88092
13114e93742J666945L501592J366208j720437j932302P45559P31142L08423N83238
13105D656626m04773k220j086347j689725j32769R85331P55382J598501R74760
13096E654766p47046k404887q69711p48089j560553j414575P54246K207572M45049
13087A316772J489093K203610J170884o3096n89808o78033K09822K92377j49653
$$ plain form
13078 5201968 4167116 2391746 1283768 -13639 -468305 -292329 222900 314283 381649
13069 381649 505311 557493 1391582 3359303 4171774 2919244 1864449 1656253 499617
13060 499617 1789336 3542626 4012767 5456185 4271176 3752656 4670559 5842599 7608312
13051 7608312 7212820 5590450 5856159 7151376 8126719 8634754 8255448 6162211 4544841
13042 4544841 4306475 3980147 2731102 2789663 4099860 7534109 7932590 6493859 6570232
13033 6570232 7185199 6492268 4196307 2639653 4341103 6504259 7095744 6709039 4137263
13024 4137263 3164743 4241783 4605709 3939804 4724939 5656296 5727212 3666896 788434
13015 788434 1001168 1175805 -113148 1320480 4696048 6585129 7207369 7583158 9314689
$$ packed form
13078E201968j034852j775370j107978j297407m54666J75976N15229R1383O7366
13069C81649J23662N2182Q34089J967721Q12471j252530j054795k08196j156636
13060D99617J289719J753290M70141J443418j185009n18520R17903J172040J765713
13051G608312l95492j622370K65709J295217R75343N08035l79306k093237j617370
13042D544841k38366l26328j249045N8561J310197L434249L98481j438731P6373
13033F570232O14967o92931k295961j556654J701450K163156N91485l86705k571776
13024D137263r72520J077040L63926o65905P85135R31357P0916k060316k878462
13015G88434K12734J74637j288953J433628L375568J889081O22240L75789J731531
$$ plain form
13006 9314689 10767840 13073201 11900921 9877322 9311562 9949905 10082918 10340440 11443160
12997 11443160 12622152 13911604 15403879 16659680 17812556 18929370 20331893 22104992
12989 22104992 25036043 29127814 33804044 37076385 41018399 47796837 55956268 65487121
12981 65487121 77215113 94731942 119135711 152067770 198436271 259655967 335846417
12974 335846417 416940081 476870120 485544588 439299067 365754948 290614379 227971745
12967 227971745 179573051 144195449 116904047 94055047 76977810 64000680 54846582
12960 54846582 48111437 42505219 37879818 35915692 34260990 32344075 29365031 24741624
12952 24741624 20715410 17000413 15138823 16015190 17229047 16794376 18008480 18682699
$$ packed form
13006I314689J453151K305361j172280k023599n65760O38343J33013K57522J102720
12997A1443160J178992J289452J492275J255801J152876J116814J402523J773099
12989B2104992K931051M091771M676230L272341L942014O778438Q159431R530853
12981F5487121J1727992J7516829K4403769L2932059M6368501O1219696P6190450
12974C35846417Q1093664N9930039Q674468m6245521p3544119p5140569o2642634
12967B27971745m8398694l5377602k7291402k2849000j7077237j2977130r154098
12960E4846582o735145n606218m625401j964126j654702j916915k979044m623407
12952B4741624m026214l714997j861590Q76367J213857m34671J214104O74219
$$ plain form
12944 18682699 18799679 19576862 18572570 15217565 13576698 13835929 13652752 12741308 10903414
12935 10903414 9960146 8550343 7054314 7732988 8511029 7646330 8109543 9575427 10344285
12926 10344285 10300507 10373980 11858743 13031673 15698291 18131284 18106933 17473549 17857392
12917 17857392 19746292 21337982 24305416 27910405 29774411 30217056 29290846 28487776
12909 28487776 26966386 24807118 23498107 24591063 26203888 28212784 30440604 32208235
12901 32208235 32739834 34335011 38457776 43403967 49273880 57162295 67113080 81348989
12893 81348989 100850276 127659675 165249154 216330153 282167452 365673016 451391868
12886 451391868 504181668 494750110 430650486 350018878 276973052 217046808 171311069
$$ packed form
12944A8682699J16980P77183j004292l355005j640867K59231j83177r11444j837894
12935A0903414r43268j409803j496029O78674P78041q64699M63213J465884P68858
12926A0344285m3778P3473J484763J172930K666618K432993k4351o33384L83843
12917A7857392J888900J591690K967434L604989J864006M42645r26210q03070
12909B8487776j521390k159268j309011J092956J612825K008896K227820J767631
12901C2208235N31599J595177M122765M946191N869913P888415R950785J4235909
12893H1348989J9501287K6809399L7589479N1080999O5837299Q3505564Q5718852
12886D51391868N2789800r431558o4099624q0631608p3045826n9926244m5735739
$$ plain form
12879 171311069 136893172 109700675 88450543 72154648 59326956 51987751 46455959
12872 46455959 39988718 35144346 29680806 24231239 20549695 19919107 19884479 20277570 21761732
12863 21761732 21138807 19896331 18305190 16281839 15431323 15554359 15918081 16011919 14980113
12854 14980113 13314270 12124286 11377779 11293112 12589431 13537105 14232635 12309890 9679635
12845 9679635 9165052 8765166 9952669 11763850 12895033 14227416 13919484 12419806 9978609
12836 9978609 7340821 6938991 7981042 9664851 10724939 9703415 8503215 9400887
12828 9400887 10414225 11939282 14377198 15247212 15304611 15188517 14186126 13593777 15360657
12819 15360657 18822419 21200784 22446685 22931025 25831766 28696620 32004691 36450499
$$ packed form
12879A71311069l4417897k7192497k1250132j6295895j2827692p339205n531792
12872D6455959o467241m844372n463540n449567l681544o30588l4628L93091J484162
12863B1761732o22925j242476j591141k023351q50516J23036L63722R3838j031806
12854A4980113j665843j189984p46507q4667J296319R47674O95530j922745k630255
12845I679635n14583l99886J187503J811181J131183J332383l07932j499678k441197
12836I978609k637788m01830J042051J683809J060088j021524j200200Q97672
12828I400887J013338J525057K437916Q70014N7399j16094j002391n92349J766880
12819A5360657L461762K378365J245901M84340K900741K864854L308071M445808
$$ plain form
12811 36450499 42582781 50215474 59231012 72206813 88679415 110506014 140498890
12804 140498890 180713294 233419088 301748469 383767904 460261211 495773638 471534666
12797 471534666 406227043 330208791 260795766 203479656 157778357 124048170 99936366
12790 99936366 81508833 66172715 54324546 46231870 40163685 36550307 33744267 31293806
12782 31293806 28290593 23152358 20067373 17917326 15920627 14637647 13815689 13873133
12774 13873133 12920080 12536804 12164646 11642018 10975214 9905599 8807219 8580408 6952074
12765 6952074 5833471 5882315 5301099 4185574 4426043 5698858 8437732 10439297 9797734
12756 9797734 7513995 6165781 4197675 4043385 4505723 3640426 4997741 6200559 5822960
$$ packed form
12811C6450499O132282P632693R015538J2975801J6472602K1826599K9992876
12804A40498890M0214404N2705794O8329381Q2019435P6493307L5512427k4238972
12797D71534666o5307623p6018252o9413025n7316110m5701299l3730187k4111804
12790I9936366j8427533j5336118j1848169q092676o068185l613378k806040k450461
12782C1293806l003213n138235l084985k150047j996699j282980q21958N7444
12774A3873133r53053l83276l72158n22628o66804j069615j098380k26811j628334
12765F952074j118603M8844n81216j115525K40469J272815K738874K001565o41563
12756I797734k283739j348214j968106j54290M62338q65297J357315J202818l77599
$$ plain form
12747 5822960 4601700 3394247 2861425 2630495 1010256 912033 2300455 4183963 4205153
12738 4205153 2866153 1828456 1400332 1963272 3067877 1786637 -774432 613049
12730 613049 2854295 3557860 2125198 334104 -308570 -1050182 -2257961 -3145896 -2617957
12721 -2617957 -1341262 -572073 1559192 3396551 3047297 2567524 2949803 3633100 4010692
12712 4010692 4252954 3588805 1529458 -1073927 -2647361 -2426391 -819166 1976389 3466003
12703 3466003 1756443 -444817 -1421374 -1256779 -1352015 -1682965 -1138371 -420586 -1425598
12694 -1425598 -1187717 276989 -1069369 -4128622 -4338354 -3732963 -2980232 -2336460 -1470502
12685 -1470502 -1617464 -1376000 -432867 1527243 2219275 1287763 572678 369227 1259638
$$ packed form
12747E822960j221260j207453n32822k30930j620239r8223J388422J883508K1190
12738D205153j339000j037697m28124N62940J104605j281240k561069J387481
12730F13049K241246P03565j432662j791094o42674p41612j207779q87935N27939
12721b617957J276695P69189K131265J837359l49254m79773L82279O83297L77592
12712D010692K42262o64149k059347k603385j573434K20970J607225K795555J489614
12703C466003j709560k201260r76557J64595r5236l30950N44594P17785j005012
12694a425598K37881J464706j346358l059253k09732O05391P52731O43772Q65958
12685a470502j46962K41464R43133J960110O92032r31512p15085k03451Q90411
$$ plain form
12676 1259638 1089272 -1320053 -1683582 -1196998 -1167103 -412959 14304 -317574 -396115 1162821
12666 1162821 2501531 3204020 3719108 3355580 840825 -680999 -1042422 -787364 971720
12657 971720 2217461 2812559 2666494 2598845 2240405 2215905 2268326 1451540 -1335293 -2921558
12647 -2921558 -2502783 -2092947 -990996 -510588 -37759 1003529 493123 -862559 -1671397
12638 -1671397 -1280144 -730320 -565997 745053 3519029 6424534 6488692 4039244 671649
12629 671649 -1692987 -2719117 -2938270 -2859147 -2268884 -1886129 -278625 947360 1344657
12620 1344657 1811910 1552938 -56660 599395 1272776 485311 752142 2029613 3183884
12611 3183884 4100110 4371076 2176548 948050 974150 1573070 2513289 2908188 2614650
$$ packed form
12676A259638j70366k409325l63529M86584K9895P54144M27263l31878p8541J558936
12666A162821J338710P02489N15088l63528k514755j521824l61423K55058J759084
12657I71720J245741N95098j46065o7649l58440k4500N2421q16786k786833j586265
12647b921558M18775M09836J101951M80408M72829J041288n10406j355682q08838
12638a671397L91253N49824J64323J311050K773976K905505O4158k449448l367595
12629F71649k364636j026130k19153P9123N90263L82755J607504J225985L97297
12620A344657M67253k58972j609598O56055O73381p87465K66831J277471J154271
12611C183884R16226K70966k194528j228498K6100N98920R40219L94899k93538
$$ plain form
12602 2614650 3252030 3702870 2230743 -870620 -1446456 1012611 2853741 3700898 3031726
12593 3031726 3408930 1878833 -972198 316496 1876445 1772090 1608253 1211099 1463432
12584 1463432 1019243 324461 -1250051 -2003642 -1326840 -1894168 -2643514 -1334590 -1278831
12575 -1278831 -2889580 -3212456 -2228008 -1810473 -875633 184933 -1109660 -3165959 -3981463
12566 -3981463 -3510540 -2983334 -2938106 -3342151 -4205828 -4777086 -4669424 -4498060 -4711287 -5960127
12556 -5960127 -6453196 -5171013 -3001389 -1516822 -236103 1076849 1285151 1695413 2235656
12547 2235656 2514454 2975395 3448158 4598074 4588253 2491371 1154973 739808 -83528
12538 -83528 -354695 -316007 -579735 194335 2087500 4041612 5053170 3608140 285523
$$ packed form
12602B614650O37380M50840j472127l101363n75836K459067J841130Q47157o69172
12593C031726L77204j530097k851031J288694J559949j04355j63837l97154K52333
12584A463432m44189o94782j574512p53591O76802n67328p49346J308924N5759
12575a278831j610749l22876R84448M17535R34840J060566j294593k056299q15504
12566c981463M70923N27206M5228m04045q63677n71258J07662J71364k13227j248840
12556e960127m93069J282183K169624J484567J280719J312952K08302M10262N40243
12547B235656K78798M60941M72763J149916r821k096882j336398m15165q23336
12538h3528k71167L8688k63728P74070J893165J954112J011558j445030l322617
$$ plain form
12529 285523 -871327 229041 781660 1116045 1590349 2197954 2512055 2625014 2139578
12520 2139578 378282 -2438139 -2979820 -1526457 911238 780016 58164 1561714 1031263
12511 1031263 -181159 -1646338 -3081910 -3674021 -2239188 -1133141 -4106011 -6222077
12503 -6222077 -4655883 -4023764 -3698840 -1758129 -1333298 -1499730 -1198587 -646074 423173
12494 423173 1437527 1351655 1628612 1437706 556677 374387 -73260 -690704 -709027 -1794506
12484 -1794506 -4439757 -5525656 -4317123 -1450490 1719851 4982917 7761141 9166938
12476 9166938 7664597 3924064 1335270 784471 -298304 -1158529 -1785825 -2169702 -2982182
12467 -2982182 -3826868 -4076856 -4465042 -4173884 -3350190 -2854758 -1711621 -2091603 -2541338
$$ packed form
12529B85523j156850J100368N52619L34385M74304O07605L14101J12959m85436
12520B139578j761296k816421n41681J453363K437695j31222p21852J503550n30451
12511A031263j212422j465179j435572n92111J434833J106047k972870k116066
12503f222077J566194O32119L24924J940711M24831j66432L01143N52513J069247
12494D23173J014354q5872K76957j90906q81029j82290m47647o17444j8323j085479
12484a794506k645251j085899J208533K866633L170341L263066K778224J405797
12476I166938j502341l740533k588794n50799j082775q60225o27296l83877q12480
12467b982182q44686k49988l88186K91158Q23694M95432J143137l79982m49735
$$ plain form
12458 -2541338 -2538200 -2689812 -1063647 720282 890809 475283 530871 1243814 2674745
12449 2674745 3249095 1514720 69379 -260643 -990707 -3001801 -4121974 -2704013 -2367251
12440 -2367251 -3625047 -4329644 -2553450 -1576002 -2008964 -3387663 -2769489 -1766786 -1566144
12431 -1566144 -1999867 -3626467 -4096255 -3802008 -4533847 -4113825 -2251678 -1648765 -1854076
12422 -1854076 -1207457 67095 189413 -1388660 -4499144 -5712306 -4996301 -3442764 -2200245
12413 -2200245 -1016181 546963 1566741 1298427 691215 1084972 1923534 3696266 3701563
12404 3701563 1746999 -296979 -2936741 -4967057 -5807482 -6729121 -6109015 -3915082 -2036105
12395 -2036105 -1365237 -957941 -2737755 -3892436 -2599059 -1663527 -1743088 -1723434 -450634
$$ packed form
12458b541338L138j51612J626165J783929J70527m15526N5588P12943J430931
12449B674745N74350j734375j445341l30022p30064k011094j120173J417961L36762
12440b367251j257796p04597J776194R77448m32962j378699O18174J002703K00642
12431a566144m33723j626600m69788K94247p31839M20022J862147O02913k05311
12422a854076O46619J274552J22318j578073l110484j213162P16005J553537J242519
12413b200245J184064J563144J019778k68314o07212L93757Q38562J772732N297
12404C701563j954564k043978k639762k030316q40425r21639O20106K193933J878977
12395b036105O70868M07296j779814j154681J293377R35532p9561J9654J272800
$$ plain form
12386 -450634 1025758 647063 -1086818 -2280249 -4417469 -4830052 -2036540 -1188272 -1944051
12377 -1944051 -2762879 -3178966 -4657581 -5715902 -5041790 -2679370 -375784 247538 -801721
12368 -801721 -280162 1829277 1796959 851572 197818 1125991 1995490 1744120 1308093 1616560
12358 1616560 1758771 1277525 852053 62526 88119 359055 177045 1314820 1488319
12349 1488319 1912430 1931186 720199 409259 1978098 4634849 5695529 4028479 1832889
12340 1832889 2005482 1889491 1967673 2934220 1900436 358920 -1389339 -2930287 -1773766
12331 -1773766 -301978 -1057573 -2799118 -3972710 -3819812 -2104759 1326642 4985115
12323 4985115 6634310 6812677 5772963 3891123 4127361 2312428 1485735 1570243 943781
$$ packed form
12386d50634J476392l78695j733881j193431k137220m12583K793512Q48268p55779
12377a944051q18828m16087j478615j058321O74112K362420K303586O23322j049259
12368h01721N21559K109439l2318r45387o53754R28173Q69499k51370m36027L08467
12358A616560J42211m81246m25472p89527K5593K70936j82010J137775J73499
12349A488319M24111J8756j210987l10940J568839K656751J060680j667050k195590
12340A832889J72593j15991P8182R66547j033784j541516j748259j540948J156521
12331a773766J471788p55595j741545j173592J52898J715053L431401L658473
12323D985115J649195J78367j039714j881840K36238j814933q26693Q4508o26462
$$ plain form
12314 943781 431961 809379 1742565 2024107 1187078 -1631873 -4351712 -3525571 -1919621
12305 -1919621 -1260507 -3025552 -4928730 -6518546 -5716617 -2351354 -1016113 -1702329 -1670223
12296 -1670223 -1029879 -986905 -1211751 47973 682097 -145529 -83413 1553576 2978246
12287 2978246 3670312 3148493 2675390 1693316 2573720 5019626 3806710 2454721 2962515
12278 2962515 4368741 3297622 866599 -359583 286604 1898018 2305440 1198133
12270 1198133 1480543 2667484 4075021 4963948 5445465 5110721 3453216 940148 771716
12261 771716 1616981 2387468 2751636 2696004 3253818 5314318 7477046 6794191 4537801
12252 4537801 4458634 5128522 4569537 4198437 4833299 4857779 4155893 4194017 4896618 3732850
$$ packed form
12314I43781n11820L77418R33186K81542q37029k818951k719839Q26141J605950
12305a919621O59114j765045j903178j589816Q01929L365263J335241o86216L2106
12296a670223O40344M2974k24846J259724O34124q27626O2116J636989J424670
12287B978246O92066n21819m73103r82074Q80404K445906j212916j351989N07794
12278B962515J406226j071119k431023j226182O46187J611414M07422j107307
12270A198133K82410J186941J407537Q88927M81517l34744j657505k513068j68432
12261G71716Q45265P70487L64168n5632N57814K060500K162728o82855k256390
12252D537801p9167O69888n58985l71100O34862K4480p01886L8124P02601j163768
$$ plain form
12242 3732850 960923 -363901 633345 2179344 3749634 4025148 3519579 2120797 1739032
12233 1739032 1435339 912052 -148631 -550653 -1763359 -3217760 -2949634 -2063988 -1621215
12224 -1621215 -493745 480904 -444189 -2185514 -3772357 -3323217 -2452553 -2148298 -3878851
12215 -3878851 -2074315 460612 1461108 711177 -708743 -67534 2943370 3480817 1664106
12206 1664106 327475 1187080 2931209 3082815 5085271 7276598 5777748 3111208
12198 3111208 1920371 429016 -1576284 -1863031 -2379535 -3309908 -2781087 -242565 2280806
12189 2280806 3238248 3564070 1351708 -651058 -602854 -300405 282825 2272952 3512132
12180 3512132 3635872 3127995 1662573 938871 3098565 3777948 1166469 -2222874 -2558738
$$ packed form
12242C732850k771927j324824R97246J545999J570290K75514n05569j398782l81765
12233A739032l03693n23287j060683m02022j212706j454401K68126Q85646M42773
12224a621215J127470R74649r25093j741325j586843M49140Q70664L04255j730553
12215c878851J804536K534927J000496p49931j419920O41209L010904N37447j816711
12206A664106j336631Q59605J744129J51606K002456K191327j498850k666540
12198C111208j190837j491355k005300k86747n16504r30373N28821K538522K523371
12189B280806R57442L25822k212362k002766M8204L02449N83230J990127J239180
12180C512132J23740n07877j465422p23702K159694O79383k611479l389343l35864
$$ plain form
12171 -2558738 -1505590 -1640687 -1679036 -2267073 -3443028 -3707758 -2793248 -1513450 -932121
12162 -932121 -1100361 554623 451909 -1033337 -322975 2375247 3421326 1847078 524703
12153 524703 637947 1233533 2970842 3266761 74759 -1633263 -1946430 -1634670 -1927775
12144 -1927775 -1451519 459515 2600864 4138134 3460082 1846441 -68646 -1571772
12136 -1571772 -2704582 -2905441 -2179922 -2826661 -3856401 -4940525 -5813245 -5492740 -5148809
12127 -5148809 -4736810 -3799149 -3037170 -3774008 -3628483 -1142494 527265 447413 124214
12118 124214 -804799 -2033547 -2779874 -3101279 -1526554 -494840 -178014 1636993 1933969
12109 1933969 429039 -1339197 -1461818 -1495222 -3019129 -4412795 -4722727 -4778385 -4966915
$$ packed form
12171b558738J053148j35097l8349n88037j175955k64730R14510J279798N81329
12162i32121j68240J654984j02714j485246P10362K698222J046079j574248j322375
12153E24703J13244N95586J737309K95919l192002j708022l13167L11760k93105
12144a927775M76256J911034K141349J537270o78052j613641j915087j503126
12136a571772j132810k00859P25519o46739j029740j084124q72720L20505L43931
12127e148809M11999R37661P61979p36838J45525K485989J669759p9852l23199
12118A24214r29013j228748p46327l21405J574725J031714L16826J815007K96976
12109A933969j504930j768236j22621l3404j523907j393666l09932n5658j88530
$$ plain form
12100 -4966915 -3709701 -2769216 -2056495 -2287987 -1481540 2659316 7392876 4403324 809561
12091 809561 1269393 1185250 1757665 1046021 177261 786062 505593 -1033383 -1701601 -1882736
12081 -1882736 -2033120 -1488040 -655346 -589075 -895779 -822048 -480438 -117117 -327171 -304419
12071 -304419 -143995 -894622 -1287706 -859963 -1879295 -2677000 -1709277 -784827 -870403 -873401
12061 -873401 -205405 1154292 1987858 1164850 464169 -472005 -1749865 -1006960 -93144
12052 -93144 -370646 -1358660 -3145310 -2934476 -3233077 -4479260 -4175122 -1486348 227872
12043 227872 1180288 2695974 2200015 1715091 300542 -753090 -1237051 -2376699 -2878931
12034 -2878931 -3381617 -2683792 -375200 2114217 4278065 5498150 4391313 2357092
$$ packed form
12100d966915J257214R40485P12721k31492Q06447M140856M733560k989552l593763
12091H09561M59832q4143N72415p11644q68760O08801k80469j538976o68218j81135
12081a882736j50384N45080Q32694O6271l06704P3731L41610L63321k10054K2752
12071c04419J60424p50627l93084M27743j019332p97705R67723R24450q5576k998
12061h73401O67996J359697Q33566q23008p00681r36174j277860P42905R13816
12052i3144k77502r88014j786650K10834k98601j246183L04138K688774J714220
12043B27872R52416J515686m95959m84924j414549j053632m83961j139648n02232
12034b878931n02686O97825K308592K489417K163848J220085j106837k034221
$$ plain form
12026 2357092 -824722 -3802633 -5692007 -5645608 -3382313 -1720352 -657070 457503
12018 457503 420086 -1551249 -2323335 -1278960 -1228541 -773146 360791 1603592 2262435
12009 2262435 1882952 3649502 3756131 1227468 -744293 -2705709 -3706201 -2677534
12001 -2677534 -1328223 -167140 585239 843249 912716 -615931 -1170705 -776718 -1305139
11992 -1305139 -2756860 -3022713 -3311195 -4132546 -3963757 -2693772 563739 3283597 2908570
11983 2908570 925671 -794495 -1683247 -698610 -611358 -1646643 -1656935 -2205612 -3293252
11974 -3293252 -2848423 -1588481 -2539164 -3526604 -3698443 -4510770 -4509579 -4633595 -5290384 -4812223
11964 -4812223 -3217337 -2299345 -1485723 -544397 230998 600283 394577 203916 1643237
$$ packed form
12026B357092l181814k977911j889374M6399K263295J661961J063282J114573
12018D57503l7417j971335p72086J044375N0419M55395J133937J242801O58843
12009B262435l79483J766550J06629k528663j971761j961416j000492J028667
12001b677534J349311J161083P52379K58010O9467j528647n54774L93987n28421
11992a305139j451721k65853k88482q21351J68789J269985L257511K719858l75027
11983B908570j982899j720166q88752R84637Q7252j035285j0292n48677j087640
11974c293252M44829J259942r50683r87440j71839q12327J191j24016o56789M78161
11964d812223J594886R17992Q13622R41326P75395L69285k05706j90661J439321
$$ plain form
11955 1643237 2961143 1885609 1066391 2399424 2900670 3038778 3743299 2957605 822158
11946 822158 -26434 1780630 3463450 4955644 4803353 5306355 6645336 6964349 6240973
11937 6240973 4699064 2989980 1455331 277798 117623 -657247 -1494127 -1895032 -2107064
11928 -2107064 -3357780 -3513408 -1047450 381561 1445206 3507071 3197341 1718882
11920 1718882 805990 360661 304241 437439 2391448 5101411 5257820 3639505 2489663
11911 2489663 1388361 2078618 3555553 2470365 1746458 2933274 3811367 2491507 -392612
11902 -392612 -2493309 -2803730 -2082141 -1650948 -2217425 -2228428 -1968933 -3044825 -3557797
11893 -3557797 -3566871 -4601975 -6232559 -5817296 -5044587 -4683025 -5697346 -5337667 -4447749
$$ packed form
11955A643237J317906j075534q19218J333033N01246J38108P04521p85694k135447
11946H22158q48592J807064J682820J492194j52291N03002J338981L19013p23376
11937F240973j541909j709084j534649j177533j60175p74870q36880m00905k12032
11928b107064j250716j55628K465958J429011J063645K061865l09730j478459
11920A718882r12892m45329n6420J33198J954009K709963J56409j618315j149842
11911B489663j101302O90257J476935j085188p23907J186816Q78093j319860k884119
11902c92612k100697l10421P21589M31193n66477j1003K59495j075892n12972
11893c557797r074j035104j630584M15263P72709L61562j014321L59679Q89918
$$ plain form
11884 -4447749 -4122361 -1728975 -273823 295923 1890279 3141681 4314410 5522742
11876 5522742 4983519 4633968 5989823 5188120 2937843 2273741 1503333 857875 852649
11867 852649 -502078 -1795016 -2403811 -2242110 -1183537 1493317 3676338 3693702 3141395
11858 3141395 2689846 1405873 2169905 2958671 557897 -1533229 -1433497 -1943040 -1677290
11849 -1677290 200693 2213371 2283606 2022732 2235766 585285 -196565 -168233 185729
11840 185729 1084209 2155961 3788969 5452531 5341296 3111772 633667 -103747 1181256
11831 1181256 1860958 156288 -1653280 -2932014 -2865626 -3319603 -4254464 -4763066 -4371821
11822 -4371821 -3433344 -1837957 -1090960 -1602259 -2033228 -2244438 -2049769 -2624625 -3364551
$$ packed form
11884d447749L25388K393386J455152N69746J594356J251402J172729J208332
11876E522742n39223l49551J355855q01703k250277o64102p70408o45458n226
11867H52649j354727j292938o08795J61701J058573K676854K183021J7364n52307
11858C141395m51549j283973P64032P88766k400774k091126R9732n09543K65750
11849a677290J877983K012678P0235k60874K13034j650481p81850K8332L53962
11840A85729Q98480J071752J633008J663562j11235k229524k478105p37414J285003
11831A181256O79702j704670j809568j278734O6388m53977r34861n08602L91245
11822d371821R38477J595387P46997n11299m30969k11210J94669n74856p39926
$$ plain form
11813 -3364551 -3106990 -2880018 -2992102 -3425275 -1327006 2965976 5769710 5781016 5483338
11804 5483338 5597481 5514168 3031275 747322 -630624 -1029945 -519734 291175 493828
11795 493828 669096 1958896 2936633 4923850 6026673 4623578 3019172 2399770 2736202
11786 2736202 3429112 3014559 2506585 623713 -193024 1584021 1967056 875786 1676757
11777 1676757 2779016 4457897 5726026 4681806 3603327 2385070 2547062 2416618
11769 2416618 51963 -2929022 -4034196 -4263271 -4593939 -4064467 -3493095 -2749608 -544791
11760 -544791 788633 -499438 -2592944 -3777881 -3091292 -291332 1465054 1529290 1651978
11751 1651978 1172936 1714774 437455 -2163309 -3007041 -2415762 -1018277 1383704 3073426
$$ packed form
11813c364551K57561K26972j12084m33173K098269M292982K803734J1306k97678
11804E483338J14143q3313k482893k283953j377946l99321N10211Q10909K02653
11795D93828J75268J289800R77737J987217J102823j403095j604406o19402L36432
11786B736202O92910m14553n07974j882872q16737J777045L83035j091270Q00971
11777A676757J102259J678881J268129j044220j078479j218257J61992j30444
11769B416618k364655k980985j105174k29075l30668N29472N71372P43487K204817
11760e44791J333424j288071k093506j184937O86589K799960J756386O4236J22688
11751A651978m79042N41838j277319k600764q43732N91279J397485K401981J689722
$$ plain form
11742 3073426 1817789 -574685 -1725732 -1584694 -1741994 -1191297 1671886 4023709 2717113
11733 2717113 2311205 3018388 2093414 1692886 1611573 569699 28958 464921 591685
11724 591685 23427 -1538085 -1109340 1040596 1734689 1796401 1229163 1415681 190110
11715 190110 -1588942 -1683169 -157810 672694 798701 1683293 175152 -2448677 -3445175
11706 -3445175 -3356596 -1259380 2021040 528250 -1345430 -3445272 -3487389 -1191212 -654800
11697 -654800 -1303759 -1296443 -2325398 -4719005 -4675498 -1745804 509724 922260 507251
11688 507251 -1294323 -1599750 -525585 -915315 -1347604 -1638072 -818235 28853 402426
11679 402426 1415333 2542362 3244645 1538533 414357 -265906 414975 2230444 2064444
$$ packed form
11742C073426j255637k392474j151047J41038j57300N50697K863183K351823j306596
11733B717113m05908P07183r24974m00528q1313j041874n40741M35963J26764
11724E91685n68258j561512M28745K149936O94093O1712n67238J86518j225571
11715A90110j779052r4227J525359Q30504J26007Q84592j508141k623829r96498
11706c445175Q8579K097216L280420j492790j873680k099842m2117K296177N36412
11697f54800o48959P316j028955k393607M3507K929694K255528M12536m15009
11688E07251j801574l05427J074165l89730m32289k90468Q19837Q47088L73573
11679D02426J012907J127029P02283j706112j124176o80263O80881J815469j66000
$$ plain form
11670 2064444 597477 -962726 -851245 1233780 2880041 4632090 6361905 6478330
11662 6478330 5386058 5315729 5409709 2504197 80609 -1333313 94112 2051375 2143125
11653 2143125 3790194 6441161 6460753 4661127 4638346 6741179 6817677 4249463 2797431
11644 2797431 3155499 3038400 1551472 390348 668785 1071004 1979254 2889502 3801234
11635 3801234 4011279 3822671 3337501 2803585 3109472 2631665 1407480 1509367 4090122
11626 4090122 6095585 6245217 4085272 1153584 365327 1813020 2911430 3666618 3944896
11617 3944896 3376608 2412720 2167910 2341510 2191939 2914015 4415504 5075116 5303710
11608 5303710 5146324 3844258 2497613 1940581 1243728 -233006 -537145 433807 443988
$$ packed form
11670B064444j466967j560203J11481K085025J646261J752049J729815J16425
11662F478330j092272p0329R3980k905512k423588j413922J427425J957263R1750
11653B143125J647069K650967J9592j799626k2781K102833P6498k568214j452032
11644B797431L58068j17099j486928j161124K78437M02219R08250R10248R11732
11635C801234K10045j88608m85170n33916L05887m77807j224185J01887K580755
11626D090122K005463J49632k159945k931688p88257J447693J098410P55188K78278
11617C944896n68288r63888k44810J73600j49571P22076J501489O59612K28594
11608E303710j57386j302066j346645n57032o96853j476734l04139R70952J0181
$$ plain form
11599 443988 617163 197787 14823 -1296090 -1845745 -597375 -205697 -1500898 -2327745
11590 -2327745 -1524275 -390970 2432951 4603647 4762298 4519806 4458914 3236324 683214
11581 683214 -706809 1406 1236769 2078023 787765 -750049 -679427 -129314 428227
11572 428227 537132 839723 86123 -1872169 -1413190 235107 74410 1237228 2561611
11563 2561611 1357081 704139 -25805 1101380 2728605 2247942 1767887 1741343 2730302
11554 2730302 3210641 3238965 3499507 3245410 1374314 556109 1755766 4174047 4516212
11545 4516212 2082724 1315708 1600893 1399508 912689 -112414 -188092 301745 -506439
11536 -506439 -607602 308185 430935 1030832 1103071 330343 1099571 2313154 978471
$$ packed form
11599D43988J73175m19376j82964j310913n49655J248370L91678j295201q26847
11590b327745Q03470J133305K823921K170696J58651k42492o0892j222590k553110
11581F83214j390023P08215J235363Q41254j290258j537814P0622N50113N57541
11572D28227J08905L02591p53600j958292M58979J648297j60697J162818J324383
11563B561611j204530o52942p29944J127185J627225m80663m80055k6544R88959
11554B730302M80339K8324K60542k54097j871096q18205J199657K418281L42165
11545D516212k433488p67016K85185k01385m86819j025103p5678M89837q08184
11536e06439j01163R15787J22750N99897P2239p72728P69228J213583j334683
$$ plain form
11527 978471 -2308094 -3668685 -2949489 -2676902 -1933353 -919297 258992 2769020 3548779
11518 3548779 3244277 2896960 1873019 1250132 1683989 2451333 3724743 3711895 4290560
11509 4290560 2922964 1221478 1010310 793283 883772 1589484 2621763 2750879 2414193
11500 2414193 -456137 -3273283 -4182324 -4564009 -5344701 -4923658 -2331564 -1296290 -10873
11491 -10873 1620525 596413 -309471 -2011636 -2642670 -2624950 -1733050 -1816050 -2003154 -968306
11481 -968306 -343190 -272804 -509865 547877 -59741 -267362 1081233 2131252 3873072
11472 3873072 3630278 1650776 309360 1377735 3149552 2293295 1212378 1670888 637332
11463 637332 -1779331 -2950941 -3513646 -2934523 -889641 1944086 4097170 4795801 4075116
$$ packed form
11527I78471l286565j360591P19196K72587P43549J014056J178289K510028P79759
11518C548779l04502l47317j023941o22887M33857P67344J273410j2848N78665
11509D290560j367596j701486k11168k17027R0489P05712J032279J29116l36686
11500B414193k870330k817146r09041l81685p80692M21043K592094J035274J285417
11491a0873J631398j024112r05884j702165o31034J7720Q91900q3000j87104J034848
11481i68306O25116P0386k37061J057742o07618k07621J348595J050019J741820
11472C873072k42794j979502j341416J068375J771817q56257j080917M58510j033556
11463F37332k416663j171610n62705N79123K044882K833727K153084O98631p20685
$$ plain form
11454 4075116 1772114 159859 -72915 -809829 -1508178 -958677 8007 -205823 -1100574
11445 -1100574 -1642566 -2224516 -2880584 -2192201 -510253 492214 652370 458972 85069
11436 85069 879968 636345 -639769 -1678152 -3682030 -5745428 -5486225 -4384946 -2699996
11427 -2699996 -280088 1271799 1945014 1868370 1498858 269421 -807264 108081 -481188
11418 -481188 -1885701 -4150735 -5269627 -4246838 -2949889 -1686007 -680558 -1232895
11410 -1232895 -3471393 -4663202 -5269142 -4833307 -4162844 -3103269 -2510187 -2636033 -1157023
11401 -1157023 -1135941 -1198258 -928588 -1969983 -2214712 -2078464 -1542437 -767381 -2032419
11392 -2032419 -3779094 -4050483 -3470712 -2392972 -2067803 -5016954 -10782405 -13154109 -8827318
$$ packed form
11454D075116k303002j612255k32774p36914o98349N49501R66684k13830q94751
11445a100574n41992n81950o56068O88383J681948J002467J60156j93398l73903
11436H5069P94899k43623j276114j038383k003878k063398K59203J101279J684950
11427b699996K419908J551887O73215p6644l69512j229437j076685R15345n89269
11418d81188j404513k265034j118892J022789J296949J263882J005449n52337
11410a232895k238498j191809o05940M35835O70463J059575N93082j25846J479010
11401a157023K1082o2317K69670j041395k44729J36248N36027P75056j265038
11392b032419j746675k71389N79771J077740L25169k949151n765451k371704M326791
$$ plain form
11383 -8827318 -4369793 -2155218 -837495 -86378 -230210 335342 749651 -1180475 -1370606
11374 -1370606 -728881 -810733 -584492 -29209 506136 501529 -826234 -1421390 25812 1216426
11364 1216426 785324 2030023 3182015 2410404 -1186056 -4193149 -4595629 -3932987 -4461598
11355 -4461598 -5217570 -5473509 -5128549 -4625921 -3176115 -1948959 -3565370 -5218177 -5155567
11346 -5155567 -4951372 -4527208 -4973887 -6154022 -5956012 -5373046 -4250735 -2260211 -97395
11337 -97395 648344 1578789 3031205 4438328 4727729 3557392 2482189 2187087 3080068
11328 3080068 3587149 4029914 3709118 1456683 -913414 -1048621 90787 220303 82891
11319 82891 -2091339 -1231315 1467590 1570441 530838 -2307549 -4757799 -3905804 -1422679
$$ packed form
11383h827318M457525K214575J317723P51117j43832N65552M14309j930126j90131
11374a370606O41725q1852K26241N55283N35345m607j327763n95156J447202J190614
11364A216426m31102J244699J151992p71611l596460l007093m02480O62642n28611
11355d461598p55972k55939L44960N02628J449806J227156j616411j652807O2610
11346e155567K04195M24164m46679j180135J98010N82966J122311J990524K162816
11337i7395P45739R30445J452416J407123K89401j170337j075203k95102Q92981
11328C080068N07081M42765l20796k252435k370097j35207J139408J29516j37412
11319H2891k174230Q60024K698905J02851j039603k838387k450250Q51995K483125
$$ plain form
11310 -1422679 952984 1343771 568765 341669 589600 -1477881 -3066521 -3572331 -3715525
11301 -3715525 -1385978 -389158 -709020 -2221947 -1851455 280846 941368 -227116 -1125969
11292 -1125969 -1076573 -787719 -1709183 -3953941 -5524684 -5001983 -4292797 -3268481 -2359071
11283 -2359071 -1947980 -2604890 -2202539 1396714 3993646 3842579 1902312 317118 -403275
11274 -403275 -1358314 -2732445 -3438929 -4740276 -5706241 -4176531 -1521600 -793246 -554413
11265 -554413 -1359784 -3013101 -2728236 -1150206 72269 1106295 2860925 4504520 5550294
11256 5550294 5279512 4434474 2415795 -56943 -1659203 -2292808 -360337 2316467 2045619
11247 2045619 1021036 899769 777984 1719167 1680745 906071 -112106 -998980 432535
$$ packed form
11310a422679K375663L90787p75006k27096K47931k067481j588640n05810j43194
11301c715525K329547R96820l19862j512927L70492K132301O60522j168484q98853
11292a125969M9396K88854r21464k244758j570743N22701P09186J024316R09410
11283b359071M11091o56910M02351L599253K596932j51067j940267j585194p20393
11274d03275r55039j374131p06484j301347r65965J529710K654931P28354K38833
11265e54413q05371j653317K84865J578030J222475J034026J754630J643595J045774
11256E550294k70782q45038k018679k472738j602260o33605J932471K676804k70848
11247B045619j024583j21267j21785R41183l8422p74674j018177q86874J431515
$$ plain form
11238 432535 1499238 3169807 3980384 5211669 7546350 7924481 7036669 5080832 1885853
11229 1885853 339203 -1352745 -2714411 -2825496 -876956 -136890 -30016 2653430 4390596
11220 4390596 2953475 1043498 -512118 -2149014 -2948734 -1566809 -816841 599061
11212 599061 2519418 3224394 3456040 2463634 -681139 -2114354 -1288782 185616 -431730
11203 -431730 -589690 -1072052 -1916787 -1661236 -2232030 -1443724 -1144125 -2530597 -3599149
11194 -3599149 -3637998 -3867880 -3553185 -1459647 -69705 -487728 -1966127 -1870361 786508
11185 786508 1370874 580481 562669 2418706 4208029 3614218 2811518 2383829 2412110 2624799
11175 2624799 1566082 717935 -567524 -2181850 -4015239 -6264794 -6149409 -4132647
$$ packed form
11238D32535J066703J670569Q10577J231285K334681L78131q87812j955837l194979
11229A885853j546650j691948j361666j11085J948540P40066J06874K683446J737166
11220D390596j437121j909977j555616j636896p99720J381925P49968J415902
11212E99061J920357P04976K31646r92406l144773j433215Q25572J474398o17346
11203d31730j57960m82362q44735K55551n70794P88306K99599j386472j068552
11194c599149l8849k29882L14695K093538J389942m18023j478399R5766K656869
11185G86508N84366p90393j7812J856037J789323n93811q02700m27689K8281K12689
11175B624799j058717q48147j285459j614326j833389k249555J15385K016762
$$ plain form
11167 -4132647 -3224688 -1934560 -1038620 -1552721 -1950964 -434566 261422 -858343 -2843987
11158 -2843987 -3177064 -2519982 -3299383 -4285007 -3030322 -1212663 -369011 1202369 1530592
11149 1530592 -817011 -1761056 -227916 2213475 2622072 2240702 1924848 610503 -5536
11140 -5536 -90152 -710570 -3046131 -6228073 -5457232 -4554833 -2975698 -2319559 -2585230 -2487631
11130 -2487631 -3253156 -3369473 -3970144 -3484895 -790418 1500159 4029338 4566188 2394338
11121 2394338 476938 -224981 -182919 1366171 3161218 3628305 2924553 3088410 3259339
11112 3259339 2171327 2246357 2747580 1925080 1483476 2708146 3939672 2435009 2107507
11103 2107507 2189882 939641 -31675 -834179 -750305 -1210322 -1660483 -901086 1001848
$$ packed form
11167d132647R07959J290128Q95940n14101l98243J516398O95988j119765j985644
11158b843987l33077O57082p79401r85624J254685J817659Q43652J571380L28223
11149A530592k347603r44045J533140K441391M08597l81370l15854j314345o16039
11140e536q4616o20418k335561l181942P70841R02399J579135O56139k65671R7599
11130b487631p65525j16317o00671M85249K694477K290577K529179N36850k171850
11121B394338j917400p01919M2062J549090J795047M67087p03752J63857J70929
11112C259339j088012P5030N01223q22500m41604J224670J231526j504663l27502
11103B107507Q2375j250241r71316q02504Q3874m60017m50161P59397J902934
$$ plain form
11094 1001848 4272799 4661123 2725385 178063 -807469 2703861 6520305 6637816 5559256
11085 5559256 5099619 5222710 3621225 1411423 1179724 1536135 1212122 871525 619368
11076 619368 -517719 258987 2553191 3638540 3441466 2232025 1203525 353157 -4366
11067 -4366 -1147493 -1471999 -1112522 -1293360 -1035621 -2012129 -2158643 -2046156 -875835 -2275549
11057 -2275549 -4653594 -5259049 -5218071 -4998239 -2797165 -209575 885423 -322112 -2329087
11048 -2329087 -2125059 -1342929 -1036322 61887 1219792 1838562 1311886 317775 9396
11039 9396 -1070597 -2880630 -3713648 -3844403 -3119438 -1224264 -1249766 -4593172 -7603616
11030 -7603616 -5986018 -3724582 -4361756 -4018463 -1272487 -135239 -1889871 -3287889
$$ packed form
11094A001848L270951L88324j935738k547322r85532L511330L816444J17511j078560
11085E559256m59637J23091j601485k209802k31699L56411l24013l40597k52157
11076F19368j137087P76706K294204J085349j97074j209441j028500q50368l57523
11067d366j143127l24506L59477j80838K57739r76508j46514J12487J170321j399714
11057b275549k378045o05455M0978K19832K201074K587590J094998j207535k006975
11048b329087K04028P82130L06607J098209J157905O18770n26676r94111l08379
11039I396j079993j810033q33018j30755P24965J895174k5502l343406l010444
11030g603616J617598K261436o37174L43293K745976J137248j754632j398018
$$ plain form
11022 -3287889 -5308208 -6170435 -5102282 -3379367 -2724644 -1344461 1158659 2045409 1832601
11013 1832601 1075472 985504 433448 6696 893645 3049617 2839454 39024 -331848
11004 -331848 -368645 -1859840 -1640637 448019 1536348 475707 -281528 89610 1734778
10995 1734778 2783358 2034570 2070055 1407496 -54273 -501765 -1113164 -1517667 -2020174
10986 -2020174 -3111285 -3289122 -2132202 357185 1602403 1887056 1827849 -137045 -1620042
10977 -1620042 -932711 56321 1548878 2977449 3473869 3022930 3259528 3473657 1350971
10968 1350971 -1257249 -2509746 -1442079 -872546 -1075372 -636190 -347718 -921240 -3301523
10959 -3301523 -3460526 -1870141 -2392538 -1529456 -1126088 -958768 677135 3102493 2723725
$$ packed form
11022c287889k020319q62227J068153J722915O54723J380183K503120Q86750k12808
11013A832601p57129q9968n52056m26752Q86949K155972k10163k800430l70872
11004c31848l6797j491195K19203K088656J088329j060641p57235L71138J645168
10995A734778J048580p48788L5485o62559j461769m47492o11399m04503n02507
10986b020174j091111j77837J156920K489387J245218K84653n9207j964894j482997
10977a620042O87331R89032J492557J428571M96420m50939K36598K14129k122686
10968A350971k608220j252497J067667N69533k02826M39182K88472n73522k380283
10959c301523j59003J590385n22397Q63082M03368J67320J635903K425358l78768
$$ plain form
10950 2723725 1577526 1236633 1094767 764478 1698856 3223028 3541025 783991 -1102227
10941 -1102227 -1431396 -2918401 -4277182 -4049997 -2401595 -457263 426068 33175 -517761
10932 -517761 -2059285 -3357300 -2197937 -866363 942844 2585598 3386696 3109960 1696512
10923 1696512 3131825 5658624 6731190 7361243 6344423 5843524 7249126 7857260 8198895
10914 8198895 7884272 6203573 5256663 5080860 4069032 3512505 2785688 2560856 2885971
10905 2885971 4842186 4661591 3408310 3790939 5836542 6297413 8429886 13986089 20317273
10896 20317273 28681858 44194632 66329557 92656613 106941467 91172867 64046970
10889 64046970 44206882 32614110 24927193 20837393 19244801 20092450 23099374 28893224
$$ packed form
10950B723725j146199l40893j41866l30289R34378J524172L17997k757034j886218
10941a102227l29169j487005j358781K27185J648402J944332Q83331l92893n50936
10932e17761j541524j298015J159363J331574J809207J642754Q01098k76736j413448
10923A696512J435313K526799J072566O30053j016820n00899J405602O08134L41635
10914H198895l14623j680699r46910j75803j011828n56527p26817k24832L25115
10905B885971J956215j80595j253281L82629K045603M60871K132473N556203O331184
10896B0317273Q364585J5512774K2134925K6327056J4284854j5768600k7125897
10889F4046970j9840088j1592772p686917m089800j592592Q47649L006924N793850
$$ plain form
10881 28893224 38284793 52880603 75893387 100888195 105515401 83532911 57527160
10874 57527160 39752143 29691937 23587454 18914476 13960568 10810803 8525638 7674824
10866 7674824 6897304 6431964 5432564 3887002 2870751 3142420 1212879 467711 1083715
10857 1083715 2355225 2911463 2773142 2590382 1603767 2188379 3499843 2902621 2396978
10848 2396978 3156938 3304590 4402793 5986986 5707992 1948276 233716 -146218 -254766
10839 -254766 -7164 -402054 -841454 -903328 -781095 -770918 -482103 378372 966491 1176461
10829 1176461 113944 -1114744 -734324 -790131 -1126165 -1648325 -527666 1633777 1840214
10820 1840214 392615 110832 420328 277314 1846060 2058104 -1756624 -4629647 -2993374
$$ packed form
10881B8893224R391569J4595810K3012784K4994808M627206k1982490k6005751
10874E7527160j7775017j0060206o104483m672978m953908l149765k285165q50814
10866G674824p77520m65340r99400j545562j016251K71669j929541p45168O16004
10857A083715J271510N56238j38321j82760r86615N84612J311464n97222n05643
10848B396978P59960J47652J098203J584193k78994l759716j714560l79934j08548
10839b54766K47602l94890m39400o1874J22233J0177K88815Q60475N88119K09970
10829A176461j062517j228688L80420n5807l36034n22160J120659K161443K06437
10820A840214j447599k81783L09496j43014J568746K12044l814728k873023J636273
$$ plain form
10811 -2993374 -1317666 -1733924 -936894 397332 1635872 2756795 3103630 3710882 4890817
10802 4890817 4709855 3171367 1349309 1221357 916642 617901 1050929 1643673 1515871
10793 1515871 467107 833448 442121 -1284513 101226 1862858 -291447 -1742197
10785 -1742197 -2173551 -1865918 -132177 1202976 1482817 -711540 -4280908 -6195128 -6387423
10776 -6387423 -5086567 -4112210 -2523502 -1124805 -131335 -884733 -3387106 -5296331 -3967843
10767 -3967843 -1920582 -2301123 -2700481 -3718121 -6787013 -7827253 -3272757 -758338
10759 -758338 -996009 -1484053 -1979142 -2193404 -823842 299521 1025916 -149161 -861138
10750 -861138 -231245 -143341 815104 1927140 2252753 2040152 2019266 2653804 2599823 3496829
$$ packed form
10811b993374J675708m16258P97030J334226J238540J120923L46835O07252J179935
10802D890817j80962j538488j822058j27952l04715k98741M33028N92744j27802
10793A515871j048764L66341l91327j726634J385739J761632k154305j450750
10785a742197m31354L07633J733741J335153K79841k194357l569368j914220j92295
10776f387423J300856R74357J588708J398697R93470p53398k502373j909225J328488
10767c967843K047261l80541l99358j017640l068892j040240M554496K514419
10759g58338k37671m88044m95089k14262J369562J123363P26395j175077p11977
10750h61138O29893Q7904R58445J112036L25613k12601k0886O34538n3981Q97006
$$ plain form
10740 3496829 5439310 7069123 7470022 7287522 6738003 5983905 3729026 748712 -1662177
10731 -1662177 -3401697 -3083937 -2901854 -2316814 -1715889 -786262 -656178 -493184 1748407
10722 1748407 3965808 4090148 3097278 2792994 3644224 4433441 4302302 2888139 1082623
10713 1082623 -913238 -1534784 -2570178 -2043801 -761724 33111 49520 512522 -274484
10704 -274484 -703766 -1258708 -1876753 -1186766 -724127 -954347 -2742852 -4237244 -2907671
10695 -2907671 -1733639 -2180576 -2376093 -1525372 -713985 -490331 -1214178 -1113938 598529
10686 598529 1166919 993252 1396013 1908673 1289260 -987883 -1056825 -282430 445448 1593894
10676 1593894 1898387 1597366 2679833 2290738 1254659 1538650 1094184 -10302 81315
$$ packed form
10740C496829J942481J629813M00899j82500n49519p54098k254879k980314k410889
10731a662177j739520L17760J82083N85040O00925R29627J30084J62994K241591
10722A748407K217401J24340r92870l04284Q51230P89217j31139j414163j805516
10713A082623j995861o21546j035394N26377J282077P94835J6409M63002p87006
10704b74484m29282n54942o18045O89987M62639k30220j788505j494392J329573
10695b907671J174032m46937j95517Q50721Q11387K23654p23847J00240J712467
10686E98529N68390j73667M02761N12660o19413k277143o8942P74395P27878J148446
10676A593894L04493l01021J082467l89095j036079K83991m44466j104486R1617
$$ plain form
10667 81315 581153 139136 -765375 -2470589 -2611295 -1492391 -2399494 -3979570 -4951716
10658 -4951716 -4987733 -4610170 -3733203 -3153918 -4137072 -4314478 -5225189 -3479950 -1014827
10649 -1014827 -654792 -1065077 -452852 1462850 1063519 -730853 -2836523 -3457754 -3015139
10640 -3015139 -2240173 -882859 -193314 313196 1760075 2201213 933748 313149 562435
10631 562435 818502 574335 135120 666513 222282 -448151 363511 1997778 3353715
10622 3353715 3514920 2507355 1762141 1218160 753471 937973 312906 376813 999382
10613 999382 2655429 5460184 6636344 5553546 4877476 4013174 1869827 1003129 1162499
10604 1162499 1261862 495325 -198684 740645 31411 -921205 1251914 1764419 -219293
$$ packed form
10667H1315M99838m42017r04511j705214j40706J118904r07103j580076r72146
10658d951716l6017L77563Q76967N79285r83154j77406r10711J745239K465123
10649a014827L60035m10285O12225J915702l99331j794372k105670o21231M42615
10640c015139P74966J357314O89545N06510J446879M41138j267465o20599K49286
10631E62435K56067k44167m39215N31393m44231o70433Q11662J634267J355937
10622C353715J61205j007565p45214n43981m64689J84502o25067O3907O22569
10613I99382J656047K804755J176160j082798o76070q64302k143347q66698J59370
10604A162499R9363p66537o94009R39329p09234r52616K173119N12505j983712
$$ plain form
10595 -219293 -1956171 -2718167 -3336148 -3367922 -3197954 -2690819 -942582 478923 578806
10586 578806 -693793 -2049482 -2730053 -2967441 -2173967 -799475 -1891699 -3519425 -4666441
10577 -4666441 -3710651 -2355661 -1217902 2337794 4470947 4282748 1206035 -876089
10569 -876089 -2008865 -4370013 -5330282 -4884690 -1502951 2032343 3492785 2975858 2061554
10560 2061554 1869827 1353700 872490 1327998 1504319 757013 -1308310 -2393303 -1688471
10551 -1688471 -688424 -484599 -1050004 -514453 -3103 -398980 -908818 -512706 1080941
10542 1080941 2636880 2362755 1751575 249134 -1584438 -3864311 -6585779 -6648450 -6043905
10533 -6043905 -6784022 -4697449 -2720355 -1740297 -1306570 -3000147 -3675673 -2303639 -963726
$$ packed form
10595b19293j736878p61996o17981l1774J69968N07135J748237J421505R9883
10586E78806j272599j355689o80571k37388P93474J374492j092224j627726j147016
10577d666441R55790J354990J137759L555696K133153j88199l076713k082124
10569h76089j132776k361148r60269M45592L381739L535294J460442n16927r14304
10560B061554j91727n16127m81210M55508J76321p47306k065323j084993P04832
10551a688471J000047K03825n65405N35551N11350l95877n09838L96112J593647
10542A080941J555939k74125o11180j502441j833572k279873k721468o2671O04545
10533f043905p40117K086573J977094R80058M33727j693577o75526J372034J339913
$$ plain form
10524 -963726 -2472033 -4567590 -4920522 -5212728 -4735088 -3178183 -732521 1526258 2014503
10515 2014503 1283206 198606 82210 -790502 -2082231 -2255398 -719133 213878 513967
10506 513967 780194 659048 591667 -471225 -640134 -204570 -1178359 -1035892 267796
10497 267796 2648726 3238414 1006500 1464553 3881004 5833352 5802619 3740958 2402248
10488 2402248 1744095 2109603 548479 -2286853 -2169273 341601 1106900 556531 -2292499
10479 -2292499 -2613091 -1823104 -2835283 -2374456 -333425 1975733 3169465 3310406 1634407
10470 1634407 -810 -465149 493053 1766413 230000 261393 300043 -1353617 -2660955
10461 -2660955 -2849903 -2899782 -3913281 -3818809 -2802743 -1584093 -1047106 -1364504 -1598301
$$ packed form
10524i63726j508307k095557l52932k92206M77640J556905K445662K258779M88245
10515B014503p31297j084600j16396q72712j291729j73167J536265R33011L00089
10506E13967K66227j21146o7381j062892j68909M35564r73789J42467J303688
10497B67796K380930N89688k231914M58053K416451J952348l0733k061661j338710
10488B402248o58153L65508j561124k835332J17580K510874P65299n50369k849030
10479b292499l20592P89987j012179M60827K041031K309158J193732J40941j675999
10470A634407j635217m64339R58202J273360j536413L1393L8650j653660j307338
10461b660955j88948m9879j013499R4472J016066J218650N36987l17398k33797
$$ plain form
10452 -1598301 -1495346 -1775431 -2188657 -3009603 -2102719 404094 2181060 3258455 3246330
10443 3246330 1706489 1132891 1019939 1583993 2191201 624186 1468065 3183967 3493368
10434 3493368 1752987 -209037 322834 772597 -482571 -2644333 -4180235 -4197800 -2316425
10425 -2316425 -1036091 -740171 -1833508 -2568945 -2367616 -2647232 -3336178 -3509671 -3267651
10416 -3267651 -1928415 -2418412 -3873070 -2747178 -1554773 -625586 -351596 -503294 -413884
10407 -413884 -8144 359706 1906127 3269380 2881097 2368822 1932991 1804900 2813044
10398 2813044 3140978 2396934 2254767 -385184 -1353724 -853707 834036 5094675 8553095
10389 8553095 8527231 4826978 1074769 -54355 -467655 -566319 1047794 1452210 1151838
$$ packed form
10452a598301J02955k80085m13226q20946R06884K506813J776966J077395j2125
10443C246330j539841n73598j12952N64054O07208j567015Q43879J715902L09401
10434C493368j740381j962024N31871M49763j255168k161762j535902j7565J881375
10425b316425J280334K95920j093337p35437K01329k79616o88946j73493K42020
10416c267651J339236m89997j454658J125892J192405R29187K73990j51698Q9410
10407d13884M05740L67850J546421J363253l88283n12275m35831j28091J008144
10398B813044L27934p44044j42167k639951r68540N00017J687743M260639L458420
10389H553095k5864l700253l752209j129124m13300r8664J614113M04416l00372
$$ plain form
10380 1151838 236235 -504987 233703 428900 -25538 -843631 -2292556 -2008903 648963
10371 648963 3711460 4619242 3897808 2830771 338833 -1749927 -3248619 -4093829 -3721201
10362 -3721201 -2313614 -2376622 -2256964 -596930 -483742 -1794350 -1595117 -1126422 -238537
10353 -238537 2740544 3833633 2748515 1005059 1076858 2717694 3666200 3305926 2005433
10344 2005433 1074579 2143013 4061044 4743669 5356211 3829672 808610 -689865 -247611
10335 -247611 -276794 -1382632 -569536 550036 437240 -558222 -2023605 -1877519 -949345
10326 -949345 437831 1602568 1618261 2157611 2501249 2555107 1837283 976084 904575 1407723
10316 1407723 2010321 2026434 1113354 -136413 -1155328 -2197485 -3162276 -2328450 -48206
$$ packed form
10380A151838r15603p41222P38690J95197m54438q18093j448925K83653K657866
10371F48963L062497R07782p21434j067037k491938k088760j498692q45210L72628
10362c721201J407587o3008J19658J660034J13188j310608J99233M68695Q87885
10353b38537K979081J093089j085118j743456P1799J640836R48506l60274j300493
10344B005433r30854J068434J918031O82625O12542j526539l021062j498475M42254
10335b47611k9183j105838Q13096J119572j12796r95462j465383J46086R28174
10326i49345J387176J164737J5693N39350L43638N3858p17824q61199p1509N03148
10316A407723O02598J6113r13080j249767j018915j042157r64791Q33826K280244
$$ plain form
10307 -48206 1674164 282756 -1251296 -1205307 -1776841 -1776687 -912461 -1350223 -2950302 -2886106
10297 -2886106 -2067389 -1708823 -1893419 -2655260 -2679167 -3001062 -2787112 -2350766 -1357984 1424663
10287 1424663 1899302 1130041 1920591 2001136 3494506 6200308 5528827 1932669 -1631206
10278 -1631206 -3431964 -3254181 -1796682 -2772805 -3779794 -2581475 -91833 2345304
10270 2345304 2769678 1850833 1195100 2767370 2632435 1613847 2076020 529635 -832077
10261 -832077 706840 803172 -383963 74665 1027901 1320035 1358576 2528173 4284507
10252 4284507 5824586 6602087 4923119 3142955 2160173 1784086 1481359 2069187 2970982
10243 2970982 2911851 3747630 3930646 3373693 1917689 1429480 910812 474558 -1575473
$$ packed form
10307d8206J722370j391408j534052M5989n71534J54Q64226m37762j600079O4196
10297b886106Q18717L58566j84596p61841k3907l21895K13950M36346R92782K782647
10287A424663M74639p69261P90550Q0545J493370K705802o71481l596158l563875
10278a631206j800758J77783J457499r76123j006989J198319K489642K437137
10270B345304M24374r18845o55733J572270j34935j018588M62173j546385j361712
10261h32077J538917R6332j187135M58628R53236K92134L8541J169597J756334
10252D284507J540079P77501j678968j780164r82782l76087l02727N87828R01795
10243B970982n9131Q35779J83016n56953j456004m88209n18668m36254k050031
$$ plain form
10234 -1575473 -3582993 -2878679 -2179799 -532404 1541321 2799029 3474347 4045320 4205176
10225 4205176 2494285 2344968 3706577 3013749 1641003 730574 -1403295 -2277517 -1402152
10216 -1402152 -1486380 -1094965 933704 2352726 3021280 4432556 3683241 2647167 3881741
10207 3881741 5611062 5619229 4456455 3523192 3179009 3263535 2266643 1239667 -33010
10198 -33010 -2159172 -3674765 -2835042 -2357798 -1923909 177 26762 -117598 646215
10189 646215 56001 209895 1030117 1523610 3106386 3848576 2966181 -20167 -2403307
10180 -2403307 -3243474 -2732610 -1783769 -423180 -197686 343910 2328753 2910272 2163864
10171 2163864 1589552 2553981 3344755 1976798 841815 205864 402051 1613782 3829989
$$ packed form
10234a575473k007520P04314O98880J647395K073725J257708O75318N70973J59856
10225D205176j710891j49317J361609o92828j372746r10429k133869q74222Q75365
10216a402152q4228L91415K028669J419022O68554J411276p49315j036074J234574
10207C881741J729321Q167j162774r33263l44183Q4526r96892j026976j272677
10198c3010k126162j515593Q39723M77244M33889J924086K6585j44360P63813
10189F46215n90214J53894Q20222M93493J582776P42190q82395k986348k383140
10180b403307q40167N10864R48841J360589K25494N41596J984843N81519p46408
10171B163864n74312R64429P90774j367957j134983o35951J96187J211731K216207
$$ plain form
10162 3829989 5451982 4562074 2699746 2681755 1757471 1358840 2712448 3386214 4213329
10153 4213329 3769036 2567217 401826 -846617 -74222 78792 -492762 -1296073 -2746547
10144 -2746547 -2338095 -1121597 -307740 -5344 -55723 1224578 3385038 2910687 841697
10135 841697 -450385 -955060 -2358362 -2715803 -2773929 -3404954 -3191100 -2643013 -1801359
10126 -1801359 -320552 -2016656 -3508016 -3840587 -2909114 -2104445 -1884828 -1822669 -1829906
10117 -1829906 -1273288 -595721 1493950 2835961 2625481 1775094 1743336 909432 202178
$$ packed form
10162C829989J621993q89908j862328j7991r24284l98631J353608O73766Q27115
10153D213329m44293j201819k165391j248443P72395J53014n71554q03311j450474
10144b746547M08452J216498Q13857L02396n0379J280301K160460m74351k068990
10135H41697j292082n04675j403302l57441n8126o31025K13854N48087Q41654
10126a801359J480807j696104j491360l32571R31473Q04669K19617O2159p237
10117a829906N56618O77567K089671J342011k10480q50387l1758q33904p07254
$$ [...]
##END NTUPLES=NMR SPECTRUM
##END=
