##TITLE=C13_92-2021
 CDCl3,  1900 sc

 28.09.2021
##JCAMPDX= 6.0         $$ Bruker NMR JCAMP-DX V2.0
##DATA TYPE= NMR SPECTRUM
##DATA CLASS= NTUPLES
##ORIGIN= UXNMR, Bruker Analytische Messtechnik GmbH
##OWNER= root
$$ XWIN-NMR		Version 3.5
$$ Tue Sep 28 11:26:25 2021 Russian Standard Time (UT+4h)  she@DPX200
##.OBSERVE FREQUENCY= 50.327896
##.OBSERVE NUCLEUS= ^13C
##.ACQUISITION MODE= SIMULTANEOUS
##.ACQUISITION SCHEME= undefined
##.AVERAGES= 1904
##.DIGITISER RES= 17
##SPECTROMETER/DATA SYSTEM= spect
##.PULSE SEQUENCE= zgpg30
##.SOLVENT NAME= DMF
##.SHIFT REFERENCE= (INTERNAL, DMF, 0, 217.489)
##AUDIT TRAIL= $$ (NUMBER, WHEN, WHO, WHERE, WHAT)
$$ ##TITLE= Audit trail, XWIN-NMR		Version 3.5
$$ ##JCAMPDX= 5.01
$$ ##ORIGIN= Bruker BioSpin GmbH
$$ ##OWNER= she
$$ F:/spectra/data/she/nmr/c13/1/pdata/1/auditp.txt
$$ ##AUDIT TRAIL=  $$ (NUMBER, WHEN, WHO, WHERE, WHAT)
(   1,<2021-09-28 11:24:06.42 +0400>,<she>,<DPX200>,
      <created by zg, POWCHK disabled, PULCHK disabled
       terminated by command 'halt'
       configuration hash MD5:
       00 E9 B6 7A A2 85 ED C7 34 08 36 98 17 FE 4E 26
       data hash MD5: 32K
       1E 2B 73 83 46 23 D8 83 CC 23 CC FC 63 38 00 75>)
(   2,<2021-09-28 11:25:06.53 +0400>,<she>,<DPX200>,
      <Start of raw data processing
       efp BC_mod = 2 LB = 1 FT_mod = 6 PKNL = 1 PHC0 = -343.1995 PHC1 = 28.36238 SI = 32K 
       data hash MD5: 32K
       FA E0 70 5E 8E 68 DD 91 3C 2F A7 C5 33 CA 0F 50>)
(   3,<2021-09-28 11:25:09.25 +0400>,<she>,<DPX200>,
      <abs ABSG = 5 
       data hash MD5: 32K
       48 6F 1B 2B 10 36 68 98 C8 AF 19 02 28 7D 06 DF>)
(   4,<2021-09-28 11:25:35.20 +0400>,<she>,<DPX200>,
      <pk PHC0 = -0.3625018 PHC1 = 3.4 
       data hash MD5: 32K
       DC 81 65 81 C6 D0 58 1A B9 79 24 60 D9 49 AD D7>)
$$ ##END=
$$ 
$$ hash MD5
$$ 39 75 4D C6 40 47 72 F1 57 9D 07 4D 75 77 A7 35
##$RELAX= 
##$RELAX= 
##$RELAX= 
##$RELAX= 
##$RELAX= 
##$RELAX= 
##$RELAX= 
##$RELAX= 
$$ Bruker specific parameters
$$ --------------------------
##$DU= <F:/spectra>
##$EXPNO= 1
##$NAME= <c13>
##$PROCNO= 1
##$TYPE= <nmr>
##$USER= <she>
##$AMP= (0..31)
100 100 100 100 100 100 100 100 100 100 100 100 100 100 100 100 100 100 
100 100 100 100 100 100 100 100 100 100 100 100 100 100 
##$AQSEQ= 0
##$AQ_mod= 1
##$AUNM= <au_zg>
##$AUTOPOS= <>
##$BF1= 50.322709
##$BF2= 200.13
##$BF3= 50.322709
##$BF4= 500.13
##$BF5= 500.13
##$BF6= 500.13
##$BF7= 500.13
##$BF8= 500.13
##$BYTORDA= 1
##$CFDGTYP= 0
##$CFRGTYP= 5
##$CHEMSTR= <none>
##$CNST= (0..31)
1 1 145 1 1 1 1 1 1 1 1 1 1 1 1 1 1 1 1 1 1 1 1 1 1 1 1 1 1 1 1 1 
##$CPDPRG= <waltz16>
##$CPDPRG1= <>
##$CPDPRG2= <waltz16>
##$CPDPRG3= <>
##$CPDPRG4= <mlev>
##$CPDPRG5= <mlev>
##$CPDPRG6= <mlev>
##$CPDPRG7= <mlev>
##$CPDPRG8= <mlev>
##$CPDPRGB= <>
##$CPDPRGT= <>
##$D= (0..31)
0 2 0.00345 0 0 0 0 0 0 0 0 0.03 2e-05 3e-06 0 0 0 0 0 0 0 0 0 0 0 0 0 
0 0 0 0 0 
##$DATE= 1632807684
##$DBL= (0..7)
120 120 120 120 120 120 120 120 
##$DBP= (0..7)
150 150 150 150 150 150 150 150 
##$DBP07= 0
$$ [...]
##$SUBNAM4= <"">
##$SUBNAM5= <"">
##$SUBNAM6= <"">
##$SUBNAM7= <"">
##$SUBNAM8= <"">
##$SUBNAM9= <"">
##$SW= 239.972175391363
##$SWIBOX= (0..15)
0 1 3 0 0 0 0 0 0 0 0 0 0 0 0 0 
##$SW_h= 12077.2946859903
##$TD= 32768
##$TD0= 1
##$TE= 0
##$TE2= 300
##$TE3= 300
##$TEG= 300
##$TL= (0..7)
120 120 120 120 120 120 120 120 
##$TP= (0..7)
150 150 150 150 150 150 150 150 
##$TP07= 0
##$TPNAME0= <>
##$TPNAME1= <>
##$TPNAME2= <>
##$TPNAME3= <>
##$TPNAME4= <>
##$TPNAME5= <>
##$TPNAME6= <>
##$TPNAME7= <>
##$TPOAL= (0..7)
0.5 0.5 0.5 0.5 0.5 0.5 0.5 0.5 
##$TPOFFS= (0..7)
0 0 0 0 0 0 0 0 
##$TUNHIN= 0
##$TUNHOUT= 0
##$TUNXOUT= 0
##$USERA1= <user>
##$USERA2= <user>
##$USERA3= <user>
##$USERA4= <user>
##$USERA5= <user>
##$V9= 5
##$VALIST= <valist>
##$VCLIST= <CCCCCCCCCCCCCCC>
##$VD= 0
##$VDLIST= <DDDDDDDDDDDDDDD>
##$VPLIST= <PPPPPPPPPPPPPPP>
##$VTLIST= <TTTTTTTTTTTTTTT>
##$WBST= 1024
##$WBSW= 4
##$XGAIN= (0..3)
0 0 0 0 
##$XL= 0
##$YL= 0
##$YMAX_a= 11949433
##$YMIN_a= -5655495
##$ZGOPTNS= <>
##$ZL1= 120
##$ZL2= 120
##$ZL3= 120
##$ZL4= 120
##$ABSF1= 222.6679
##$ABSF2= -17.32892
##$ABSG= 5
##$ABSL= 3
##$ALPHA= 0
##$AQORDER= 0
##$ASSFAC= 0
##$ASSFACI= 0
##$ASSFACX= 0
##$ASSWID= 0
##$AUNMP= <proc_1d>
##$AZFE= 0.1
##$AZFW= 0.5
##$BCFW= 0
##$BC_mod= 2
##$BYTORDP= 0
##$COROFFS= 0
##$CY= -3
##$DATMOD= 1
##$DC= 0
##$DFILT= <>
##$DTYPP= 0
##$F1P= 0
##$F2P= 0
##$FCOR= 0.5
##$FTSIZE= 32768
##$FT_mod= 6
##$GAMMA= 0
##$GB= 0
##$INTBC= 1
##$INTSCL= 4.134877e-10
##$ISEN= 128
##$LB= 1
##$LEV0= 0
##$LPBIN= 0
##$MAXI= 10000
##$MC2= 0
##$MEAN= 0
##$ME_mod= 0
##$MI= 0.1934396
##$NCOEF= 0
##$NC_proc= -1
##$NLEV= 6
##$NOISF1= 120.0001
##$NOISF2= 80.00006
##$NSP= 0
##$NTH_PI= 0
##$NZP= 0
##$OFFSET= 217.4887
##$PC= 1.4
##$PHC0= -343.562
##$PHC1= 31.76238
##$PH_mod= 1
##$PKNL= yes
##$PPARMOD= 0
##$PSCAL= 0
##$PSIGN= 0
##$REVERSE= no
##$SF= 50.3229899661168
##$SI= 32768
##$SIGF1= 140
##$SIGF2= 120
##$SINO= 11.81781
##$SIOLD= 32768
##$SREGLST= <13C.CDCl3>
##$SSB= 0
##$STSI= 32768
##$STSR= 0
##$SW_p= 12077.2946859903
##$SYMM= 0
##$S_DEV= 0
##$TDeff= 32768
##$TDoff= 0
##$TI= <>
##$TILT= no
##$TM1= 0
##$TM2= 0
##$TOPLEV= 0
##$USERP1= <user>
##$USERP2= <user>
##$USERP3= <user>
##$USERP4= <user>
##$USERP5= <user>
##$WDW= 1
##$XDIM= 32768
##$YMAX_p= 375218603
##$YMIN_p= -7162154
$$ End of Bruker specific parameters
$$ ---------------------------------
##NTUPLES= NMR SPECTRUM
##VAR_NAME=  FREQUENCY,     SPECTRUM/REAL,   SPECTRUM/IMAG
##SYMBOL=    X,             R,               I
##VAR_TYPE=  INDEPENDENT,   DEPENDENT,       DEPENDENT
##VAR_FORM=  AFFN,          ASDF,            ASDF
##VAR_DIM=   32768,         32768,           32768
##UNITS=     HZ,            ARBITRARY UNITS, ARBITRARY UNITS
##FACTOR=    0.368581032318806, 1,           1
##FIRST=     10944.6813275247, 0,            0
##LAST=      -1132.61335846556, 0,           0
##MIN=       -1132.61335846556, -7162154,    0
##MAX=       10944.6813275247, 375218603,    0
$$ Real data points
##PAGE= N=1
##DATA TABLE= (X++(R..R)), XYDATA
$$ [...]
$$ plain form
11167 -491214 -929763 -38272 1230962 1873999 2520406 2621229 2589131 2650106 1613593 474764
11157 474764 -122403 -1031256 -1205693 -607324 11242 -103849 73493 962055 1872529 1664041
11147 1664041 1241024 1202061 975354 756443 73007 -992567 -447598 693072 564507
11138 564507 -163706 -816809 -908470 -1790348 -2731296 -3081180 -2615062 -1853265 -1034252 -1144360
11128 -1144360 -1104632 -318747 -422381 -1414540 -1892798 -1502439 -1130041 -1299033 -565872 954185
11118 954185 1072381 -190421 -232770 110098 -275874 -345580 -55159 -85622 -470705 -1130112
11108 -1130112 -1336717 -1023470 -968998 -665222 -610539 -556226 -559600 -706699 -725810 -718740 -924636
11097 -924636 -1719264 -2216758 -2077885 -1886827 -2158544 -2172384 -1840994 -1336717 -142377 -235781
$$ packed form
11167d91214m38549Q91491J269234O43037O46407J00823l2098O0975j036513j138829
11157D74764n97167r08853j74437N98369O18566j15091J77342Q88562R10474k08488
11147A664041m23017l8963k26707k18911o83436j065574N44969J140670j28565
11138E64507p28213o53103r1661q81878r40948l49884M66118P61797Q19013j10108
11128a144360L9728P85885j03634r92159m78258L90359L72398j68992P33161J520057
11118I54185J18196j262802m2349L42868l85972o9706K90421l0463l85083o59407
11108a130112k06605L13247N4472L03776N4683N4313l374j47099j9111P070k05896
11097i24636p94628m97494J38873J91058k71717j3840L31390N04277J194340r3404
$$ plain form
11087 -235781 -431821 -630347 -1455719 -2686809 -3484087 -3301334 -3340187 -3791907 -3156928 -3091106
11077 -3091106 -3210429 -3008645 -3205786 -3183701 -1985726 -1541389 -868065 -315281 62311
11068 62311 259892 -1095796 -2606890 -2662391 -2058914 -2059043 -2044314 -520225 982894 1758131
11058 1758131 1554452 1011456 2057958 3117955 2123463 747689 -192214 -1168761 -1358560
11049 -1358560 -650040 -95537 -168349 -707253 -1478166 -1504954 -1751107 -1891346 -2077893 -1558674
11039 -1558674 -610847 -204196 -931021 -1531300 -553741 -586792 -745494 -759872 -784492 610065
11029 610065 1951706 812456 -550741 -52028 666084 -96848 -755915 -684164 493183
11020 493183 1968512 1944963 1480121 1468585 1810388 2781053 3585594 3177710 2096703 1643418
$$ packed form
11087b35781j96040j98526q25372j231090p97278J82753l8853m51720O34979O5822
11077c091106j19323K01784j97141K2085J197975M44337O73324N52784L77592
11068F2311J97581j355688j511094n5501O03477j29J4729J524089J503119P75237
11058A758131k03679n42996J046502J059997r94492j375774r39903r76547j89799
11049a358560P08520N54503p2812n38904p70913k6788k46153j40239j86547N19219
11039a558674R47827M06651p26825o00279R77559l3051j58702j4378k4620J394557
11029F10065J341641j139250j363197M98713P18112p62932o59067P1751J177347
11020D93183J475329k3549m64842j1536L41803R70665Q04541m07884j081007m53285
$$ plain form
11010 1643418 706947 -1360487 -1581229 -892470 -192924 354049 -615103 -1706751 -2023690
11001 -2023690 -1635030 -1116289 -2146886 -2816980 -1823673 -990059 -597440 -830862 -760572
10992 -760572 -1113099 -1801627 -704091 -327430 -413157 -72776 -488488 -673925 -851095 -1464514
10982 -1464514 -1457042 -1663449 -1957137 -1170897 -265015 -323675 -453512 -172532 297929 86617
10972 86617 -858339 -1830078 -1651601 -1453180 -2058686 -2086879 -1992397 -1623447 -1005740 -233508
10962 -233508 423930 979438 1346840 1148648 1071134 949278 314919 -365465 -1310324 -2612637
10952 -2612637 -2667854 -2107430 -962092 57552 140547 -98085 324492 787160 365585
10943 365585 -787002 -948851 -693191 -526229 -819613 -2919386 -4853155 -5055694 -4060155
$$ packed form
11010A643418r36471k067434k20742O88759O99546N46973r69152j091648l16939
11001b023690L88660N18741j030597o70094R93307Q33614L92619k33422P0290
10992g60572l52527o88528J097536L76661q5727L40381m15712j85437j77170o13419
10982a464514P472k06407k93688P86240R05882n8660j29837K80980M70461k11312
10972H6617r44956r71739J78477J98421o05506k8193R4482L68950O17707P72232
10962b33508O57438N55508L67402j98192p7514j21856o34359o80384r44859j302313
10952b612637n5217N60424J145338J019644Q2995k38632M22577M62668m21575
10943C65585j152587j61849K55660J66962k93384k099773j933769k02539R95539
$$ plain form
10934 -4060155 -2049491 -577457 -86244 276016 268299 -184166 -278080 -632945 -766264 -594714
10924 -594714 -307653 -1363225 -1887526 -1965429 -2032439 -1876177 -1864867 -2351474 -2929432 -1756713
10914 -1756713 -1323293 -1748572 -2607715 -3276753 -3328284 -3531479 -3772951 -3440544 -2528527 -1852574
10904 -1852574 -1287892 -886658 -1560193 -2539124 -3401193 -3822408 -4559283 -4576044 -2966744
10895 -2966744 -1356579 -1019501 -1324276 -777336 610595 1528958 891206 -215492 -19655
10886 -19655 537781 1002738 692983 -554814 -1168906 -1599391 -1639221 -515531 -246366 -1081430
10876 -1081430 -1449258 -251561 1071464 1316802 895279 77909 352023 1164192 2485893
10867 2485893 3526937 4236651 4337356 3868865 2476930 244463 -1483235 -1545081 -1372813
$$ packed form
10934d060155K010664J472034M91213L62260p717m52465r3914l54865j33319J71550
10924e94714K87061j055572n24301p7903o7010J56262J1310m86607n77958J172719
10914a756713M33420m25279q59143o69038n1531k03195k41472L32407R12017O75953
10904a852574N64682M01234o73535r78931q62069m21215p36875j6761J609300
10895b966744J610165L37078l04775N46940J387931R18363o37752j106698J95837
10886a9655N57436M64957l09755j247797o14092m30485l9830J123690K69165q35064
10876a081430l67828J197697J323025K45338m21523q17370K74114Q12169J321701
10867B485893J041044P09714J00705m68491j391935k232467j727698o1846J72268
$$ plain form
10858 -1372813 -1449312 -1008767 -243017 487913 965864 958620 1219991 1218529 534358 -36486
10848 -36486 -197674 -799099 -801620 -290776 -517734 -2206760 -2852864 -2102549 -2173139 -2187258
10838 -2187258 -2643632 -3211417 -3147135 -2201422 -323228 66650 -1476946 -2825778 -3242681
10829 -3242681 -3142055 -2605090 -1765536 -2234655 -2339427 -1907522 -1605091 -967078 -1704757
10820 -1704757 -2672023 -2782723 -2157417 -1304396 -1545985 -2012013 -1627625 -1399567 -1215839
10811 -1215839 118984 1649028 1290089 -30539 -1220593 -1854553 -2251009 -1662548 -803986
10802 -803986 -470176 -924303 -1453199 -1550015 -1083538 -142854 310652 988348 -849524 -2338194
10792 -2338194 -2221866 -2170723 -2891244 -2943748 -1847811 -1556687 -1865678 -1251389 -18865
$$ packed form
10858a372813p6499M40545P65750P30930M77951p244K61371j462o84171n70844
10848c6486j61188o01425k521N10844k26958j689026o46104P50315p0590j4119
10838b187258m56374n67785O4282R45713J878194L89878j543596j348832m16903
10829c242681J00626N36965Q39554m69119j04772M31905L02431O38013p37679
10820a704757r67266j10700O25306Q53021k41589m66028L84388K28058J83728
10811a215839J334823J530044l58939j320628j190054o33960l96456N88461Q58562
10802h03986L33810m54127n28896r6816M66477R40684M53506O77696j837872j488670
10792b338194J16328N1143p20521n2504J095937K91124l08991O14289J232524
$$ plain form
10783 -18865 -178676 -754709 25028 1013294 1061578 987140 1682413 2354964 1774185 924166
10773 924166 707332 981843 1526577 1521660 489260 -224586 -647699 -725947 -885302 -544370
10763 -544370 917353 2097043 2897428 3492557 3548087 2677398 2146107 2778109 2767157 1109367
10753 1109367 -285147 -679415 -25009 404988 334569 -150293 -469797 -1204474 -961025
10744 -961025 935092 3086250 3616145 2321432 1938071 2477633 2753844 2481232 2069414
10735 2069414 1908205 407585 -767573 -1057883 -983775 -947523 -807264 256638 671263
10726 671263 464971 957159 961781 867318 255175 -507868 65745 187321 -351043 -592074
10716 -592074 -612983 -454099 -513989 -274515 975409 1259805 121337 -517324 -841571 -1535616
$$ packed form
10783a8865j59811n76033P79737R88266M8284p4438O95273O72551n80779q50019
10773I24166k16834K74511N44734m917j032400p13846m23113p8248j59355L40932
10763e44370J461723J179690Q00385N95129N5530q70689n31291O32002j0952j657790
10753A109367j394514l94268O54406M29997p0419m84862l19504p34677K43449
10744i61025J896117K151158N29895j294713l83361N39562K76211k72612m11818
10735B069414j61209j500620j175158k90310P4108L6252J40259J063902M14625
10726F71263k06292M92188M622r4463o12143p63043N73613J21576n38364k41031
10716e92074k0909J58884n9890K39474J249924K84396j138468o38661l24247o94045
$$ plain form
10706 -1535616 -2131129 -2472856 -1591050 -836810 -241470 546099 694278 416598 157903
10697 157903 -658552 -991827 -142396 369218 -643717 -1570591 -1393875 -737183 -631802
10688 -631802 -1133307 -2305464 -3147032 -2874111 -2798532 -1980016 -1612152 -1832135 -1554964 -1614582
10678 -1614582 -1783291 -1363360 -1039087 -910853 214791 1289978 567709 -224927 -912591
10669 -912591 -1245586 -642179 -680342 -195994 926029 1029697 1044482 1599143 1439387 800437
10659 800437 279340 -515718 -1061519 -982304 -894796 -400602 461239 890772 707334 -53250
10649 -53250 -1205434 -1519433 -1541456 -1611796 -1327014 -1401426 -675689 673602 1551400 1233892
10639 1233892 267145 -899220 -1570835 -2253252 -2809599 -2497250 -2944891 -2829250 -1176212
$$ packed form
10706a535616n95513l41727Q81806P54240N95340P87569J48179k77680k58695
10697A57903q16455l33275Q49431N11614j012935r26874J76716O56692J05381
10688f31802n01505j172157q41568K72921P5579Q18516L67864k19983K77171n9618
10678a614582j68709M19931L24273J28234J125644J075187p22269p92636o87664
10669i12591l32995O03407l8163M84348J122023J03668J4785N54661j59756o38950
10659H00437n21097p95058n45801P9215Q7508M94194Q61841M29533j83438p60584
10649e3250j152184l13999k2023p0340K84782p4412P25737J349291Q77798l17508
10639A233892r66747j166365o71615o82417n56347L12349m47641J15641J653038
$$ plain form
10630 -1176212 -186008 -533009 -834279 -89748 -290933 -1770918 -2502890 -1968653 -1376033
10621 -1376033 -1018243 -800803 50072 134512 691155 1390474 1267732 617028 -122541 -1052354
10611 -1052354 -1378360 -287618 792152 1354500 1945936 2058909 1117335 151188 304923
10602 304923 1889769 2797964 2418981 1129388 -449240 -1365710 -2041776 -2207404 -2765290
10593 -2765290 -2456908 -1886370 -2396679 -3051707 -3177532 -2482462 -2325534 -2899268 -3006995
10584 -3006995 -2690740 -2215051 -2263113 -960580 29496 -174535 -687806 -2180709 -1954914
10575 -1954914 -735677 -758498 -1215416 -1558170 -2112371 -2007342 -775021 -478667 -1424619
10566 -1424619 -1439496 -1785179 -1958650 -1477328 221876 1199010 433256 55172 -537459
$$ packed form
10630a176212R90204l47001l01270P44531k01185j479985p31972N34237N92620
10621a376033L57790K17440Q50875Q4440N56643O99319j22742o50704p39569r29813
10611a052354l26006J090742J079770N62348N91436J12973r41574r66147J53735
10602C04923J584846R08195l78983j289593j578628r16470o76066j65628n57886
10593b765290L08382N70538n10309o55028j25825O95070J56928n73734j07727
10584c006995L16255M75689m8062J302533R90076k04031n13271j492903K25795
10575a954914J219237k2821m56918l42754n54201J05029J232321K96354r45952
10566a424619j4877l45683j73471M81322J699204R77134p65754l78084n92631
$$ plain form
10557 -537459 -1310392 -1933037 -2380086 -2323625 -1449927 -424297 -183575 -253046 100947 498845
10547 498845 467486 65182 -124945 402743 378988 -359619 -682354 -733099 -657164 494122
10537 494122 1730464 2478919 2712914 3258925 2601927 1558121 726093 846937 1249630
10528 1249630 621459 -1579099 -2676371 -1950881 -1872271 -2153136 -2007826 -1487213 -68313
10519 -68313 -40009 -1656326 -2084095 -1677630 -1003975 -839691 -1236030 -1678942 -2220334 -2890746
10509 -2890746 -3596255 -3263612 -2784350 -1953366 -696421 -511292 -326777 573447 1046939
10500 1046939 1244499 1088454 1017276 887730 778578 1784301 2169480 2168760 1078635 213359
10490 213359 -470776 -1343910 -1995050 -2749562 -2515300 -1239722 -664280 -206130 426625
$$ packed form
10557e37459p72933o22645m47049N6461Q73698J025630K40722o9471L53993L97898
10547D98845l1359m02304j90127N27688k3755p38607l22735n0745P5935J151286
10537D94122J236342P48455K33995N46011o56998j043806q32028J20844M02693
10528A249630o28171k200558j097272P25490P8610k80865J45310N20613J418900
10519f8313K8304j616317m27769M06465O73655J64284l96339m42912n41392o70412
10509b890746p05509L32643M79262Q30984J256945J85129J84515R00224M73492
10500A046939J97560j56045p1178j29546j09152J005723L85179p20j090125q65276
10490B13359o84135q73134o51140p54512K34262J275578N75442M58150O32755
$$ plain form
10481 426625 1008630 821299 98284 -368990 -1290889 -1998501 -1774240 -1357410 -666249 308550
10471 308550 835679 961160 1706699 2763384 3106981 3196644 2399891 1773851 1469364 711162
10461 711162 167306 107734 -70394 -797419 -2098087 -2652176 -2718623 -2200876 -1467984 -1687760
10451 -1687760 -2887773 -3103601 -2175742 -2267013 -3369386 -3858962 -3788474 -3102808 -1617427
10442 -1617427 -290307 -203437 -1077814 -1195268 -1205954 -2448009 -3067275 -3882883 -4140636
10433 -4140636 -3600681 -2990067 -2985296 -2905870 -1700533 -932164 -954203 -715010 -294702 -272462
10423 -272462 -875992 -1874709 -2929855 -3664450 -3300746 -2111265 -1368739 -2345628 -3100953
10414 -3100953 -2169694 -1275473 -327485 -92877 220608 1110054 1061924 11806 -212806
$$ packed form
10481D26625N82005j87331p23015m67274r21899p07612K24261M16830O91161R74799
10471C08550N27129J25481P45539J056685L43597Q9663p96753o26040l04487p58202
10461G11162n43856n9572j78128p27025j300668n54089o6447N17747P32892k19776
10451a687760j200013k15828R27859r1271j102373m89576P0488O85666J485381
10442a617427J327120Q6870q74377j17454j0686j242055o19266q15608k57753
10433d140636N39955O10614M771P9426J205337P68369k2039K39193M20308K2240
10423b72462o03530r98717j055146p34595L63704J189481P42526r76889p55325
10414c100953R31259Q94221R47988K34608L13485Q89446m8130j050118k24612
$$ plain form
10405 -212806 71514 -190185 -743572 -1334464 -1622060 -1014195 -633090 -915592 -86084 2387584
10395 2387584 3800761 2982611 2187476 1577400 486967 -16940 315666 1397973 2162556
10386 2162556 2404144 2273088 1142782 -481483 -1224491 -476389 -774927 -897536 -468899
10377 -468899 -219196 -46495 307797 920594 1436882 1955597 1804357 1517159 1429783 1353627
10367 1353627 1138645 1124686 652078 -581976 -1837895 -2193065 -1770705 -512168 70721
10358 70721 460894 1012053 679870 963677 260034 -1223520 -1488596 -1282375 -1801456 -3076032
10348 -3076032 -3425336 -3039763 -2675919 -1719252 -664963 430650 1005336 838243 -215417
10339 -215417 -1106711 -1309930 -1226074 -1500249 -991622 -351629 -693144 -1733240 -1743231 -1692150
$$ packed form
10405b12806K84320k61699n53387n90892k87596O07865L81105k82502Q29508K473668
10395B387584J413177q18150p95135o10076j090433n03907L32606J082307P64583
10386B162556K41588j31056j130306j624265p43008P48102k98538j22609M28637
10377d68899K49703J72701L54292O12797N16288N18715j51240k87198q7376p6156
10367A353627k14982j3959m72608j234054j255919l55170M22360J258537N82889
10358G0721L90173N51159l32183K83807p03643j483554k65076K06221n19081j274576
10348c076032l49304L85573L63844R56667J054289J095613N74686j67093j053660
10339b15417q91294k03219Q3856k74175N08627O39993l41515j040096r991N1081
$$ plain form
10329 -1692150 -1536212 -1927549 -2496487 -2946623 -3441167 -3153421 -1970842 -672329 -903485
10320 -903485 -1364852 -481024 -481607 -1433965 -1959340 -2333672 -2534244 -2363328 -1836882 -1644734
10310 -1644734 -1138766 -761224 -993513 -1211075 -1508741 -2143099 -1948543 -771879 -674083
10301 -674083 -2209187 -4068270 -4000976 -2809621 -1751971 -161759 386377 -72402 -1031379
10292 -1031379 -1567665 -1169662 -977352 -708307 -1013326 -1595331 -2392335 -2494221 -2513687 -2403785
10282 -2403785 -1777371 -1411598 -972820 -621174 -221774 -277648 -461538 -597556 -487877 252384
10272 252384 265281 -1258924 -2626079 -2415410 -1566373 129814 989446 370992 -115358
10263 -115358 -667512 -1423562 -2251150 -2561252 -2373924 -2458429 -2366190 -1882563 -1166711 -358547
$$ packed form
10329a692150J55938l91337n68938m50136m94544K87746J182579J298513k31156
10320i03485m61367Q83828n83r52358n25375l74332k00572J70916N26446J92148
10310a644734N05968L77542k32289k17562k97666o34358J94556J176664R7796
10301f74083j535104j859083O7294J191355J057650J590212N48136m58779r58977
10292a031379n36286L98003J92310K69045l05019n82005p97004j01886j9466J09902
10282b403785O26414L65773M38778L51646L99400n5874j83890j36018J09679P40261
10272B52384J2897j524205j367155K10669Q49037J696187Q59632o18454m86350
10263a15358n52154p56050q27588l10102J87328q4505R2239M83627P15852Q08164
$$ plain form
10253 -358547 104033 -99593 568790 -243375 -1777880 -2818478 -1863015 595053 2626678
10244 2626678 2997165 2521496 2381624 1800816 1220487 92778 -1529317 -1470345 -1782780
10235 -1782780 -2636660 -3500956 -4295365 -4628479 -3784143 -1706290 -254188 -257973 -406548
10226 -406548 -238893 -1306393 -1583746 -1814257 -1259553 -1162552 -1106663 -188878 144082 147598
10216 147598 123120 -353575 -1178406 -971986 -534361 -144493 -511230 -10347 1068620 853144
10206 853144 412380 440149 1027432 866536 -222761 -1189908 -1024175 -875651 -1264168 -2225938
10196 -2225938 -2811903 -3073426 -3397915 -2930068 -1780473 -2063283 -2599148 -2670534 -2203469
10187 -2203469 -2178199 -2545818 -2832540 -2612840 -1217860 -257771 229234 194660 347085 805503
$$ packed form
10253c58547M62580k03626O68383q12165j534505j040598R55463K458068K031625
10244B626678L70487m75669j39872n80808n80329j127709j622095N8972l12435
10235a782780q53880q64296p94409l33114Q44336K077853J452102l785j48575
10226d06548J67655j067500k77353k30511N54704R7001N5889R17785L32960L516
10216A47598k4478m76695q24831K06420M37625L89868l66737N00883J078967k15476
10206H53144m40764K7769N87283j60896j089297r67147J65733J48524l88517r61770
10196b225938n85965k61523l24489M67847J149595k82810n35865p1386M67065
10187b203469K5270l67619k86722K19700J394980R60089M87005l4574J52425M58418
$$ plain form
10177 805503 707495 723677 824084 1228402 1698218 1324632 499830 608069 -84349 235413
10167 235413 543130 455290 339899 -508142 -1160901 -1017452 -423890 -287342 -1133023 -1080328
10157 -1080328 -1143509 -1743240 -2375502 -1807575 -1801565 -2265552 -2074102 -2276399 -1749727 -1582273
10147 -1582273 -2093348 -2362429 -1962385 -1897626 -2487716 -2694993 -2374374 -2498695 -2511253 -1988431
10137 -1988431 -332528 456978 383280 -101550 -1005743 -342452 702624 770985 402065
10128 402065 240781 424358 808479 512299 -759720 -2004177 -2741107 -3256197 -3596148
10119 -3596148 -3596473 -3466589 -3515080 -2813561 -1641702 -1041747 -225460 406804 233684 -291385
10109 -291385 -895596 -1082128 -1049516 -1024254 -180146 774294 1205398 936684 929073 995236
$$ packed form
10177H05503r8008J6182J00407M04318M69816l73586q24802J08239o92418L19762
10167B35413L07717q7840j15391q48041o52759J43449N93562J36548q45681N2695
10157a080328o3181n99731o32262N67927O010m63987J91450k02297N26672J67454
10147a582273n11075k69081M00044O4759n90090k07277L20619j24321j2558N22822
10137a988431J655903P89506p3698m84830r04193O63291J045076O8361l68920
10128D02065j61284J83577L84121k96180j272019j244457p36930n15090l39951
10119c596148l25J29884m8491P01519J171859N99955Q16287O32264j73120n25069
10109b91385o04211j86532L2612K5262Q44108R54440M31104k68714p611O6163
$$ plain form
10099 995236 386474 -68184 -115492 -522033 -714145 -657994 477985 1310045 1173659 1174927
10089 1174927 155913 -370955 -398694 -581837 -964976 -1141636 -1297309 -580489 256875
10080 256875 -328506 -1568142 -1716951 -1282133 -1375826 -1813224 -1151307 -379094 -815748 -1545837
10070 -1545837 -2352739 -2571607 -2099433 -1717782 -1454491 -1330886 -224889 848420 968496
10061 968496 917538 295280 206966 297967 90913 -117168 178100 29650 -346630 -990757
10051 -990757 -1723951 -2515527 -2205486 -1582412 -1663858 -2200584 -1923478 -407568 972609
10042 972609 800610 801126 1085668 807565 1324020 2103820 1003144 -467717 -1529112 -1842387
10032 -1842387 -2037102 -1934430 -1573841 -1777385 -1398308 -505247 -534053 -434741 -649312 -1307645
$$ packed form
10099I95236o08762m54658m7308m06541j92112N6151J135979Q32060j36386J268
10089A174927j019014n26868k7739j83143l83139j76660j55673P16820Q37364
10080B56875n85381j239636j48809M34818r3693m37398O61917P72213m36654p30089
10070a545837q06902k18868M72174L81651K63291J23605J105997J073309J20076
10061I68496n0958o22258q8314R1001k07054k08081K95268j48450l76280o44127
10051i90757p33194p91576L10041O23074q1446n36726K77106J515910J380177
10042I72609j71999N16K84542k78103N16455P79800j100676j470861j061395l13275
10032a842387j94715J02672L60589k03544L79077Q93061k8806R9312k14571o58333
$$ plain form
10022 -1307645 -2716763 -4169705 -4115712 -3107967 -2128928 -1704577 -908967 1114250 1695049
10013 1695049 1219065 538020 -644378 -1540085 -701888 251329 418210 353744 -1129179
10004 -1129179 -1775123 -1880938 -2144951 -2339228 -2954103 -2934714 -2916678 -2884099 -1607783 -1652508
9994 -1652508 -2555049 -1884882 -1615411 -1686942 -1316189 -1559694 -2989804 -3353097 -3095593 -3744238
9984 -3744238 -4037829 -4179456 -5034381 -5741852 -4616663 -2797217 -1173280 -790476 -1099356
9975 -1099356 -1277718 -1056059 -645318 -485296 -1663359 -2251861 -1028153 -205808 -841995
9966 -841995 -1932817 -2184901 -1956748 -1693000 -1751860 -2529342 -2081455 -1184107 -1106664 -2057350
9956 -2057350 -1878986 -919739 -813933 -2244092 -2389036 -1638557 -1845620 -1764032 -1841971 -2014963
$$ packed form
10022a307645j409118j452942N3993J007745R79039M24351P95610K023217N80799
10013A695049m75984o81045j182398q95707Q38197R53217J66881o4466j482923
10004a129179o45944j05815k64013j94277o14875J9389J8036L2579J276316m4725
9994a652508r02541O70167K69471p1531L70753k43505j430110l63293K57504o48645
9984c744238k93591j41627q54925p07471J125189J819446J623937L82804l08880
9975a099356j78362K21659M10741J60022j178063n88502J223708Q22345o36187
9966h41995j090822k52084K28153K63748n8860p77482M47887Q97348P7443r50686
9956b057350J78364R59247J05806j430159j44944P50479k07063Q1588p7939j72992
$$ plain form
9946 -2014963 -1392502 -797210 -1153210 -1737042 -2371642 -2663597 -2457631 -1851801 -1425047 -1339228
9936 -1339228 -821503 -866177 -886031 -956420 -1730861 -1864220 -1004741 73853 720202 842862
9926 842862 1101061 1680402 2155970 1823081 1069874 639437 35459 -422153 -311044 -571122
9916 -571122 -1194004 -1567999 -1195027 -1126391 -1439834 -1305271 -943717 -135298 924441 1267912
9906 1267912 528416 -517486 -1107354 -1394984 -1378036 -1954096 -1661649 -1250204 -1107061 -982720
9896 -982720 -986216 -815018 -467475 918732 1534148 657213 -128480 -293449 -778677 -1121709
9886 -1121709 -817008 -487724 464880 1375425 1318846 276949 126505 158111 -574589 -1078055
9876 -1078055 -1049500 -671216 -75559 419886 -112685 -507922 264625 374566 131867 80911
$$ packed form
9946b014963O22461N95292l56000n83832o34600k91955K05966O05830M26754Q5819
9936a339228N17725m4674j9854p0389p74441j33359Q59479J078594O46349J22660
9926H42862K58199N79341M75568l32889p53207m30437o03978m57612J11109k60078
9916e71122o22882l73995L72972O8636l13443J34563L61554Q08419J059739L43471
9906A267912p39496j045902n89868k87630J6948n76060K92447M11445J43143J24341
9896i82720l496J71198L47543J386207O15416q76935p85693j64969m85228l43032
9886a121709L04701L29284R52604R10545n6579j041897j50444L1606p32700n03466
9876a078055K8555L78284N95657M95445n32571l95237P72547J09941k42699n0956
$$ plain form
9866 80911 -478136 -687183 -943136 -657575 -192750 -449104 -313592 -1088056 -1594734 -1679457
9856 -1679457 -2461326 -3078710 -3390880 -3583918 -4285717 -3867802 -2894186 -1641709 -377004
9847 -377004 -933276 -1831381 -2030637 -3027522 -3133985 -2378532 -1831653 -406678 920456
9838 920456 553452 -142057 -788857 -1104800 -170080 78872 -347664 146936 1226228 1166843
9828 1166843 -1004340 -1702566 -1034527 98895 313036 -631094 -1062585 -413839 -873864
9819 -873864 -716662 832619 2013711 1171684 74459 -3620 -61303 723437 1057168 992283
9809 992283 513629 -628931 -1581781 -1517206 -1494196 -1975694 -2836942 -3622527 -3665187 -2635325
9799 -2635325 -1528158 -1098871 -530450 -1519701 -3135094 -2587750 -1321303 -892617 -1119923
$$ packed form
9866H0911n59047k09047k55953K85561M64825k56354J35512p74464n06678q4723
9856a679457p81869o17384l12170j93038p01799M17915R73616J252477J264705
9847c77004n56272q98105j99256r96885j06463P55453N46879J424975J327134
9838I20456l67004o95509o46800l15943R34720K48952m26536M94600J079292n9385
9828A166843k171183o98226O68039J133422K14141r44130m31491O48746m60025
9819h73864J57202J549281J181092q42027j097225p8079n7683P84740L33731o4885
9809I92283m78654j142560r52850O4575K3010m81498q61248p85585m2660J029862
9799b635325J107167M29287N68421r89251j615393N47344J266447M28686k27306
$$ plain form
9790 -1119923 -2287287 -2041928 -279860 689583 346913 157463 257893 -554023 -1827708
9781 -1827708 -2200163 -3561313 -4370529 -3389313 -1976197 -645727 277674 169229 -240498
9772 -240498 -366796 -1104943 -959979 -463593 -853796 -1425337 -1224270 -818855 -1104250 -1204123
9762 -1204123 -960267 -270962 1029957 1724880 1717736 1732748 1057021 530463 480879 415927
9752 415927 387139 -1334 712042 1805002 2401019 2189106 392821 -583246 -1367721 -2155310
9742 -2155310 -1978556 -1339830 -536284 -410372 -1094132 -1966567 -2752412 -3924517 -3628734
9733 -3628734 -2537472 -1351805 -926862 -852184 -1773524 -2860638 -2422571 -1500482 -947291
9724 -947291 -354635 779252 1124376 -9500 -1174938 -1545473 -1616012 -2312534 -2278551 -827334
$$ packed form
9790a119923j167364K45359J762068R69443l42670j89450J00430q11916j273685
9781a827708l72455j361150q09216R81216J413116J330470R23401j08445m09727
9772b40498j26298p38147J44964M96386l90203n71541K01067M05415k85395r9873
9762a204123K43856O89305J300919O94923p144J5012o75727n26558m9584o4952
9752D15927k8788l88473P13376J092960N96017k11913j796285r76067p84475p87589
9742b155310J76754O38726Q03546J25912o83760q72435p85845j172105K95783
9733c628734J091262J185667M24943P4678r21340j087114M38067R22089N53191
9724i47291N92656J133887L45124j133876j165438l70535p0539o96522L3983J451217
$$ plain form
9714 -827334 349250 -83602 -1546202 -2730913 -3103679 -2480626 -1121435 21927 232872
9705 232872 -454294 -1074292 -601592 -133804 -105207 14166 766560 553584 -206377 -502977
9695 -502977 -563505 -1308408 -2255796 -1866325 -1769004 -1723321 -1418186 -852659 60711 1199063
9685 1199063 1689853 1352538 1038116 455753 -328580 -637991 -1403825 -2061651 -2897871 -2946322
9675 -2946322 -1895528 -333448 1014228 1380925 433793 -156726 88724 178107 274560
9666 274560 1021202 1517227 852331 -139957 264991 1310345 1463521 886291 552652 1034631
9656 1034631 1002164 900316 361972 263178 481544 -9012 -301501 -106363 895073 2016812
9646 2016812 2771331 2835807 1751424 456346 -1034433 -803539 -222452 -560550 -1381161
$$ packed form
9714h27334J176584m32852j462600j184711l72766O23053J359191J143362K10945
9705B32872o87166o19998M72700M67788K8597J19373P52394k12976p59961k96600
9695e02977o0528p44903r47388L89471R7321M5683L05135N65527R13370J138352
9685A199063M90790l37315l14422n82363p84333l09411p65834o57826q36220m8451
9675b946322J050794J562080J347676L66697r47132n90519K45450Q9383R6453
9666B74560P46642M96025o64896r92288M04948J045354J53176n77230l33639M81979
9656A034631l2467j01848n38344r8794K18366m90556k92489J95138J001436J121739
9646B016812P54519O4476j084383j295078j490779K30894N81087l38098q20611
$$ plain form
9637 -1381161 -1674810 -1903604 -2315118 -2694344 -1686904 -391444 821345 1510362 839838
9628 839838 490884 -248833 -925637 -1822987 -2422531 -2895525 -2811336 -2908839 -2448809 -1826868
9618 -1826868 -1455577 -1070055 -1134221 -1949766 -2538643 -2604275 -1978811 -1062291 -284210 -514722
9608 -514722 -1292737 -2032592 -2166945 -1952876 -2195845 -2727955 -3149755 -2360896 -1220768 -578749
9598 -578749 -324125 119760 715012 663668 364420 -701745 -1682833 -2036538 -987180 -237596
9588 -237596 -457454 -86222 547168 901633 69265 -1143293 -2041986 -2427826 -2416685 -1819878
9578 -1819878 -1493923 -1994638 -2865242 -3321593 -2469996 -709417 273891 -284449 -1814295
9569 -1814295 -1385916 68409 591286 459307 -138660 -886834 -1255535 -1965238 -2601485
$$ packed form
9637a381161k93649k28794m11514l79226J007440J295460J212789O89017o70524
9628H39838l48954p39717o76804q97350n99544m72994Q4189r7503M60030O21941
9618a826868L71291L85522o4166q15545n88877o5632O25464R16520P78081k30512
9608e14722p78015p39855j34353K14069k42969n32110m21800P88859J140128O42019
9598e78749K54624M43885N95252n1344k99248j066165r81088l53705J049358P49584
9588b37596k19858L71232O33390L54465q32368j212558q98693l85840J1141N96807
9578a819878L25955n00715q70604m56351Q51597J760579R83308n58340j529846
9569a814295M28379J454325N22877j31979n97967p48174l68701p09703o36247
$$ plain form
9560 -2601485 -2496053 -1623658 -820397 -439827 -364953 -211094 296395 339879 1605563 2922661
9550 2922661 2459015 1184950 687774 271015 -266664 10917 847299 1488365 1557549 747060
9540 747060 -61355 -568010 -229924 411227 121182 86252 -388064 -753276 -913049 -1001528
9530 -1001528 -330445 498063 1093036 1745155 1681930 1059969 104378 33349 548946 803406
9520 803406 180928 -306637 306486 783018 696155 331784 48841 418913 11182 -291281
9510 -291281 -206468 -484642 -445713 40731 11640 -11749 58822 -766404 -1940192 -2617250
9500 -2617250 -2367094 -2286688 -1434793 -940934 -1079088 -803478 -593777 -295624 339390 1121083
9490 1121083 280511 -358210 -277623 488016 1349127 872840 -145073 -361791 -460693 -1051458
$$ packed form
9560b601485J05432Q72395Q03261L80570P4874J53859N07489M3484J265684J317098
9550B922661m63646j274065m97176m16759n37679K77581Q36382O41066O9184q10489
9540G47060q08415n06655L38086O41151k90045l4930m74316l65212j59773q8479
9530a001528O71083Q28508N94973O52119o3225o21961r55591p1029N15597K54460
9520H03406o22478m87565O13123M76532q6863l64371k82943L70072m07731l02463
9510b91281Q4813k78174L8929M86444k9091k3389P0571q25226j173788o77058
9500b617250K50156Q0406Q51895M93859j38154K75610K09701K98153O35014P81693
9490A121083q40572o38721Q0587P65639Q61111m76287j017913k16718r8902n90765
$$ plain form
9480 -1051458 -995620 -424204 -318606 -885144 -2350401 -2558822 -1601823 -361408 704084
9471 704084 1049241 1353377 2196947 2364822 2409991 2242482 2536935 2167588 1370756 655071
9461 655071 172386 448278 49249 -493742 -918376 -1553796 -2132690 -2232743 -1983696 -2202111
9451 -2202111 -2830489 -3698440 -3456332 -2907629 -2095228 -604051 404013 -120674 -588204
9442 -588204 -627697 -983557 -1283842 -1106230 -204476 -623774 -846798 -784790 -1889589 -2064124
9432 -2064124 -1189917 -1469690 -1754673 -1008275 125993 -144938 -1042765 -2278714 -2733766
9423 -2733766 -3451528 -4426381 -4514487 -3334048 -2044432 -1268925 -1546491 -2311252 -2325868 -2174974
9413 -2174974 -2500314 -2537978 -2669509 -2271038 -1782267 -2089113 -2829867 -2830069 -2664137 -1582873
$$ packed form
9480a051458N5838N71416J05598n66538j465257k08421R56999J240415J065492
9471G04084L45157L04136Q43570J67875M5169j67509K94453l69347p96832p15685
9461F55071m82685K75892l99029n42991m24634o35420n78894j00053K49047k18415
9451b202111o28378q67951K42108N48703Q12401J491177J008064n24687m67530
9442e88204l9493l55860l00285J77612R01754m19298k23024O2008j104799j74535
9432b064124Q74207k79773k84983P46398J134268k70931q97827j235949m55052
9423b733766p17762r74853q8106J180439J289616P75507k77566p64761j4616J50894
9413b174974l25340l7664j31531L98471M88771l06846p40754k02J65932J081264
$$ plain form
9403 -1582873 76954 1077544 1690792 729985 -694581 -944899 -225303 -899478 -2238709
9394 -2238709 -3091430 -3142550 -2315128 -1252703 -1042910 -767455 -336785 -457043 -340224 -244517
9384 -244517 -1218486 -2320319 -2748113 -3307084 -3162798 -2503118 -1925547 -1364432 -1724760 -1998567
9374 -1998567 -2713524 -4681699 -4748266 -3299226 -2149455 -2287249 -2219309 -1715217 -1057937
9365 -1057937 -51217 80625 218818 351180 -4648 -445627 -1429155 -2699822 -3870026
9356 -3870026 -3748866 -2615883 -1320250 -271718 -359935 -78132 77225 -1363672 -2277725
9347 -2277725 -2316722 -1578177 -1625290 -1760643 -1787552 -1846346 -1665293 -575445 312832 958314
9337 958314 1424811 -235247 -2300686 -2118729 -916814 -94398 124203 -351591 -110014
$$ packed form
9403a582873J659827J000590O13248r60807j424566k50318P19596o74175j339231
9394b238709q52721n1120Q27422J062425K09793K75455M30670j20258J16819R5707
9384b44517r73969j101833m27794n58971J44286O59680N77571N61115l60328k73807
9374a998567p14957j968175o6567J449040J149771j37794O7940N04092O57280
9365a057937J006720J31842J38193J32362l55828m40979r83528j270667j170204
9356c870026J21160J132983J295633J048532q8217K81803J55357j440897r14053
9347b277725l8997P38545m7113j35353k6909n8794J81053J089848Q88277O45482
9337I58314M66497j660058k065439J81957J201915Q22416K18601m75794K41577
$$ plain form
9328 -110014 -70621 -260835 -465934 -508916 -1299713 -1196887 -1587097 -1749087 -430577 470326
9318 470326 537792 268436 406039 358839 115943 -89485 73138 -666670 -2111652 -2442127
9308 -2442127 -1517443 -420073 773460 1417746 113319 -641229 84250 1110216 1027427
9299 1027427 937713 1400538 753130 -110668 -311253 -22022 -473661 -1285403 -935469 174452
9289 174452 271079 -239793 -330621 33883 -454554 -1750388 -2817131 -2934231 -2791462 -1508864
9279 -1508864 47316 423352 290459 358635 207540 446853 263813 -284351 -902978 -1691387
9269 -1691387 -2281786 -2121819 -1987384 -2192726 -2101757 -2094149 -1862762 -1195172 -660865 -360367
9259 -360367 -275585 247451 904717 1266621 1020179 384036 -558022 -1236426 -374394 -122845
$$ packed form
9328a10014L9393j90214k05099m2982p90797J02826l90210j61990J318510R00903
9318D70326O7466k69356J37603m7200k42896k05428J62623p39808j444982l30475
9308b442127R24684J097370J193533O44286j304427p54548P25479J025966q2789
9299A027427q9714M62825o47408q63798k00585K89231m51639q11742L49934J109921
9289A74452R6627n10872r0828L64504m88437j295834j066743j17100J42769J282598
9279a508864J556180L76036j32893O8176j51095K39313j83040n48164o18627p88409
9269a691387n90399J59967J34435k05342R0969P608K31387O67590N34307L00498
9259c60367Q4782N23036O57266L61904k46442o36143r42058o78404Q62032K51549
$$ plain form
9249 -122845 -160882 626695 1458034 1390213 209203 -1117849 -1781225 -1845941 -1669476 -1573193
9239 -1573193 -699490 -449844 -592168 -614331 -267538 -187193 -51683 262414 -104896 -210716
9229 -210716 -372559 -201687 -765467 -1393861 -588648 -164232 -949197 -1602037 -1338554 -609260
9219 -609260 78642 -535880 -1052516 -484257 -376654 -469846 -837987 -998894 29422 799848
9209 799848 377530 351298 429193 -294071 -859893 -369688 -367941 -1377373 -1191545 -1172175
9199 -1172175 -390839 215727 618939 1116093 123360 -1094830 -1469357 -1816592 -2174885
9190 -2174885 -2268088 -1728217 -1329967 -1437500 -1447701 -464341 975764 1610439 404827 -976667
9180 -976667 -914273 -327618 283572 -337998 -1080909 -735783 -84094 73017 382501 -60644
$$ packed form
9249a22845l8037P87577Q31339o7821j181010j327052o63376o4716J76465R6283
9239a573193Q73703K49646j42324k2163L46793Q0345J35510L14097l67310j05820
9229b10716j61843J70872n63780o28394Q05213M24416p84965o52840K63483P29294
9219f09260O87902o14522n16636N68259J07603r3192l68141j60907J028316P70426
9209G99848m22318k6232P7895p23264n65822M90205J747j009432J85828J9370
9199a172175P81336O06566M03212M97154r92733j218190l74527l47235l58293
9190b174885r3203N39871L98250j07533j0201R83360J440105O34675j205612j381494
9180i76667O2394N86655O11190o21570p42911L45126O51689J57111L09484m43145
$$ plain form
9170 -60644 -625532 -741437 -1023895 2205 1608271 1722294 1244309 1137968 1267944 745527
9160 745527 7021 -470433 -1155606 -1759939 -1809553 -1186054 -981139 -690414 -701542 -2164631
9150 -2164631 -3665496 -3392872 -1722862 -530335 -177265 -219055 -711703 -504686 -277526
9141 -277526 -559463 -982544 -756902 -299073 -103013 -522353 -770711 -804773 -1973464 -1418056
9131 -1418056 74379 -273574 -819799 -854632 -475071 -477914 -1114102 -1252832 -1550929 -1493405
9121 -1493405 -932457 210066 1366516 616080 -240147 -786216 -1348722 -1650718 -1258946
9112 -1258946 -1294871 -2000171 -2132698 -1743931 -500165 403337 37986 -1718661 -2897693
9103 -2897693 -2576410 -2078488 -992822 -91146 -821547 -1712742 -2317652 -2127848 -1485486
$$ packed form
9170f0644n64888j15905k82458J026100J606066J14023m77985j06341J29976n22417
9160G45527p38506m77454o85173o04333m9614O23499K04915K90725j1128j463089
9150b164631j500865K72624J670010J192527L53070m1790m92648K07017K27160
9141b77526k81937m23081K25642M57829J96060m19340k48358l4062j168691N55408
9131a418056J492435l47953n46225l4833L79561k843o36188j38730k98097N7524
9121a493405N60948J142523J156450p50436q56227n46069n62506l01996L91772
9112a258946l5925p05300j32527L88767J243766R03502l65351j756647j179032
9103b897693L21283M97922J085666R01676p30401q91195o04910J89804O42362
$$ plain form
9094 -1485486 153114 1657391 1679637 755090 419953 482889 644157 336422 -322540 -111670
9084 -111670 -1097295 -1904836 -1486179 -1189869 -339471 832306 2494416 3717377 3727639
9075 3727639 3315827 3039459 2558577 2044240 2082957 2695801 2359901 1048840 -678358
9066 -678358 -1253283 -873576 -1042250 -1074258 -536117 -19065 619563 700646 264936 -45240
9056 -45240 -698184 -455913 -86949 251325 1131375 1154384 -524816 -1958116 -2090660 -1483122
9046 -1483122 -941052 -303999 162079 180003 -9511 411229 1029474 1700018 1341525 623
9036 623 -308434 -172692 -909136 -1591523 -2505897 -3161338 -3525963 -3456109 -1889728 -521507
9026 -521507 -656279 -565150 104432 695983 532767 55510 252006 669536 806166 425616
$$ packed form
9094a485486J638600J504277K2246r24547l35137O2936J61268l07735o58962K10870
9084a11670r85625q07541M18657K96310Q50398J171777J662110J222961J0262
9075C727639m11812k76368m80882n14337L8717O12844l35900j311061j727198
9066f78358n74925L79707j68674l2008N38141N17052O38628Q1083m35710l10176
9056d5240o52944K42271L68964L38274Q80050K3009j679200j433300j32544O07538
9046a483122N42070O37053M66078J7924j89514M20740O18245O70544l58493j340902
9036F23l09057J35742p36444o82387r14374o55441l64625O9854J566381J368221
9026e21507j34772R1129O69582N91551j63216m77257J96496M17530J36630l80550
$$ plain form
9016 425616 -356711 -1339199 -2454756 -2401546 -1290692 -1066949 -868034 7119 413759 183638
9006 183638 -48393 -522742 -1153806 -1349828 -1398018 -2168561 -2472173 -1546296 -1071053 -1230209
8996 -1230209 -1556031 -1653981 -1854557 -1724594 -1497940 -1371799 -1381761 -1055595 -395600 -208070
8986 -208070 209206 29583 -77346 492206 -492915 -2105661 -1784228 -114132 1087510
8977 1087510 1135235 663905 1095473 1101070 483088 87970 177823 -44665 -85797 -489889
8967 -489889 -270266 891925 787342 -361826 -706148 -505238 -28995 271471 -406829
8958 -406829 -1509602 -2371394 -2577963 -1783237 -837642 -1375268 -1807756 -1970437 -1746454 -1129021
8948 -1129021 -706427 95889 465600 316300 611829 601040 314676 407827 680993 911503
$$ packed form
9016D25616p82327r82488j115557N3210J110854K23743J98915Q75153M06640k30121
9006A83638k32031m74349o31064j96022m8190p70543l03612R25877M75243j59156
8996a230209l25822r7950k00576J29963K26654J26141r962L26166O59995J87530
8986b08070M17276j79623j06929N69552r85121j612746L21433J670096J201642
8977A087510M7725m71330M31568N597o17982l95118Q9853k22488m1132m04092
8967d89889K19623J162191j04583j149168l44322K00910M76243L00466o78300
8958d06829j102773q61792k06569P94726R45595n37626m32488j62681K23983O17433
8948a129021M22594Q02316L69711j49300K95529j0789k86364R3151K73166K30510
$$ plain form
8938 911503 1639922 2227142 2409822 1948379 1974605 2350187 2392293 1428224 539889 793071
8928 793071 539398 524881 824746 1106555 1256913 1161675 374937 -1343239 -2682325 -1882876
8918 -1882876 -245865 177276 170103 1025688 1502521 1198116 574529 870670 1739559 2620318
8908 2620318 2149153 747238 -459521 -192594 1301167 697847 -591633 -890857 -758613
8899 -758613 -662810 -1511277 -2031422 -1703113 -1353172 -897286 -480875 -439885 -489516 113889
8889 113889 -189853 -681175 -373749 -844099 -2049642 -2138729 -1070016 -401324 -1399391 -2206283
8879 -2206283 -2025003 -1166992 -799945 -834460 -198227 1069986 1425841 128974 -1072129
8870 -1072129 -1765520 -1879648 -1731620 -2364163 -1991310 -634010 59029 -493868 -1755031
$$ packed form
8938I11503P28419N87220J82680m61443K6226L75582M2106r64069q88335K53182
8928G93071k53673j4517K99865K81809J50358r5238p86738j718176j339086P99449
8918a882876J637011M23141p173Q55585M76833l04405o23587K96141Q68889Q80759
8908B620318m71165j401915j206759K66927J493761o03320j289480k99224J32244
8899g58613R5803q48467n20145L28309L49941M55886M16411M0990m9631O03405
8889A13889l03742m91322L07426m70350j205543q9087J068713O68692r98067q06892
8879b206283J81280Q58011L67047l4515O36233J268213L55855j296867j201103
8870a072129o93391j14128J48028o32543L72853J357300O93039n52897j261163
$$ plain form
8861 -1755031 -2701777 -2875908 -2545361 -1617973 -335400 370332 -202892 -1208475 -1732535
8852 -1732535 -1803542 -1113899 76983 788856 1523385 1668136 1288368 1226033 655342 -796756
8842 -796756 -1826411 -1879740 -824100 -84721 150110 -324313 -1083126 -1329831 -1547063 -1013632
8832 -1013632 -248636 538323 1877868 2880787 2902828 1508253 -394689 -1370012 -1909150
8823 -1909150 -1657610 -912864 -390886 -132359 -1202146 -2204610 -2414764 -2192445 -1929059
8814 -1929059 -1227770 -1603417 -3076907 -3308667 -2114125 -1046039 -53437 -123926 -353061
8805 -353061 -655503 -1723542 -2595835 -2137834 -1004078 -52222 691373 760442 376730 -397634
8795 -397634 -1301094 -1751930 -1879827 -1214005 -569088 -924235 -1079148 -410723 936144 1367026
$$ packed form
8861a755031r46746j74131L30547R27388J282573P05732n73224j005583n24060
8852a732535p1007O89643J190882P11873P34529J44751l79768o2335n70691j452098
8842g96756j029655n3329J055640P39379K34831m74423p58813k46705k17232N33431
8832a013632P64996P86959J339545J002919K2041j394575j902942r75323n39138
8823a909150K51540P44746N21978K58527j069787j002464k10154K22319K63386
8814a929059P01289l75647j473490k31760J194542J068086R92602p0489k29135
8805c53061l02442j068039q72293M58001J133756R51856P43595O9069l83712p74364
8795c97634r03460m50836j27897O65822O44917l55147j54913O68425J346867M30882
$$ plain form
8785 1367026 1556715 1452478 1248248 1621498 2113551 2089899 1404922 458013 538603 583281
8775 583281 -46184 157236 142708 345796 866466 969213 581650 150856 72272 -491989
8765 -491989 -714493 -135058 226078 399371 -380719 -1802780 -1361704 250222 783913
8756 783913 -239253 -1297714 -1710808 -1659247 -1291647 -1217146 -1198091 -956870 -1085719 -101732
8746 -101732 1372691 1647611 1564856 1750094 2336526 2315371 2292840 2053137 1639147 725069
8736 725069 498601 1004691 1402972 1794736 2248178 2791080 2485141 1397957 1003153 639853
8726 639853 224892 1524739 2185735 2062507 1929749 1854258 1982311 1694379 1398774 1817525
8716 1817525 2363061 2226373 1219810 518199 673501 1011632 1133240 1389469 562346
$$ packed form
8785A367026J89689j04237k04230L73250M92053k3652o84977r46909Q0590M4678
8775E83281o29465K03420j4528K03088N20670J02747l87563m30794p8584n64261
8765d91989k22504N79435L61136J73293p80090j422061M41076J611926N33691
8756G83913j023166j058461m13094N1561L67600P4501J9055K41221j28849R83987
8746a01732J474423K74920q2755J85238N86432k1155k2531k39703m13990r14078
8736G25069k26468N06090L98281L91764M53442N42902l05939j087184l94804l63300
8726F39853m14961J299847O60996j23228j32758p5491J28053k87932k95605M18751
8716A817525N45536j36688j006563p01611J55302L38131J21608K56229q27123
$$ plain form
8707 562346 -457830 -279792 397723 818182 1172794 1085762 -457471 -1345312 -1191872 -340638
8697 -340638 336239 391221 694567 1206749 1186361 1149232 834518 796923 64516 295462
8687 295462 1322606 1247120 1184360 1129508 1393696 1106703 602929 1021023 1703543 2310307
8677 2310307 3038232 3595089 4179722 4707163 5423188 6053991 6147679 5367332 4562565 3479282
8667 3479282 2867581 3988355 4380515 4445528 6524999 8143089 8560177 8389836 8079849
8658 8079849 8912652 10082142 11616364 15067382 20697699 27511323 33667962 39469332
8650 39469332 44908643 49518116 51921361 51786712 48838893 45417837 41320964 36174365
8642 36174365 30536672 25416331 21318248 18578996 16871188 14647800 13539545 13564539
$$ packed form
8707E62346j020176J78038O77515M20459L54612q7032j543233q87841J53440Q51234
8697c40638O76877N4982L03346N12182k0388l7129l14714l7595p32407K30946
8687B95462J027144p5486o2760n4852K64188k86993n03774M18094O82520O06764
8677B310307P27925N56857N84633N27441P16025O30803R3688p80347q04767j083283
8667C479282o11701J120774L92160O5013K079471J618090M17088j70341l09987
8658H079849Q32803J169490J534222L451018N630317O813624O156639N801370
8650C9469332N439311M609473K403245j34649k947819l421056m096873n146599
8642C6174365n637693n120341m098083k739252j707808k223388j108255K4994
$$ plain form
8634 13564539 13495307 13508995 13245339 11955905 9653449 8079057 7194645 6728968 7478646
8625 7478646 9008210 9677905 9480535 9271542 8619505 7797626 8159353 8084196 8583295 9213955
8615 9213955 9353691 8794233 9363940 10559096 10820009 11243504 12713437 13251395 14546655
8606 14546655 17023201 19259422 21656076 24800550 29108530 33315472 38719705 47021775
8598 47021775 56863160 68162827 83049878 101626787 121651635 139750430 153346130
8591 153346130 161565509 162821997 156150443 142984482 126050181 108655158 92719640
8584 92719640 78965648 67044700 56793079 49274485 43326104 37653343 33372424 31359394
8576 31359394 30243217 28043725 26157874 24524143 23675442 23556141 23915926 24127348 23555822
$$ packed form
8634A3564539o9232J3688k63656j289434k302456j574392q84412m65677P49678
8625G478646J529564O69695j97370k08993o52037q21879L61727p5157M99099O30660
8615I213955J39736n59458N69707J195156K60913M23495J469933N37958J295260
8606A4546655K476546K236221K396654L144474M307980M206942N404233Q302070
8598D7021775R841385J1299667J4887051J8576909K0024848J8098795J3595700
8591A53346130Q219379J256488o671554j3165961j6934301j7395023j5935518
8584I2719640j3753992j1920948j0251621p518594n948381n672761m280919k013030
8576C1359394j116177k199492j885851j633731q48701j19301L59785K11422n71526
$$ plain form
8567 23555822 22332681 20370928 19010972 18935310 19637117 20077029 19800904 19377499 19201134
8558 19201134 20135286 20660265 21121066 22681179 24416797 26067539 27219257 29281934 32671494
8549 32671494 35691227 38545630 43547791 50386201 58083087 67427733 79553706 94857109
8541 94857109 113499414 137420421 167244860 200876823 236883463 272270044 300464728
8534 300464728 315829892 317356455 305182517 281249429 249144572 213914418 181080154
8527 181080154 152519044 127731342 107054334 91415295 78864148 69141545 61411944
8520 61411944 55027920 49007072 44680929 42092821 39392769 35951202 33201373 31400521
8512 31400521 30214201 29461128 29159006 28298012 28087161 28086774 27311029 25308267 24049980
$$ packed form
8567B3555822j223141j961753j359956p5662P01807M39912k76125m23405j76365
8558A9201134R34152N24979M60801J560113J735618J650742J151718K062677L389560
8549C2671494L019733K854403N002161O838410P696886R344646J2125973J5303403
8541I4857109J8642305K3921007K9824439L3631963L6006640L5386581K8194684
8534C00464728J5365164J526563j2173938k3933088l2104857l5230154l2834264
8527A81080154k8561110k4787702k0677008j5639039j2551147r722603p729601
8520F1411944o384024o020848m326143k588108k700052l441567k749829j800852
8512C1400521j186320p53073l02122q60994k10851l87p75745k002762j258287
$$ plain form
8503 24049980 24258802 25035058 26070713 26786485 27135294 27791905 29153391 30748496 32976691
8494 32976691 36766008 40914740 44614399 49671956 56061302 62676603 70591128 80688747
8486 80688747 94550048 111733048 133381347 160589413 193841924 232667916 274779045
8479 274779045 316739917 350941653 371992769 375218603 360264791 330574223 290829462
8472 290829462 248512254 208994126 174865524 146112963 122960492 104767009 89970663
8465 89970663 77727460 68174841 60721070 54461285 48929041 44737870 42424357 40792337
8457 40792337 38273115 35129506 33381002 31037491 29044128 28233309 27926919 26651196
8449 26651196 25208604 24285874 24085656 24520762 25209479 26335733 26644673 26197187 27371308
$$ packed form
8503B4049980K08822P76256J035655P15772L48809O56611J361486J595105K228195
8494C2976691L789317M148732L699659N057557O389346O615301P914525J0097619
8486H0688747J3861301J7183000K1648299K7208066L3252511L8825992M2111129
8479B74779045M1960872L4201736K1051116L225834j4953812k9690568l9744761
8472B90829462m2317208l9518128l4128602k8752561k3152471j8193483j4796346
8465H9970663j2243203r552619p453771o259785n532244m191171k313513j632020
8457D0792337k519222l143609j748504k343511j993363q10819l06390j275723
8449B6651196j442592r22730k00218M35106O88717J126254L08940m47486J174121
$$ plain form
8440 27371308 28870118 30374782 32318292 34174546 37285411 40386030 44454058 50067818
8432 50067818 55521165 62662330 72222811 84054327 99582916 119219953 142650133 170921283
8424 170921283 203848429 238269717 271731298 299190282 315608270 318818411 308028156
8417 308028156 283913580 251046848 215764163 181506349 150602984 125673308 105869231
8410 105869231 89688645 76636863 66309007 57618250 50202968 43993704 39331350 35593879
8402 35593879 32606539 29499868 27501403 26151248 24585125 23509547 21946414 20998722
8394 20998722 20531948 18900910 17590686 16988451 16020538 14856571 14630399 15077058 15716367
8385 15716367 16092080 16471794 16846387 17048609 17667419 18066130 18580367 20294799 23240875
$$ packed form
8440B7371308J498810J504664J943510J856254L110865L100619M068028N613760
8432E0067818N453347P141165R560481J1831516J5528589J9637037K3430180K8271150
8424A70921283L2927146L4421288L3461581K7458984J6417988L210141j0790255
8417C08028156k4114576l2866732l5282685l4257814l0903365k4929676j9804077
8410A05869231j6180586j3051782j0327856q690757p415282o209264m662354l737471
8402C5593879k987340l106671j998465j350155j566123j075578j563133r47692
8394B0998722m66774j631038j310224o02235r67913j163967k26172M46659O39309
8385A5716367L75713L79714L74593K02222O18810L98711N14237J714432K946076
$$ plain form
8376 23240875 25768102 27615247 31147913 35349571 41051453 49416913 59301323 69676861
8368 69676861 82076762 98540591 116855739 134524109 149818315 159212226 160546850
8361 160546850 153918232 141104395 124372013 106216360 89566832 74767293 62535296
8354 62535296 52139075 43669247 37176736 32106217 27365733 23271339 20520962 17734690
8346 17734690 15550819 14736268 13258503 12654882 12340248 11801634 10107473 8658358 8232616
8337 8232616 7214473 5971520 6088986 6813485 7198831 6954144 6049075 5984439 6753029
8328 6753029 7573475 7361229 6586640 6494916 6055562 6273565 7634472 9134458 10038435
8319 10038435 10419015 11452442 12838597 13006189 13498828 15891210 19768076 24784303 29587066
$$ packed form
8376B3240875K527227J847145L532666M201658N701882Q365460R884410J0375538
8368F9676861J2399901J6463829J8315148J7668370J5294206R393911J334624
8361A60546850o628618j2813837j6732382j8155653j6649528j4799539j2231997
8354F2535296j0396221q469828o492511n070519m740484m094394k750377k786272
8346A7734690k183871q14551j477765o03621l14634n38614j694161j449115m25742
8337H232616j018143j242953J17466P24499L85346k44687r05069o4636P68590
8328F753029Q20446k12246p74589r1724m39354K18003J360907J499986R03977
8319A0038435L80580J033427J386155J67592M92639K392382L876866N016227M802763
$$ plain form
8310 29587066 34448983 40076561 44787310 48345616 50338997 50791950 48981718 44960159
8302 44960159 40131898 34174657 28182637 23495104 19186288 16377365 14963670 13577454
8294 13577454 12596535 11172864 9074910 7792667 7108616 6720068 5389949 3876212 3096404
8285 3096404 2349551 1793230 1501269 1942309 2081354 2061220 1563945 1781010 2668123 3680998
8275 3680998 3537278 3015422 3437559 3872984 3888133 3953332 3931255 2976451 1922599 989641
8265 989641 588238 1159481 1404149 420463 -621810 -76577 2614626 3904514 2139779
8256 2139779 416106 554297 952237 1161459 1197829 1191325 1639145 993825 7423 262976
8246 262976 1206737 1219292 1197435 1380135 1320705 1022282 482792 689026 1159606 930844
$$ packed form
8310B9587066M861917N627578M710749L558306J993381M52953j810232m021559
8302D4960159m828261n957241n992020m687533m308816k808923j413695j386216
8294A3577454r80919j423671k097954j282243o84051l88548j330119j513737p79808
8285C096404p46853n56321k91961M41040J39045k0134m97275K17065Q87113J012875
8275C680998j43720n21856M22137M35425J5149O5199k2077r54804j053852r32958
8265I89641m01403N71243K44668r83686j042273N45233K691203J289888j764735
8256B139779j723673J38191L97940K09222L6370o504M47820o45320r86402K55553
8246B62976R43761J2555k1857J82700n9430k98423n39490K06234M70580k28762
$$ plain form
8236 930844 661642 159042 -24850 315416 959595 1382577 441051 -418505 -310755 1013445
8226 1013445 1963671 2249266 2111822 1476985 872846 -211174 -936924 -1357354 -1690733
8217 -1690733 -1255076 668650 1678254 756282 -427374 -353272 -289247 -417493 -559997
8208 -559997 -996727 -1936668 -1949961 -1104685 -516648 -389945 93332 1023285 2253397 2983351
8198 2983351 2915741 3000911 2423617 1535963 1659660 2457160 2772815 2352839 2365222 2500913
8188 2500913 2656148 2078687 432879 -482634 -917576 -1039309 -174784 618586 960637
8179 960637 864268 370507 -377163 -125361 1020126 1447584 1327626 1680105 2277025 2159549
8169 2159549 2150267 2546933 2895021 1890133 950529 -138311 -547540 33104 259445 1532225
$$ packed form
8236I30844k69202n02600j83892L40266O44179M22982r41526q59556J07750J324200
8226A013445R50226K85595j37444o34837o04139j084020p25750m20430l33379
8217a690733M35657J923726J009604r21972j183656P4102O4025j28246j42504
8208e59997m36730r39941j3293Q45276N88037J26703M83277R29953J230112P29954
8198B983351o7610Q5170n77294q87654J23697P97500L15655m19976J2383J35691
8188B500913J55235n77461j645808r15513m34942j21733Q64525P93370L42051
8179I60637r6369m93761p47670K51802J145487M27458j19958L52479N96920j17476
8169B159549r282L96666L48088j004888r39604j088840m09229N80644K26341J272780
$$ plain form
8159 1532225 2545967 2905156 2627205 2258998 2594601 3517348 4249542 3789515 2681976
8150 2681976 2577814 3160617 3361615 2636219 1365206 947548 391734 -566684 -908232
8141 -908232 -240497 -344155 -820791 -219080 289645 54545 -653341 -193365 209694 -435257
8131 -435257 -630445 -1008954 -1220958 -420053 38955 -172949 -750216 -1373537 -721811 854971
8121 854971 1456270 1242732 1108769 657099 -315106 -1594346 -1988585 -2005778 -1182166 336705
8111 336705 1150220 -168774 -1146774 -1092409 -751765 325188 1251416 1220179 1860878 2091520
8101 2091520 565290 -712789 -1430595 -1441901 -114987 -298392 -497518 -59245 120253
8092 120253 -161433 -623516 -471578 70671 41387 79431 577855 1902073 1625412 797301
$$ packed form
8159A532225J013742L59189k77951l68207L35603R22747P32194m60027j107539
8150B681976j04162N82803K00998p25396j271013m17658n55814r58418l41548
8141i08232O67735j03658m76636O01711N08725k35100p07886M59976M03059o44951
8131d35257j95188l78509k12004Q00905M59008k11904n77267o23321O51726J576782
8121H54971O01299k13538j33963m51670r72205j279240l94239j7193Q23612J518871
8111C36705Q13515j318994r78000N4365L40644J076953R26228l1237O40699K30642
8101B091520j526230j278079p17806j1306J326914j83405j99126M38273J79498
8092A20253k81686m62083J51938N42249k9284L8044M98424J324218k76661q28111
$$ plain form
8082 797301 553313 499869 1189326 1477831 1333406 1352535 1412571 926734 849014 941287 1326869
8071 1326869 1020708 335920 -138404 300167 1354557 1779724 800287 -774951 -1117444
8062 -1117444 -726469 -1445200 -2251527 -3064431 -4208066 -4575481 -3947119 -2975954 -2043261
8053 -2043261 -1322486 -630796 -491797 -83497 517115 201453 135390 -346407 -178662 1608354
8043 1608354 1931849 905266 359672 -331400 -1533184 -2819256 -3710292 -4373190 -4490349
8034 -4490349 -3873412 -2280898 -448863 191408 106192 -822812 -1580661 -1203598 -591492
8025 -591492 -1019807 -1476058 -2118337 -2058524 -1713962 -1351136 -1719779 -2660028 -2902468 -3113761
8015 -3113761 -3663335 -4256241 -3843295 -2930465 -2733558 -2499035 -2108240 -906615 64810
$$ packed form
8082G97301k43988n3444O89457K88505j44425J9129O0036m85837p7720R2273L85582
8071A326869l06161o84788m74324M38571J054390M25167r79437j575238l42493
8062a117444L90975p18731q06327q12904j143635l67415O28362R71165R32693
8053b043261P20775O91690J38999M08300O00612l15662o6063m81797J67745J787016
8043A608354L23495j026583n45594o91072j201784j286072q91036o62898j17159
8034d490349O16937J592514J832035O40271q5216r29004p57849L77063O12106
8025e91492m28315m56251o42279N9813L44562L62826l68643r40249k42440k11293
8015c113761n49574n92906M12946R12830J96907K34523L90795J201625R71425
$$ plain form
8006 64810 -315408 -467550 -1347142 -2278109 -926943 1720532 2659780 2261495 1565864 1574510
7996 1574510 2762531 3627028 3336602 3132540 3131054 2259466 1066431 396569 -247630 -183656
7986 -183656 -240718 99200 1799591 2636092 2288713 2320318 3236084 2623405 827094 -1073052
7976 -1073052 -2296453 -2147138 -1502024 -1465810 -1305071 -618679 -1265973 -2161535 -3078278 -3707790
7966 -3707790 -2432641 -735473 500714 767825 -670522 -2269994 -2787606 -1787230 -197548
7957 -197548 112411 -370317 -389633 98113 150630 630611 734564 305172 408512 553200
7947 553200 -415034 -1503994 -804002 476171 1757032 2413570 1664173 -244621 -1403295
7938 -1403295 -1579761 -1638288 -253794 1207949 958865 271354 260448 623850 591049 356617
$$ packed form
8006F4810l80218j52142q79592r30967J351166K647475R39248l98285o95631Q646
7996A574510J188021Q64497k90426k04062j486q71588j193035o69862o44199O3974
7986a83656n7062L39918J700391Q36501l47379L1605R15766o12679j796311j900146
7976a073052j223401J49315O45114L6214J60739O86392o47294q95562r16743o29512
7966c707790J275149J697168J236187K67111j438347j599472n17612J000376J589682
7957a97548L09959m82728j9316M87746N2517M79981J03953m29392J03340J44688
7947E53200r68234j088960O99992J280173J280861O56538p49397j908794j158674
7938a403295j76466n8527J384494J461743k49084o87511j0906L63402l2801k34432
$$ plain form
7928 356617 399793 466729 484591 844765 1254462 166014 -345488 338291 851797 554688
7918 554688 728278 1342001 1203283 1090146 1467245 2249071 2017437 382356 -73513 45052
7908 45052 83268 560066 -145634 -901150 -1350027 -2230176 -2661001 -2195212 -2520231 -3447102
7898 -3447102 -3954171 -3232230 -3103628 -4181143 -4554903 -4382619 -3693913 -3237448 -2601029
7889 -2601029 -1373986 -230606 -342843 -584921 -336937 -772670 -308783 1499007 2327570
7880 2327570 1693556 1145368 1256646 1299066 662091 -484128 -1153566 -1601170 -1993462 -1708912
7870 -1708912 -2480266 -3116366 -2184200 -911135 47009 378243 -21308 -1005219 -1864541
7861 -1864541 -1546290 -630185 -386108 -13976 283003 728635 1420785 780456 -256921
$$ packed form
7928C56617M3176O6936J7862L60174M09697j088448n11502O83779N13506k97109
7918E54688J73590O13723j38718j13137L77099P81826k31634j635081m55869J18565
7908D5052L8216M76798p05700p55516m48877q80149m30825M65789l25019r26871
7898c447102n07069P21941J28602j077515l73760J72284O88706M56465O36419
7889b601029J227043J143380j12237k42078K47984m35733M63887J807790Q28563
7880B327570o34014n48188J11278M2420o36975j146219o69438m47604l92292K84550
7870a708912p71354o36100R32166J273065R58144L31234l99551r83911q59322
7861a864541L18251R16105K44077L72132K96979M45632O92150o40329j037377
$$ plain form
7852 -256921 -294008 484299 1024003 1163240 353601 -720813 -970256 -143598 811820 419539
7842 419539 28003 -663164 -2714691 -3050070 -1922774 -1768688 -2371764 -3040983 -2132033
7833 -2132033 -1212996 22731 1057151 1742451 1693997 881473 1013112 1402289 1314871 629601
7823 629601 -102047 -59288 383925 268630 205595 -393848 -572620 396327 496546 -241969
7813 -241969 471072 1235214 1527109 766200 -896722 -1865274 -1664674 -1055920 -1452817 -1372414
7803 -1372414 -851983 56086 904547 1442149 1438772 768515 -86865 -409548 68378 192483
7793 192483 574308 1250896 1322741 1053148 528380 210150 -43762 -245841 -353079 331557
7783 331557 961160 954223 78770 -412967 50919 -567304 -1927988 -1831372 -832791 1083751
$$ packed form
7852b56921l7087P78307N39704J39237q09639j074414k49443Q26658R55418l92281
7842D19539l91536o91167k051527l35379J127296J54086o03076o69219R08950
7833b132033R19037J235727J034420O85300m8454q12524J31639L89177q7418o85270
7823F29601p31648M2759M43213j15295o3035n99443j78772R68947J00219p38515
7813b41969P13041P64142K91895p60909j662922r68552K00600O08754l96897Q0403
7803a372414N20431R08069Q48461N37602l377o70257q55380l22683M77926J24105
7793A92483L81825O76588P1845k69593n24768l18230k53912k02079j07238O84636
7783C31557O29603o937q75453m91737M63886o18223j360684R6616R98581J916542
$$ plain form
7773 1083751 3087506 4017546 3121793 1212622 -50545 59302 1130253 766691 16763
7764 16763 -474066 -130909 35507 -849480 -1337939 -785479 -1081769 -1316756 -927702 -38981
7754 -38981 942961 1536720 845867 101602 72486 120552 -44868 -192660 -517760 -1162358
7744 -1162358 -1595884 -1141814 -475788 -816598 -1630379 -1902769 -1846896 -1144108 -653857 -629317
7734 -629317 -1200284 -944452 -44736 155179 -451516 -742879 -36049 689512 1018106 435526
7724 435526 -928122 -1446801 -595779 -199871 336161 839322 1462151 1630017 709624 384984
7714 384984 606928 153301 554278 1582925 1795245 1829216 779311 -1057441 -2027732
7705 -2027732 -2561207 -2575994 -1634255 -1304674 -1861649 -1526131 -599010 -761385 -1589339 -2121870
$$ packed form
7773A083751K003755R30040q95753j909171j263167J09847J070951l63562p49928
7764A6763m90829L43157J66416q84987m88459N52460k96290k34987L89054Q88721
7754c8981R81942N93759o90853p44265k9116M8066j65420j47792l25100o44598
7744a162358m33526M54070O66026l40810q13781k72390N5873P02788M90251K4540
7734f29317n70967K55832Q99716J99915o06695k91363P06830P25561L28594n82580
7724D35526j363648n18679Q51022L95908N36032N03161O22829J67866r20393l24640
7714C84984K21944m53627M00977J028647K12320L3971j049905j836752r70291
7705b027732n33475j4787R41739L29581n56975L35518R27121j62375q27954n32531
$$ plain form
7695 -2121870 -2552598 -2398073 -2834806 -3389328 -3180667 -2749620 -2299827 -1737537 -693676
7686 -693676 -377407 -593577 -1068929 -1729362 -1453337 -1202938 -1538095 -1418765 -1355687 -1502812
7676 -1502812 -1098071 -104066 -276580 -1579250 -1365280 -474414 -853186 -1513890 -1835822
7667 -1835822 -1202685 -839070 -363224 -493023 -1764848 -1862570 -1343663 -587577 -268377 -401649
7657 -401649 153694 870450 247820 -334183 122339 294146 -183516 -1468680 -1285876 -258122
7647 -258122 2481 696919 1090479 1308989 1508124 1695464 1706469 956374 214815 68570
7637 68570 96132 -497956 -1118867 -1029857 997095 2376197 1435213 948847 99940 -1066563
7627 -1066563 -1325602 -1246705 -933415 -186932 969 -899417 -1129921 -515967 -509698 -942917
$$ packed form
7695b121870m30728J54525m36733n54522K08661M31047M49793N62290J043861
7686f93676L16269k16170m75352o60433K76025K50399l35157J19330O3078j47125
7676a502812M04741R94005j72514j302670K13970Q90866l78772o60704l21932
7667a835822O33137L63615M75846j29799j271825r7722N18907P56086L19200j33272
7657d01649N55343P16756o22630n82003M56522J71807m77662j285164J82804J027754
7647b58122K60603O94438L93560K18510J99135J87340J1005p50095p41559j46245
7637F8570K7562n94088o20911Q9010K026952J379102r40984m86366q48907j166503
7627a066563k59039P8897L13290P46483J87901r00386k30504O13954O269m33219
$$ plain form
7617 -942917 -843438 -1314868 -1612374 -1251504 -1274022 -1750302 -1986981 -1437828 -859107 -369099
7607 -369099 -684289 -1031443 -1028350 -1686470 -2363068 -1777919 -1711894 -2166150 -1453069 97828
7597 97828 1755171 2135009 648961 -648411 -1419942 -1720492 -1406486 -879330 -1117396
7588 -1117396 -906524 143278 -123647 -778540 126363 990832 436432 -666409 -1292038
7579 -1292038 -1733621 -1476614 -1059436 -1127104 -2033951 -2074766 -994369 -214127 358865 -36292
7569 -36292 -751330 -645687 74746 533102 121845 -381276 -85706 -324662 -1432065 -1859919
7559 -1859919 -1880688 -1653295 -859904 140003 883675 1314415 1640389 289447 -1182262
7550 -1182262 -1597218 -1312713 -1160951 -1330180 -913535 -707467 83879 764255 2129431
$$ packed form
7617i42917R9479m71430k97506L60870k2518m76280k36679N49153N78721M90008
7607c69099l15190l47154L093o58120o76598N85149O6025m54256P13081J550897
7597I7828J657343L79838j486048j297372p71531l00550L14006N27156k38066
7588a117396K10872J049802k66925o54893R04903Q64469n54400j102841o25629
7579a292038m41583K57007M17178o7668r06847m0815J080397P80242N72992l95157
7569c6292p15038J05643P20433M58356m11257n03121K95570k38956j107403m27854
7559a859919k0769K27393P93391R99907P43672M30740L25974j350942j471709
7550a182262m14956K84505J51762j69229M16645K06068P91346O80376J365176
$$ plain form
7541 2129431 2861065 1477263 317336 454392 915256 900959 229673 233643 658296 975465
7531 975465 957801 954616 740697 -403434 -2136455 -2890775 -2693088 -1843737 -578787 399752
7521 399752 22156 -369380 -1326156 -2483348 -2758770 -2503333 -2396874 -2622009 -2716011 -2250620
7511 -2250620 -1145188 321096 1183978 1750425 2144762 2498907 2543236 2677822 2979722
7502 2979722 3048079 2795237 2040980 1923811 2193752 1974914 1104699 1027770 393108 -824325
7492 -824325 -789969 252991 -15726 -707022 -530215 -277581 -213756 340128 269616 -120302
7482 -120302 -720320 -1384805 -922849 -465623 -673274 5840 -149198 -697711 -949980 -1261933
7472 -1261933 -1545841 -1785249 -1932177 -1194662 -1028992 -2192590 -2671070 -2707084 -2422236 -1589339
$$ packed form
7541B129431P31634j383802j159927J37056M60864j4297o71286L970M24653L17169
7531I75465j7664l185k13919j144131j733021p54320J97687Q49351J264950R78539
7521C99752l77596l91536r56776j157192k75422K55437J06459k25135r4002M65391
7511b250620J105432J466284Q62882N66447L94337L54145M4329J34586L01900
7502B979722O8357k52842p54257j17169K69941k18838q70215p6929o34662j217433
7492h24325L4356J042960k68717o91296J76807K52634O3825N53884p0512l89918
7482a20302o00018o64485M61956M57226k07651O79114j55038n48513k52269l11953
7472a261933k83908k39408j46928P37515J65670j163598m78480l6014K84848Q32897
$$ plain form
7462 -1589339 -1831040 -2819794 -3463654 -3198365 -2943748 -3386786 -3370463 -2014116 -1035093 -998564
7452 -998564 -1195313 -1312686 -1249329 -1481176 -1359361 -977974 -1156481 -730099 468926 609872
7442 609872 647976 1426277 1138383 -493221 -1833635 -1653007 -1405518 -1492150 -1815545 -1437405
7432 -1437405 -560300 535711 919206 978371 603805 235645 407132 1016693 1608871 1459956
7422 1459956 761115 816714 1647571 1790193 1568675 602755 -1039012 -1198330 -476917 69046
7412 69046 341663 1039120 330725 -1063347 -1024361 -1340496 -1242640 -597426 -490124 -89266
7402 -89266 901652 1618757 1970970 1245689 315189 -893476 -680221 141699 -183123 -1429882
7392 -1429882 -2593108 -2958307 -2691341 -2252641 -2033027 -2348116 -1808922 -1572666 -2097226
$$ packed form
7462a589339k41701r88754o43860K65289K54617m43038J6323J356347R79023L6529
7452i98564j96749j17373O3357k31847J21815L81387j78507M26382J199025J40946
7442F09872L8104P78301k87894j631604j340414J80628K47489q6632l23395L78140
7432a437405Q77105J096011L83495N9165l74566l68160J71487O09561N92178j48915
7422A459956o98841N5599Q30857J42622k21518r65920j641767j59318P21413N45963
7412F9046K72617O97457p08395j394072L8986l16135R7856O45214J07302M00858
7402h9266R90918P17105L52213p25281r30500j208665K13255Q21920l24822j246759
7392a429882j163226l65199K66966M38700K19614l15089N39194K36256n24560
$$ plain form
7383 -2097226 -2424119 -2438788 -2528584 -3119529 -3336582 -2628068 -571993 231684 -312780 -701040
7373 -701040 -1036630 -1229167 -1559917 -2072238 -1229630 -212560 -1128536 -2107129 -1799789 -645686
7363 -645686 79617 -409255 -1006007 -821915 -1031513 -1377908 -1091733 -721123 -536000 -924288
7353 -924288 -839366 -309012 84619 -736641 -1398868 -1075100 -1617473 -2224381 -2095123 -1847897
7343 -1847897 -1246219 -1057693 -1797169 -1906685 -1188532 -984129 -1125995 -1181688 -951073 -790065
7333 -790065 -1008609 -741819 -564240 -1520386 -3202879 -4073703 -4484786 -3637532 -2799889 -2008976
7323 -2008976 -888437 -193535 98922 656563 194754 -350418 -976418 -1898792 -1538199
7314 -1538199 -1077396 -668392 440461 1435659 628930 -239524 -446635 -895002 -1355617
$$ packed form
7383b097226l26893j4669q9796n90945k17053P08514K056075Q03677n44464l88260
7373g01040l35590j92537l30750n12321Q42608J017070r15976r78593L07340J154103
7363f45686P25303m88872n96752J84092k09598l46395K86175L70610J85123l88288
7353i24288Q4922N30354L93631q21260o62227L23768n42373o06908J29258K47226
7343a847897O01678J88526p39476j09516P18153K04403j41866n5693K30615J61008
7333g90065k18544K66790J77579r56146j682493q70824m11083Q47254Q37643P90913
7323b008976J120539O94902K92457N57641m61809n45172o26000r22374L60593
7314a538199M60803M09004J108853R95198q06729q68454k07111m48367m60615
$$ plain form
7305 -1355617 -1997046 -1098131 -163075 -689315 -1245327 -2362639 -2680897 -1872727 -1238455
7296 -1238455 -977013 -1173252 -615245 146093 -4268 199738 -148657 -1101227 -1281568 -1378731
7286 -1378731 -1152925 -619849 -366957 -918932 -1304169 -1374402 -828330 -74111 -191781 -509884
7276 -509884 -669058 -1157284 -1514858 -1708227 -2167751 -2787353 -3146713 -2234530 -901609 -708688
7266 -708688 -18844 992923 884443 247093 -462463 -657154 -1030795 -800664 -724937 -1212139
7256 -1212139 -881161 129683 611137 -324288 -1635956 -2123011 -2440178 -2899391 -2201215
7247 -2201215 -727543 -98667 -825267 -1472785 -1504952 -1734454 -661040 715933 237190
7238 237190 -568031 -593779 -234524 -373437 -814194 -518946 -871697 -1163796 -1240825 -689199
$$ packed form
7305a355617o41429Q98915R35056n26240n56012j117312l18258Q08170O34272
7296a238455K61442j96239N58007P61338j50361K04006l48395r52570j80341r7163
7286a378731K25806N33076K52892n51975l85237p0233N46072P54219j17670l18103
7276e09884j59174m88226l57574j93369m59524o19602l59360R12183J332921J92921
7266g08688O89844J011767j08480o37350p09556j94691l73641K30131P5727m87202
7256a212139L30978J010844M81454r35425j311668m87055l17167m59213O98176
7247b201215J473672O28876p26600o47518l2167k29502J073414J376973m78743
7238B37190q05221k5748L59255j38913m40757K95248l52751k92099p7029N51626
$$ plain form
7228 -689199 -129743 -767091 -1932385 -2998753 -3506463 -2913459 -1666300 -1220643 -1400925
7219 -1400925 -1846014 -1560671 -413723 232635 383655 12449 310892 1315775 1444445
7210 1444445 788725 1180901 1108067 269972 654176 938583 537631 38149 840247 1147212
7200 1147212 591995 428763 501487 811074 527739 1378308 1481662 424735 356253 404068
7190 404068 207578 363232 821152 340527 -23032 548593 1398146 2383339 3063844 2263399
7180 2263399 1711988 1092520 1107158 1767376 1552663 1020076 491533 -4142 -364807 -407887
7170 -407887 -438595 -711323 -1353156 -1697561 -1732181 -2062078 -859358 -59100 259188 1216469
7160 1216469 1187815 1139001 1988121 3251264 2692589 1932017 947494 -87039 -542546 -1195942
$$ packed form
7228f89199N59456o37348j165294j066368n07710N93004J247159M45657j80282
7219a400925m45089K85343J146948O46358J51020l71206K98443J004883J28670
7210A444445o55720L92176p2834q38095L84204K84407m00952m99482Q02098L06965
7200A147212n55217j63232P2724L09587k83335Q50569J03354j056927o8482M7815
7190D04068j96490J55654M57920m80625l63559N71625Q49553R85193O80505q00445
7180B263399n51411o19468J4638O60218k14713n32587n28543m95675l60665m3080
7170d07887l0708k72728o41833l44405l4620l29897J202720Q00258L18288R57281
7160A216469k8654m8814Q49120J263143n58675p60572r84523j034533m55507o53396
$$ plain form
7150 -1195942 -1797998 -1860681 -1715831 -1499461 -1343424 -1023945 -1249881 -1863142 -2351844 -1660567
7140 -1660567 -1144413 -1207241 -1065548 -416999 40350 -585761 -1204148 -989030 -386411 -427888
7130 -427888 -1354097 -2322795 -2038855 -1028317 -1508734 -2516045 -2117109 -1409987 -1278078
7121 -1278078 -1008740 -325124 1304621 1895615 1132401 172637 -447424 -484606 -238474 -395573
7111 -395573 -279765 -254892 -845813 -252624 1063599 729273 -1259055 -1673640 -698189 634945
7101 634945 1154291 48676 -1708570 -2251527 -1735218 -1006600 -768710 -845417 -997100 -630084
7091 -630084 -1334457 -1944317 -1787951 -1555859 -638583 38591 857956 1640332 1778887 3350
7081 3350 -928665 -737651 -1417941 -2020746 -2162188 -1607106 -848908 -389381 -309254 -756057
$$ packed form
7150a195942o02056o2683J44850K16370J56037L19479k25936o13261m88702O91277
7140a660567N16154o2828J41693O48549M57349o26111o18387K15118O02619m1477
7130d27888r26209r68698K83940J010538m80417j007311L98936P07122J31909
7121a278078K69338O83616J629745N90994p63214r59764o20061l7182K46132j57099
7111c95573J15808K4873n90921N93189J316223l34326j988328m14585R75451J333134
7101F34945N19346j105615j757246n42957N16309P28618K37890p6707j51683L67016
7091f30084p04373o09860J56366K32092R17276O77174Q19365P82376J38555j775537
7081C350r32015J91014o80290o02805j41442N55082P58198M59527Q0127m46803
$$ plain form
7071 -756057 -1905009 -2677345 -1707408 -393223 380944 107565 -220415 -130930 -470584 -346443
7061 -346443 -1210141 -2429110 -2903526 -2039581 -854617 -1344414 -1760430 -1375775 -1638516
7052 -1638516 -2936400 -4325365 -3903119 -2500189 -1196141 -1169660 -1589994 -1496216 -1273835
7043 -1273835 -1062331 -393085 -433284 331212 1224509 1598070 2094554 2844024 1933355 458859
7033 458859 365809 1265022 1854939 1703718 1027989 -135384 -539509 82397 709426 1162326
7023 1162326 590735 112408 530186 354765 -138922 -591474 166031 934463 109970 -574067
7013 -574067 -1312916 -2134810 -2017921 -1201689 -216002 274252 -877822 -1956575 -1953387 -1421964
7003 -1421964 -472079 -332249 -884862 -949949 -451437 -312069 -962090 -1264381 -1286829 -1183809
$$ packed form
7071g56057j148952p72336R69937J314185P74167k73379l27980Q9485l39654J24141
7061c46443q63698j218969m74416Q63945J184964m89797m16016L84655k62741
7052a638516j297884j388965M22246J402930J304048K6481m20334R3778K22381
7043a273835K11504O69246m0199P64496Q93297L73561M96484P49470r10669j474496
7033D58859r3050Q99213N89917j51221o75729j163373m04125O21906O27029M52900
7023A162326n71591m78327M17778j75421m93687m52552P57505P68432q24493o84037
7013e74067p38849q21894J16889Q16232R85687M90254j152074j078753L188N31423
7003a421964R49885J39830n52613o5087M98512J39368o50021l02291k2448J03020
$$ plain form
6993 -1183809 -915404 -53708 574742 328163 -285273 -325591 -377200 -429592 169538 907450
6983 907450 976240 720153 716014 1059768 946078 492728 861087 814188 1197374 1100611 556083
6972 556083 -11311 338448 1084522 1396791 670750 344569 550586 -148795 -1582077 -2819835
6962 -2819835 -2512658 -1536249 -224331 283533 -799379 -2237619 -2424733 -1873480 -2634371
6953 -2634371 -3003250 -2386890 -1601631 -1000967 -100333 1112516 364237 -268499 340124
6944 340124 270783 -149479 -423449 -566236 31203 -74153 -2033265 -2845842 -2066803 -1278707
6934 -1278707 -1498268 -1915597 -2016186 -2324595 -2414624 -1963783 -1674412 -1299166 -1674306 -1286406
6924 -1286406 -364960 10350 -14834 -194254 91633 2328 -733271 -1154293 -1302749 -905122
$$ packed form
6993a183809K68405Q61696O28450k46579o13436m0318n1609n2392N99130P37912
6983I07450O8790k56087m139L43754j13690m53350L68359m6899L83186r6763n44528
6972E56083n67394L49759P46074L12269p26041l26181K06017o99381j433282j237758
6962b819835L07177R76409J311918N07864j082912j438240j87114N51253p60891
6953b634371l68879O16360P85259O00664R00634J212849p48279o32736O08623
6944C40124o9341m20262k73970j42787N97439j05356j959112q12577P79039P88096
6934a278707k19561m17329j00589l08409r0029M50841K89371L75246l75140L87900
6924a286406R21446L75310k5184j79420K85887q9305p35599m21022j48456L97627
$$ plain form
6914 -905122 -64045 381975 610562 623455 -154631 -1439068 -2740349 -3512356 -3262994 -2709423
6904 -2709423 -1508511 -91489 783893 1705878 1636910 1147785 -680248 -2362964 -1616047
6895 -1616047 -24965 1032594 847025 -19453 -1904024 -2686682 -2306109 -1230084 -345972
6886 -345972 623117 741902 417252 106145 -448923 98470 801084 1026835 1504135 2114524
6876 2114524 1692997 1060092 712430 1009646 941448 205797 67422 803440 1017960 220095
6866 220095 -379664 -597181 -817188 -811157 23772 83120 -448885 -887795 -1763482 -2527032
6856 -2527032 -2720791 -1834093 -684872 342931 481910 132251 43932 921725 1546764
6847 1546764 2358996 1992562 1179157 656713 -508009 -1406319 -1331440 -2091022 -3360839
$$ packed form
6914i05122Q41077M46020K28587J2893p78086j284437j301281p72007K49362N53571
6904b709423J200912J417022Q75382R21985o8968m89125j828033j682716P46917
6895a616047J591082J057559j85569q66478j884571p82658L80573J076025Q84112
6886c45972R69089J18785l24650l11107n55068N47393P02614K25751M77300O10389
6876B114524m21527o32905l47662K97216o8198p35651j38375P36018K14520p97865
6866B20095n99759k17517k20007O031Q34929N9348n32005m38910q75687p63550
6856b527032j93759Q86698J149221J027803J38979l49659q8319Q77793O25039
6847A546764Q12232l66434q13405n22444j164722q98310P4879p59582j269817
$$ plain form
6838 -3360839 -3388827 -2271823 -1116694 -514508 234439 710300 1058363 1226874 1634774
6829 1634774 1656090 841095 -273916 -1451000 -1235470 -555452 -656494 -1543270 -1771225
6820 -1771225 -1746406 -1750052 -930640 -455211 -835722 -1649475 -1604986 -579728 -671376 -1697083
6810 -1697083 -1314467 -766349 -1112865 -906656 -1299725 -1698584 -1940289 -1865055 -457361 705360
6800 705360 873750 1046150 660251 -95318 -425447 205456 1574769 2460585 2245593 1608815
6790 1608815 597144 279112 526417 791752 471335 -401728 -423218 75848 718829 817469
6780 817469 727881 824282 92946 -481532 -181599 -258502 -1036097 -1524294 -1567653 -1800385
6770 -1800385 -1613553 -1216764 -1233714 -1981588 -2585817 -3069952 -4213387 -3653301 -2647965
$$ packed form
6838c360839k7988J117004J155129O02186P48947M75861L48063J68511M07900
6829A634774K1316q14995j115011j177084K15530O80018j01042q86776k27955
6820a771225K4819l646Q19412M75429l80511q13753M4489J025258r1648j025707
6810a697083L82616N48118l46516K06209l93069l98859k41705P5234J407694J162721
6800G05360J68390J72400l85899p55569l30129O30903J369313Q85816k14992o36778
6790A608815j011671l18032K47305K65335l20417q73063k1490M99066O42981R8640
6780H17469q9588R6401p31336n74478K99933p6903p77595m88197m3359k32732
6770a800385J86832L96789j6950p47874o04229m84135j143435N60086J005336
$$ plain form
6761 -2647965 -1473700 -624554 -1050025 -1265353 -69604 1607494 1495431 641143 -296428
6752 -296428 -708741 -1431434 -1076946 -689750 -648357 -832814 -1584921 -1352099 -988648 -621697
6742 -621697 -354657 -1309849 -2253867 -2593370 -2344088 -1667778 -1118459 -1399550 -1365670 -1211519
6732 -1211519 -914715 -332414 -347959 -934899 -1941988 -2638449 -2255970 -1955446 -1737089 -1631686
6722 -1631686 -1579042 -560927 -504155 -1457058 -2059035 -2856919 -2187785 -767430 -429544 -231006
6712 -231006 970207 1100869 303616 276856 497551 388999 -171605 176278 1219570 1200284
6702 1200284 423347 -326397 -1670549 -2326733 -2012069 -822425 -810823 -976046 -1517353
6693 -1517353 -2691952 -2924774 -3255615 -2710333 -1924876 -1135327 -582839 -330676 -44487
$$ packed form
6761b647965J174265Q49146m25471k15328J195749J677098j12063q54288r37571
6752b96428m12313p22693L54488L87196M1393j84457p52107K32822L63451L66951
6742f21697K67040r55192r44018l39503K49282O76310N49319k81091L3880J54151
6732a211519K96804N82301j5545n86940j007089o96461L82479L00524K18357J05403
6722a631686N2644J018115N6772r52903o01977p97884O69134J420355L37886J98538
6712b31006J201213J30662p97253k6760K20695j08552n60604L47883J043292j9286
6702A200284p76937p49744j344152o56184L14664J189644J1602j65223n41307
6693a517353j174599k32822l30841N45282P85457P89549N52488K52163K86189
$$ plain form
6684 -44487 -732531 -2107417 -2136300 -1404681 -605329 -294280 -393553 -749174 -1121037 -954052
6674 -954052 -679877 -196255 1208219 770561 -1367498 -1740939 -1975339 -2846321 -4015498
6665 -4015498 -4798258 -4150836 -3497859 -3007003 -2149525 -1449121 -1237949 -1317031 -1541966 -1679952
6655 -1679952 -1118771 -174577 265513 -806485 -2017553 -2697606 -2190666 -1826687 -1251479
6646 -1251479 -1089764 -1295884 -1357064 -1754016 -2031417 -2903962 -3753491 -3750305 -3494568 -3591567
6636 -3591567 -4606297 -5451064 -4871651 -3346729 -2324593 -2047930 -319462 946004 1329904
6627 1329904 1108482 918242 -428081 -2015541 -2763880 -2462090 -1253075 -431435 -244070
6618 -244070 -209598 -28449 294017 1120537 1894275 1859201 1477442 1335587 1285915 1232155
$$ packed form
6684d4487o88044j374886k8883P31619P99352L11049r9273l55621l71863J66985
6674i54052K74175M83622J404474m37658k138059l73441k34400q70982j169177
6665d015498p82760O47422O52977M90856Q57478P00404K11172p9082k24935j37986
6655a679952N61181R44194M40090j071998j211068o80053N06940L63979N75208
6646a251479J61715k06120o1180l96952k77401q72545q49529L186K55737r6999
6636c591567j014730q44767N79413J524922J022136K76663J728468J265466L83900
6627A329904k21422j90240j346323j587460p48339L01790J209015Q21640J87365
6618b44070L4472J81149L22466Q26520P73738l5074l81759j41855m9672n3760
$$ plain form
6608 1232155 1115196 217739 -111955 -544625 -1648216 -2948191 -2980272 -1737556 -826038
6599 -826038 -662710 558334 952244 237581 -747424 -976710 -1043022 -1288781 -1124446 -668348
6589 -668348 -875778 -1105904 -801879 -571203 65755 1030790 1183850 592455 -342933 -503730
6579 -503730 -1262682 -2504642 -2376007 -2456814 -2387640 -2658904 -2925724 -2923026 -1921728 -1309710
6569 -1309710 -1676243 -2670028 -3084371 -2638778 -1326744 -476226 -445081 -115704 -309635 -1558950
6559 -1558950 -1838172 -567997 -57878 -153722 -276851 -695814 -1226664 -1677789 -1791629 -2471914
6549 -2471914 -2422475 -1516115 -1661304 -2040408 -2602259 -3183450 -3087381 -2295660 -1145250 -746994
6539 -746994 -934937 -494558 -304628 -592105 -1599421 -2104006 -1817269 -2919199 -4352503
$$ packed form
6608A232155j16959q97457l29694m32670j103591j299975l2081J242716R11518
6599h26038J63328J221044L93910p14663r85005k29286o6312k45759J64335M56098
6589f68348k07430k30126L04025K30676O36958R65035J53060n91395r35388j60797
6579e03730p58952j241960J28635q0807O9174k71264k66820K698J001298O12018
6569a309710l66533r93785m14343M45593J312034Q50518L1145L29377j93931j249315
6559a558950k79222J270175N10119r5844j23129m18963n30850m51125j13840o80285
6549b471914M9439R06360j45189l79104n61851n81191R6069P91721J150410L98256
6539g46994j87943M40379J89930k87477j007316n04585K86737j101930j433304
$$ plain form
6530 -4352503 -4009891 -3202287 -1842207 -728280 -437017 -354001 -763539 -1195092 -1070322
6521 -1070322 -254338 -272037 -288492 -208194 -422328 368416 916526 1385278 1697554 1063904
6511 1063904 436953 -408304 -694054 -525274 -368363 -889282 -1647207 -1773756 -1266423 -792163
6501 -792163 -788465 -429173 -519984 -1317729 -1914364 -2397094 -2496310 -2313087 -1992561 -1419772
6491 -1419772 -22238 428324 -122329 -1219471 -2267312 -2945089 -3016232 -2457047 -1453230
6482 -1453230 -237883 107587 -712643 -1427689 -826435 -445758 -674847 -305928 -125093
6473 -125093 49313 410300 405118 394774 485629 1456920 1565399 1579881 2066724 2356271 2149789
6462 2149789 1073192 273049 132434 -12273 470475 714449 1636286 3079249 3823182
$$ packed form
6530d352503L42612Q07604J360080J113927K91263Q3016m09538m31553J24770
6521a070322Q15984j7699j6455Q0298k14134P90744N48110M68752L12276o33650
6511A063904o26951q45257k85750J68780J56911n20919p57925j26549N07333M74260
6501g92163L698L59292r0811p97745n96635m82730r9216J83223L20526N72789
6491a419772J397534M50562n50653j097142j047841o77777p1143N59185J003817
6482a453230J215347L45470q20230p15046O01254L80677k29089L68919J80835
6473a25093J74406L60987n182j0344R0855R71291J08479J4482M86843K89547k06482
6462B149789j076597q00143j40615j44707M82748K43974R21837J442963P43933
$$ plain form
6453 3823182 2737782 846260 11126 359319 1427506 1677321 669330 -280209 -460841
6444 -460841 679312 768536 -62570 12206 650116 1242494 952734 1173250 1468274 307578
6434 307578 -1060066 -1280337 -1262326 -341210 1538606 2724170 2964056 1738810 -15214
6425 -15214 -382104 186190 601442 178721 -612456 -922043 -723184 -1553050 -2099711 -2824777
6415 -2824777 -2735300 -1591988 -435799 -457972 -1190827 -2124617 -3162289 -3533206 -3037764
6406 -3037764 -1913881 -1837685 -2180389 -1932488 -2369267 -2490140 -1764059 -566973 245486
6397 245486 -9074 -708323 -353152 391709 1268254 1095504 1318990 1116700 211393 -303031
6387 -303031 -152012 -716358 -2127533 -2125784 -1167220 -354775 -51625 5909 486859 1023070
$$ packed form
6453C823182j085400j891522q35134L48193J068187K49815j007991r49539j80632
6444d60841J140153Q9224q31106P4776O37910N92378k89760K20516K95024j160696
6434C07578j367644k20271J8011R21116J879816J185564K39886j225246j754024
6425a5214l66890N68294M15252m22721p91177l09587J98859q29866n46661p25066
6415b824777Q9477J143312J156189k2173p32855r33790j037672l70917M95442
6406c037764J123883P6196l42704K47901m36779j20873P26081J197086Q12459
6397B45486k54560o99249L55171P44861Q76545j72750K23486k02290r05307n14424
6387c03031J51019n64346j411175J749R58564Q12445L03150N7534M80950N36211
$$ plain form
6377 1023070 1460397 1455896 1586820 784437 -871753 -1640570 -1488121 -412823 330780 -104638
6367 -104638 -309163 -564734 -440264 605377 869396 507609 619931 1066716 1147590 648656
6357 648656 -141261 -661584 -697037 -1644390 -1974030 -1098518 -171588 -266844 -95700 122164
6347 122164 -564506 -1176526 -743335 -187236 -124300 -303843 -478479 -8612 -223378 -1393439
6337 -1393439 -2212176 -1451850 -654397 -1193552 -1406047 -401052 794538 1578763 1514615
6328 1514615 460430 600828 491701 -478849 -902675 -1652163 -2039670 -1451470 -88392
6319 -88392 923384 1155177 270174 56515 207728 -1198119 -2100515 -1909243 -1983275 -1993096
6309 -1993096 -888410 575605 764334 -1095493 -1550499 -934010 -462373 -725786 -1425086
$$ packed form
6377A023070M37327m501J30924q02383j656190p68817J52449J075298P43603m35418
6367a04638k04525k55571J24470J045641K64019l61787J12322M46785Q0874m98934
6357F48656p89917n20323l5453r47353l29640Q75512R26930r5256J71144K17864
6347A22164o86670o12020M33191N56099O2936j79543j74636M69867k14766j170061
6337a393439q18737P60326P97453n39155k12495J004995J195590P84225o4148
6328A514615j054185J40398j09127r70550m23826p49488l87507N88200J363078
6319h8392J011776K31793q85003k13659J51213j405847r02396J91272p4032r821
6309a993096J104686J464015J88729j859827m55006O16489M71637k63413o99300
$$ plain form
6300 -1425086 -526944 1102571 1764653 1841525 2161886 1469727 1092191 636089 -39762 189333
6290 189333 386584 -192246 -1255628 -1534125 -1738504 -1499123 -1411766 -1831302 -2240656 -2702168
6280 -2702168 -2719206 -1905733 -835092 -647487 -272530 -309773 -949422 -1475065 -1267442 -612981
6270 -612981 148104 313311 1277817 1962348 1034401 178146 -604242 -842070 -817299 -1126114
6260 -1126114 -1402913 -1336175 -1529354 -2146909 -2322707 -1955754 -1629328 -2281976 -2754170 -3213986
6250 -3213986 -2582455 -1630364 -981150 -568326 -851450 -1457857 -2630253 -3353062 -3178054
6241 -3178054 -1907772 128473 -99752 -1133730 -1114881 -660090 -434049 -858067 -434139
6232 -434139 114005 -49790 -557574 -435870 -312577 -1264935 -1498011 -817062 -918001 -936721
$$ packed form
6300a425086Q98142J629515O62082P6872L20361o92159l77536m56102o75851K29095
6290A89333J97251n78830j063382k78497k04379K39381Q7357m19536m09354m61512
6280b702168j7038Q13473J070641J87605L74957l7243o39649n25643K07623O54461
6270f12981P61085J65207R64506O84531r27947q56255p82388k37828K4771l08815
6260a126114k76799O6738j93179o17555j75798L66953L26426o52648m72194m59816
6250c213986O31531R52091O49214M12824k83124o06407j172396p22809J75008
6241c178054J270282K036245k28225j033978J8849M54791K26041m24018M23928
6232d34139N48144j63795n07784J21704J23293r52358k33076O80949j00939j8720
$$ plain form
6222 -936721 -1435798 -2200992 -1806890 -1655618 -1192395 -683059 -162900 -232683 309532 466337
6212 466337 580694 -76070 -939567 -2081679 -1969899 -1033037 -840071 -516013 -724505 -514731
6202 -514731 -435856 -803742 -907867 -899829 -1267263 -1479233 -1357952 -1506609 -1989288 -1728813
6192 -1728813 -1935172 -1972829 -1721421 -1958580 -1249851 617868 2300927 2448956 1174658
6183 1174658 -559419 -736868 -295709 -517373 -235699 1089375 1400267 642630 444100
6174 444100 293446 -300053 -517029 -515440 -301453 -359379 323289 1291390 911215 -1142040
6164 -1142040 -2134863 -1283556 424051 979804 945594 1092571 1023940 1621006 1274213 454032
6154 454032 719779 908970 1138427 1139740 872157 461356 643689 784452 854325 -347668
$$ packed form
6222i36721m99077p65194L94102J51272M63223N09336N20159o9783N42215J56805
6212D66337J14357o56764q63497j142112J11780R36862J92966L24058k08492K09774
6202e14731P8875l67886j04125Q038l67434k11970J21281j48657m82679K60475
6192a728813k06359l7657K51408k37159P08729J867719J683059J48029j274298
6183A174658j734077j77449M41159k21664K81674J325074L10892p57637j98530
6174D44100j50654n93499k16976J589K13987n7926O82668R68101l80175k053255
6164a142040r92823Q51307J707607N55753l4210J46977o8631N97066l46793q20181
6154D54032K65747J89191K29457J313k67583m10801J82333J40763O9873j201993
$$ plain form
6144 -347668 -1281321 -774093 -337083 -1248289 -2652714 -2907398 -2931244 -2811791 -4007911 -4676470
6134 -4676470 -3367629 -1888648 -1313458 -476559 53017 -386374 -987750 -1833418 -2883490
6125 -2883490 -2929627 -2425687 -1706349 -1048631 -227980 -34203 -33232 71962 317473 342001
6115 342001 -843590 -2010218 -3090701 -3798451 -3185802 -2235008 -1035028 313346 824803
6106 824803 919239 1417070 1883550 2302612 1811328 577726 847336 926876 -403903 -2565894
6096 -2565894 -3911623 -2920616 -747047 -202739 -1401040 -2525391 -1736339 -512217 524499
6087 524499 175823 -549800 -1536042 -2016305 -1165098 -869224 -1540604 -2575568 -2655240 -1862816
6077 -1862816 -1187737 -1491569 -1230667 -536547 -426432 -135024 457869 461741 515480 -320520
$$ packed form
6144c47668r33653N07228M37010r11206j404425k54684k3846J19453j196120o68559
6134d676470J308841J478981N75190Q36899N29576m39391o01376q45668j050072
6125b883490m6137N03940P19338O57718Q20651J93777R71J05194K45511K4528
6115C42001j185591j166628j080483p07750O12649R50794J199980J348374N11457
6106H24803R4436M97831M66480M19062m91284j233602K69610P9540j330779k161991
6096b565894j345729R91007K173569N44308j198301j124351P89052J224122J036716
6087E24499l48676p25623r86242m80263Q51207K95874o71380j034964p9672P92424
6077a862816O75079l03832K60902O94120J10115K91408N92893L872N3739q36000
$$ plain form
6067 -320520 -1133228 -1091889 -701953 -1012565 -1991171 -2533718 -3240590 -3480594 -2767484 -1820020
6057 -1820020 -2269042 -2152911 -1981597 -2005586 -1099995 -301766 426244 1892472 2503447 2979636
6047 2979636 3641852 3487992 2759561 1085918 887234 897956 -52606 63129 875605 561500
6037 561500 411574 944060 1890358 2477114 2523919 2069093 1007756 -329825 -1279029 -1673758
6027 -1673758 -1525860 -1042136 -1044896 -682475 -988771 -1377925 -693783 229427 974180 2242997
6017 2242997 2711406 2114722 2232611 1483643 850369 146763 -250518 -396168 -262280 -195580
6007 -195580 -148904 222893 926533 1229909 830069 5249 -571899 -1027984 -1824451 -2091438
5997 -2091438 -1387463 -1044180 -495027 -683000 -1621170 -2164209 -2481717 -2785492 -1969718 -195090
$$ packed form
6067c20520q12708M1339L89936l10612r78606n42547p06872k40004P13110R47464
6057a820020m49022J16131J71314k3989R05591P98229P28010J466228O10975M76189
6047B979636O62216j53860p28431j673643j98684J0722r50562J15735Q12476l14105
6037E61500j49926N32486R46298N86756M6805m54826j061337j337581r49204l94729
6027a673758J47898M83724k760L62421l06296l89154O84142R23210P44753J268817
6017B242997M68409n96684J17889p48968o33274p03606l97281j45650J33888O6700
6007a95580M6676L71797P03640L03376l99840q24820n77148m56085p96467k66987
5997b091438P03975L43283N49153j87973r38170n43039l17508l03775Q15774J774628
$$ plain form
5987 -195090 398776 -401102 -429109 49461 -519695 -1031311 -1095820 -1536493 -896800 473153
5977 473153 2188710 3182557 2845167 2411798 1566644 1467413 1987319 1128629 147273 -917892
5967 -917892 -1683159 -2148526 -2520308 -1685313 -1045692 -665743 -62140 294654 1739083 3325931
5957 3325931 3756440 3760181 3296662 1569134 404163 513085 -49464 -1097246 -1105612 -657074
5947 -657074 -586267 -1132636 -1448071 -945634 -1414575 -1028388 -1050578 -1332943 -360299 164744
5937 164744 107400 552112 1369870 1497943 1349903 1061908 366965 -898622 -1489012 -544785
5927 -544785 617374 1367521 792635 646107 1206939 808502 926887 1308769 894874 -280262
5917 -280262 -1641699 -2373653 -1488256 -66414 -347464 -2277423 -3042442 -2745538 -1906538
$$ packed form
5987a95090N93866p99878k8007M78570n69156n11616o4509m40673O39693J369953
5977D73153J715557R93847l37390m33369q45154r9231N19906q58690r81356j065165
5967i17892p65267m65367l71782Q34995O39621L79949O03603L56794J444429J586848
5957C325931M30509L741m63519j727528j164971J08922n62549j047782q366M48538
5947f57074P0807n46369l15435N02437m68941L86187k2190k82365R72644N25043
5937A64744n7344M44712Q17758J28073j48040k87995o94943j265587n90390R44227
5927e44785J162159P50147n74886j46528N60832l98437J18385L81882m13895j175136
5917b80262j361437p31954Q85397J421842k81050j929959p65019K96904Q39000
$$ plain form
5908 -1906538 -832699 82727 -394527 -1215081 -1666845 -1500528 -1874711 -2312892 -2809225
5899 -2809225 -2704738 -3032452 -2982455 -2472770 -3370109 -3590681 -2542127 -1102281 182620
5890 182620 1018422 1888694 1915074 1134336 327146 -313891 -609462 -573044 -206520 -32929
5880 -32929 -856356 -1406792 -1240606 -2117949 -2454219 -1659878 -2176454 -3418619 -4238040 -3330229
5870 -3330229 -1841203 -1706747 -1593651 -1562700 -1485473 -1058119 -200177 137814 339356 203453
5860 203453 349840 485986 364129 337647 23314 -69627 50425 252968 241951 588802
5850 588802 1230759 751218 31368 -114345 359060 850513 566446 531036 1467796 2239488
5840 2239488 1891534 1572130 1899168 805866 -635683 -322111 -594095 -33413 1488086
$$ packed form
5908a906538J073839R15426m77254q20554m51764J66317l74183m38181m96333
5899b809225J04487l27714M9997N09685q97339k20572J048554J439846J284901
5890A82620Q35802Q70272K6380p80738q07190o41037k95571L6418L66524J73591
5880c2929q23427n50436J66186q77343l36270P94341n16576j242165q19421R07811
5870c330229J489026J34456J13096L0951P7227M27354Q57942L37991K01542j35903
5860B03453J46387J36146j21857k6482l14333r2941J20052K02543j1017L46851
5850E88802O41957m79541p19850j45713M73405M91453k84067l5410R36760P71692
5840B239488l47954l19404L27038j093302j441549L13572k71984N60682J521499
$$ plain form
5831 1488086 2068825 1377472 -104229 -998110 -1564306 -1614359 -1907781 -1745667 -1741470 -2402221
5821 -2402221 -2618857 -1852616 -1901517 -2310573 -2522260 -2168159 -2072365 -2077927 -874025 58726
5811 58726 -300977 -816148 -1182873 -2050147 -2215865 -1800977 -1315667 -609697 365911 809411
5801 809411 989112 845250 143858 -844614 -1001809 -334044 409943 103810 -727849 -678294
5791 -678294 -884524 -667886 -481697 -700302 -862718 -579944 -925499 -923735 -639284 -999291
5781 -999291 -1441868 -1381048 -1583463 -1640519 -993628 187066 667787 -112068 -753967 -2018966
5771 -2018966 -2953687 -2705510 -2331441 -1653468 -1353337 -1255512 -485079 378697 478335 -169471
5761 -169471 -1173940 -1488202 -2134278 -1910117 -788703 44033 -475000 -1228166 -1260258 -1396273
$$ packed form
5831A488086N80739o91353j481701q93881n66196n0053k93422J62114M197o60751
5821b402221k16636P66241m8901m09056k11687L54101R5794n562J203902R32751
5811E8726l59703n15171l66725q67274j65718M14888M85310P05970R75608M43500
5801H09411J79701j43862p01392r88472j57195O67765P43987l06133q31659M9555
5791f78294k06230K16638J86189k18605j62416K82774l45555J764K84451l60007
5781i99291m42577O0820k02415n7056O46891J180694M80721p79855o41899j264999
5771b018966r34721K48177L74069O77973L00131R7825P70433Q63776R9638o47806
5761a69471j004469l14262o46076K24161J121414Q32736n19033p53166l2092j36015
$$ plain form
5751 -1396273 -1788587 -1474287 -225037 163902 -1078358 -1982603 -1260684 620473 1282387
5742 1282387 62347 -1762878 -1578135 -818587 -381132 403904 989083 1167207 672173
5733 672173 -487023 -2069108 -2608558 -2319997 -1264906 -244039 470377 584858 243912
5724 243912 -458 259022 300956 499975 1175081 416054 -530180 -1022462 -1679352 -2440523
5714 -2440523 -2931325 -2881619 -2108027 -2353058 -2461768 -2554802 -2809374 -2870360 -2248951 -1978726
5704 -1978726 -2334218 -1993116 -1680904 -717119 -294394 -720009 -1382217 -1355195 -1009628 -1626533
5694 -1626533 -1840823 -808225 83530 904622 1455035 1338093 508361 -833323 -1738489
5685 -1738489 -1722100 -776641 689886 2160869 2727923 1697914 180121 -1319995 -2134043
$$ packed form
5751a396273l92314L14300J249250L88939j242260r04245P21919J881157O61914
5742A282387j220040j825225J84743P59548M37455P85036N85179J78124m95034
5733F72173j159196j582085n39450K88561J055091J020867P14416J14481l40946
5724B43912k44370K59480M1934J99019O75106p59027r46234m92282o56890p61171
5714b440523m90802M9706P73592k45031j08710r3034k54572o0986O21409K70225
5704a978726l55492L41102L12212R63785M22725m25615o62208K7022L45567o16905
5694a626533k14290J032598Q91755Q21092N50413j16942q29732j341684r05166
5685a738489J6389R45459J466527J470983N67054j030009j517793j500116q14048
$$ plain form
5676 -2134043 -3132815 -4340328 -4058915 -3349620 -2762477 -1195819 289350 635761 -45933
5667 -45933 -943159 -1314609 -996859 -225311 101210 -523589 -745155 -1447275 -2358423 -1675924
5657 -1675924 -965956 -771840 -549599 442316 1125094 1388833 1416488 816606 -254509 -1162243
5647 -1162243 -1500300 -1642401 -2023505 -2257650 -2799160 -2434279 -2583553 -3777795 -3144911
5638 -3144911 -1523648 -601822 -502353 -600251 -393360 862405 1361173 1584580 1441913 1162760
5628 1162760 549152 559849 527424 -211170 -131960 -595650 -1366583 -933589 -1205543 -2127850
5618 -2127850 -2098210 -1760918 -1439855 -1554280 -1094217 -574657 -619710 170638 789449 390259
$$ packed form
5676b134043r98772j207513K81413P09295N87143J566658J485169L46411o81694
5667d5933q97226l71450L17750P71548L26521o24799k21566p02120r11148O82499
5657a675924P09968J94116K22241R91915O82778K63739K7655n99882j071115r07734
5647a162243l38057j42101l81104k34145n41510L64881j49274j194242O32884
5638c144911J621263R21826R9469r7898K06891J255765M98768K23407j42667k79153
5628A162760o13608J0697l2425p38594P9210m63690p70933M32994k71954r22307
5618b127850K9640L37292L21063j14425M60063N19560m5053P90348O18811l99190
$$ [...]
##END NTUPLES=NMR SPECTRUM
##END=
