##TITLE=C13_91-2021
 CDCl3,  2000 sc

 29.09.2021
##JCAMPDX= 6.0         $$ Bruker NMR JCAMP-DX V2.0
##DATA TYPE= NMR SPECTRUM
##DATA CLASS= NTUPLES
##ORIGIN= UXNMR, Bruker Analytische Messtechnik GmbH
##OWNER= root
$$ XWIN-NMR		Version 3.5
$$ Wed Sep 29 11:04:35 2021 Russian Standard Time (UT+4h)  she@DPX200
##.OBSERVE FREQUENCY= 50.327896
##.OBSERVE NUCLEUS= ^13C
##.ACQUISITION MODE= SIMULTANEOUS
##.ACQUISITION SCHEME= undefined
##.AVERAGES= 2000
##.DIGITISER RES= 17
##SPECTROMETER/DATA SYSTEM= spect
##.PULSE SEQUENCE= zgpg30
##.SOLVENT NAME= DMF
##.SHIFT REFERENCE= (INTERNAL, DMF, 0, 222.653)
##AUDIT TRAIL= $$ (NUMBER, WHEN, WHO, WHERE, WHAT)
$$ ##TITLE= Audit trail, XWIN-NMR		Version 3.5
$$ ##JCAMPDX= 5.01
$$ ##ORIGIN= Bruker BioSpin GmbH
$$ ##OWNER= she
$$ F:/spectra/data/she/nmr/c13/1/pdata/1/auditp.txt
$$ ##AUDIT TRAIL=  $$ (NUMBER, WHEN, WHO, WHERE, WHAT)
(   1,<2021-09-29 11:02:19.48 +0400>,<she>,<DPX200>,
      <created by zg, POWCHK disabled, PULCHK disabled
       terminated by command 'halt'
       configuration hash MD5:
       00 E9 B6 7A A2 85 ED C7 34 08 36 98 17 FE 4E 26
       data hash MD5: 32K
       5D 0D FC 35 6C 17 E0 32 B1 EB 9D 71 9D 6B F8 0A>)
(   2,<2021-09-29 11:02:21.93 +0400>,<she>,<DPX200>,
      <Start of raw data processing
       efp BC_mod = 2 LB = 1 FT_mod = 6 PKNL = 1 PHC0 = -336.8167 PHC1 = 31.76238 SI = 32K 
       data hash MD5: 32K
       16 16 CC 01 09 31 1D 7C E4 5D 34 A6 9E D7 D1 79>)
(   3,<2021-09-29 11:02:24.79 +0400>,<she>,<DPX200>,
      <abs ABSG = 5 
       data hash MD5: 32K
       BE A2 E0 CA 48 AA 3A 61 4E CF 41 FB 7B 5D FD 78>)
(   4,<2021-09-29 11:02:59.32 +0400>,<she>,<DPX200>,
      <pk PHC0 = -1.058078 PHC1 = 1.6 
       data hash MD5: 32K
       F1 28 80 74 2E 87 B7 F7 D2 5C DD 86 88 F0 02 C3>)
(   5,<2021-09-29 11:03:19.03 +0400>,<she>,<DPX200>,
      <abs ABSG = 5 
       data hash MD5: 32K
       F2 26 43 E7 07 74 DC 38 12 59 B2 25 D5 2E F0 CB>)
$$ ##END=
$$ 
$$ hash MD5
$$ 07 73 D0 26 D3 5C 5F 90 E5 8A E9 42 91 72 1E EE
##$RELAX= 
##$RELAX= 
##$RELAX= 
##$RELAX= 
##$RELAX= 
##$RELAX= 
##$RELAX= 
##$RELAX= 
$$ Bruker specific parameters
$$ --------------------------
##$DU= <F:/spectra>
##$EXPNO= 1
##$NAME= <c13>
##$PROCNO= 1
##$TYPE= <nmr>
##$USER= <she>
##$AMP= (0..31)
100 100 100 100 100 100 100 100 100 100 100 100 100 100 100 100 100 100 
100 100 100 100 100 100 100 100 100 100 100 100 100 100 
##$AQSEQ= 0
##$AQ_mod= 1
##$AUNM= <au_zg>
##$AUTOPOS= <>
##$BF1= 50.322709
##$BF2= 200.13
##$BF3= 50.322709
##$BF4= 500.13
##$BF5= 500.13
##$BF6= 500.13
##$BF7= 500.13
##$BF8= 500.13
##$BYTORDA= 1
##$CFDGTYP= 0
##$CFRGTYP= 5
##$CHEMSTR= <none>
##$CNST= (0..31)
1 1 145 1 1 1 1 1 1 1 1 1 1 1 1 1 1 1 1 1 1 1 1 1 1 1 1 1 1 1 1 1 
##$CPDPRG= <waltz16>
##$CPDPRG1= <>
##$CPDPRG2= <waltz16>
##$CPDPRG3= <>
##$CPDPRG4= <mlev>
##$CPDPRG5= <mlev>
##$CPDPRG6= <mlev>
##$CPDPRG7= <mlev>
##$CPDPRG8= <mlev>
##$CPDPRGB= <>
##$CPDPRGT= <>
##$D= (0..31)
$$ [...]
##$SUBNAM4= <"">
##$SUBNAM5= <"">
##$SUBNAM6= <"">
##$SUBNAM7= <"">
##$SUBNAM8= <"">
##$SUBNAM9= <"">
##$SW= 239.972175391363
##$SWIBOX= (0..15)
0 1 3 0 0 0 0 0 0 0 0 0 0 0 0 0 
##$SW_h= 12077.2946859903
##$TD= 32768
##$TD0= 1
##$TE= 0
##$TE2= 300
##$TE3= 300
##$TEG= 300
##$TL= (0..7)
120 120 120 120 120 120 120 120 
##$TP= (0..7)
150 150 150 150 150 150 150 150 
##$TP07= 0
##$TPNAME0= <>
##$TPNAME1= <>
##$TPNAME2= <>
##$TPNAME3= <>
##$TPNAME4= <>
##$TPNAME5= <>
##$TPNAME6= <>
##$TPNAME7= <>
##$TPOAL= (0..7)
0.5 0.5 0.5 0.5 0.5 0.5 0.5 0.5 
##$TPOFFS= (0..7)
0 0 0 0 0 0 0 0 
##$TUNHIN= 0
##$TUNHOUT= 0
##$TUNXOUT= 0
##$USERA1= <user>
##$USERA2= <user>
##$USERA3= <user>
##$USERA4= <user>
##$USERA5= <user>
##$V9= 5
##$VALIST= <valist>
##$VCLIST= <CCCCCCCCCCCCCCC>
##$VD= 0
##$VDLIST= <DDDDDDDDDDDDDDD>
##$VPLIST= <PPPPPPPPPPPPPPP>
##$VTLIST= <TTTTTTTTTTTTTTT>
##$WBST= 1024
##$WBSW= 4
##$XGAIN= (0..3)
0 0 0 0 
##$XL= 0
##$YL= 0
##$YMAX_a= 12804824
##$YMIN_a= -3168687
##$ZGOPTNS= <>
##$ZL1= 120
##$ZL2= 120
##$ZL3= 120
##$ZL4= 120
##$ABSF1= 222.6533
##$ABSF2= -17.34351
##$ABSG= 5
##$ABSL= 3
##$ALPHA= 0
##$AQORDER= 0
##$ASSFAC= 0
##$ASSFACI= 0
##$ASSFACX= 0
##$ASSWID= 0
##$AUNMP= <proc_1d>
##$AZFE= 0.1
##$AZFW= 0.5
##$BCFW= 0
##$BC_mod= 2
##$BYTORDP= 0
##$COROFFS= 0
##$CY= -3
##$DATMOD= 1
##$DC= 0
##$DFILT= <>
##$DTYPP= 0
##$F1P= 0
##$F2P= 0
##$FCOR= 0.5
##$FTSIZE= 32768
##$FT_mod= 6
##$GAMMA= 0
##$GB= 0
##$INTBC= 1
##$INTSCL= 4.134877e-10
##$ISEN= 128
##$LB= 1
##$LEV0= 0
##$LPBIN= 0
##$MAXI= 10000
##$MC2= 0
##$MEAN= 0
##$ME_mod= 0
##$MI= 0.1934396
##$NCOEF= 0
##$NC_proc= -1
##$NLEV= 6
##$NOISF1= 120.0001
##$NOISF2= 80.00006
##$NSP= 0
##$NTH_PI= 0
##$NZP= 0
##$OFFSET= 222.6533
##$PC= 1.4
##$PHC0= -337.8748
##$PHC1= 33.36238
##$PH_mod= 1
##$PKNL= yes
##$PPARMOD= 0
##$PSCAL= 0
##$PSIGN= 0
##$REVERSE= no
##$SF= 50.3227301267518
##$SI= 32768
##$SIGF1= 140
##$SIGF2= 120
##$SINO= 11.81781
##$SIOLD= 32768
##$SREGLST= <13C.CDCl3>
##$SSB= 0
##$STSI= 32768
##$STSR= 0
##$SW_p= 12077.2946859903
##$SYMM= 0
##$S_DEV= 0
##$TDeff= 32768
##$TDoff= 0
##$TI= <>
##$TILT= no
##$TM1= 0
##$TM2= 0
##$TOPLEV= 0
##$USERP1= <user>
##$USERP2= <user>
##$USERP3= <user>
##$USERP4= <user>
##$USERP5= <user>
##$WDW= 1
##$XDIM= 32768
##$YMAX_p= 268514114
##$YMIN_p= -6129025
$$ End of Bruker specific parameters
$$ ---------------------------------
##NTUPLES= NMR SPECTRUM
##VAR_NAME=  FREQUENCY,     SPECTRUM/REAL,   SPECTRUM/IMAG
##SYMBOL=    X,             R,               I
##VAR_TYPE=  INDEPENDENT,   DEPENDENT,       DEPENDENT
##VAR_FORM=  AFFN,          ASDF,            ASDF
##VAR_DIM=   32768,         32768,           32768
##UNITS=     HZ,            ARBITRARY UNITS, ARBITRARY UNITS
##FACTOR=    0.368581032318806, 1,           1
##FIRST=     11204.5221820472, 0,            0
##LAST=      -872.772503943062, 0,           0
##MIN=       -872.772503943062, -6129025,    0
##MAX=       11204.5221820472, 268514114,    0
$$ Real data points
##PAGE= N=1
##DATA TABLE= (X++(R..R)), XYDATA
$$ [...]
$$ plain form
15670 2235732 338697 -639260 -837425 -1541005 -1765552 -1204208 -1015948 -1518329 -1428931
15661 -1428931 -714941 609603 1411904 144185 -1741535 -2042148 -1429125 -1135180 -1044841
15652 -1044841 -1433597 -1417749 -873401 -1219356 -1983266 -1814277 -1413585 -365223 131797
15643 131797 728399 2172286 3547819 3520458 2684110 1850664 1756867 1911631 831443
15634 831443 -618459 -305876 1201582 1075518 450181 412082 -15325 -156515 -107899 -55304
15624 -55304 -398514 -1133867 -1395828 -817147 -149107 372014 -507392 -2216383 -2369311 -843201
15614 -843201 160238 206836 -75288 816618 2225976 1965235 1195846 1004249 1022996 317167
15604 317167 576234 1330665 1773074 1778106 452629 -351143 -1951506 -2364932 -1639887 -531935
$$ packed form
15670B235732j897035r77957j98165p03580k24547N61344J88260n02381Q9398
15661a428931P13990J324544Q02301j267719j885720l00613O13023K93945R0339
15652a044841l88756J5848N44348l45955p63910J68989M00692J048362M97020
15643A31797N96602J443887J375533k7361q36348q33446r3797J54764j080188
15634H31443j449902L12583J507458j26064o25337l8099m27407j41190M8616N2595
15624e5304l43210p35353k61961N78681O68040N21121q79406j708991j52928J526110
15614h43201J003439M6598k82124Q91906J409358k60741p69389j91597J8747p05829
15604C17167K59067P54431M42409N032j325477q03772j600363m13426P25045J107952
$$ plain form
15594 -531935 631956 1509206 1193774 -258789 -172859 1401691 2575996 3409354 2750168
15585 2750168 2068635 2161401 1788381 1310440 867394 830623 1223940 1738074 1708501 1761983
15575 1761983 1998292 1544988 1244403 426815 -268382 -153201 282958 35120 -586319
15566 -586319 -320554 -50439 -279123 531928 958783 -549765 -2254533 -3346331 -2917150
15557 -2917150 -1418776 -606779 162956 283910 127762 687398 1542494 1819498 1853481
15548 1853481 1951265 1800935 1333204 1028468 1124573 1008349 794812 887446 904020 762617
15538 762617 759425 1523105 2102406 2125139 1485245 2118289 2693748 1677994 964248 40134
15528 40134 8058 693465 202116 -898012 -996109 -579317 -655618 420830 1508113 1201508
$$ packed form
15594e31935J163891Q77250l15432j452563Q5930J574550J174305Q33358o59186
15585B750168o81533R2766l73020m77941m43046l6771L93317N14134k9573N3482
15575A761983K36309m53304l00585q17588o95197J15181M36159k47838o21439
15566e86319K65765K70115k28684Q11051M26855j508548j704768j091798M29181
15557b917150J498374Q11997P69735J20954j56148N59636Q55096K77004L3983
15548A853481R7784j50330m67731l04736R6105j16224k13537R2634J6574j41403
15538G62617l192P63680N79301K2733o39894O33044N75459j015754p13746r24114
15528D0134l2076O85407m91349j100128r8097M16792p6301J076448J087283l06605
$$ plain form
15518 1201508 800297 742254 547354 1540310 1744261 -61237 -1022496 -1545454 -1731341
15509 -1731341 -1089320 -281399 1264635 1428524 -164664 -788260 -489485 -230339 -125246
15500 -125246 536076 266590 831848 1397217 1438626 1173732 132639 -329410 354061 647777
15490 647777 707036 1063003 983093 704454 -23881 -1130098 -1546857 -939980 -240027 93937
15480 93937 -331190 -763329 -167414 -426520 -1279419 -999459 -322241 199828 -673846 -1930485
15470 -1930485 -2581804 -3420164 -3828650 -3176351 -2234821 -2124462 -1786717 -1635684 -1892054
15461 -1892054 -1128424 -111616 625301 1236091 1541056 1671542 1192839 293186 614874
15452 614874 1402548 1458534 1697013 1915508 1973894 382603 -62778 355716 -491328 -1058928
$$ packed form
15518A201508m01211n8043j94900R92956K03951j805498r61259n22958j85887
15509a731341O42021Q07921J546034J63889j593188o23596K98775K59146J05093
15500a25246O61322k69486N65258N65369M1409k64894j041093m62049O83471K93716
15490F47777N9259L55967p9910k78639p28335j106217m16759O06877O99953L33964
15480I3937m25127m32139N95915k59106q52899K79960O77218N22069q73674j256639
15470a930485o51319q38360m08486O52299R41530J10359L37745J51033k56370
15461a892054P63630J016808P36917O10790L04965J30486m78703q99653L21688
15452F14874P87674N5986K38479K18495N8386j591291m45381M18494q47044n67600
$$ plain form
15442 -1058928 -943038 -1407749 -1121883 -56035 777448 1147257 77357 -1645235 -1898920
15433 -1898920 -385105 1524920 2604100 3447006 2144123 189649 -106100 -171750 80983
15424 80983 1004204 854065 35986 372147 642526 -725628 -1543669 -1280006 -971273 -895050
15414 -895050 -14208 1384252 1837627 817908 -568627 -292236 538056 473834 211614
15405 211614 268756 388159 799040 1183999 781307 1183 -720021 -1867041 -1429405 46462
15395 46462 556579 -282077 -986572 -510409 695747 310239 75464 600461 627248 536922
15385 536922 945125 282650 -1019386 -1273135 -1725116 -2295365 -2285225 -2176255 -1927175 -1577400
15375 -1577400 -1786411 -1968522 -1037522 -383302 -453989 -307311 -13749 404633 -400573 -1697255
$$ packed form
15442a058928J15890m64711K85866J065848Q33483L69809j069900j722592k53685
15433a898920J513815J910025J079180Q42906j302883j954474k95749o5650K52733
15424H0983R23221j50139q18079L36161K70379j368154q18041K63663L08733P6223
15414h95050Q80842J398460M53375j019719j386535K76391Q30292o4222k62220
15405B11614N7142J19403M10881L84959m02692p80124p21204j147020M37636J475867
15395D6462N10117q38656p04495M76163J206156l85508k34775N24997K6787r0326
15385E36922M08203o62475j302036k53749m51981n70249J0140J08970K49080L49775
15375a577400k09011j82111R31000O54220p0687J46678K93562M18382q05206j296682
$$ plain form
15365 -1697255 -2896202 -3041364 -3280936 -3886132 -3094656 -646627 443384 92979 -529168
15356 -529168 193557 1405601 1817102 1318654 436757 -363282 -170044 -139758 -263816 -118580
15346 -118580 -745825 -2034948 -2074096 -1341384 -1389819 -1240735 -2217938 -2682338 -2526377 -1583250
15336 -1583250 -697469 -279643 -106687 -1057513 -2207506 -2645284 -1855789 -2135184 -3168514
15327 -3168514 -3680830 -3391704 -3430520 -3705987 -3078647 -2152734 -1684368 -2173563 -1548356 -515939
15317 -515939 -130004 -425419 -13387 -807341 -1308607 -1373025 -2189632 -2872664 -2274674 -961211
15307 -961211 -83882 700538 632796 -124654 -874295 -313891 -191694 -524282 -218673 606979
15297 606979 867284 1046562 987626 648492 -273930 -285621 1138538 2034341 1418057 213268
$$ packed form
15365a697255j198947j45162k39572o05196P91476K448029J090011l50405o22147
15356e29168P22725J212044M11501m98448q81897q00039J93238L0286j24058J45236
15346a18580o27245j289123l9148P32712m8435J49084r77203m64400J55961R43127
15336a583250Q85781M17826J72956r50826j149993m37778P89495k79395j033330
15327c168514n12316K89126l8816k75467O27340R25913M68366m89195O25207J032417
15317e15939L85935k95415M12032p93954n01266o4418q16607o83032N97990J313463
15307i61211Q77329P84420o7742p57450p49641N60404J22197l32588L05609Q25652
15297F06979K60305J79278n8936l39134r22422j1691J424159Q95803o16284j204789
$$ plain form
15287 213268 -691720 -636227 -854402 -318579 770772 812186 99882 180042 639932 321537
15277 321537 -7111 -514445 -1242630 -2473413 -3236036 -2551798 -1940626 -1750814 -1315138
15268 -1315138 440213 2244803 1985246 451005 -915565 -1440069 -629013 539425 1042232
15259 1042232 892553 1244759 1892833 1325827 282832 -615497 -520562 -64600 1000333
15250 1000333 1435629 877095 1025306 2147316 2800221 2712852 2793432 3684736 3929435 3362326
15240 3362326 2444934 2345338 2632455 2172088 961165 -112183 -715354 -768326 -21109
15231 -21109 373297 215818 -699853 -1752765 -1664397 -1414842 -676275 977841 1240523 400990
15221 400990 -101701 -24276 272736 -247268 -1101598 -793521 118745 619019 658028 -620503
$$ packed form
15287B13268r04988N5493k18175N35823J089351M1414p12304Q0160M59890l18395
15277C21537l28648n07334p28185j230783p62623O84238O11172J89812M35676
15268a315138J755351J804590k59557j534241j366570n24504Q11056J168438N02807
15259A042232j49679L52206O48074n67006j042995q98329R4935M55962J064933
15250A000333M35296n58534J48211J122010O52905q7369Q0580Q91304K44699n67109
15240C362326r17392r9596K87117m60367j210923j073348o03171n2972P47217
15231b1109L94406j57479r15671j052912Q8368K49555P38567J654116K62682q39533
15221D00990n02691P7425K97012n20004q54330L08077R12266N00274L9009j278531
$$ plain form
15211 -620503 -1756786 -921722 332766 297008 94008 783463 650641 196251 715719
15202 715719 1106536 1450323 1446369 1268531 957091 535229 602234 701394 896296 1086863
15192 1086863 1449206 2138855 1219761 392390 1208866 1885519 813460 -265306 514023
15183 514023 1676985 2363133 2074559 1878919 1295853 303907 -469020 -769963 -1125596
15174 -1125596 -1597147 -1624891 -942451 63786 492234 1727353 2804925 2082794 447168
15165 447168 -384032 102268 575418 813209 1089052 1016725 144975 -852350 -397787 625568
15155 625568 2104659 2198860 1190382 261998 58833 1216751 1382618 540602 203583
15146 203583 317643 -267796 -1415338 -1884296 -1509853 -1278010 -1550284 -1541087 -1894691 -1259199
$$ packed form
15211f20503j136283Q35064J254488l5758k03000O89455j32822m54390N19468
15202G15719L90817L43787l954j77838l11440m21862O7005R9160J94902J90567
15192A086863L62343O89649r19094q27371Q16476O76653j072059j078766P79329
15183E14023J162962O86148k88574j95640n83066r91946p72927l00943l55633
15174a125596m71551k7744O82440J006237M28448J235119J077572p22131j635626
15165D47168q31200M86300M73150K37791K75843p2327q71750r97325M54563J023355
15155F25568J479091R4201j008478r28384k03165J157918J65867q42016l37019
15146B03583J14060n85439j147542m68958L74443K31843k72274R197l53604O35492
$$ plain form
15136 -1259199 238658 956322 731368 -142006 -1234351 -1913408 -1425452 -1898606 -2021375
15127 -2021375 -29399 634986 99023 -64515 347676 963706 955919 577230 109795 315348
15117 315348 795642 738849 -123602 -1060308 -514555 -654803 -800628 -1427377 -2109371 -2634585
15107 -2634585 -1776966 -963771 -1035567 -988557 -930461 -995061 -355859 190643 50714 493837
15097 493837 642143 1170153 1248644 325113 -163918 -1073037 -1693742 -664966 -178494 -779729
15087 -779729 -1972153 -2054404 -2294484 -3072396 -3307640 -2176985 -818005 -929860 -941531
15078 -941531 -492367 -495109 -992980 -460822 373959 -15492 -374448 947930 1432456 321886
15068 321886 -893713 -749265 224648 115829 -462125 -219129 245464 -519178 -492757 210465
$$ packed form
15136a259199J497857P17664k24954q73374j092345o79057M87956m73154j22769
15127b021375J991976O64385n35963j63538M12191O16030p787l78689m67435K05553
15117C15348M80294n6793q62451r36706N45753j40248j45825o26749o81994n25214
15107b634585Q57619Q13195p1796M7010N8096o4600O39202N46502j39929M43123
15097D93837J48306N28010P8491r23531m89031r09119o20705J028776M86472o01235
15087g79729j192424q2251k40080p77912k35244J130655J358980j11855j1671
15078i41531M49164k742m97871N32158Q34781l89451l58956J322378M84526j110570
15068C21886j215599J44448R73913j08819n77954K42996M64593p64642K6421P03222
$$ plain form
15058 210465 1449396 1921275 597445 -1227521 -1920340 -696367 351546 490890 640740
15049 640740 1151345 1785056 1715066 730973 -79572 266318 1055757 1239324 998067 1189602
15039 1189602 1049597 185447 -645587 -996025 -759645 -44637 186759 189788 670047 981845
15029 981845 1055943 961260 287228 -235809 -39721 105961 32998 396817 207089 -601061
15019 -601061 -1906486 -2471409 -1706614 -755193 -521110 -1057766 -1558068 -1286357 -729976
15010 -729976 -261885 -733860 -656266 206628 803102 1552423 1332232 1126583 1086526 1126678
15000 1126678 1094185 1017117 938390 552080 269543 436587 1335300 2009111 508293 -992416
14990 -992416 -1296379 -945482 -290656 -255148 -1160978 -1599030 -1425687 -404064 416258 293289
$$ packed form
15058B10465J238931M71879j323830j824966o92819J223973J047913J39344J49850
15049F40740N10605O33711o9990r84093q10545L45890P89439J83567k41257J91535
15039A189602j40005q64150q31034l50438K36380P15008K31396L029M80259L11798
15029I81845P4098r4683o74032n23037J96088J45682p2963L63819j89728q08150
15019f01061j305425n64923P64795R51421K34083n36656n00302K71711N56381
15010g29976M68091m71975P7594Q62894N96474P49321k20191k05649m0057M0152
15000A126678l2493p7068p8727l86310k82537J67044Q98713O73811j500818j500709
14990i92416l03963L50897O54826L5508r05830m38052J73343J021623Q20322j22969
$$ plain form
14980 293289 169439 -119498 -252658 -603358 -657493 -619713 -1230620 -1670781 -2627062 -3267742
14970 -3267742 -2804220 -1901301 -1576687 -938937 -586342 -1498592 -2489017 -2664172 -1916789
14961 -1916789 -842152 -732529 -1032265 218526 1124869 559814 279884 783524 547172
14952 547172 410269 -270073 -829808 -406054 -1222978 -2592878 -2361751 -1304895 -1439191
14943 -1439191 -914126 266126 925465 1193772 785334 287896 -841431 -1637497 -1246039
14934 -1246039 57233 914277 1079892 1166055 1758857 1573270 1102935 -418133 -1625289
14925 -1625289 -1107007 353111 1464349 2260709 1672222 696732 1632924 2271798 1296951
14916 1296951 1384583 1524265 627030 302017 513972 -50070 -694308 -949747 -969483 57876
$$ packed form
14980B93289j23850k88937j33160l50700n4135L7780o10907m40161r56281o40680
14970c267742M63522R02919L24614O37750L52595r12250r90425j75155P47383
14961a916789J074637J09623k99736J250791R06343n65055k79930N03640k36352
14952E47172j36903o80342n59735M23754q16924j369900K31127J056856j34296
14943a439191N25065J180252O59339K68307m08438m97438j129327p96066L91458
14934a246039J303272Q57044J65615Q6163N92802j85587m70335j521068j207156
14925a625289N18282J460118J111238P96360n88487r75490R36192O38874r74847
14916A296951Q7632J39682q97235l25013K11955n64042o44238k55439j9736J027359
$$ plain form
14906 57876 1244403 1551763 1019353 1130818 1538801 1650578 1917090 1166372 -313611
14897 -313611 -1317485 -2661641 -3998363 -4251065 -3176136 -1764924 -1055825 -231753 509543
14888 509543 1275263 1348098 662013 93882 -920747 -2146385 -1398808 -88501 238349
14879 238349 351044 200791 60211 257277 683930 251140 -559050 -293342 376492 8807
14869 8807 -1171068 -1674777 -1157066 -704158 -995209 -673900 -14058 508065 503233 -236436
14859 -236436 -593928 -757108 -321429 -285128 -970636 -926402 -1186419 -574082 501768 1718845
14849 1718845 1600412 574642 -2806 -336245 -510275 157564 485643 -160867 57004
14840 57004 538624 -37082 -128668 52595 -140177 57886 577043 1012518 943167 -59978
$$ packed form
14906E7876J186527L07360n32410J11465M07983J11777K66512p50718j479983
14897c13611j003874j344156j336722k52702J074929J411212P09099Q24072P41296
14888E09543P65720P2835o86085n68131j014629j225638P47577J310307L26850
14879B38349J12695j50253j40580J97066M26653m32790q10190K65708O69834l67685
14869H807j179875n03709N17711M52908k91051L21309O59842N22123m832p39669
14859b36436l57492j63180M35679L6301o85508M4234k60017O12337J075850J217077
14849A718845j18433j025770n77448l33439j74030O67839L28079o46510K17871
14840E7004M81620n75706r1586J81263j92772J98063N19157M35475o9351j003145
$$ plain form
14830 -59978 -1425161 -1472162 -1420015 -1735270 -2357863 -2944786 -2808109 -2092115 -935474 -135035
14820 -135035 551426 1263844 1709584 1877960 1106778 672270 1459005 1613381 778222 204762
14810 204762 174590 -37524 -845686 188748 520858 784291 300367 -516357 -1302796 -1491228
14800 -1491228 -1333349 -1464760 -1144931 -364756 -619899 -1272052 -2345961 -4254133 -4625977
14791 -4625977 -3168467 -1590426 -207837 931259 742545 -30830 -718756 -1165520 -1480103
14782 -1480103 -2358062 -2795538 -2799924 -1452872 -119263 663293 871221 -74802 -629791
14773 -629791 -1221889 -1092247 -1167967 -1437769 -961808 355507 1894827 3515995 3554195
14764 3554195 2195846 934272 -331252 -651039 -903537 -916157 -636700 -611011 -1075728
$$ packed form
14830e9978j365183m7001N2147l15255o22593n86923J36677P15994J156641Q00439
14820a35035O86461P12418M45740J68376p71182m34508P86735J54376q35159n73460
14810B04762l0172k12114q08162J034434L32110K63433m83924q16724p86439j88432
14800a491228J57879j31411L19829P80175k55143o52153j073909j908172l71844
14791d625977J457510J578041J382589J139096j88714p73375o87926m46764l14583
14782a480103q77959m37476m386J347052J333609P82556K07928r46023n54989
14773f29791n92098J29642p5720k69802M75961J317315J539320J621168L8200
14764C554195j358349j261574j265524l19787k52498j2620K79457K5689m64717
$$ plain form
14755 -1075728 -1850020 -2203882 -2044486 -1727629 -1962318 -2101135 -1850999 -1499033 -449235
14746 -449235 488504 74290 -987119 -1461264 -1590015 -1648557 -1418327 -613376 442433
14737 442433 1245595 1345358 665354 831387 1286158 1294504 844984 -222984 -1150271 -1744735
14727 -1744735 -1640780 -1007620 -204330 602055 1223969 1552739 1062107 1600363 3556927
14718 3556927 4020822 3226996 2583847 2154525 1755236 818898 -104156 -663282 -1209843
14709 -1209843 -1646076 -1821789 -2481995 -2750543 -2092782 -1329692 -888504 -96764 361193
14700 361193 803833 1469777 1312112 1306512 2038375 2477781 1961270 1501097 1404381 1506506
14690 1506506 1067990 415599 719888 1073124 828512 487493 -556642 -1681385 -2144228
$$ packed form
14755a075728p74292l53862J59396L16857k34689j38817K50136L51966J049798
14746d49235R37739m14214j061409m74145j28751n8542K30230Q04951J055809
14737D42433Q03162R9763o80004J66033M54771Q346m49520j067968r27287n94464
14727a744735J03955O33160Q03290Q06385O21914L28770m90632N38256J956564
14718C556927M63895p93826o43149m29322l99289r36338r23054n59126n46561
14709a209843m36233j75713o60206k68548O57761P63090M41188P91740M57957
14700C61193M42640O65944j57665n600P31863M39406n16511m60173r6716J02125
14690A506506m38516o52391L04289L53236k44612l41019j044135j124743m62843
$$ plain form
14681 -2144228 -2079718 -1590222 -972867 -989720 -1194716 -545865 -204345 -224205 467009 1018038
14671 1018038 193150 -382430 30043 70381 -566361 -1013061 -727075 -665650 -1404950 -2366832
14661 -2366832 -2323749 -551757 409248 -67182 156051 -43647 36176 64523 -98409 539941
14651 539941 910536 781165 1029088 1584236 1183190 298222 309146 756479 790892 460399
14641 460399 -34070 356845 816511 908013 1030848 867156 97577 -851121 -1629989 -1232750
14631 -1232750 -50070 39763 -620678 -1297637 -715538 -318260 300294 214740 -1197148
14622 -1197148 -1662233 -1569563 -1496404 -1727117 -1694426 -1472241 -1082367 -952166 -793733 -977435
14612 -977435 -1483484 -1873867 -1081425 554496 1711039 1715887 903378 683889 926788 1816525
$$ packed form
14681b144228O4510M89496O17355j6853k04996O48851L41520j9860O91214N51029
14671A018038q24888n75580M12473M0338o36742m46700K85986O1425p39300r61882
14661b366832M3083J771992R61005m76430K23233j99698P9823K8347j62932O38350
14651E39941L70595j29371K47923N55148m01046q84968J0924M47333L4413l30493
14641D60399m94469L90915M59666R1502J22835j63692p69579r48698p78868L97239
14631a232750J182680Q9833o60441o76959N82099L97278O18554q5554j411888
14622a197148m65085R2670P3159k30713L2691K22185L89874J30201J58433j83702
14612i77435n06049l90383P92442J635921J156543M848q12509k19489K42899Q89737
$$ plain form
14602 1816525 2300768 1963919 1386570 1458383 1706951 1485058 430680 -763415 -1455289
14593 -1455289 -1602881 -1704428 -1974337 -1504890 -1198706 -2003237 -2642971 -2868549 -2892830 -2478082
14583 -2478082 -2072907 -1795546 -684947 527346 606567 352193 -413627 -793563 -1057294
14574 -1057294 -2193663 -2189074 -1784632 -1534998 -1263091 -442617 235781 1252091 2041810
14565 2041810 862620 -797602 -1385649 -1128147 -347967 -95698 -1233491 -2273363 -2295062
14556 -2295062 -1973613 -1242448 -671319 233566 1266297 1056306 317819 -890779 -1557011
14547 -1557011 -1395315 -1107287 -1076531 -623772 416903 63661 -1727300 -2500975 -1922725
14538 -1922725 -1573717 -1472395 -1573513 -1565447 -818162 -274265 327658 235939 -416176 -1340204
$$ packed form
14602A816525M84243l36849n77349P1813K48568k21893j054378j194095o91874
14593a455289j47592j01547k69909M69447L06184q04531o39734k25578k4281M14748
14583b478082M05175K77361J110599J212293P9221k54374p65820l79936k63731
14574a057294j136369M589M04442K49634K71907Q20474O78398J016310P89719
14565B041810j179190j660222n88047K57502P80180K52269j137793j039872k1699
14556b295062L21449P31165N71129R04885J032731k09991p38487j208598o66232
14547a557011J61696K88028L0756M52759J040675l53242j790961p73675N78250
14538a922725L49008J01322j01118Q066P47285N43897O01923r1719o52115r24028
$$ plain form
14528 -1340204 -1409686 -2027693 -2319117 -1485858 -347313 1012109 2486258 3697483 3708454
14519 3708454 2676929 1569421 1249662 24661 -742798 -335036 249572 328052 417886
14510 417886 507736 965913 1328865 969887 518154 -228237 -421870 -1010184 -1941452 -2239113
14500 -2239113 -2430724 -2579460 -2199715 -2459741 -2681685 -1477985 650561 1502907 1411608
14491 1411608 1318231 865334 1281164 1348347 132808 -996479 -1687482 -1379306 -685798
14482 -685798 -418115 -1380390 -2285127 -1282992 -700374 -434542 308326 1286975 2187092
14473 2187092 2168449 2123085 2322284 1422877 439078 248945 -739564 -1962780 -1656710 -1373764
14463 -1373764 -798558 -337006 -775358 -972035 -542783 -311168 713706 1558081 1486771
$$ packed form
14528a340204o9482o18007k91424Q33259J138545J359422J474149J211225J0971
14519C708454j031525j107508l19759j225001p67459M07762N84608P8480Q9834
14510D17886Q9850M58177L62952l58978m51733p46391j93633n88314r31268k97661
14500b239113j91611j48736L79745k60026k21944J203700K128546Q52346r1299
14491A411608r3377m52897M15830O7183j215539j129287o91003L08176O93508
14482f85798K67683r62275r04737J002135N82618K65832P42868R78649R00117
14473B187092j8643m5364J99199q99407r83799j90133r88509j223216L06070K82946
14463a373764N75206M61552m38352j96677M29252K31615J024874Q44375p1310
$$ plain form
14454 1486771 877795 -561894 -424988 904300 1296427 1480556 1076832 -557933 -985900
14445 -985900 -249012 782806 1158212 709835 395765 -110397 -140422 -38385 -954463 -1464542
14435 -1464542 -1567827 -2036576 -2807887 -3800641 -3935244 -2756382 -1542265 -1284495 -353395
14426 -353395 237042 490166 1064525 659641 272375 483012 918949 -192074 -1347606
14417 -1347606 -703735 448947 1058183 1913242 2387045 2172753 2302659 2202345 1099091
14408 1099091 -620152 -668276 257908 -304233 -508275 659844 809346 31104 -531807
14399 -531807 -175831 -392296 -861168 -1544902 -2579816 -2903290 -2503831 -1989919 -807272
14390 -807272 1044338 1934227 1002479 -230572 -1317094 -2029417 -1930721 -1467833 -439458
$$ packed form
14454A486771o08976j439689J36906J329288L92127J84129m03724j634765m27967
14445i85900P36888J031818L75406m48377l14070n06162l0025J02037r16078n10079
14435a464542j03285m68749p71311r92754j34603J178862J214117K57770R31100
14426c53395N90437K53124N74359m04884l87266K10637M35937j111023j155532
14417a347606O43871J152682O09236Q55059M73803k14292J29906j00314j103254
14408A099091j719243m8124R26184n62141k04042J168119J49502p78242n62911
14399e31807L55976k16465m68872o83734j034914l23474L99459N13912J182647
14390h07272J851610Q89889r31748j233051j086522p12323R8696M62888J028375
$$ plain form
14381 -439458 -46663 1166567 2246653 2413184 1640726 1178730 1664395 1276470 614632
14372 614632 446462 442155 371571 17024 -400555 -1035542 -1847641 -1351992 -394575 -569806
14362 -569806 -1303539 -809204 526196 1318140 2110762 2106457 1989679 2660988 2747698 1754007
14352 1754007 1405952 624330 -692390 -1414942 -1291427 -766207 11430 -205958 -537778
14343 -537778 -219519 -539219 -1027163 -919858 -393738 917891 1347776 594949 148985
14334 148985 959030 638945 -1042877 -2196301 -2453494 -1704254 -660089 392096 321722
14325 321722 -310897 81037 619685 878141 1225078 487048 371468 1558269 1443272
14316 1443272 241320 -760816 -796171 299354 1199568 1295419 865216 389289 390383 1498856
$$ packed form
14381d39458L92795J213230J080086J66531p72458m61996M85665l87925o61838
14372F14632j68170m307p0584l54547m17579o34987q12099M95649R57417j75231
14362e69806p33733M94335J335400P91944P92622m305j16778O71309Q6710r93691
14352A754007l48055p81622j316720p22552J23515N25220P77637k17388l31820
14343e37778L18259l19700m87944J07305N26120J311629M29885p52827m45964
14334A48985Q10045l20085j681822j153424k57193P49240J044165J052185p0374
14325C21722o32619L91934N38648K58456L46937p38030j15580J186801j14997
14316A443272j201952j002136l5355J095525R00214R5851m30203m75927J094J108473
$$ plain form
14306 1498856 2045193 1340374 1822879 2609405 2609130 2272139 1468296 137616 -331350 38361
14296 38361 911326 1263348 1377119 584221 -599078 -1494701 -2321383 -3151987 -2360066 -383037
14286 -383037 447496 1529085 1667952 1760475 2346307 3151571 3635268 3045644 1883260
14277 1883260 1531078 967046 319212 379941 798278 947860 875092 1415579 1099397 -720101
14267 -720101 -1752199 -1800526 -1807750 -1437073 -712405 -28773 -219678 -247326 -318067 -312671 154611
14256 154611 -462942 -106641 741653 1326156 1454251 958660 342671 -569262 -1439521 -1678832
14246 -1678832 -1462481 -1965458 -2739974 -3228644 -3023821 -2150765 -1694909 -1497997 -1206207
14237 -1206207 -968389 -1014236 -745151 -485783 -1032723 -1203393 -1000049 -1331791 -1560265 -2523334
$$ packed form
14306A498856N46337p04819M82505P86526k75l36991q03843j330680m68966L69711
14296C8361Q72965L52022J13771p92898j183299q95623q26682q30604P91921J977029
14286c83037Q30533J081589J38867R2523N85832Q05264M83697n89624j162384
14277A883260l52182n64032o47834O0729M18337J49582p2768N40487l16182j819498
14267g20101j032098m8327p224L70677P24668O83632j90905k7648p0741N396M67282
14256A54611o17553L56301Q48294N84503J28095m95591o15989r11933q70259k39311
14246a678832K16351n02977p74516m88670K04823Q73056M55856J96912K91790
14237a206207K37818m5847K69085K59368n46940j70670K03344l31742k28474r63069
$$ plain form
14227 -2523334 -2793280 -2360755 -2129482 -2126228 -2423938 -2098893 -1382015 511765 1408747 1280063
14217 1280063 241574 103981 1242503 1704023 1341631 483585 68744 128238 101340
14208 101340 486898 1501895 2157724 1942205 1354066 615583 -518021 -2091991 -3262818
14199 -3262818 -3115712 -1952657 -1073516 149267 591909 -246863 -334949 -1067153 -2013932
14190 -2013932 -1661556 -11311 555404 584328 1660249 2283679 1376263 -437890 -1825805
14181 -1825805 -3137879 -3980565 -3456685 -2391700 -1649289 -1175944 -481148 -418461 -925588
14172 -925588 -2515108 -3763562 -3376369 -2079953 -555790 321102 -263650 -1089914 -1935407
14163 -1935407 -1682104 -48541 1393257 670330 -318280 -295924 89226 71728 501367
$$ packed form
14227b523334k69946M32525K31273L254k97710L25045P16878J893780Q96982j28684
14217A280063j038489j37593J138522M61520l62392q58046m14841N9494k6898
14208A01340L85558J014997O55829k15519n88139p38483j133604j573970j170827
14199c262818J47106J163055Q79141J222783M42642q38772q8086p32204r46779
14190b013932L52376J650245N66715K8924J075921O23430r07416j814153j387915
14181a825805j312074q42686N23880J064985P42411M73345O94796O2687n07127
14172i25588j589520j248454L87193J296416J524163Q76892n84752q26264q45493
14163a935407K53303J633563J441798p22927r88610K2356L85150j7498M29639
$$ plain form
14154 501367 1651921 1742762 542805 -1069441 -1968219 -694074 1218709 2334984 2411047
14145 2411047 1336234 434214 -154773 -621670 -566784 -209170 194773 -166324 -725630
14136 -725630 -1872907 -2753524 -2761860 -1748632 73399 1813602 3242465 3003340 1479871
14127 1479871 32056 -60490 748030 824832 460053 321620 98425 -515043 -1334319 -2517751
14117 -2517751 -2967798 -1989750 -706497 -806865 -554974 258562 648116 218679 -646555
14108 -646555 -821707 -1100312 -1293237 -654801 470881 822676 303878 -375997 -48656
14099 -48656 583849 254314 -798611 -693094 -669355 -1411367 -1618753 -1041095 238655 840026
14089 840026 517142 167850 446421 1153439 642581 -111176 94766 328389 -141197 -1071694
$$ packed form
14154E01367J150554R0841j199957j612246q98778J274145J912783J116275P6063
14145B411047j074813r02020n88987m66897N4886L57614M03943l61097n59306
14136g25630j147277q80617q336J013228J822031J740203J428863k39125j523469
14127A479871j447815r2546Q08520P6802l64779j38433k23195o13468q19276j183432
14117b517751m50047R78048J283253j00368K51891Q13536L89554m29437q65234
14108f46555j75152k78605j92925O38436J125682L51795n18798o79875L27341
14099d8656O32505l29535j052925J05517K3739p42012k07386N77658J279750O01371
14089H40026l22884l49292K78571P07018n10858p53757K05942K33623m69586r30497
$$ plain form
14079 -1071694 -1740513 -1577346 -1776028 -2925150 -3208178 -2878090 -1796765 -99264 1730100
14070 1730100 2308711 1243822 218632 -21795 233911 566908 1270466 1400218 1137702
14061 1137702 939214 377066 -288067 -412044 723783 415798 -1133870 -1258617 -1420587
14052 -1420587 -1762604 -1991797 -1254162 -659906 -574616 138899 1081107 2185612 2387790
14043 2387790 1752297 1055698 -26511 -54057 -453494 -290266 324242 872929 1209788
14034 1209788 630966 -243795 -333130 -725543 -1462515 -2127961 -2453549 -2543255 -975779 667760
14024 667760 1075545 316445 -869154 -1259671 -896354 -125832 869816 1238224 740500
14015 740500 753682 611031 84474 -775495 -1950691 -2413460 -2334635 -1798486 -1426783 -724749
$$ packed form
14079a071694o68819J63167j98682j149122k83028L30088J081325J697501J829364
14070A730100N78611j064889j025190k40427K55706L32997P03558J29752k62516
14061A137702j98488n62148o65133j23977J135827l07985j549668j24747j61970
14052a420587l42017k29193P37635N94256Q5290P13515R42208J104505K02178
14043B387790o35493o96599j082209k7546l99437J63228O14508N48687L36859
14034A209788n78822q74761q9335l92413p36972o65446l25588q9706J567476J643539
14024F67760M07785p59100j185599l90517L63317P70522R95648L68408m97724
14015G40500J3182j42651n26557q59969j175196m62769P8825N36149L71703P02034
$$ plain form
14005 -724749 767473 671176 -863610 -1536587 -1559251 -625031 171604 -144401 907555
13996 907555 2345700 2751653 2244913 45369 -1600280 -1722992 -1419675 -1329543 -2606162
13987 -2606162 -3068581 -3013338 -2830224 -2657670 -2374802 -1838778 -1740575 -2516723 -2763729 -2034947
13977 -2034947 -1039714 -525544 -958930 -674223 14158 -966213 -2320036 -3077151 -2652655
13968 -2652655 -2966096 -3834384 -3170363 -3132469 -3612582 -3484337 -2565088 -994011 108372
13959 108372 290234 151774 -351723 -579954 436586 1128357 1656496 2378067 2198637
13950 2198637 1005218 581004 1507090 2036968 659272 -491619 -371222 341412 620304
13941 620304 326105 301670 498749 1603485 1379991 -562499 -2243057 -1445242 1068663
$$ packed form
14005g24749J492222r6297j534786o72977k2664R34220P96635l16005J051956
13996I07555J438145M05953n06740k199544j645649j22712L03317R0132j276619
13987b606162m62419N5243J83114J72554K82868N36024R8203p76148k47006P28782
13977b034947R95233N14170m33386K84707O88381r80371j353823p57115M24496
13968b652655l13441q68288O64021L7894m80113J28245R19249J571077J102383
13959A08372J81862j38460n03497k28231J016540O91771N28139P21571j79430
13950B198637j193419m24214R26086N29878j377696j150891J20397P12634K78892
13941F20304k94199k4435J97079J104736k23494j942490j680558P97815K513905
$$ plain form
13932 1068663 2172101 2351386 2418236 2067246 1933018 1793921 1394359 629602 -316725
13923 -316725 -196329 701852 704695 807657 685646 676664 473550 232619 715657 1631651
13913 1631651 2012091 857781 -237874 -383461 -650810 -529317 -331940 -212906 56491
13904 56491 554204 419852 -283392 -1103509 -2064202 -1957073 -1497119 -1490796 -998995 1093101
13894 1093101 1933941 1767287 1796945 388594 -410324 -266724 -247879 724449 1136348 262834
13884 262834 -382016 -731914 -904644 -1256939 -1571662 -328869 1484300 2349337 2520486
13875 2520486 1595259 -12174 -909433 185008 997660 768058 506602 718263 1223930
13866 1223930 941108 834035 317165 -462575 -729341 -650901 -776674 -1209401 -2173886 -1822105
$$ packed form
13932A068663J103438J79285O6850l50990j34228j39097l99562p64757r46327
13923c16725J20396Q98181K843J02962j22011q982k03114k40931M83038R15994
13913A631651L80440j154310j095655j45587k67349J21493J97377J19034K69397
13904E6491M97713j34352p03244q20117r60693J07129M59954O323M91801K092096
13894A093101Q40840j66654K9658j408351p98918J43600J8845R72328M11899q73514
13884B62834o44850l49898j72730l52295l14723J242793J813169Q65037J71149
13875B520486r25227j607433q97259J094441Q12652k29602k61456K11661N05667
13866A223930k82822j07073n16870p79740k66766P8440j25773m32727r64485L51781
$$ plain form
13856 -1822105 -576670 -52127 11595 490870 337662 -311485 152827 140134 -1083408
13847 -1083408 -1308584 -65976 652646 523851 -181752 -676249 -167046 1632685 2354835
13838 2354835 1803876 1127738 1226711 999214 1070289 1187013 281118 -932295 -1287552 -1544087
13828 -1544087 -1622218 -1688721 -2480311 -3070124 -3074914 -2480896 -2080969 -1557711 -896224 -779996
13818 -779996 -1569516 -1624817 -2233637 -2755341 -2733574 -2203452 -1331155 -773307 -367888 -89680
13808 -89680 -296753 -550713 -1002430 -522770 756631 1389945 1785374 1775230 782449 -453698
13798 -453698 -1306478 -1168129 -243615 -18582 120105 -116158 -1693734 -2667627 -2275403
13789 -2275403 -1098060 -208895 -530081 -1737256 -2353527 -2121934 -1712366 -1962744 -2841741
$$ packed form
13856a822105J245435N24543O3722M79275j53208o49147M64312j2693j223542
13847a083408k25176J242608P18622j28795p05603m94497N09203J799731P22150
13838B354835n50959o76138R8973k27497P1075J16724r05895j213413l55257k56535
13828a544087p8131o6503p91590n89813m790N94018L99927N23258O61487J16228
13818g79996p89520n5301o08820n21704K1767N30122Q72297N57848M05419K78208
13808h9680k07073k53960m51717M79660J279401O33314L95429j0144r92781j236147
13798d53698q52780J38349R24514K25033J38687k36263j577576r73893L92224
13789b275403J177343Q89165l21186j207175o16271K31593M09568k50378q78997
$$ plain form
13780 -2841741 -2865988 -1667678 -391108 670043 830150 1636880 2051019 2028833 1248441
13771 1248441 569727 -379852 -799997 -977762 -937545 -620152 -517307 334800 546321 473090
13761 473090 -174059 -639960 -1363833 -1444278 -1703198 -2426094 -2173159 -2226172 -2093616 -1786716
13751 -1786716 -1551476 -929145 -882035 -923376 -1156709 -1049342 51855 458831 269150 -698156
13741 -698156 -2035454 -3214417 -3641565 -3864413 -3611289 -2098127 -1135520 -1521789 -2903989
13732 -2903989 -3181617 -2232279 -1850173 -1641616 -1714236 -2646057 -2284674 -847731 670247
13723 670247 1104406 1483173 1345604 1503740 1007416 482757 90655 -316727 -354066 -533724
13713 -533724 -835071 -327659 389388 1044121 732878 -661827 -828473 -23277 -146353
$$ packed form
13780b841741k4247J198310J276570J061151J60107Q06730M14139k2186p80392
13771A248441o78714r49579m20145j77765M0217L17393J02845Q52107K11521p3231
13761D73090o47149m65901p23873q0445k58920p22896K52935n3013J32556L06900
13751a786716K35240O22331M7110m1341k33333J07367J101197M06976j89681r67306
13741f98156j337298j178963m27148k22848K53124J513162R62607l86269j382200
13732b903989k77628R49338L82106K08557p2620r31821L61383J436943J517978
13723F70247M34159L78767j37569J58136m96324n24659l92102m07382l7339j79658
13713e33724l01347N07412P17047O54733l11243j394705j66646Q05196j23076
$$ plain form
13704 -146353 -312649 -46139 271777 -95278 -1077744 -941867 -788221 -765525 -357332 366484
13694 366484 1141735 2070230 2403927 2407187 1373146 -298334 -1020392 -982235 403889 2285358
13684 2285358 2517592 1975568 1233784 934158 868565 -50983 18859 239407 521421 -68703
13674 -68703 -1359565 -2001141 -2327236 -2302736 -2291920 -2188240 -1549042 -418043 455488 681227
13664 681227 153817 -314920 -388516 -548271 -1050178 -1844755 -2350523 -1949379 -1586789 -1135098
13654 -1135098 -990659 -1457482 -1515660 -1479293 -909576 -1145737 -1682404 -2496500 -3510377 -3849248
13644 -3849248 -3152670 -2088080 -957196 125102 466814 162271 -1107400 -2204700 -1016806
13635 -1016806 201339 189299 -226387 -559281 1226123 2518447 2528856 2623103 2704524 1373451
$$ packed form
13704a46353j66296K66510L17916l67055r82466J35877J53646K2696M08193P23816
13694C66484P75251R28495L33697L260j034041j671480p22058L8157J386124J881469
13684B285358K32234n42024p41784k99626o5593r19548O9842K20548K82014n90124
13674f8703j290862o41576l26095K4500J0816J03680O39198J130999Q73531K25739
13664F81227n27410m68737p3596j59755n01907p94577n05768M01144L62590M51691
13654a135098J44439m66823n8178L6367N69717k36161n36667q14096j013877l38871
13644c849248O96578J064590J130884J082298L41712l04543j269671j097300J187894
13635a016806J218145j2040m15686l32894J785404J292324J0409R4247Q1421j331073
$$ plain form
13625 1373451 -594124 -1839314 -2029713 -2804520 -3571315 -2790306 -1051600 444243 728344
13616 728344 167899 -194716 -462228 -1354237 -2081546 -1546390 -600785 -47076 372554 938415
13606 938415 1572081 1337330 412754 327016 400541 936967 2056626 2078949 1820756 1538845
13596 1538845 681664 207618 318918 481562 1013336 1167447 811728 -126475 -765311
13587 -765311 -1327192 -2386506 -2222213 -674608 -212735 -590019 -952494 -735516 -577668
13578 -577668 -1365106 -1888343 -1263381 -225328 376553 397721 205469 215184 561271 1821164
13568 1821164 2135935 2251243 3063645 2611760 2461139 2380095 1419004 1130261 286913 -1054543
13558 -1054543 -1709140 -2432731 -3137052 -2508843 -1570026 -810742 -608261 -931368 -582838
$$ packed form
13625A373451j967575j245190j90399p74807p66795P81009J738706J495843K84101
13616G28344n60445l62615k67512q92009p27309N35156R45605N53709M19630N65861
13606I38415O33666k34751r24576q5738P3525N36426J119659K2323k58193k81911
13596A538845q57181m74046J11300J62644N31774J54111l55719r38203o38836
13587g65311n61881j059314J64293J547605M61873l77284l62475K16978J57848
13578e77668p87438n23237O24962J038053O01881K1168j92252R715L46087J259893
13568A821164L14771J15308Q12402m51885j50621q1044r61091k88743q43348j341456
13558a054543o54597p23591p04321O28209R38817P59284K02481l23107L48530
$$ plain form
13549 -582838 -1088087 -1635287 -1828848 -1770914 -931118 1039026 1971471 1674102 1317404 1015658
13539 1015658 434495 -640585 -1790582 -1481668 -641881 -535494 -415253 40655 939250
13530 939250 1715798 1973432 1148616 -89795 -651523 -637851 -716463 -681288 -1431706 -1267362
13520 -1267362 -898979 -696031 -989958 -894840 -329251 -149829 549501 707647 954048 947616
13510 947616 -162569 -796881 -1031731 -427292 -397223 -751419 -93619 330145 -692966
13501 -692966 -1989019 -1914509 -1414490 -569443 462677 -585353 -1449427 -820519 -313946
13492 -313946 -631794 -1007841 -1432943 -1823176 -1989782 -1958745 -1457748 -1956095 -1414980 -117070
13482 -117070 366179 205130 298193 342854 699059 560560 -58221 -749171 -1225718 -1111842
$$ packed form
13549e82838n05249n47200j93561N7934Q39796J970144R32445k97369l56698l01746
13539A015658n81163j075080j149997L08914Q39787J06387J20241M55908Q98595
13530I39250P76548K57634q24816j238411n61728J3672p8612L5175p50418J64344
13520a267362L68383K02948k93927R5118N65589J79422O99330J58146K46401o432
13510I47616j110185o34312k34850O04439L0069l54196O57800M23764j023111
13501f92966j296053P4510N00019Q45047J032120j048030q64074O28908N06573
13492c13946l17848l76047m25102l90233j66606L1037N00997m98347N41115J297910
13482a17070M83249j61049R3063M4661L56205j38499o18781o90950m76547J13876
$$ plain form
13472 -1111842 -774940 -234530 24411 -61239 -2256 151897 310886 258549 -115728 -241963
13462 -241963 -570042 -675292 -1086634 -465865 -123488 -181285 849687 1018318 116355 620702
13452 620702 1446321 1542896 1049353 391284 43442 -257470 -335442 -19137 1183071 1858275
13442 1858275 1404899 719010 -396697 -745057 -999776 -1051687 -627031 291150 654138
13433 654138 795629 1216051 803882 548577 -241533 -1108383 -911986 -825261 -706792 -569063
13423 -569063 -526769 -697826 -304376 631415 1269959 877684 -404140 -1228059 -221556
13414 -221556 530236 206633 -529053 -897039 -740482 -515686 -129692 984691 2341229
13405 2341229 3926830 4299795 3756733 3574288 3522505 2198001 696820 53429 -162807
$$ packed form
13472a111842L36902N40410K58941q5650N8983J54153J58989n2337l74277j26235
13462b41963l28079j05250m11342O20769L42377n7797J030972J68631r01963N04347
13452F20702Q25619R6575m93543o58069l47842l00912p7972L16305J202208O75204
13442A858275m53376o85889j115707l48360k54719n1911M24656R18181L62988
13433F54138J41491M20422m12169k55305p90110q66850J96397Q6725J18469J37729
13423e69063M2294j71057L93450R35791O38544l92275j281824q23919J006503
13414b21556P51792l23603p35686l67986J56557K24796L85994J114383J356538
13405B341229J585601L72965n43062j82445n1783j324504j501181o43391k16236
$$ plain form
13396 -162807 95532 -152470 -953447 -882699 -519987 -1047078 -937880 65420 279205 -454460
13386 -454460 -799741 -1263422 -1636450 -939616 -365406 -850663 -101390 316114 41983 20515
13376 20515 61691 432939 1140277 1659484 1532155 1160394 1148847 689252 454597 -219081
13366 -219081 -929753 -170838 1615078 1322087 224515 385873 36488 -146813 13015
13357 13015 337706 -164902 -1403520 -1269965 360874 714777 414746 -226002 -1977817
13348 -1977817 -3497969 -3840337 -2874684 -1794166 -1870467 -2048893 -2075450 -2399327 -1715782
13339 -1715782 -1528293 -1501836 -1031023 205483 21649 -279369 378594 300681 177536 758368
13329 758368 1601746 1632151 425376 -108134 285455 736208 -201265 -944290 -1397362 -1638595
$$ packed form
13396a62807K58339k48002q00977P0748L62712n27091J09198J003300K13785p33665
13386d54460l45281m63681l73028O96834N74210m85257P49273M17504k74131k1468
13376B0515M1176L71248P07338N19207j27329l71761j1547m59595k34655o73678
13366b19081p10672P58915J785916k92991j097572J61358l49385j83301J59828
13357A3015L24691n02608j238618J33555J630839L53903l00031o40748j751815
13348a977817j520152l42368R65653J080518p6301j78426k6557l23877O83545
13339a715782J87489K6457M70813J236506j83834l01018O57963p7913j23145N80832
13329G58368Q43378L0405j206775n33510L93589M50753r37473p43025m53072k41233
$$ plain form
13319 -1638595 -1114092 -582974 -146411 -326378 -1374733 -1152668 -425700 -423405 -654410 -523211
13309 -523211 -982101 -1136982 -619024 -901055 -1878558 -2135202 -781526 389119 748575
13300 748575 976477 1105332 1135082 1455378 1789345 2772587 3828032 3389271 3296840 2709496
13290 2709496 1597217 1389205 1622023 937203 1158398 2311142 3933270 4811124 4007081
13281 4007081 3065630 2302689 1881601 2165232 2303746 2203301 2613232 2687665 2138370 1677797
13271 1677797 754262 36986 22377 249189 524921 206327 -1467961 -2160561 -789297
13262 -789297 135373 -206853 -134165 687343 1748521 1688518 1297977 1667718 2468705 2018436
13252 2018436 778061 -694146 -2154371 -2135617 -1745847 -762605 -166257 -250443 -808130
$$ packed form
13319a638595N24503N31118M36563j79967j048355K22065P26968K295k31005J31199
13309e23211m58890j54881N17958k82031r77503k56644J353676J170645L59456
13300G48575K27902J28855K9750L20296L33967R83242J055445m38761r2431n87344
13290B709496j112279k08012K32818o84820K21195J152744J622128Q77854q04043
13281D007081r41451p62941m21088K83631J38514j00445M09931P4433n49295m60573
13271A677797r23535p17276j4609K26812K75732l18594j674288o92600J371264
13262g89297R24670l42226P2688Q21508J061178o0003l90541L69741Q00987m50269
13252B018436j240375j472207j460225J8754L89770R83242N96348q4186n57687
$$ plain form
13243 -808130 -131828 773098 861522 845401 282551 12370 770077 1250471 588303 -79972
13233 -79972 270373 863937 715336 -39657 -1275155 -1807429 -391070 63771 -724636
13224 -724636 -551801 -305399 -388795 135786 720551 313564 -341249 -819342 -425975 1196249
13214 1196249 1991595 2229397 2554695 2212380 1638818 1674172 1757824 1865108 1411599 374804
13204 374804 36587 687499 484524 294166 268556 -432289 -1414529 -1591162 -692428 -926656
13194 -926656 -1750636 -1004604 152758 371407 -396087 -798842 -813518 -720112 -1608922 -2870296
13184 -2870296 -3506644 -4265197 -4339166 -3352698 -1657974 -314816 -95003 48132 185940
13175 185940 -676262 -2311739 -2365774 -1560591 -431028 92186 -207111 -537696 -46843
$$ packed form
13243h08130O76302R04926Q8424j6121n62850k70181P57707M80394o62168o68275
13233g9972L50345N93564j48601p54993j235498n32274J416359M54841p88407
13224g24636J72835K46402q3396N24581N84765m06987o54813m78093L93367J622224
13214A196249P95346K37802L25298l42315n73562L5354Q3652J07284m53509j036795
13204C74804l38217O50912k02975j90358k5610p00845r82240j76633Q98734k34228
13194i26656q23980P46032J157362K18649p67494m02755j4676R3406q88810j261374
13184b870296o36348p58553p3969R86468J694724J343158K19813J43135J37808
13175A85940q62202j635477n4035Q05183J129563N23214k99297l30585M90853
$$ plain form
13166 -46843 1736940 2957225 2638582 1693486 1062615 303894 -456268 -1054754 -2211578
13157 -2211578 -3246033 -3018444 -2370607 -2195470 -1090415 742328 1193084 915835 790604
13148 790604 -50700 -534600 -368587 -341104 -190719 789528 1953619 2211134 1169190
13139 1169190 -42864 -846537 -1599770 -856437 154594 -16791 -566472 -1898914 -2294460
13130 -2294460 -1718934 -950833 -68779 1079062 1717625 2023077 2103542 1344543 1650259
13121 1650259 2655152 2782596 2632495 1538132 355210 -306902 -213569 -122081 978440
13112 978440 1901216 2359388 2768491 2199619 1573315 1518913 1807090 1857159 401901 33082
13102 33082 202514 -462999 -488515 -449818 -6042 1294047 2635900 3158393 2506007 2246943
$$ packed form
13166d6843J783783J220285l18643r45096o30871p58721p60162n98486j156824
13157b211578j034455K27589O47837J75137J105055J832743M50756k77249j25231
13148G90604q41304m83900J66013K7483J50385R80247J164091K57515j041944
13139A169190j212054q03673p53233P43333J011031j71385n49681j332442l95546
13130b294460N75526P68101Q82054J147841O38563L05452Q0465p58999L05716
13121A650259J004893J27444j50101j094363j182922o62112R3333R1488J100521
13112I78440R22776M58172M09103n68872o26304n4402K88177N0069j455258l68819
13102C3082J69432o65513k5516L8697M43776J300089J341853N22493o52386k59064
$$ plain form
13092 2246943 3257881 3918569 3215281 1786138 1568133 1387427 783636 1039441 1635772
13083 1635772 2567309 2749831 1320843 409237 133495 401461 1474776 1653709 409300
13074 409300 -1298173 -1926502 -917411 688284 1457641 1430292 2152906 3114729 2614738
13065 2614738 1865748 1591835 734051 155246 -175937 488853 1984018 2087306 981254
13056 981254 -442427 -1356801 -1697546 -1100876 -720691 -1302315 -961507 -541300 117113
13047 117113 1066767 2544052 3406450 3565555 3597420 3006989 2756406 2899713 2608947 2393919
13037 2393919 2385829 2435459 2540844 2646896 2559620 2798120 2361026 2282502 2611247 3167789
13027 3167789 3940630 5017372 4627479 4068222 4468388 4622398 4075449 3902379 4440654
$$ packed form
13092B246943J010938O60688p03288j429143k18005j80706o03791K55805N96331
13083A635772R31537J82522j428988r11606k75742K67966J073315J78933j244409
13074D09300j707473o28329J009091J605695P69357k7349P22614R61823m99991
13065B614738p48990k73913q57784n78805l31183O64790J495165J03288j106052
13056I81254j423681r14374l40745N96670L80185n81624L40808M20207O58413
13047A17113R49654J477285Q62398J59105L1865n90431k50583J43307k90766k15028
13037B393919q090M9630J05385J06052q7276K38500m37094p8524L28745N56542
13027C167789P72841J076742l89893n59257M00166J54010n46949j73070N38275
$$ plain form
13018 4440654 4550991 3810518 3255808 2586012 2577863 3641221 4639363 5851376 6727261
13009 6727261 7357505 7755079 6606616 5171899 4856221 6607516 7844617 7724661 7500139
13000 7500139 7350320 7379973 7428968 8960055 10290579 11591255 13503469 14628698 15746320
12991 15746320 18153378 20691701 22795729 24862833 27975548 31966718 37453237 43298769
12983 43298769 50036350 59430556 70631874 84525748 102704848 127774907 160108747
12976 160108747 198988677 237848179 260341492 252754595 220699786 181354135 147028163
12969 147028163 119975626 98488387 81726726 69003454 58518915 49852851 43483703
12962 43483703 38736437 34558727 31920907 29669199 26847211 23299357 20770093 18874017
$$ packed form
13018D440654J10337p40473n54710o69796q149J063358R98142J212013Q75885
13009F727261O30244L97574j148463j434717l15678J751295J237101j19956k24522
13000G500139j49819K9653M8995J531087J330524J300676J912214J125229J117622
12991A5746320K407058K538323K104028K067104L112715L991170N486519N845532
12983D3298769O737581R394206J1201318J3893874J8179100K5070059L2333840
12976A60108747L8879930L8859502K2493313p586897l2054809l9345651l4325972
12969A47028163k7052537k1487239j6761661j2723272j0484539q666064o369148
12962D3483703m747266m177710k637820k251708k821988l547854k529264j896076
$$ plain form
12954 18874017 17387453 15992067 14569671 14005584 13403469 12789549 11674596 11462937 11243472
12945 11243472 10310424 8833899 8747404 8378252 8523100 9401629 9446957 8349200 8239264
12936 8239264 8012227 7184382 6661103 6625105 6741458 5905320 5669070 5625953 5607217 5261581
12926 5261581 5654140 5955911 6322182 6751937 8012456 10244776 12345547 14007839 15362837
12917 15362837 17070104 19587986 22263839 22658172 20975335 18951160 18337555 17953915
12909 17953915 16906733 16912403 18801792 20870525 21098393 21676176 23585518 26182322 29535223
12900 29535223 33114038 36883018 41626460 47101534 54021058 63132723 75384561 91641897
12892 91641897 113097614 141204807 176084134 217059712 254350625 268514114 250645546
$$ packed form
12954A8874017j486564j395386j422396n64087o02115o13920j114953k11659k19465
12945A1243472r33048j476525q6495l69152J44848Q78529M5328j097757j09936
12936H239264k27037q27845n23279l5998J16353q36138k36250m3117j8736l45636
12926E261581L92559L01771L66271M29755J260519K232320K100771J662292J354998
12917A5362837J707267K517882K675853L94333j682837k024175o13605l83640
12909A7953915j047182N670J889389K068733K27868N77783J909342K596804L352901
12900B9535223L578815L768980M743442N475074O919524R111665J2251838J6257336
12892I1641897K1455717K8107193L4879327M0975578L7290913J4163489j7868568
$$ plain form
12885 250645546 212980297 173078639 139362104 112972080 92703341 77710433 66635033
12878 66635033 57998339 51158837 44914088 38940292 33927798 31214990 29573808 27281555
12870 27281555 23480431 20422884 18523031 17512649 16626382 15967264 15904906 15852860 14951137
12861 14951137 13406153 12140727 11849963 10849873 9211400 8102358 7746127 7857119
12853 7857119 7111985 5160282 3752521 3221863 3299172 4129044 4959546 5496284 5470983
12844 5470983 5214089 4784968 4313505 4077555 4461360 5595757 5851259 6266137 6480770
12835 6480770 6284530 6348880 6304539 6297926 5662053 5064213 5210815 6167824 6772862 6349928
12825 6349928 6487537 9376829 11371795 10815877 10923015 12483431 14769139 17501341 19512474
$$ packed form
12885B50645546l7665249l9901658l3716535k6390024k0268739j4992908j1075400
12878F6635033q636694o839502o244749n973796n012494k712808j641182k292253
12870B7281555l801124l057547j899853j010382q86267o59118o2358n2046r01723
12861A4951137j544984j265426k90764j000090j638473j109042l56231J10992
12853G857119p45134j951703j407761n30658P7309Q29872Q30502N36738k5301
12844E470983k56894m29121m71463k35950L83805J134397K55502M14878K14633
12835F480770j96240O4350m4341o613o35873n97840J46602R57009O05038m22934
12825F349928J37609K889292J994966n55918J07138J560416K285708K732202K011133
$$ plain form
12816 19512474 21802065 24682722 27593626 31600478 36422510 41054383 47905431 56891025
12808 56891025 67281348 79917944 95982170 117504820 146016103 182858467 223314797
12801 223314797 254032973 258652020 235676349 198563951 161448477 130111928 105503179
12794 105503179 86983176 73154963 61234048 51983574 45526768 39902266 34515766
12787 34515766 30312555 27099070 24161577 22409393 21265418 19431700 18030693 16769999
12779 16769999 14604524 12442665 10353688 8794722 7634214 7090590 7237286 7954126
12771 7954126 7737585 7825234 6535581 4996144 4902206 4973308 5794155 7459126 7766042
12762 7766042 6663891 5569279 4485942 3292190 3689189 4505880 4246957 4636935 4729893
$$ packed form
12816A9512474K289591K880657K910904M006852M822032M631873O851048Q985594
12808E6891025J0390323J2636596J6064226K1522650K8511283L6842364M0456330
12801B23314797L0718176M619047k2975671l7112398l7115474l1336549k4608749
12794A05503179j8520003j3828213j1920915r250474o456806n624502n386500
12787C4515766m203211l213485k937493j752184j143975j833718j401007j260694
12779A6769999k165475k161859k088977j558966j160508n43624J46696P16840
12771G954126k16541Q7649j289653j539437r3938P1102Q20847J664971L06916
12762G766042j102151j094612j083337j193752L96999Q16691k58923L89978R2958
$$ plain form
12753 4729893 3746284 2777901 3340340 3442555 2836138 2814497 3165751 3432339 2529831 2592250
12743 2592250 2904686 2394301 2392957 1746006 1623323 1541725 1053880 809446 77032 88061
12733 88061 1559431 1991949 1995210 1898873 760172 1032764 2027654 2198027 2026115 836525
12723 836525 -30691 831320 1674071 1499174 1236276 2537209 3259329 2928176 3169225
12714 3169225 3478805 3893138 3840989 2819460 1767089 1212113 1832625 2949396 3108311
12705 3108311 2907905 3066847 2972556 2632559 2115965 1786444 1976244 1582333 1091320 951410
12695 951410 1278755 2130883 2385368 1874270 547495 1139764 2090294 2584995 2699038
12686 2699038 1361421 1254255 1858280 1973097 1278548 686491 819909 1006895 254981
$$ packed form
12753D729893r83609r68383N62439J02215o06417k1641L51254K66588r02508O2419
12743B592250L12436n10385j344o46951j22683q1598m87845k44434p32414J1029
12733H8061J471370M32518L261r6337j138701K72592R94890J70373j71912j189590
12723H36525q67216Q62011Q42751j74897k62898J300933P22120l31153K41049
12714C169225L09580M14333n2149j021529j052371n54976O20512J116771J58915
12705C108311k00406J58942r4291l39997n16594l29521J89800l93911m91013j39910
12695I51410L27345Q52128K54485n11098j326775N92269R50530M94701J14043
12686B699038j337617j07166O04025J14817o94549n92057J33418J86986p51914
$$ plain form
12677 254981 -741799 -585878 520959 1425712 2348254 2859602 3473423 3561899 2987216 3006995
12667 3006995 3085596 2714074 2149241 605866 524852 282787 -387505 -1097323 -1913153 -205514
12657 -205514 1267920 1800008 2432121 3260837 4292777 4004193 2366711 1116485 650174
12648 650174 545432 1425432 2519571 2552725 2123218 858706 -211460 226750 1420175
12639 1420175 2393130 2239499 827608 413882 1840961 3824238 3910367 3524875 3686228
12630 3686228 4473863 4227431 1683526 441512 734522 349726 -794246 -334816 879372
12621 879372 661778 210742 70749 128990 706642 1862580 1520670 635388 31044 573271
12611 573271 2441583 3187706 2668834 2656069 2094084 701155 16117 1147441 1989620
$$ packed form
12677B54981r96780J55921J106837R04753R22542N11348O13821Q8476n74683J9779
12667C006995P8601l71522n64833j543375q1014k42065o70292p09818q15830J707639
12657b05514J473434N32088O32113Q28716J031940k88584j637482j250226m66311
12648F50174j04742Q80000J094139L3154m29507j264512j070166M38210J193425
12639A420175R72955j53631j411891m13726J427079J983277Q6129l85492J61353
12630C686228P87635k46432k543905j242014K93010l84796j143972M59430J214188
12621H79372k17594m51036j39993N8241N77652J155938l41910q85282o04344N42227
12611E73271J868312P46123n18872j2765n61985j392929o85038J131324Q42179
$$ plain form
12602 1989620 2515074 2693162 2738434 2375948 1655821 1476331 1812722 1782874 708889 -168801
12592 -168801 -353355 -326893 -195723 -174051 -119436 -1039321 -1472886 -550556 201154 198917
12582 198917 -150210 -700077 -147730 202387 49148 877742 175038 -954561 -1081739
12573 -1081739 -1141311 -2030845 -2727469 -2979795 -4024201 -5273447 -5815067 -5257686 -3058675
12564 -3058675 -1233639 337441 1400764 1204329 91606 -916477 -1174995 -923995 -622896
12555 -622896 -940706 -1258631 -1702341 -1092169 -990137 -2134393 -3554980 -3938207 -3548037
12546 -3548037 -3799984 -3622305 -3359195 -2449924 -813714 440170 1057190 2203185 3092287
12537 3092287 2966314 1493781 470497 563586 1332626 905793 -277813 620803 1796004
$$ packed form
12602A989620N25454J78088M5272l62486p20127j79490L36391k9848j073985q77690
12592a68801j84554K6462J31170K1672N4615r19885m33565R22330P51710k237
12582A98917l49127n49867N52347L50117j53239Q28594p02704j129599j27178
12573a081739n9572q89534o96624k52326j044406j249246n41620N57381K199011
12564c058675J825036J571080J063323j96435j112723j008083k58518K51000L01099
12555f22896l17810l17925m43710O10172J02032j144256j420587l83227L90170
12546c548037k51947J77679K63110R09271J636210J253884O17020J145995Q89102
12537C092287j25973j472533j023284R3089P69040m26833j183606Q98616J175201
$$ plain form
12528 1796004 824492 596078 1427120 1568319 872135 -109391 -346754 153649 689516
12519 689516 -405535 -819204 -169357 -273119 -335358 -74939 68569 -69921 316679 155436
12509 155436 -682859 -2016948 -2490121 -1728544 -998893 -413698 48407 412431 1391325
12500 1391325 2315304 2094099 926852 -31720 -566078 -537070 -759941 -520295 2916
12491 2916 859445 1200907 1884781 3206712 4110274 4037991 2338086 -445 -1792966
12482 -1792966 -3121338 -3199341 -2753634 -2034027 -416176 317992 912390 942911 857427 631608
12472 631608 -194601 -198798 720812 1745739 1388711 833568 1183650 2529222 3739552
12463 3739552 3008375 1630246 1212408 1509981 1444682 1021658 718391 1333778 1902013
$$ packed form
12528A796004r71512k28414Q31042J41199o96184r81526k37363N00403N35867
12519F89516j095051m13669O49847j03762o2239K60419J43508j38490L86600j61243
12509A55436q38295j334089m73173P61577P29651N85195M62105L64024R78894
12500A391325R23979k21205j167247r58572n34358K9008k22871K39646N23211
12491B916Q56529L41462O83874J321931R03562p2283j699905k338531j792521
12482a792966j328372p8003M45707P19607J617851P34168N94398L0521q5484k25819
12472F31608q26209m197R19610J024927l57028n55143L50082J345572J210330
12463C739552p31177j378129m17838K97573o5299m23024l03267O15387N68235
$$ plain form
12454 1902013 1576099 985996 569732 451127 567295 293906 7488 90198 209728 -659025
12444 -659025 -1287845 -2103907 -3097296 -3553819 -2616893 -1270306 -390026 156126 816556
12435 816556 1365305 1704294 1411429 825099 201399 38385 188557 61404 -722930 -1290247
12425 -1290247 -396182 302036 152858 -1871748 -3258893 -2920417 -3301838 -3033979 -1918013
12416 -1918013 -1658461 -804525 58894 333867 946003 970619 493525 286790 -64459 -48155
12406 -48155 903365 1335790 1486946 1987506 2378905 2148658 1304102 2067238 2789536 2046490
12396 2046490 360655 -619284 -597544 -750216 -558889 -111839 672133 1266242 1959069
12387 1959069 2100598 1668627 2135324 2414751 2073827 2454477 2504106 2198256 1869002 1775307
$$ packed form
12454A902013l25914n90103m16264j18605J16168k73389k86418Q2710J19530q68753
12444f59025o28820q16062r93389m56523R36926J346587Q80280N46152O60430
12435H16556N48749L38989k92865n86330o23700j63014J50172j27153p84334n67317
12425a290247Q94065O98218j49178k024606j387145L38476l81421K67859J115966
12416a918013K59552Q53936Q63419K74973O12136K4616m77094k06735l51249J6304
12406d8155R51520M32425J51156N00560L91399k30247q44556P63136P22298p43046
12396B046490j685835r79939K1740j52672J91327M47050P83972N94109O92827
12387A959069J41529m31971M66697K79427l40924L80650M9629l05850l29254r3695
$$ plain form
12377 1775307 1726466 779027 503930 1243685 2093887 2863952 3582578 2981604 1979898
12368 1979898 1190639 66609 -265329 -294505 -404891 -606512 -628488 -456005 -450029 -429653
12358 -429653 -1377612 -2185470 -2520017 -1542431 -614056 -541719 388362 1793155 3140135
12349 3140135 3564977 2775977 1763537 1329623 1156427 325275 -78212 711662 1389149
12340 1389149 2811702 3691508 3226208 3254879 3397297 3099818 2962869 2425362 1287808
12331 1287808 -190836 -650204 193548 495571 510387 196866 151247 -295240 -681621 -148442
12321 -148442 306605 -287297 -368109 279856 1501189 898635 -552113 -483161 -1007367 -2413835
12311 -2413835 -3227270 -2666838 -1589414 -747996 -482210 -111370 272729 471468 895325
$$ packed form
12377A775307m8841r47439k75097P39755Q50202P70065P18626o00974j001706
12368A979898p89259j124030l31938k9176j10386k01621k1976J72483N976K0376
12358d29653r47959q07858l34547R77586R28375P2337R30081J404793J346980
12349C140135M24842p89000j012440m33914j73196q31152m03487P89874O77487
12340A389149J422553Q79806m65300K8671J42418k97479j36949n37507j137554
12331A287808j478644m59368Q43752L02023J4816l13521m5619m46487l86381N33179
12321a48442M55047n93902q0812O47965J221333o02554j450748O8952n24206j406468
12311b413835q13435N60432J077424Q41418K65786L70840L84099J98739M23857
$$ plain form
12302 895325 275216 -253114 232143 471993 361900 157718 197392 604501 354024 -1297350
12292 -1297350 -1611403 -6554 1807575 1692438 1053953 266802 779154 1327938 1332984
12283 1332984 1469475 640016 230263 1050691 1323019 1050715 822431 457704 726940
12274 726940 950370 -445630 -2098199 -1442247 -169564 -270074 -444917 357974 886711
12265 886711 572339 770498 2007571 2545329 2115943 1941566 2145319 2326349 1585120
12256 1585120 1419577 2200586 1709694 704605 -156793 -1054549 -698343 134253 -245638
12247 -245638 -169237 203613 -756721 -2661654 -2902206 -2096258 -1294290 -558955 13690 827775
12237 827775 793885 559969 720105 407663 -209392 -998441 -2115837 -2749572 -2030050 -1618482
$$ packed form
12302H95325o20109n28330M85257K39850j10093k04182L9674M07109k50477j651374
12292a297350l14053J604849J814129j15137o38485p87151N12352N48784N046
12283A332984J36491q29459m09753Q20428K72328k72304k28284l64727K69236
12274G26940K23430j396000j652569O55952J272683j00510j74843Q02891N28737
12265H86711l14372J98159J237073N37758m29386j74377K03753J81030p41229
12256A585120j65543P81009m90892j005089q61398q97756L56206Q32596l79891
12247b45638P6401L72850r60334j904933k40552Q05948Q01968P35335N72645Q14085
12237H27775l3890k33916J60136l12442o17055p89049j117396o33735P19522M11568
$$ plain form
12227 -1618482 -1553808 -1917040 -1781728 -1583868 -1550461 -376144 423677 221493 -465787 -344927
12217 -344927 -226234 63130 104664 -757142 -1545548 -2356550 -2295532 -1311245 -930623 -1027861
12207 -1027861 -483373 260677 -210934 -248790 931605 1515968 1307597 1903364 1678601
12198 1678601 239979 -1302402 -2255067 -2894921 -3232518 -3194402 -3905618 -4416460 -3073617
12189 -3073617 -1810094 -327039 1022345 671554 -361307 -1057474 -1416413 -2600269 -3249655
12180 -3249655 -2267077 -1001967 -311486 -810661 -794700 -426320 -570790 -168062 250316
12171 250316 -371849 -820003 -449093 756572 2090914 1433164 350007 567193 847380
12162 847380 1011526 201291 -382998 -1359209 -1410511 -903317 -1161132 -1703081 -1250014 -94630
$$ packed form
12227a618482O4674l63232J35312J97860L3407J174317P99821k02184o87280J20860
12217c44927J18693K89364M1534q61806p88406q11002O1018R84287L80622r7238
12207a027861N44488P44050m71611l7856J180395N84363k08371N95767k24763
12198A678601j438622j542381r52665o39854l37597L8116p11216n10842J342843
12189c073617J263523J483055J349384l50791j032861o96167l58939j183856o49386
12180c249655R82578J265110O90481m99175J5961L68380j44470M02728M18378
12171B50316o22165m48154L70910J205665J334342o57750j083157K17186K80187
12162H47380J64146q10235n84289r76211n1302N07194k57815n41949M53067J155384
$$ plain form
12152 -94630 575153 776661 562311 -124436 -426046 -432262 -385188 -41733 -199172 -1206184
12142 -1206184 -1631464 -889361 125640 345522 306858 1180995 1804709 2086963 2647277
12133 2647277 3040458 2650855 2153529 1059191 371590 83136 -193867 -230936 181084
12124 181084 1290268 1918299 1576904 939996 136366 426119 280713 -468433 -1424280
12115 -1424280 -1233168 -562372 702319 1946113 3164704 3391609 2802822 2719379 3529299
12106 3529299 3345099 2225502 2817535 3821018 3346375 1950100 1523275 1316191 1102859
12097 1102859 1049258 646227 282174 605299 1724831 2454225 2001417 1092533 1107351 1093187
12087 1093187 1543447 2565669 2728318 1633547 642796 271606 421714 475096 468695 774177
$$ packed form
12152i4630O69783K01508k14350o86747l01610o216M7074L43455j57439j007012
12142a206184m25280P42103J015001K19882l8664Q74137O23714K82254N60314
12133B647277L93181l89603m97326j094338o87601k88454k77003l7069M12020
12124A81084J109184O28031l41395o36908q03630K89753j45406p49146r55847
12115a424280J91112O70796J264691J243794J218591K26905n88787q3443Q09920
12106C529299j84200j119597N92033J003483m74643j396275m26825k07084k13332
12097A102859n3601m03031l64053L23125J119532P29394m52808r08884J4818j4164
12087A093187M50260J022222J62649j094771r90751l71190J50108N3382o401L05482
$$ plain form
12077 774177 -232898 -1679293 -2102815 -1909826 -1069846 -743084 -1845619 -1516876 320604
12068 320604 622481 -649775 -1564230 -1685397 -1048158 -141394 224710 33333 165844
12059 165844 -234205 -129932 258296 1328491 2632653 2626459 2715259 2849149 2459114 1098016
12049 1098016 -782647 -1466917 -1383535 -1790781 -2328540 -1691681 -510594 495623 1091597
12040 1091597 1580655 1984497 808684 -39354 209363 -882360 -1499990 -556915 771593
12031 771593 288447 -74812 150664 652486 1109176 1577385 1240775 882126 620651 543934
12021 543934 527477 133979 134896 640765 1749935 1589427 1051686 234712 -429191 3853
12011 3853 712478 128030 -754268 -1410639 -1914419 -1255998 -378842 -800505 -1137956 -1237433
$$ packed form
12077G74177j007075j446395m23522J92989Q39980L26762j102535L28743J837480
12068C20604L01877j272256r14455j21167O37239R06764L66104j91377J32511
12059A65844m00049J04273L88228J070195J304162o194Q8800J33890l90035j361098
12049A098016j880663o84270Q3382m07246n37759O36859J181087J006217N95974
12040A091597M89058M03842j175813q48038K48717j091723o17630R43075J328508
12031G71593m83146l63259K25476N01822M56690M68209l36610l58649k61475p6717
12021E43934j6457l93498R17N05869J109170j60508n37741q16974o63903M33044
12011C853P08625n84448q82298o56371n03780O58421Q77156m21663l37451r9477
$$ plain form
12001 -1237433 -790520 -905937 -1578324 -1357125 487137 2292788 1982692 455650 -1322803
11992 -1322803 -2597806 -2360928 -1275497 -495272 -883352 -2350958 -3418342 -2737452 -1662711
11983 -1662711 -498008 469296 -56479 -937555 -831394 -321272 -258951 -932024 -596094
11974 -596094 -537021 -744840 -1199848 -915525 120436 883462 555350 358670 -80471 -1410215
11964 -1410215 -2098193 -1579170 -900291 -1409660 -1923160 -2701324 -2609542 -1709443 -693201
11955 -693201 -100673 -358969 -1570340 -3526702 -4326549 -2333569 -428373 -691921 -1417227
11946 -1417227 -1721667 -1286116 -1056282 -1391737 -921165 -545651 -322250 288431 1609558
11937 1609558 1830281 1916830 2240348 2145798 1204541 495800 1077369 2043364 1261561 -258886
$$ packed form
12001a237433M46913j15417o72387K21199J844262J805651l10096j527042j778453
11992a322803j275003K36878J085431P80225l88080j467606j067384O80890J074741
11983a662711J164703R67304n25775q81076J06161N10122O2321o73073L35930
11974e96094N9073k07819m55008K84323J035961P63026l28112j96680m39141j329744
11964a410215o87978N19023O78879n09369n13500p78164R1782R00099J016242
11955f93201N92528k58296j211371j956362p99847J992980J905196k63548p25306
11946a417227l04440M35551K29834l35455M70572L75514K23401O10681J321127
11937A609558K20723Q6549L23518r4550r41257p08741N81569R65995p81803j520447
$$ plain form
11927 -258886 -1317077 -2263010 -1980789 -457726 909518 660850 -515783 -875874 -424048
11918 -424048 -402147 -881889 -1440432 -1341904 -1293344 -958458 -1873863 -2722117 -2051820 -1463623
11908 -1463623 -1182025 -192889 315582 258598 536368 661899 758740 922257 1001263 815183
11898 815183 997119 1380958 562733 -478121 -1295876 -997342 -67673 452450 403427 -239322
11888 -239322 -957195 -1156485 -679125 -671076 -981401 -1477359 -2457078 -2767956 -1965402 -1263468
11878 -1263468 -860849 -767310 -995644 -505872 283530 981854 1438669 2086519 2381953 1824583
11868 1824583 2115535 2837041 2621143 2739587 2734152 1808657 906587 1211644 529312 -408261
11858 -408261 306473 1184398 1622297 2077208 2085278 1587009 430417 214907 324380 746874
$$ packed form
11927b58886j058191r45933K82221J523063J367244k48668j176633l60091M51826
11918d24048K1901m79742n58543R8528M8560L34886r15405q48254O70297N88197
11908a463623K81598R89136N08471n6984K77770J25531R6841J63517P9006j86080
11898H15183J81936L83839q18225j040854q17755K98534R29669N20123m9023o42749
11888b39322p17873j99290M77360Q049l10325m95958r79719l10878Q02554P01934
11878a263468M02619R3539k28334M89772P89402O98324M56815O47850K95434n57370
11868A824583K90952P21506k15898J18444n435r25495r02070L05057o82332r37573
11858d08261P14734Q77925M37899M54911Q070m98269j156592k15510J09473M22494
$$ plain form
11848 746874 1782437 2171815 1635405 -121489 -1415826 -1451144 -1224035 -1257291 -955023
11839 -955023 -1047574 -1359973 -1049504 -1245026 -2090359 -1573223 -662801 -8617 3777 -121133
11829 -121133 -962003 -1848338 -2358483 -2440928 -2095964 -1086571 392660 1619754 1856692
11820 1856692 1231065 618557 29630 -1034420 -1425593 -952763 -6795 541360 119861
11811 119861 895708 2405372 2546047 1953738 1592773 897498 4485 -67190 -456972 -2106227
11801 -2106227 -2670928 -1019239 131690 -103778 1406247 2324253 1510470 567925 232968
11792 232968 332815 164266 270283 1111551 1334420 1119222 1007811 1473270 846047 -338008
11782 -338008 -267828 -118471 500653 315481 64389 1292870 2263728 1808856 1146964 1512500
$$ packed form
11848G46874J035563L89378n36410j756894j294337l5318K27109l3256L02268
11839i55023r2551l12399L10469j95522q45333N17136R10422O54184J2394j24910
11829a21133q40870q86335n10145q2445L44964J009393J479231J227094K36938
11820A856692o25627o12508n88927j064050l91173M72830R45968N48155m21499
11811A19861P75847J509664J40675n92309l60965o95275q93013p1675l89782j649255
11801b106227n64701J651689J150929k35468J510025R18006q13783r42545l34957
11792B32968R9847j68549J06017Q41268K22869k15198j11411M65459o27223j184055
11782c38008P0180J49357O19124j85172k51092J228481R70858m54872o61892L65536
$$ plain form
11772 1512500 2690011 2346646 1891647 1606333 1078459 770629 574620 -441291 -1379020
11763 -1379020 -1660120 -775761 -294659 -386041 -190543 -474435 -643996 -1550479 -3555626
11754 -3555626 -4489207 -4023486 -2682061 -1644458 -1657753 -3017139 -5136159 -4272891 -2839315
11745 -2839315 -3227691 -3588896 -3418533 -2271371 -1298618 -475438 -505926 -524766 -8350 -424271
11735 -424271 -1703053 -1962480 -1494922 -680488 309945 728208 229574 -537934 -1706353
11726 -1706353 -2459443 -2261010 -2158036 -1234915 -93746 -59072 -291886 -130504 223833
11717 223833 450301 -34620 -648911 -767805 -1424754 -1561898 -1035622 -55853 1532341
11708 1532341 2042419 1909749 1842655 2738579 3437964 1832082 -409714 -2327399 -2970557
$$ packed form
11772A512500J177511l43365m54999k85314n27874l07830j96009j015911r37729
11763a379020k81100Q84359M81102r1382J95498k83892j69561r06483k005147
11754c555626r33581M65721J341425J037603j3295j359386k119020Q63268J433576
11745b839315l88376l61205J70363J147162R72753Q23180l0488j8840N16416m15921
11735d24271j278782k59427M67558Q14434R90433M18263m98634p67508j168419
11726a706353p53090J98433J02974R23121J141169L4674k32814J61382L54337
11717B23833K26468m84921o14291j18894o56949j37144N26276R79769J588194
11708A532341N10078j32670o7094Q95924O99385j605882k241796j917685o43158
$$ plain form
11699 -2970557 -2591963 -2716077 -2455470 -2979360 -2448900 -892721 -548851 -729588 -495826
11690 -495826 752810 1909328 2382887 2016342 787286 -676987 -1341750 -1395700 -1084645
11681 -1084645 -669658 -1470952 -2667877 -3495601 -3673133 -3300153 -2781712 -2357050 -2589512
11672 -2589512 -3288926 -3013765 -891097 319346 274907 63948 733747 1268870 653458
11663 653458 517978 910644 1388008 1028169 -516785 -845639 -383783 -262936 -972010
11654 -972010 -1656243 -1887203 -544567 592587 594664 1402147 2077834 2613108 2689853 2056805
11644 2056805 1006210 -57421 -948055 -1683242 -1483729 -1147343 -674712 449588 979346
11635 979346 555963 821999 1514472 1088215 1002038 231090 -363390 -595682 -205965 1663767
$$ packed form
11699b970557L78594j24114K60607n23890N30460J556179L43870j80737K33762
11690d95826J248636J156518M73559l66545j229056j464273o64763n3950L11055
11681a084645M14987q01294j196925q27724j77532L72980N18441M24662k32462
11672b589512o99414K75161K122668J210443m4439k10959O69799N35123o15412
11663F53458j35480L92666M77364l59839j544954l28854M61856J20847p09074
11654i72010o84233k30960J342636J137154K077Q07483O75687N35274P6745o33048
11644B056805j050595j063631q90634p35187J99513L36386M72631J124300N29758
11635I79346m23383K66036O92473m26257q6177p70948n94480k32292L89717J869732
$$ plain form
11625 1663767 2473191 1986640 1739676 1492717 1519399 1228447 45042 -1643637 -3069094
11616 -3069094 -2601386 -981194 -98979 539982 880665 1350715 2259111 2404595 1938433
11607 1938433 1491120 547896 -172781 -1262053 -1686201 -1428624 -915905 -1473668 -1784762
11598 -1784762 -1105803 -931898 -1411772 -1052201 -945580 -1906515 -2754265 -2750946 -2493749 -2813629
11588 -2813629 -2904564 -2275219 -1775057 -1996696 -1799881 -857404 60201 1120878 1633941
11579 1633941 971298 1289981 1348252 -534327 -2163247 -1900832 -766039 -810993 -1079095
11570 -1079095 -1247552 -1553890 -937433 -205910 446319 885219 628948 -222077 -955777
11561 -955777 -1183151 -609131 -367092 -946116 -457932 62595 -215293 -612704 -641300 -2080123
$$ packed form
11625A663767Q09424m86551k46964k46959K6682k90952j183405j688679j425457
11616c069094M67708J620192Q82215O38961L40683M70050R08396J45484m66162
11607A938433m47313r43224p20677j089272m24148K57577N12719n57763l11094
11598a784762O78959J73905m79874L59571J06621r60935q47750L319K57197l19880
11588b813629r0935O29345N00162k21639J96815R42477R17605J060677N13063
11579A633941o62643L18683N8271j882579j628920K62415J134793m4954k68102
11570a079095j68457l06338O16457P31523O52229M38900k56271q51025p33700
11561i55777k27374N74020K42039n79024M88184N20527k77888l97411k8596j438823
$$ plain form
11551 -2080123 -2178354 -1168393 -674526 67389 1247857 1801214 950985 517443 12973
11542 12973 -598461 -722239 -489729 184805 913937 1284483 811943 336921 -293386 -1788716
11532 -1788716 -2008734 -1853673 -1302144 -474400 415499 633795 -472327 -2013352 -2385595
11523 -2385595 -1907686 -2228695 -3234799 -3396889 -2780365 -2120129 -2016483 -1710036 -1192192
11514 -1192192 -998344 5812 910566 1091170 805028 631292 140980 94796 594470
11505 594470 1721099 1927034 1361327 673097 -316334 -848019 -508036 -265415 -175084 858426
11495 858426 878144 528574 747326 1104299 454616 -690141 -352232 193928 346014 992008
11485 992008 1486713 1024349 670124 948245 463426 -484658 -1076085 -1183801 -840413 -657803
$$ packed form
11551b080123r8231J009961M93867P41915J180468N53357q50229m33542n04470
11542A2973o11434j23778K32510O74534P29132L70546m72540m75022o30307j495330
11532a788716k20018J55061N51529Q27744Q89899K18296j106122j541025l72243
11523b385595M77909l21009j006104j62090O16524O60236J03646L06447N17844
11514a192192J93848J004156R04754J80604k86142j73736m90312m6184M99674
11505E94470J126629K05935n65707o88230r89431n31685L39983K42621R0331J033510
11495H58426J9718l49570K18752L56973o49683j144757L37909N46160J52086O45994
11485I92008M94705m62364l54225K78121m84819r48084n91427j07716L43388J82610
$$ plain form
11475 -657803 -1921782 -2215253 -1021920 58367 561995 190803 -131124 -1080642 -1908204
11466 -1908204 -1614774 -1118378 -896863 203823 1413957 1394476 1455341 432660 -566563
11457 -566563 -302721 1136919 1802852 2048266 1513648 745978 -38915 -295823 447781
11448 447781 296886 4263 154923 -765773 -1517154 -1177196 -1190994 -1450206 -1496398 -1634680
11438 -1634680 -2046846 -1716018 -395271 668493 1023623 1608007 1612845 308117 -1257927
11429 -1257927 -2782254 -3058277 -1887472 -1157358 -1153054 -340679 860313 1614320 1929705
11420 1929705 1389678 861314 494209 -363450 -529482 483014 1443451 988481 527739
11411 527739 -415132 -1458347 -1232527 -1162496 -788501 -679143 -1270841 -15982 1435578
$$ packed form
11475f57803j263979k93471J193333J080287N03628l71192l21927r49518q27562
11466a908204K93430M96396K21515J100686J210134j9481O0865j022681r99223
11457e66563K63842J439640O65933K45414n34618p67670p84893k56908P43604
11448D47781j50895k92623J50660r20696p51381L39958j3798k59212m6192j38282
11438a634680m12166L30828J320747J063764L55130N84384M838j304728j566044
11429a257927j524327k76023J170805P30114M304Q12375J200992P54007L15385
11420A929705n40027n28364l67105q57659j66032J012496R60437m54970m60742
11411E27739r42871j043215K25820P0031L73995J09358n91698J254859J451560
$$ plain form
11402 1435578 1619162 1491259 955014 466621 -370224 -316474 781894 1665559 1036977
11393 1036977 499234 35683 -718875 -1397207 -1391669 -1418228 -1386048 -1398254 -923155 -466400
11383 -466400 -560083 -309971 1211727 2388774 2866692 3012814 1940560 1377505 1854366
11374 1854366 2107741 1734405 1812058 1805320 600707 -615424 -768961 -452108 -805469 -893410
11364 -893410 -386332 -174280 -919847 -730305 887416 2514208 2015032 1986040 3222255
11355 3222255 3128845 2569681 1862852 1171430 422925 133005 -29229 24976 780567 949738
11345 949738 659086 158296 -415690 2763 969903 1604183 1551429 850543 1249034 1595489
11335 1595489 654357 -470065 -1317067 -1754094 -2620662 -2929834 -2702854 -2375554 -2146859
$$ packed form
11402A435578J83584j27903n36245m88393q36845N3750J098368Q83665o28582
11393A036977n37743m63551p54558o78332N538k6559L2180j2206M75099M56755
11383d66400r3683K50112J521698J177047M77918J46122j072254n63055M76861
11374A854366K53375l73336P7653o738j204613j216131j53537L16853l53361q7941
11364h93410N07078K12052p45567J89542J617721J626792m99176k8992J236215
11355C222255r3410n59164p06829o91422p48505k89920j62234N4205P55591J69171
11345I49738k90652n00790n73986M18453R67140O34280n2754p00886L98491L46455
11335A595489r41132j124422q47002m37027q66568l09172K26980L27300K28695
$$ plain form
11326 -2146859 -2986191 -3348512 -2308742 -694650 727358 1389164 999880 373301 836666
11317 836666 905116 127996 -90950 171102 159761 -200899 60046 253893 -666880 -1253117
11307 -1253117 -1387026 -745738 -438014 -518026 -457999 -477283 -1097960 -2012804 -1863633 -763948
11297 -763948 -527942 -575134 -77308 696329 789119 -303806 -1914988 -2821086 -2121654 -1172758
11287 -1172758 -382125 -275521 -697026 -318011 118964 500567 450809 274893 275905 337608
11277 337608 164778 -262729 -751032 -1825186 -2050024 -1845229 -1629961 -504957 610062
11268 610062 633860 -487545 -1083937 -883693 -677808 -580297 -482499 -290131 -343885 -880504
11258 -880504 -1950535 -2962868 -2543738 -2260010 -2625497 -3280597 -2808259 -1164941 -897710
$$ packed form
11326b146859q39332l62321J039770J614092J422008O61806l89284o26579M63365
11317H36666O8450p77120k18946K62052j1341l60660K60945J93847r20773n86237
11307a253117j33909O41288L07724q0012O0027j9284o20677r14844J49171J099685
11297g63948K36006m7192M97826P73637R2790j092925j611182r06098O99432R48896
11287a172758P90633J06604m21505L79015M36975L81603m9758j75916J012O1703
11277C37608j72830m27507m88303j074154k24838K04795K15268J125004J115019
11268F10062K3798j121405n96392K00244K05885R7511R7798J92368n3754n36619
11258h80504j070031j012333M19130K83728l65487o55100M72338J643318K67231
$$ plain form
11249 -897710 -1294221 19393 777866 227875 736127 2272687 2902454 1788768 1129337
11240 1129337 1235710 566638 547612 464943 -187359 -443031 -19696 1162924 2179800
11231 2179800 1666995 676103 173285 -226089 -644082 -1073289 -538950 274881 -204136
11222 -204136 -1455891 -2167540 -1984938 -1489191 -1591007 -1894942 -1528245 -2365301 -3405068
11213 -3405068 -2664634 -1150114 449639 1601544 1516987 -228685 -1274925 10756 800481
11204 800481 857518 837522 403977 1043848 1455754 465381 -321431 809520 1570217 1160642
11194 1160642 313460 372288 184344 169239 925819 1635790 1159545 937471 1886887 2868599
11184 2868599 3418115 3758765 3024829 1887851 515893 -728584 -1601718 -1016571 -209449
$$ packed form
11249h97710l96511J313614P58473n49991N08252J536560O29767j113686o59431
11240A129337J06373o69072j9026q2669o52302k55672M23335J182620J016876
11231B179800n12805r90892n02818l99374m17993m29207N34339Q13831m79017
11222b04136j251755p11649J82602M95747j01816l03935L66697q37056j039767
11213c405068P40434J514520J599753J151905q4557j745672j046240J285681P89725
11204H00481N7037j9996m33545O39871M11906r90373p86812J130951P60697m09575
11194A160642q47182N8828j87944j5105P56580P09971m76245k22074R49416R81712
11184B868599N49516L40650p33936j136978j371958j244477q73134N85147Q07122
$$ plain form
11175 -209449 -727938 -1803083 -2116002 -744257 -157055 -513123 -640760 -653895 -325103
11166 -325103 562432 1217759 1087162 343266 323101 1322275 1814971 1307753 360535 -317907
11156 -317907 -635415 -829809 -1240762 -1318746 -1465458 -1951221 -1246340 -1084937 -1548119 -2000430
11146 -2000430 -1737789 -235609 692670 491708 -1061161 -2786803 -3120384 -2531297 -1867636
11137 -1867636 -2557368 -2656133 -1850871 -1833474 -1527295 -1509435 -1315155 -1879150 -1676523 -1542502
11127 -1542502 -2015434 -1813500 -1525682 -1330399 -1155254 -167777 827686 1476398 1545038 107346
11117 107346 -543179 -182999 -225783 -1179751 -1876617 -1756019 -1728483 -561325 -370554 -661620
11107 -661620 218141 1027637 645781 198603 -181743 -956898 -1529321 -1175651 -58516
$$ packed form
11175b09449n18489j075145l12919J371745N87202l56068j27637j3135L28792
11166c25103Q87535O55327j30597p43896k0165R99174M92696n07218r47218o78442
11156c17907l17508j94394m10953p7984j46712m85763P04881J61403m63182m52311
11146b000430K62641J502180R28279k00962j552869j725642l33581N89087O63661
11137a867636o89732r8765Q05262J7397L06179J7860J94280n63995K02627J34021
11127a542502m72932K01934K87818J95283J75145R87477R95463O48712O8640j437692
11117A07346o50525L60180m2784r53968o96866J20598K7536J167158J90771k91066
11107f61620Q79761Q09496l81856m47178l80346p75155n72423L53670J117135
$$ plain form
11098 -58516 102055 -1066024 -1289476 -543377 72583 522698 754488 1871372 2416385
11089 2416385 2161482 2682228 2340937 799502 -353797 -1018013 -491219 569316 -91105
11080 -91105 -1041495 -976859 -186648 97112 355058 436997 -157002 -1268088 -1761038 -2434806
11070 -2434806 -2189018 -797683 -1021504 -1746471 -2152357 -1949942 -1311820 -1045057 -458193
11061 -458193 -212695 -7908 262474 -257837 -918569 144837 1856490 1466608 129139
11052 129139 -1084979 -2039626 -2132637 -1363097 -322984 -3866 819222 2370369 1838026
11043 1838026 1261072 864089 -48359 -636062 -724929 191388 1153927 2310989 2974598
11034 2974598 1858314 334896 -645069 -1523270 -1348520 -796363 -417811 46922 499063
$$ packed form
11098e8516J60571j168079k23452P46099O15960M50115K31790J116884N45013
11089B416385k54903N20746l41291j541435j153299o64216N26794J060535o60421
11080i1105r50390O4636P90211K83760K57946Q1939n93999j111086m92950o73768
11070b434806K45788J391335k23821p24967m05886K02415O38122K66763N86864
11061d58193K45498K04787K70382n20311o60732J063406J711653l89882j337469
11052A29139j214118r54647r3011P69540J040113L19118Q23088J551147n32343
11043A838026n76954l96983r12448n87703q8867R16317R62539J157062O63609
11034B974598j116284j523418r79965q78201J74750N52157L78552M64733M52141
$$ plain form
11025 499063 535869 357705 -306472 -1385738 -2534585 -3082101 -3144874 -2496343 -1773092 -1162479
11015 -1162479 -176971 104953 38316 810694 1405668 824436 605207 909341 229438 -167709
11005 -167709 -356735 -462451 -332458 -188554 -716350 -1717827 -1815889 -1273346 -1106286 -1304502
10995 -1304502 -796772 492190 1874017 2220326 2425026 2367016 1459446 1759499 2284156
10986 2284156 2932751 2432980 2045454 2453301 1835074 1591763 1113157 949497 767710
10977 767710 1043356 2063538 2590110 2445509 1237328 936377 561145 -368550 -467520
10968 -467520 -216808 28026 693247 504061 -383882 -789235 -900757 -1045831 -1002280 -725476
10958 -725476 -1495140 -2397214 -1675070 -1185018 -863027 -145802 416842 1641195 2357818
$$ packed form
11025D99063L6806j78164o64177j079266j148847n47516o2773O48531P23251O10613
11015a162479R85508K81924o6637P72378N94974n81232k19229L04134o79903l97147
11005a67709j89026j05716J29993J43904n27796j001477r8062N42543J67060j98216
10995a304502N07730J288962J381827L46309K04700n8010r07570L00053N24657
10986B284156O48595m99771l87526M07847o18227k43311m78606j63660j81787
10977G67710K75646J020182N26572j44601j208181l00951l75232r29695r8970
10968d67520K50712K44834O65221j89186q87943m05353j11522j45074M3551K76804
10958g25476p69664r02074P22144M90052L21991P17225N62644J224353P16623
$$ plain form
10949 2357818 1329417 -27424 408679 1136066 1991464 2738059 3277242 3225746 3071554
10940 3071554 2711438 3053029 4525675 5795357 6181690 5904865 5881212 7569162 9598533
10931 9598533 12526442 17557252 24014032 32138585 43638488 57214353 61715148 51426701
10923 51426701 36847893 26525281 21147037 17920532 15711786 13489316 12366119 13342275
10915 13342275 15082062 17046590 20245207 25525915 34194697 46365318 58926253 60719547
10907 60719547 48150259 34128659 24339216 17954330 14199987 11208895 9396010 8182732
10899 8182732 6320407 5408334 4228769 3353340 4343918 5334297 4683937 3714441 3331686
10890 3331686 3167691 2844306 2152316 2515863 3256862 3271527 3183968 2901724 1761445 752385
$$ packed form
10949B357818j028401j356841M36103P27387Q55398P46595N39183n1496j54192
10940C071554l60116L41591J472646J269682L86333k76825k3653J687950K029371
10931I598533K927909N030810O456780Q124553J1499903J3575865M500795j0288447
10923E1426701j4578808j0322612n378244l226505k208746k222470j123197R76156
10915A3342275J739787J964528L198617N280708Q668782J2170621J2560935J793294
10907F0719547j2569288j4021600r789443o384886l754343k991092j812885j213278
10899H182732j862325r12073j179565q75429R90578R90379o50360r69496l82755
10890C331686j63995l23385o91990L63547P40999J4665q7559k82244j140279j009060
$$ plain form
10880 752385 830444 823318 1055929 1000858 437128 144480 -38206 58028 -357395 -791427
10870 -791427 -780635 -1092260 -1554747 -1149788 -718785 -548969 -984637 -1657222 -2199015 -2393905
10860 -2393905 -1501639 -531966 -446606 -931264 -1683486 -2000098 -2759853 -2679814 -1606901 -1475601
10850 -1475601 -844614 -105740 77283 94020 705998 845588 554372 -192953 210606 933141
10840 933141 987416 1321507 562117 -385359 -111096 445488 132436 645215 1160324 1773417
10830 1773417 2296928 1964513 1285109 1836021 1962111 848233 381276 313648 47064
10821 47064 206140 -170868 -439791 35909 221646 -341150 -1525821 -2446348 -2215163 -1668727
10811 -1668727 -1776017 -1304457 -416113 926443 2093746 2086937 903758 678443 1528864
$$ packed form
10880G52385P8059p126K32611n5071n63730k92648j82686R6234m15423m34032
10870g91427J0792l11625m62487M04959M31003J69816m35668o72585n41793j94890
10860b393905Q92266R69673Q5360m84658p52222l16612p59755Q0039J072913J31300
10850a475601O30987P38874J83023J6737O11978J39590k91216p47325M03559P22535
10840I33141N4275L34091p59390r47476K74263N56584l13052N12779N15109O13093
10830A773417N23511l32415o79404N50912J26090j113878m66957o7628k66584
10821D7064J59076l77008k68923M75700J85737n62796j184671r20527K31185N46436
10811a668727j07290M71560Q88344J342556J167303o809j183179k25315Q50421
$$ plain form
10802 1528864 1939795 904384 255747 589705 1175448 1219907 930854 1392277 1129709
10793 1129709 -2469 -708353 -733848 -476959 -102970 334277 1289817 2136169 2576836
10784 2576836 2627742 2511941 1922566 1125603 596441 -38374 -400653 -452986 -1066815 -1847033
10774 -1847033 -2656485 -2180388 -999649 -784691 -433877 85154 643425 1184509 836858
10765 836858 130948 -643783 -212767 -105284 -1747535 -2675445 -1660926 -748095 -685997
10756 -685997 -918243 -270091 769856 1484550 2744294 2535679 642744 -992111 -965613
10747 -965613 -460661 -47205 -320339 -733998 -1391716 -1472003 -977187 -227703 310343 44677
10737 44677 -379936 506848 1289398 1180753 471187 -106429 -1030800 -2336515 -2386877 -923967
$$ packed form
10802A528864M10931j035411o48637L33958N85743M4459k89053M61423k62568
10793A129709j132178p05884k5495K56889L73989M37247R55540Q46352M40667
10784B576836N0906j15801n89375p96963n29162o34815l62279n2333o13829p80218
10774a847033q09452M76097J180739K14958L50814N19031N58271N41084l47651
10765H36858p05910p74731M31016J07483j642251r27910J014519R12831O2098
10756f85997k32246O48152J039947P14694J259744k08615j892935j634855K6498
10747i65613N04952M13456k73134m13659o57718q0287M94816P49484N38046k65666
10737D4677m24613Q86784P82550j08645p09566n77616r24371j305715n0362J462910
$$ plain form
10727 -923967 180078 745684 1161574 1504695 2442962 2710766 3181268 2977595 1906948
10718 1906948 1064565 790707 981364 1450473 1351230 1009320 495896 604751 182727 -1292528
10708 -1292528 -3188960 -3515108 -2377705 -903856 557136 1372473 2300706 2695795 2567629
10699 2567629 3016487 3424113 3010761 1850783 24254 -1474155 -1168371 -565230 -581892
10690 -581892 -28985 211918 362911 530097 215119 -52434 11339 -470811 -968305 -898905
10680 -898905 -505135 -82633 282685 131317 549093 911934 753296 1303332 2113595 2893218
10670 2893218 2995208 1021853 351035 1268811 1955756 2175791 1644397 1703616 1571001
10661 1571001 553996 304185 829772 1327626 1201534 2104090 2848724 2045930 580082
$$ packed form
10727i23967J104045N65606M15890L43121R38267K67804M70502k03673j070647
10718A906948q42383k73858J90657M69109r9243l41910n13424J08855m22024j475255
10708a292528j896432l26148J137403J473849J460992Q15337R28233L95089j28166
10699B567629M48858M07626m13352j159978j826529j498409L05784O03141j6662
10690e81892N52907K40903J50993J67186l14978k67553O3773m82150m97494O9400
10680h98905L93770M22502L65318j51368M17776L62841j58638N50036Q10263P79623
10670B893218J01990j973355o70818R17776O86945K20035n31394N9219j32615
10661A571001j017005k49811N25587M97854j26092R02556P44634q02794j465848
$$ plain form
10652 580082 344172 888373 1508768 1828591 1869242 1317521 577780 41395 510196 513335
10642 513335 -133836 -399345 -664209 159652 1150512 1242000 1079207 1608127 1057109 -1062143
10632 -1062143 -1978265 -1568774 -890979 -1019239 -1065631 -488284 -245182 -377987 -1304332 -1998685
10622 -1998685 -1563932 -1121110 -932838 -186075 847725 1793413 1279419 176579 -680008
10613 -680008 -1722091 -2526852 -2571557 -2348969 -1802565 -1279811 -804018 -511467 -225587 -577112
10603 -577112 -1167782 -2831872 -3203073 -2530520 -1712097 -594068 -120657 154420 -104137
10594 -104137 -287087 -940698 -1708965 -2936283 -3574783 -2856429 -2358477 -2647073 -2738461 -1809537
10584 -1809537 -1514655 -1968836 -2418539 -2377118 -2063075 -2443858 -2205789 -1340681 -1049798 -871776
$$ packed form
10652E80082k35910N44201O20395L19823M0651n51721p39741n36385M68801L139
10642E13335o47171k65509k64864Q23861R90860R1488j62793N28920n51018k119252
10632a062143r16122M09491O77795j28260m6392N77347K43102j32805r26345o94353
10622a998685M34753M42822J88272P46763J033800R45688n13994j102840q56587
10613f80008j042083q04761m4705K22588N46404N22754M75793K92551K85880l51525
10603e77112n90670j664090l71201O72553Q18423J118029M73411K75077k58557
10594a04137j82950o53611p68267j227318o38500P18354M97952k88596r1388R28924
10584a809537K94882m54181m49703M1421L14043l80783K38069Q65108K90883J78022
$$ plain form
10574 -871776 -360678 -1028811 -1789226 -2125578 -1270901 -1413507 -2116531 -1765843 -832493 -585326
10564 -585326 35884 389459 606193 1767145 2122486 1543853 476724 126910 700414
10555 700414 998253 607685 1233192 1482828 802930 821306 1057859 108600 -167592 290072
10545 290072 176855 -500258 -1244089 -2128307 -2547483 -3217946 -4032768 -3291728 -2788639 -2188645
10535 -2188645 -779940 257552 743455 -387773 -2184961 -2259507 -1316032 -768772 211180
10526 211180 1271700 1368731 987131 1158516 300879 -1163354 -2524892 -3248161 -2670154
10517 -2670154 -1443654 -621547 -625647 -379712 412498 314672 -238832 -516695 -589270 -183502
10507 -183502 -441488 -759327 -741941 -795807 -70720 456630 235501 832943 509171 -519068
$$ packed form
10574h71776N11098o68133p60415l36352Q54677j42606p03024L50688R33350K47167
10564e85326O21210L53575K16734J160952L55341n78633j067129l49814N73504
10555G00414K97839l90568O25507K49636o79898J8376K36553r49259k76192M57664
10545B90072j13217o77113p43831q84218m19176o70463q14822P41040N03089N99994
10535b188645J408705J037492M85903j131228j797188p4546R43475N47260R79952
10526B11180J060520R7031l81600J71385q57637j464233j361538p23269N78007
10517b670154J226500Q22107m100K45935P92210r7826n53504k77863p2575M05768
10507a83502k57986l17839J7386n3866P25087N27350k21129N97442l23772j028239
$$ plain form
10497 -519068 -301861 335578 393896 1079611 1672635 527257 -1373477 -1437186 -983154 40948
10487 40948 912070 792792 199966 244815 1701234 2832818 2956467 2781730 3341075 3544114
10477 3544114 2751901 1489536 988146 1706050 2781218 3067199 2785487 1818452 728847
10468 728847 433784 -334482 -1207584 -990172 -795931 -1962048 -3692986 -3813745 -2256379
10459 -2256379 -1348822 -1898942 -2467444 -1956881 -721214 -397876 -487455 -393237 153294 783586
10449 783586 640650 644161 641911 -456379 -687319 -460075 -299124 -228898 504563 465061
10439 465061 -668517 -1540287 -770096 -226265 483373 1385929 1471875 949112 1229764 1144962
10429 1144962 -27703 -494543 -641770 -1839155 -2711654 -2129660 -1382834 -1324179 -2230583
$$ packed form
10497e19068K17207O37439N8318O85715N93024j145378j900734o3709M54032J024102
10487D0948Q71122j19278n92826M4849J456419J131584J23649j74737N59345K03039
10477C544114p92213j262365n01390P17904J075168K85981k81712r67035j089605
10468G28847k95063p68266q73102K17412J94241j166117j730938j20759J557366
10459b256379R07557n50120n68502N10563J235667L23338q9579R4218N46531O30292
10449G83586j42936L511k250j098290k30940K27244J60951P0226P33461l9502
10439D65061j133578q71770P70191N43831P09638R02556Q5946n22763K80652q4802
10429A144962j172665m66840j47227j197385q72499N81994P46826N8655r06404
$$ plain form
10420 -2230583 -2205294 -604760 780054 528874 -136684 -235261 441816 268827 -125996
10411 -125996 -283529 -1611700 -1821431 -779891 -901914 -1620131 -1294528 -1080793 -714918
10402 -714918 -204506 -448362 -601386 8060 1275705 1219474 761910 1172527 1552508 2222429
10392 2222429 1354397 -437413 -919941 -989384 -399564 710123 1063516 343048 -26606
10383 -26606 824751 850686 -344439 -973167 -1594214 -2447854 -2568516 -2485133 -1596735 -906160
10373 -906160 -1207272 -1729031 -1803697 -793346 -223026 -69290 -498610 -1061722 -1006197 -540158
10363 -540158 -249122 -766980 -899699 -1292390 -1917523 -1220504 -614464 -457409 398069 698417
10353 698417 382156 334646 644282 5463 -858760 -920621 -1025122 -1337234 -1889213 -1636438
$$ packed form
10420b230583K5289J600534J384814k51180o65558r8577O77077j72989l94823
10411a25996j57533j328171k09731J041540j22023p18217L25603K13735L65875
10402g14918N10412k43856j53024O09446J267645n6231m57564M10617L79981O69921
10392B222429q68032j791810m82528o9443N89820J109687L53393p20468l69654
10383b6606Q51357K5935j195125o28728o21047q53640j20662Q3383Q88398O90575
10373i06160l01112n21759p4666J010351N70320J53736m29320n63112N5525M66039
10363e40158K91036n17858j32719l92691o25133O97019O06040J57055Q55478L00348
10353F98417l16261m7510L09636o38819q64223o1861j04501l12112n51979K52775
$$ plain form
10343 -1636438 -1416383 -671094 33468 -585060 -1517565 -1817445 -1523249 -600835 497854
10334 497854 1855518 2444093 1743463 1874956 2343725 1587315 216236 -240756 34458
10325 34458 -679646 -2189760 -2722168 -3135102 -3306929 -2630090 -2707265 -2766240 -2495415 -2385291
10315 -2385291 -1693495 278298 994900 138534 249418 831959 1445703 1973564 2062231
10306 2062231 1837790 1364933 1367462 1701998 2344574 2238196 1932483 675429 -543827
10297 -543827 -1118838 -1330824 -2030475 -2150964 -745872 907985 1564968 1452136 763397
10288 763397 -94126 -652875 -606719 683170 1099710 1078633 529740 -529223 -1069272 448717
10278 448717 2146179 2175051 1469626 1087753 1154741 1396259 1909399 2317598 2498322 2285994
$$ packed form
10343a636438K20055P45289P04562o18528r32505k99880K94196R22414J098689
10334D97854J357664N88575p00630J31493M68769p56410j371079m56992K75214
10325C4458p14104j510114n32408m12934j71827O76839p7175n8975K70825J10124
10315b385291O91796J971793P16602q56366J10884N82541O13744N27861Q8667
10306B062231k24441m72857K529L34536O42576j06378l05713j257054j219256
10297e43827n75011k11986o99651j20489J405092J653857O56983j12832o88739
10288G63397q57523n58749M6156J289889M16540k1077n48893j058963n40049J517989
10278D48717J697462K8872p05425l81873O6988K41518N13140M08199J80724k12328
$$ plain form
10268 2285994 937138 1009787 1979086 1245053 491030 45206 -198343 -341488 -699321
10259 -699321 -686253 282851 582969 1004959 1675596 1776118 1814051 1728458 502178 -504567
10249 -504567 -607715 -858577 -685011 685906 1752200 1564986 457907 125788 712491
10240 712491 413723 -233587 -182243 86159 -744668 -714117 -1013261 -1135564 -851522 -256997
10230 -256997 408625 826522 1753528 2152839 1522512 1757818 2101318 1344096 625833 -212411
10220 -212411 -1823542 -2534353 -2259602 -2358203 -1631788 -833102 -898714 -1175449 -3837 4336
10210 4336 244359 441256 360280 -86598 331035 1456129 1834029 1729741 1469652 993632
10200 993632 623765 72732 131940 1368126 2015793 1787557 934214 1123956 1328402 1011785
$$ packed form
10268B285994j348856P2649R69299p34033p54023m45824k43549j43145l57833
10259f99321J3068R69104L00118M21990O70637J00522L7933q5593j226280j006745
10249e04567j03148k50862J73566J370917J066294j87214j107079l32119N86703
10240G12491k98768o47310N1344K68402q30827L0551k99144j22303K84042N94525
10230b56997O65622M17897R27006L99311o30327K35306L43500p57222p18263q38244
10220b12411j611131p10811K74751r8601P26415P98686o5612k76735J171612Q173
10210D336K40023J96897q0976m46878M17633J125094L77900j04288k60089m76020
10200I93632l69867n51033N9208J236186O47667k28236q53343J89742K04446l16617
$$ plain form
10190 1011785 -433822 -1274209 -1237854 -741773 -820727 -1061137 -511162 -7784 733056 -27001
10180 -27001 -863292 10077 1002622 604483 287064 254983 -222013 -83540 -232788 -274966
10170 -274966 -1084246 -1583404 -743416 -23588 203994 -188014 -811736 -724168 -97306 536051
10160 536051 1042059 902445 91025 -138850 291364 486748 984537 1348110 667834 -90937
10150 -90937 -760775 -628122 68454 695039 1180732 1667898 1761883 1550155 563548 109007
10140 109007 -399079 -602052 -145426 -432023 -355040 50087 943445 569305 -459310 -1623323
10130 -1623323 -2398932 -1577362 -141079 266135 416573 525973 355044 253456 -15200
10121 -15200 -1017427 -1308077 -1264776 -2076587 -2095742 -1614047 -1459416 -385652 1248672 1802158
$$ packed form
10190A011785j445607q40387L6355M96081p8954k40410N49975N03378P40840p60057
10180b7001q36291Q73369R92545l98139l17419l2081m76996J38473j49248m2178
10170b74966q09280m99158Q39988P19828K27582l92008o23722Q7568O26862O33357
10160E36051N06008j39614q11420k29875M30214J95384M97789L63573o80276p58771
10150i0937o69838J32653O96576O26585M85693M87166R3985k11728r86607m54541
10140A09007n08086k02973M56626k86597P6983M05127Q93358l74140j028615j164013
10130a623323p75609Q21570J436283M07214J50438J09400j70929j01588k68656
10121a5200j002227k90650M3301q11811j9155M81695J54631J073764J634324N53486
$$ plain form
10111 1802158 1272990 -119280 -1445659 -1309857 -929390 -1444017 -1618408 -46998 74129
$$ packed form
10111A802158n29168j392270j326379J35802L80467n14627j74391J571410J21127
$$ [...]
##END NTUPLES=NMR SPECTRUM
##END=
