##TITLE=C13_88-2021
 CDCl3,  16700 sc

 2.09.2021
##JCAMPDX= 6.0         $$ Bruker NMR JCAMP-DX V2.0
##DATA TYPE= NMR SPECTRUM
##DATA CLASS= NTUPLES
##ORIGIN= UXNMR, Bruker Analytische Messtechnik GmbH
##OWNER= root
$$ XWIN-NMR		Version 3.5
$$ Fri Sep  3 08:37:12 2021 Russian Standard Time (UT+4h)  she@DPX200
##.OBSERVE FREQUENCY= 50.327896
##.OBSERVE NUCLEUS= ^13C
##.ACQUISITION MODE= SIMULTANEOUS
##.ACQUISITION SCHEME= undefined
##.AVERAGES= 19700
##.DIGITISER RES= 17
##SPECTROMETER/DATA SYSTEM= spect
##.PULSE SEQUENCE= zgpg30
##.SOLVENT NAME= DMF
##.SHIFT REFERENCE= (INTERNAL, DMF, 0, 222.668)
##AUDIT TRAIL= $$ (NUMBER, WHEN, WHO, WHERE, WHAT)
$$ ##TITLE= Audit trail, XWIN-NMR		Version 3.5
$$ ##JCAMPDX= 5.01
$$ ##ORIGIN= Bruker BioSpin GmbH
$$ ##OWNER= she
$$ F:/spectra/data/she/nmr/c13/1/pdata/1/auditp.txt
$$ ##AUDIT TRAIL=  $$ (NUMBER, WHEN, WHO, WHERE, WHAT)
(   1,<2021-09-03 08:35:49.37 +0400>,<she>,<DPX200>,
      <created by zg, POWCHK disabled, PULCHK disabled
       terminated by command 'halt'
       configuration hash MD5:
       00 E9 B6 7A A2 85 ED C7 34 08 36 98 17 FE 4E 26
       data hash MD5: 32K
       97 38 9D 5B 22 7F 0E 51 22 AE A2 59 42 A7 20 74>)
(   2,<2021-09-03 08:35:52.39 +0400>,<she>,<DPX200>,
      <Start of raw data processing
       efp BC_mod = 2 LB = 1 FT_mod = 6 PKNL = 1 PHC0 = -336.5117 PHC1 = 33.36238 SI = 32K 
       data hash MD5: 32K
       23 55 0C 39 7D 5C C5 40 03 BB 66 C8 81 B1 7F 6C>)
(   3,<2021-09-03 08:35:55.26 +0400>,<she>,<DPX200>,
      <abs ABSG = 5 
       data hash MD5: 32K
       80 A2 80 FE 3A D5 AD 69 B0 67 22 C0 4A 7D 3F 60>)
(   4,<2021-09-03 08:36:26.32 +0400>,<she>,<DPX200>,
      <pk PHC0 = 2.965955 PHC1 = -5 
       data hash MD5: 32K
       E9 85 EB 81 B1 EC BA 3E E1 21 1E 0E 7C 4D FA B8>)
(   5,<2021-09-03 08:36:29.31 +0400>,<she>,<DPX200>,
      <abs ABSG = 5 
       data hash MD5: 32K
       14 BC EA 42 65 2C 84 90 EB E3 1C 01 4D D0 9B 04>)
$$ ##END=
$$ 
$$ hash MD5
$$ F7 06 76 32 F1 85 F1 73 83 96 44 D4 60 DD 70 C3
##$RELAX= 
##$RELAX= 
##$RELAX= 
##$RELAX= 
##$RELAX= 
##$RELAX= 
##$RELAX= 
##$RELAX= 
$$ Bruker specific parameters
$$ --------------------------
##$DU= <F:/spectra>
##$EXPNO= 1
##$NAME= <c13>
##$PROCNO= 1
##$TYPE= <nmr>
##$USER= <she>
##$AMP= (0..31)
100 100 100 100 100 100 100 100 100 100 100 100 100 100 100 100 100 100 
100 100 100 100 100 100 100 100 100 100 100 100 100 100 
##$AQSEQ= 0
##$AQ_mod= 1
##$AUNM= <au_zg>
##$AUTOPOS= <>
##$BF1= 50.322709
##$BF2= 200.13
##$BF3= 50.322709
##$BF4= 500.13
##$BF5= 500.13
##$BF6= 500.13
##$BF7= 500.13
##$BF8= 500.13
##$BYTORDA= 1
##$CFDGTYP= 0
##$CFRGTYP= 5
##$CHEMSTR= <none>
##$CNST= (0..31)
1 1 145 1 1 1 1 1 1 1 1 1 1 1 1 1 1 1 1 1 1 1 1 1 1 1 1 1 1 1 1 1 
##$CPDPRG= <waltz16>
##$CPDPRG1= <>
##$CPDPRG2= <waltz16>
##$CPDPRG3= <>
##$CPDPRG4= <mlev>
##$CPDPRG5= <mlev>
##$CPDPRG6= <mlev>
##$CPDPRG7= <mlev>
##$CPDPRG8= <mlev>
##$CPDPRGB= <>
##$CPDPRGT= <>
##$D= (0..31)
$$ [...]
##$SUBNAM4= <"">
##$SUBNAM5= <"">
##$SUBNAM6= <"">
##$SUBNAM7= <"">
##$SUBNAM8= <"">
##$SUBNAM9= <"">
##$SW= 239.972175391363
##$SWIBOX= (0..15)
0 1 3 0 0 0 0 0 0 0 0 0 0 0 0 0 
##$SW_h= 12077.2946859903
##$TD= 32768
##$TD0= 1
##$TE= 0
##$TE2= 300
##$TE3= 300
##$TEG= 300
##$TL= (0..7)
120 120 120 120 120 120 120 120 
##$TP= (0..7)
150 150 150 150 150 150 150 150 
##$TP07= 0
##$TPNAME0= <>
##$TPNAME1= <>
##$TPNAME2= <>
##$TPNAME3= <>
##$TPNAME4= <>
##$TPNAME5= <>
##$TPNAME6= <>
##$TPNAME7= <>
##$TPOAL= (0..7)
0.5 0.5 0.5 0.5 0.5 0.5 0.5 0.5 
##$TPOFFS= (0..7)
0 0 0 0 0 0 0 0 
##$TUNHIN= 0
##$TUNHOUT= 0
##$TUNXOUT= 0
##$USERA1= <user>
##$USERA2= <user>
##$USERA3= <user>
##$USERA4= <user>
##$USERA5= <user>
##$V9= 5
##$VALIST= <valist>
##$VCLIST= <CCCCCCCCCCCCCCC>
##$VD= 0
##$VDLIST= <DDDDDDDDDDDDDDD>
##$VPLIST= <PPPPPPPPPPPPPPP>
##$VTLIST= <TTTTTTTTTTTTTTT>
##$WBST= 1024
##$WBSW= 4
##$XGAIN= (0..3)
0 0 0 0 
##$XL= 0
##$YL= 0
##$YMAX_a= 118822570
##$YMIN_a= -32080204
##$ZGOPTNS= <>
##$ZL1= 120
##$ZL2= 120
##$ZL3= 120
##$ZL4= 120
##$ABSF1= 222.6826
##$ABSF2= -17.31421
##$ABSG= 5
##$ABSL= 3
##$ALPHA= 0
##$AQORDER= 0
##$ASSFAC= 0
##$ASSFACI= 0
##$ASSFACX= 0
##$ASSWID= 0
##$AUNMP= <proc_1d>
##$AZFE= 0.1
##$AZFW= 0.5
##$BCFW= 0
##$BC_mod= 2
##$BYTORDP= 0
##$COROFFS= 0
##$CY= -3
##$DATMOD= 1
##$DC= 0
##$DFILT= <>
##$DTYPP= 0
##$F1P= 0
##$F2P= 0
##$FCOR= 0.5
##$FTSIZE= 32768
##$FT_mod= 6
##$GAMMA= 0
##$GB= 0
##$INTBC= 1
##$INTSCL= 4.134877e-10
##$ISEN= 128
##$LB= 1
##$LEV0= 0
##$LPBIN= 0
##$MAXI= 10000
##$MC2= 0
##$MEAN= 0
##$ME_mod= 0
##$MI= 0.1934396
##$NCOEF= 0
##$NC_proc= 2
##$NLEV= 6
##$NOISF1= 120.0001
##$NOISF2= 80.00006
##$NSP= 0
##$NTH_PI= 0
##$NZP= 0
##$OFFSET= 222.6679
##$PC= 1.4
##$PHC0= -333.5457
##$PHC1= 28.36238
##$PH_mod= 1
##$PKNL= yes
##$PPARMOD= 0
##$PSCAL= 0
##$PSIGN= 0
##$REVERSE= no
##$SF= 50.3227293897603
##$SI= 32768
##$SIGF1= 140
##$SIGF2= 120
##$SINO= 11.81781
##$SIOLD= 32768
##$SREGLST= <13C.CDCl3>
##$SSB= 0
##$STSI= 32768
##$STSR= 0
##$SW_p= 12077.2946859903
##$SYMM= 0
##$S_DEV= 0
##$TDeff= 32768
##$TDoff= 0
##$TI= <>
##$TILT= no
##$TM1= 0
##$TM2= 0
##$TOPLEV= 0
##$USERP1= <user>
##$USERP2= <user>
##$USERP3= <user>
##$USERP4= <user>
##$USERP5= <user>
##$WDW= 1
##$XDIM= 32768
##$YMAX_p= 426600180
##$YMIN_p= -2259647
$$ End of Bruker specific parameters
$$ ---------------------------------
##NTUPLES= NMR SPECTRUM
##VAR_NAME=  FREQUENCY,     SPECTRUM/REAL,   SPECTRUM/IMAG
##SYMBOL=    X,             R,               I
##VAR_TYPE=  INDEPENDENT,   DEPENDENT,       DEPENDENT
##VAR_FORM=  AFFN,          ASDF,            ASDF
##VAR_DIM=   32768,         32768,           32768
##UNITS=     HZ,            ARBITRARY UNITS, ARBITRARY UNITS
##FACTOR=    0.368581032318806, 1,           1
##FIRST=     11205.2560958543, 0,            0
##LAST=      -872.038590136011, 0,           0
##MIN=       -872.038590136011, -2259647,    0
##MAX=       11205.2560958543, 426600180,    0
$$ Real data points
##PAGE= N=1
##DATA TABLE= (X++(R..R)), XYDATA
$$ [...]
18187 342372 277421 -188829 -200028 275876 497416 467470 103835 -237547 -338685 -454628
18177 -454628 -519553 -301175 76563 471357 774527 548870 223826 62147 18265 -268251
18167 -268251 -120195 323212 564369 467683 680983 807074 517488 154989 -76296 -62016
18157 -62016 -107597 -147304 -135786 45508 204431 -79923 -509121 -519921 -167513 22795
18147 22795 -174385 144562 519914 405966 564692 612298 490740 266287 231871 500972
18137 500972 564301 359925 166494 93563 -13603 -438372 -623772 -72392 428594 270
18127 270 -687543 -968205 -1189332 -1035895 -607946 -601812 -874775 -894488 -494616 37637 511896
18116 511896 336738 311526 666986 511296 463875 303857 301584 422833 281567 222370
18106 222370 72337 157759 588694 935231 1164407 824703 479012 492277 628907 266097
18096 266097 -527596 -955570 -304918 570516 1016891 1254241 1339274 1215961 843168 542475
18086 542475 276883 -228451 -302820 359199 859420 695291 211679 -45353 -69482 79426
18076 79426 343844 808311 1002396 845435 1029156 1017647 683258 477373 448671 474989
18066 474989 282880 -14136 237662 747644 1318875 1577387 1572968 1253105 1209448 1227507
18056 1227507 1178328 686665 196679 -243344 -771655 -813540 -308244 -120795 -295632 -140970
18046 -140970 -115610 228660 789971 923418 721149 717578 1076721 1274988 1132326 818212
18036 818212 503151 322562 -65097 -58095 -359534 -528220 -64833 -49600 -390009 -803964
18026 -803964 -524801 -222361 -537703 -794764 -819629 -343292 -13627 61895 33544 -320159
18016 -320159 -446223 -158286 48258 306899 452202 322101 118685 -88550 -339535 -307498
18006 -307498 50188 428238 460262 189408 -271357 -340754 -412427 -364137 25214 -156426
17996 -156426 -831424 -874721 -591973 -633762 -383715 112320 417493 419271 -34137 -521914
17986 -521914 -891774 -1000053 -675613 -427621 -381132 -386524 -474849 -471582 -729933 -1314023 -1450847
17975 -1450847 -1293471 -1309641 -1193783 -1327368 -1159972 -739040 -517501 -141104 -103533 -340082
17965 -340082 -416671 -517688 -553387 -205572 52415 54053 248676 492028 432910 12431
17955 12431 -272553 -299087 -232156 -318658 -605812 -398657 -233980 -348474 -617643 -862863
17945 -862863 -785739 -270334 287623 691282 572588 416077 745047 879652 393409 20362
17935 20362 -127889 -123973 -485019 -434363 -253671 -527253 -784410 -632312 -64810 362619
17925 362619 512856 465128 738842 918624 616766 288065 106537 188511 279866 42799
17915 42799 -138791 -260321 -343444 -322399 -310223 -65725 161333 193415 414482 281033
17905 281033 -49273 -187433 -115498 -176771 -315474 -508409 -980087 -1331374 -661967 -152050
17895 -152050 -605303 -923046 -713731 -311590 -293023 -462834 -403907 -55357 -21287 81441
17885 81441 562918 781959 580755 318438 741706 859547 257848 -111673 -15238 291963
17875 291963 713794 831398 831859 460110 183268 391455 269125 98405 449253 685914
17865 685914 415377 310976 539038 769726 716820 745188 871095 831754 959670 841805
17855 841805 119242 -301191 -222361 -396701 -670272 -399809 88384 -108153 -594039 -681065
17845 -681065 -58473 888721 1518346 1529114 997155 767012 731806 591941 462713 374225
17835 374225 372082 240181 -28497 -221930 99041 596802 811072 884102 895007 621247
17825 621247 462000 118451 -96006 326949 588565 599177 525057 417000 280425 135161
17815 135161 -93027 -607795 -755846 -594090 -150960 132862 211662 119332 -366735 -737217
17805 -737217 -1022486 -951478 -614633 -248679 -163598 12618 412916 213731 -227477 -474666
17795 -474666 -492939 -473809 -6929 391579 200127 146656 139700 33589 -82417 -143597 -146766
17784 -146766 -480771 -714054 -620454 -623825 -366641 66798 395149 340466 -13110 -388363
17774 -388363 -717751 -744241 -464202 62290 529362 471173 302179 237593 -63950 -343343
17764 -343343 -442358 -386131 -149058 138835 338014 312058 610980 1236081 1504314 1515742
17754 1515742 1541243 1169950 668900 38181 -630075 -872340 -891819 -1158001 -1084293 -750401
17744 -750401 6182 534596 331659 154843 -238579 -309294 -350912 -151620 323838 785049
17734 785049 830455 620529 401856 -28381 -130239 -81484 76542 133672 142074 72197 224302
17723 224302 266497 61443 197282 -143283 -443718 -169589 48031 252834 941424 1364886
17713 1364886 956743 391767 97914 57674 -52416 -93127 -184894 -33547 164504 92678
17703 92678 94045 224953 158931 -195474 -501582 -582083 -805781 -691645 -591920 -530970 -173205
17692 -173205 -267614 -460868 -281814 -113350 13894 484658 773613 695406 490307 219847
17682 219847 180286 239307 213321 -9425 -164126 -453860 -827656 -848166 -684413 -400839
17672 -400839 -384886 -169540 260129 526904 658174 803596 1184516 1383031 1558275 1560328
17662 1560328 1155196 371854 -258368 -231407 590823 1211649 1157999 709995 399456 328578
17652 328578 333250 351925 470324 473559 209005 -22507 -296102 -415438 -456646 -272367 174038
17641 174038 725977 1149969 998547 738589 326912 -183076 -82241 302509 634151 763501
17631 763501 1022826 887781 328211 -58106 -367583 -467997 -193064 -194832 -547633 -779791
17621 -779791 -762057 -559542 -392465 -245758 -370725 -380629 -275099 -79797 95778 77511
17611 77511 -344954 -451373 -265404 -210476 -149357 -246845 -368576 -545903 -918732 -1181643
17601 -1181643 -718112 -324119 -301257 -574356 -593435 -355741 -257875 -167436 112800 -162490
17591 -162490 -560434 -464046 -159261 175417 349526 -130367 -429334 -299858 -525111 -469171
17581 -469171 -39054 334375 118524 -254313 -99675 359697 502416 219729 -222717 -84008
17571 -84008 324548 387694 173090 177206 188433 363116 436724 233491 -96892 -300123 -301920
17560 -301920 -168795 74343 252954 272090 326151 204981 -11096 -190571 -264392 -411273
17550 -411273 -186308 196285 680797 1198870 989450 851884 760929 148062 -452167 -445829
17540 -445829 52912 249821 -42046 -193931 -262071 -135613 -76097 -388911 -694723 -669333
17530 -669333 -339635 -204929 -232752 -372173 -503352 -366390 51377 204340 265409 185253
17520 185253 -83536 -319508 -397225 11204 400444 548243 472065 137285 -94998 -73576
17510 -73576 -33399 -45290 -170733 -482077 -619691 -737500 -683675 -417294 -326991 -562988
17500 -562988 -836192 -323677 78345 149035 41358 -158917 -381687 -335777 -66672 162284
17490 162284 315910 397671 325053 125035 -192527 97242 594088 706944 523356 755276
17480 755276 1142368 1146942 850188 506787 -72687 -377419 -382475 -310084 -108432 100174
17470 100174 -61734 -216186 -98756 -318726 -483938 -380133 -260557 -388071 -522445 -537673
17460 -537673 -20227 332095 -31186 -208640 -230217 -552269 -930394 -1260818 -1022529 -740599
17450 -740599 -486689 46461 -34921 -76210 -13898 -64872 -389648 -564209 -572362 -665401 -324076
17439 -324076 163570 39338 -350924 -424207 -308753 -215253 -83986 90986 157576 372719
17429 372719 360606 310655 753514 713221 423062 125908 239128 432886 471817 226732
17419 226732 20887 146161 473790 631394 594282 310608 -183978 -459064 -452142 -435763
17409 -435763 -737880 -624456 -200696 -123795 26848 246323 264587 361260 416784 511019
17399 511019 751374 844642 1066276 1114747 846676 651752 577533 664705 911366 1640166
17389 1640166 2979135 4120452 5633984 8062548 12098716 18003593 25360175 29122959
17381 29122959 24027220 16422878 11411194 8285282 6013682 4683786 3929049 3330586
17373 3330586 2715597 2382352 2243194 2179614 2297755 2064583 1785840 1648592 1362037 1229861
17363 1229861 990641 1021849 874546 534601 388714 372054 567882 218796 -237428 -157963
17353 -157963 137668 553749 604008 426573 382136 330000 99229 -102303 -26970 469814
17343 469814 762919 994558 886100 299656 150494 238392 210873 53433 93257 332630
17333 332630 712475 997248 709004 5574 -384530 -422226 29865 252301 293235 234736
17323 234736 -129230 -314482 -62793 304183 503349 413516 304508 257577 313754 82062
17313 82062 -366390 -714180 -746856 -639665 -811518 -597433 -407845 -492638 -723717 -407656
17303 -407656 57300 -29326 -344238 -346119 95719 619317 768699 541384 123736 -575406
17293 -575406 -807701 -722034 -952238 -981148 -578111 -380037 -607224 -574857 -471140 -328754
17283 -328754 -377828 -298517 -422472 -842703 -842308 -306457 215463 387205 464798 301232 -56377
17272 -56377 -297752 -208360 -293115 -468168 -583623 -527240 -286531 -523442 -819764 -622781
17262 -622781 -302860 -675841 -1020332 -1104994 -925360 -617701 -662637 -462261 -287292 -549113
17252 -549113 -336007 342578 500808 -1881 -343229 -216019 -115394 -237575 112321 458668
17242 458668 234199 154894 514490 379521 -453664 -1135468 -1314548 -830990 -230775 21414
17232 21414 -257764 -550639 -559122 -455263 -610792 -1051105 -789124 -133249 373600 474730
17222 474730 148842 -312511 -460068 -420577 -398166 -128377 -318710 -723887 -905203 -902617
17212 -902617 -539517 -81388 -127742 -224201 -176501 -33564 349642 957996 1424339 1602506
17202 1602506 1193225 333967 17699 -303488 -397764 -111041 169143 98240 -348856 -505699
17192 -505699 -404511 29355 263863 139717 133177 -4331 -50607 -317969 -901247 -781492
17182 -781492 -153849 75851 -104104 -388910 -581735 -365097 -26370 -172686 -144145 149427
17172 149427 155058 237851 190988 12922 -177348 -188209 -488518 -864523 -153997 590267
17162 590267 680591 258569 33945 -139368 -353558 -228470 -14880 92177 -66507 98879
17152 98879 311234 50977 -163578 89849 239929 -333964 -861121 -795245 -341930 74020
17142 74020 -37980 -358689 -492730 -454131 -294740 166992 479823 700875 900995 744671
17132 744671 217571 -479175 -752224 -464857 603 -33253 -58936 432341 672932 554060
17122 554060 340407 -15933 -244445 -100298 -145218 -316852 -311968 -153562 156984 377814
17112 377814 140393 -207793 230846 452815 260514 179547 -47666 85157 306680 337847
17102 337847 339147 435195 277792 300809 361708 498239 593749 650700 838744 911531 980560
17091 980560 788073 396733 122915 227977 943172 1768779 1924601 1537592 861883 -39727
17081 -39727 -799870 -991932 -732819 -496734 -242488 -133972 -232376 -655264 -1055385 -1069497
17071 -1069497 -1086113 -1367955 -1351070 -947340 -645576 -344353 49534 288348 467144 532340
17061 532340 315639 195419 252612 49020 -37188 -258804 -384007 -365061 -80868 466854
17051 466854 337210 -373401 -1039662 -986672 -724149 -726516 -766154 -810986 -364487 -60169
17041 -60169 78844 555657 956350 844172 515688 451957 649977 846305 799364 609173
17031 609173 503024 293340 211413 -81868 -465835 -382948 -144092 -19440 12695 -82793
17021 -82793 24774 -154111 -49812 151351 281272 566694 448696 254143 11859 -488304
17011 -488304 -704340 -514348 -825710 -1271936 -1329137 -880176 -616024 -432425 -194356 -206492
17001 -206492 -325282 -371755 -274024 -397927 -314538 -18124 124110 265783 196161 28410
16991 28410 264452 955255 1533484 1661318 1155123 736852 384263 48700 -208815 -303673
16981 -303673 -28643 84355 3290 -36470 93896 155465 -742 -250734 -238371 -34362
16971 -34362 -271496 -443868 -583188 -568552 -210890 351401 541489 294621 -170738 -288356
16961 -288356 -179364 -12190 294812 464428 391974 382044 96626 175865 611576 740046
16951 740046 727182 466912 189275 -112134 -246078 -431166 -709736 -638064 -408073 -358037
16941 -358037 -293970 -351999 -251991 -75178 -44663 57149 383936 755798 677184 601638
16931 601638 565063 288324 74492 217119 346837 -149882 -235788 143429 401018 260676
16921 260676 -168905 -492037 -110233 22480 50612 370938 537112 400005 156124 102589
16911 102589 550090 874329 940998 1175441 1145428 1145453 949866 785804 1382118 2725317
16901 2725317 4038826 5314173 7399135 10435406 14929352 21451654 26617834 23267977
16893 23267977 15605951 10766417 8002972 6536001 5451682 5039200 4619224 3680898
16885 3680898 2615808 2079799 1763706 1348664 1201494 841769 514796 491440 634951
16876 634951 1083338 1517202 1329651 1115204 1291390 1084890 848087 692103 907348 976772
16866 976772 510564 120993 257627 540080 576561 297393 376591 781541 1107161 1031798
16856 1031798 945268 1175903 959774 757254 766826 436598 241749 7424 -363880 -962898
16846 -962898 -1278319 -1180821 -1184865 -1665594 -2028286 -1595314 -683087 -268048 -579362 -853869
16836 -853869 -512315 -251541 -281090 -342019 -472587 -331152 47597 192876 70643 4638
16826 4638 -69844 -361518 -458230 -326352 -248838 -119745 52897 16334 85481 111635 -135233
16815 -135233 -590201 -1107455 -1240089 -1316530 -1516977 -1543377 -1117688 -882014 -968716 -649287
16805 -649287 -73249 214050 313287 634021 629414 408028 241129 167223 565536 752358
16795 752358 376898 40748 -113153 35811 354460 361261 351043 548878 833141 1221075
16785 1221075 1301630 1073308 982946 1261631 1430231 1033162 389199 36389 61783 -5842
16775 -5842 -47034 -160840 -76603 -97450 -21094 122962 20941 -91391 -53603 102731 61950
16764 61950 158191 550188 430339 -114741 -494813 -535566 -448843 -199435 280298 623758
16754 623758 664765 181334 -8666 -14910 -257240 -268130 6118 40952 449824 731719
16744 731719 677179 677873 249921 85538 35517 -494789 -412277 -152112 -178609 -436078 -960895
16733 -960895 -1251246 -982383 -536860 -346926 -178628 -12810 -53667 -80128 -23729 433545
16723 433545 409751 -318833 -627310 -536783 -703683 -1119392 -1071682 -495752 -158824 -216001
16713 -216001 -73519 501756 813105 629746 489650 364997 321942 -33593 -621384 -913584
16703 -913584 -732850 -463522 -18480 110124 158698 231947 522212 723322 635057 99075
16693 99075 -117978 -129502 -358098 -557612 -736211 -845976 -963867 -979694 -786840 -727980
16683 -727980 -614738 -352620 -86440 628415 767840 258933 30965 -424985 -456445 -369405
16673 -369405 -651498 -1126684 -1202653 -1028537 -758917 -448014 -328545 -150558 -98773 -368000
16663 -368000 -483862 -299749 147276 457680 522013 413557 452701 704604 652941 192741
16653 192741 188828 428715 608507 824785 822982 604612 413390 279359 182371 72901
16643 72901 -65060 112179 -15312 -448396 -644871 -209766 421755 674152 803895 653087
16633 653087 23154 -417572 -143264 351922 408943 1946 -234014 1449 195363 -45339
16623 -45339 -445466 -233565 -1274 -5567 -211841 -515984 -472104 -104276 -15212 -300418
16613 -300418 -169469 -43262 -117672 -324143 -411503 -403620 -576878 -586253 -612117 -85300 75066
16602 75066 -123772 -122743 -219106 -367605 -542662 -609265 -556759 -581613 -506947 -191686 91921
16591 91921 274379 232086 312637 475106 902898 1301214 1402635 1273979 1248669 993432
16581 993432 752852 450065 300937 551202 753117 487941 257045 270930 386455 405567
16571 405567 -34618 -499491 -611062 -604716 -316646 45052 69696 121317 146086 111708 49442
16560 49442 -299153 -427977 -228324 268799 717907 680733 285241 -115617 55871 457419
16550 457419 373065 -17256 46928 668877 820623 479247 -12621 -375380 -509233 -709928
16540 -709928 -766534 -396120 7079 -16148 214293 407539 138269 599954 763832 469141
16530 469141 241792 -237485 -707218 -437876 -3385 165453 217257 104702 117790 182889
16520 182889 199414 219582 398293 484573 460906 278132 625468 836442 582198 490936
16510 490936 853046 936465 609970 43470 -631302 -1538378 -1753174 -993738 -498187 -319566
16500 -319566 -216251 -374983 -314821 -162179 -34513 89939 84166 196009 -53649 -714390
16490 -714390 -1060837 -826335 -115768 700387 1113419 1041168 890232 591008 408252 357527
16480 357527 231341 266098 7629 -393484 -481653 -414104 -275307 -334506 -162167 179813
16470 179813 572442 550931 228200 126552 16521 -454152 -512041 -276229 -49347 336463
16460 336463 455932 -201744 -886948 -1087109 -1048772 -576546 82399 546601 699353 224585
16450 224585 102523 322654 143665 -108833 150659 449812 177166 382006 800459 753602
16440 753602 540777 188862 -78645 -141271 115553 284778 271191 195142 538248 858564
16430 858564 549098 297226 684867 850909 728703 663012 436876 265111 616605 850225
16420 850225 752682 266829 72503 86000 18349 74762 17431 92413 259032 651947 1009962
16409 1009962 850703 502075 244957 -276468 -224362 66798 279635 270954 -241279 -837682
16399 -837682 -940615 -780943 -691419 -475598 -398992 -332493 -328195 -146879 161833 281667
16389 281667 208083 29811 -241807 -329700 -144949 -178853 -255070 30447 225563 131879
16379 131879 70344 366362 176533 -506556 -787737 -825885 -849524 -734939 -446028 116382
16369 116382 649771 776453 573354 378647 135764 -453420 -645721 -487601 -499977 -448380
16359 -448380 -272733 -367862 -443926 -287582 143379 80944 30448 -87809 -210668 -390087
16349 -390087 -663470 -416763 250910 424958 99298 83506 163241 72174 423722 677574
16339 677574 388408 -52391 10492 366469 346097 169431 43535 -160718 -648132 -821282
16329 -821282 -789818 -549949 -190318 -48369 -226357 -596812 -677972 -591054 -753127 -931571
16319 -931571 -1016551 -511169 261592 578554 579286 489680 223752 214105 529000 715880 946370
16308 946370 646029 162472 -249194 -429150 -438810 -231877 169858 461781 453285 191829
16298 191829 -47622 -287679 -226891 4988 109967 -261890 -729105 -732377 -282193 159521
16288 159521 806855 1101095 586571 -93796 -425046 -389685 -194450 45673 195264 412448
16278 412448 599745 343479 17521 -6955 -440661 -667718 -749209 -1142448 -983535 -644580
16268 -644580 -703091 -642896 -335436 -245433 -444495 -661117 -323701 -336440 -373205 -168681
16258 -168681 -206884 -265776 -311258 -113969 -109324 -130315 -320950 -791651 -770151 -377150 -460228
16247 -460228 -461303 -235728 -345903 -510869 -168858 24613 -307634 -950278 -1336556 -1342648
16237 -1342648 -1332561 -1359283 -1105952 -906634 -812290 -493896 -143856 140774 137727 35393
16227 35393 -245512 -348559 -35975 102230 -11414 68575 -110329 -504840 -491114 -302431
16217 -302431 125103 692695 866658 774921 696199 476852 560918 704727 275065 39930
16207 39930 341076 504707 368785 7075 -231905 -537999 -586153 -489874 -668666 -969610
16197 -969610 -825360 -418596 -350870 -172050 344795 502717 763528 856246 637777 426289
16187 426289 196635 -52840 -322045 -359474 -133656 465187 891634 839975 284372 -268073
16177 -268073 -325941 -400508 -496611 -862891 -984764 -791591 -509860 -210026 -398985 -534780
16167 -534780 -826718 -991663 -1002735 -879467 -506849 -406246 -626344 -408827 -418421 -694500
16157 -694500 -718448 -530270 -344581 -349654 -152321 -244171 -384761 -403574 -711625 -1143035
16147 -1143035 -1070112 -921794 -740362 -561445 -384964 -387366 -76417 340030 341454 461602
16137 461602 755658 697948 64250 -429968 -394839 79519 210948 52935 -12748 -28817
16127 -28817 -6280 237279 520893 372733 -196146 -569932 -389619 -121329 -123762 -436710
16117 -436710 -496045 -238910 -40417 200642 309307 55534 -238800 -462568 -363226 -69961
16107 -69961 181604 38437 -373090 -279894 -192507 -127175 -68080 -221748 -341923 -399085 -523762
16096 -523762 -817354 -1251123 -1430677 -1184350 -876973 -536331 -248923 -86941 -71336 -3605
16086 -3605 45469 7248 83388 69051 -50870 -84970 -2897 -59601 -64742 198450 524270
16075 524270 496244 165688 -8743 273890 313633 385968 469156 378814 43914 -465970
16065 -465970 -805826 -794314 -223596 267634 325336 256457 173596 278773 666864 996073
16055 996073 1170799 1034312 665221 720571 528169 419863 125436 -120644 133768 586839
16045 586839 1005182 1144765 964326 363467 -397506 -369547 31344 390869 1113128 1644357
16035 1644357 1664205 1356528 1210748 977960 582350 -68352 -130710 102241 397566 397996
16025 397996 252001 -142177 -662743 -202701 456592 511150 331079 41757 -6266 -296941
16015 -296941 -780097 -924944 -821536 -739902 -1041266 -1164703 -1105365 -1291521 -1383680 -1126107
16005 -1126107 -871247 -931489 -878378 -814193 -731846 -425262 -194667 58779 236340 8242
15995 8242 -271803 -385874 -308393 -45921 225549 705949 813240 542494 144271 20267
15985 20267 59016 52001 -208326 -47926 413573 586387 140403 -514704 -534248 -456948 -657333
15974 -657333 -967551 -1165249 -968859 -894312 -964959 -970967 -995212 -900612 -903268 -1052711 -1100706
15963 -1100706 -934685 -931182 -1007842 -432974 5644 -131360 -108783 -107148 -357167 -578486
15953 -578486 -436675 -278408 -332560 -738295 -1169927 -1331736 -892088 -365417 48535 266934
15943 266934 461231 446768 381093 727527 1083240 1161824 515984 92790 174985 66754
15933 66754 -428492 -671076 -422291 -9336 19848 -120786 117234 537071 662056 603472
15923 603472 389815 658437 1091774 528622 -170637 -289963 -190255 -405224 -814347 -1094334
15913 -1094334 -735985 -89575 197338 -37513 -136187 305557 451350 514703 491933 153741
15903 153741 -162623 -468610 -674011 -624259 -278812 365213 710972 797046 721159 938558
15893 938558 1136395 1024578 833499 143723 -417560 -16523 274671 -116671 -368773 -192048
15883 -192048 -318189 -533813 -318978 -194212 -402664 -572672 -569328 -655545 -461036 55220
15873 55220 457179 594305 580369 505995 505299 473279 242735 233575 506855 674111 480116
15862 480116 419051 774393 736300 420607 272897 249631 327104 363250 441625 625528 468583
15851 468583 217448 -55608 78642 306326 97664 -6624 172913 225510 -106140 -238795
15841 -238795 -49332 85429 -34180 -533554 -1009967 -963032 -845013 -846626 -727257 -619506
15831 -619506 -671431 -499344 -293492 -294680 -704539 -931219 -584389 -238972 -284760 -641878
15821 -641878 -899285 -761943 -598981 -544640 -405513 -671013 -1107852 -1406610 -1179515 -808079
15811 -808079 -460273 -308698 -276642 -224568 -214319 -73184 -24543 -201295 -546464 -800200
15801 -800200 -724180 -565830 -126995 296124 317938 16836 -197515 -439944 -534219 -293254
15791 -293254 -87881 -157018 -105494 -67440 -41227 110879 105699 1002 -220482 -382471 -490307
15780 -490307 -469460 -218353 -137888 -320298 -416605 -604483 -893397 -796325 -540484 -279238
15770 -279238 -115954 -184072 -103241 -462767 -997193 -1064151 -1165134 -1195950 -1240450 -903182
15760 -903182 -462159 59684 196245 -186527 -285952 -109509 -274096 -747681 -899433 -881775
15750 -881775 -686279 -752942 -1003541 -1337391 -1345877 -999309 -598330 139213 952112 893890
15740 893890 337822 95686 204937 391264 284179 -82906 -534719 -763165 -341939 -249184
15730 -249184 -425544 185752 712941 563931 531588 384505 375675 169306 -205172 -211102
15720 -211102 -142696 -208577 -429264 -575150 -342676 -147905 -260096 -397774 -561756 -521992
15710 -521992 -182397 210697 5945 -697317 -700272 -364475 -243047 -259015 -128435 11659
15700 11659 286837 450640 82043 71193 418332 696387 806637 1007414 1060989 726104
15690 726104 133175 -314162 -349061 -286466 -244828 30319 -115445 -326503 -282993 -448401
15680 -448401 -363667 -167412 -41704 -129944 -309293 -329825 -333779 -12852 111760 -358950
15670 -358950 -797397 -893552 -859394 -1132174 -1061695 -538253 -187745 -66414 51664 186778
15660 186778 505638 799436 667646 621839 536734 114391 40465 156617 325972 673963
15650 673963 774547 404089 -196892 -285916 130326 576970 1065360 1341428 1323492 618084
15640 618084 -98374 -192165 -27680 391810 612117 527744 782095 951543 733201 718849
15630 718849 811902 732211 280801 -178147 -439970 -280931 -197626 -225650 -250822 -325019 -671445
15619 -671445 -923383 -828281 -567280 -529563 -542245 -607991 -367203 290993 910738 1018604
15609 1018604 1070093 917310 349364 128224 612415 1163050 1186680 1020074 721664 581769
15599 581769 242716 56085 67675 59511 150213 514630 607729 215147 -376397 -865677
15589 -865677 -984968 -1290116 -1404149 -1088212 -810776 -653990 -216337 -17131 2782 165648
15579 165648 192984 475763 552184 619362 776568 204515 -666828 -1000725 -618389 -469373
15569 -469373 -505368 -223509 264835 677859 641825 306137 169348 56673 152843 -102146
15559 -102146 -381245 -432992 -432959 -548706 -722148 -834330 -1244503 -1519014 -1253746 -1194493 -1215608
15548 -1215608 -1112340 -616706 190919 577272 272766 -465128 -982881 -1184803 -1225032 -1064273
15538 -1064273 -861991 -976318 -1256651 -1174391 -654606 -454036 -546464 -857311 -1229216 -1199456
15528 -1199456 -564852 259170 462013 325609 366086 512412 543250 165503 -163841 37325
15518 37325 97656 -28630 15438 171275 -163308 -319055 -345377 -583378 -290754 149622
15508 149622 262306 122932 -3432 -364178 -652598 -666248 -526949 -634344 -757107 -665308
15498 -665308 -439021 -748160 -1057799 -660279 -306410 -108169 150765 -7005 -369438 -451232
15488 -451232 -10656 220062 392256 549517 620018 411547 7019 -200515 -281887 -179164
15478 -179164 159732 391681 188792 -196424 -281761 -314088 -542862 -423060 174608 164797
15468 164797 -129036 -315521 -451631 -706856 -664709 -368311 -493411 -704218 -552672 -556736
15458 -556736 -694692 -893200 -965536 -805031 -874295 -962176 -771475 -298785 15509 -13724
15448 -13724 129942 271426 51980 -62029 -39535 -342640 -556025 -26474 496775 270956
15438 270956 -250046 -498064 -493696 -878523 -1009844 -520605 -50622 173590 225630 223509
15428 223509 190529 239538 104851 261432 575239 700802 718952 866664 897507 763677
15418 763677 963038 1174184 1081666 724611 154816 -101344 -156660 -295023 -411306 -519493
15408 -519493 -816583 -783934 -28892 201462 -408592 -749650 -530196 -117724 -131873 -413854
15398 -413854 -610888 -517380 -413356 -513737 -783700 -761857 -488885 -245823 -421298 -642604
15388 -642604 -874643 -917341 -1003760 -967755 -379909 -81261 -12793 104477 212555 210105 411830
15377 411830 449721 22497 -488414 -500969 -445126 -779126 -809506 -532990 -72715 268741
15367 268741 150679 67530 56001 197020 -118928 -711167 -841929 -717305 -533177 -270143
15357 -270143 107959 12041 -488154 -482387 -351349 -43789 -136033 -603164 -508196 -257939
15347 -257939 -1597 138875 -236638 -355832 -129631 148214 306432 1324 -401727 -675186
15337 -675186 -403857 -177268 -187823 -4834 -107225 -343129 -344394 -244968 -317532 -219760 72494
15326 72494 51174 -128330 -175136 -314625 -390159 -75607 55013 76861 201583 124040 109450
15315 109450 235097 338754 136624 -174269 -144188 -368784 -670029 -895036 -1271526 -1047222
15305 -1047222 -762174 -560155 72324 473668 281545 16344 -267001 -399323 -541024
15296 -541024 -341190 135167 21229 -199523 -195000 -170269 -292441 -298601 -99282 -15652 -60708
15285 -60708 -184064 -392884 -628763 -672363 -472228 -142560 -59935 -260287 -398530 -376206
15275 -376206 -44230 535489 692232 215882 -203140 -170624 54500 -206950 -531955 -311958
15265 -311958 -53847 33736 130818 179107 292961 152228 295095 684711 950922 1211696
15255 1211696 1211990 1282231 1120485 721049 933135 1439101 1798478 1552115 1170613 731981
15245 731981 128232 -105789 64246 151580 307630 424810 454521 695333 660124 135293
15235 135293 -292987 -361990 -79450 468982 522822 377488 309452 272855 451293 379960
15225 379960 -66854 -204271 14004 70756 174858 427948 435943 206782 132079 369141
15215 369141 383413 130280 -153753 -232941 -220279 -425943 -796335 -875952 -758669 -675356
15205 -675356 -864830 -717818 -106952 -106861 -46349 -37948 -94761 -68223 35482 -120458 -153316
15194 -153316 62398 251595 659338 659814 314584 202027 350832 194552 -500015 -284650
15184 -284650 268452 278558 178620 -1698 -87232 -338310 -553604 -554050 -400569 -233376 -226321
15173 -226321 -554713 -544837 -759935 -1111344 -1005129 -797278 -592548 -602016 -953709 -976532
15163 -976532 -689304 -621326 -853602 -776878 -129163 239980 252769 231245 200639 222711 199932
15152 199932 182257 70568 -128466 -297114 -286335 -190078 -211763 -102177 4977 -101441
15142 -101441 -430204 -450101 -608500 -962394 -1041761 -1000795 -1137238 -1038094 -373351 141621
15132 141621 79343 -491444 -801674 -811114 -550468 -298998 -479131 -742856 -886235 -385117
15122 -385117 94027 66693 35556 215227 208207 42329 -284821 -249518 215424 288395 245421
15111 245421 50205 -145967 -376757 -489447 -454667 -535807 -347403 -113303 380124 1369723
15101 1369723 1518490 1276671 1632778 1869884 1263193 266498 -251916 -234777 8452 397646
15091 397646 782217 1016812 887871 485360 365387 388184 265744 -337815 -770862 -874876
15081 -874876 -628742 -613475 -546427 -429268 -413793 -349538 -287984 -89851 -350206 -575891
15071 -575891 -397428 -79442 -258616 -417085 -524524 -430758 -92759 114262 315780 260541
15061 260541 39940 -115260 -267925 -489503 -854069 -922010 -577083 -96346 397873 434531
15051 434531 352083 -1118 -583675 -396658 -178124 270203 648505 623435 317381 -255775
15041 -255775 -773615 -981273 -1137953 -1130633 -883746 -758965 -360377 483725 694446 274728
15031 274728 282341 450071 519084 566604 784683 705856 303989 200609 355718 341775 257276
15020 257276 218685 259487 289367 37089 -356939 -567885 -610602 -323279 -94274 -247515
15010 -247515 -509501 -562178 -835087 -817830 -701616 -760604 -1085317 -1401339 -1386464 -1279803
15000 -1279803 -789558 -225863 92439 89014 73306 -95981 -398660 -249253 382726 706452
14990 706452 547493 469707 317743 137128 287214 121111 -523024 -856808 -851466 -576054
14980 -576054 -229782 299146 456450 -40302 -648834 -773004 -514585 -214182 70755 283189
14970 283189 24589 -99567 -240405 -368240 -420530 -218300 375171 718865 720386 720335 392587
14959 392587 90850 -104397 -298865 -50867 364061 789469 869311 743352 650875 467714
14949 467714 198416 -493098 -1007229 -1046823 -814722 -218738 362735 584933 289354 -218670
14939 -218670 -588614 -882189 -980690 -801343 -693415 -451616 -98151 160611 285678 666966
14929 666966 929630 628033 355031 304536 703415 965730 907485 761983 443387 317738
14919 317738 249673 167870 -265741 -495218 -370968 -199723 16039 -141576 -98386 40516
14909 40516 -122232 6905 229105 596784 498501 412957 459283 508959 354542 116450
14899 116450 95522 362711 565979 650177 337277 35129 -114268 -707508 -1140241 -904792
14889 -904792 -601900 -488990 -620324 -469394 -124496 313427 275364 351634 560913 107831
14879 107831 -285008 -113097 7218 -319245 -581630 -382053 -338646 -621145 -744450 -801538
14869 -801538 -392630 -71641 100564 109371 -250319 -552137 -482732 -432407 -242924 365052
14859 365052 643812 627487 682543 462263 310661 452725 146162 -138881 -115763 -429104
14849 -429104 -724385 -690978 -368463 -376587 -644334 -501620 -388991 -658962 -973570 -1299547
14839 -1299547 -1210818 -822131 -460466 -254968 -308957 -651852 -759662 -576980 -377924 -451895
14829 -451895 -929132 -1251018 -1125799 -952322 -816418 -360714 -134559 -234524 -204835 -84626
14819 -84626 -174670 211 644393 1144545 1004888 741592 644319 375329 152751 215812
14809 215812 281260 -61654 -365128 -344704 -290085 -461281 -980264 -1151795 -931303 -819660
14799 -819660 -947815 -795820 -68373 670101 553418 -51325 -180449 -48353 68677 -4251
14789 -4251 57637 176206 -91486 -418347 -171471 77946 193558 296967 309771 614276
14779 614276 726174 643351 564352 401850 -37804 -850528 -1467735 -1258377 -431999 436934
14769 436934 842002 890657 720982 742140 1008357 870177 449064 212964 -345284 -762793
14759 -762793 -322451 124117 243720 164867 -109186 -580958 -848597 -619882 -459554 -413961
14749 -413961 -125515 44038 -184527 -225691 -545941 -949708 -1186979 -914474 -132300 270872
14739 270872 307089 129133 -287498 -785084 -1077740 -1231092 -1307576 -1432839 -1537797 -1129131
14729 -1129131 -137015 511448 246917 -59310 -210053 -283655 -417665 -637387 -705534 -849209
14719 -849209 -1002864 -1012652 -723774 -450044 -593941 -603083 -577292 -748539 -676185 -470163 -238915
14708 -238915 -62204 -285729 -735256 -567577 75469 188205 153168 278131 59434 -244045
14698 -244045 -411341 -332614 -390037 -524110 -637996 -735250 -985821 -1164930 -1391933 -1749947
14688 -1749947 -1791154 -1395884 -690465 -186765 143256 98063 -259381 -448751 -445274 -180259
14678 -180259 -208969 -339834 -273846 -104960 204534 591718 825102 941620 666008 287505
14668 287505 19695 56599 416523 462473 215869 -135799 -98678 -29366 -155922 -241013
14658 -241013 -371547 -319327 -200218 -425809 -261292 210952 287710 446025 727745 871010
14648 871010 599242 203812 -409819 -565246 -577728 -837265 -369649 269704 -11650 -112180
14638 -112180 89276 -218855 -391619 -36448 532855 826656 750336 491968 187218 -42376
14628 -42376 -242770 -96373 494284 956190 1160078 1221052 1079513 624387 193138 274663
14618 274663 578716 785490 525777 26789 -25101 88914 173808 449426 674831 733580
14608 733580 560791 174910 79372 102190 250058 369189 4599 -544627 -626493 -397417
14598 -397417 255016 602967 95201 -130828 -483263 -652601 -611876 -574645 -559525 -622665
14588 -622665 -762737 -533757 155923 574621 572952 571722 425208 495077 689976 664621 417630
14577 417630 83743 62027 353569 390731 228856 112884 82204 282783 383547 392508
14567 392508 397711 466534 619188 228683 -618058 -1084408 -999548 -613639 -601340 -982738
14557 -982738 -1015073 -581967 -336733 -324254 -126562 -53776 -217153 -674958 -879575 -327604
14547 -327604 -33521 -71665 108320 222115 50590 -48166 19951 -116175 -101157 -188334
14537 -188334 -283644 -410082 -910134 -1240155 -1016889 -322374 496395 899049 850996 545549
14527 545549 -251979 -729829 -805769 -968577 -1089310 -1463459 -1728740 -1572342 -1349025 -846855
14517 -846855 -370759 -218513 -106110 165272 743742 1196783 1076154 496410 8979 -42747
14507 -42747 111799 186190 150755 178756 198608 87103 16744 -365089 -826764 -1060443 -942938
14496 -942938 -942911 -1034271 -1122458 -1021979 -958707 -1016743 -1078377 -827691 -498950 -578402 -706016
14485 -706016 -711571 -558648 -486429 -143495 154615 -40087 -511868 -838459 -1009316 -727193
14475 -727193 -405085 -35583 561668 734308 364610 370267 405282 469187 491350 447723 277551
14464 277551 358760 608122 802259 1148067 1660603 1853146 1445342 1153396 973975 284131
14454 284131 -496969 -665753 -781659 -438061 175980 222982 -1552 -91213 -18844 34345
14444 34345 151996 209161 460914 817089 1212912 1258118 1091334 893879 808187 894698
14434 894698 822246 701437 863681 896312 559438 440897 196879 139030 432557 506127
14424 506127 453569 547080 172043 -508790 -626537 -572877 -578285 -817408 -494433 -84175
14414 -84175 225251 270665 51795 -214548 -554793 -769833 -445282 -121772 -220615 -53660
14404 -53660 92149 -282240 -508206 -161621 372872 701857 361274 -143594 -418867 -340313
14394 -340313 -53476 97815 301682 393246 230827 274286 690461 910635 854726 925427
14384 925427 1007242 831439 1127639 1009408 440121 45300 -503548 -1007405 -860215 -492439
14374 -492439 40105 444116 290275 110399 278657 458804 336030 320681 312161 71400
14364 71400 140979 173090 -168237 -423058 -505070 -485722 -214329 233134 654921 948646
14354 948646 632037 279319 401221 537770 608659 535294 687667 536106 512602 684007
14344 684007 606923 869652 847161 328881 34162 -314356 -240655 186763 -38873 -333759
14334 -333759 -272343 158425 620782 865856 520635 231825 -24379 -89458 121980 105890
14324 105890 -38776 -475737 -537838 54727 178287 -262759 -557680 -278641 -15512 106806
14314 106806 159831 85156 69253 24913 14171 -15896 -159109 -258786 -502203 -364795 8592
14303 8592 496446 727977 655306 504275 264301 -3858 -245813 -377214 -471476 -718835
14293 -718835 -1221675 -1305856 -713094 -572168 -460774 -412320 -278564 -258321 -171541 16906
14283 16906 196272 215169 230866 19680 -213555 33736 404456 513190 448384 438907 281622
14272 281622 -152832 -441601 -538779 -460245 -551414 -597010 -444418 -276812 -236504 -542896
14262 -542896 -712345 -346090 82443 127848 242817 702617 598208 330476 84755 72174
14252 72174 513397 529317 46713 -412162 -680958 -613104 -346340 -399012 -501662 -361280
14242 -361280 -302800 -243556 -11387 45559 272277 458032 306307 -176257 -273711 -184068
14232 -184068 81348 218546 374972 527193 387765 186902 -22153 119349 16083 -428348
14222 -428348 -439703 -45986 165983 384905 473715 166904 -192072 -590389 -487268 -182065
14212 -182065 9437 164329 32980 -625774 -802551 -739575 -623402 -464182 -393296 -407100
14202 -407100 -457363 -452857 -332184 -271397 -610697 -614336 -519067 -701525 -758549 -890257 -858345
14191 -858345 -380915 89966 38739 -264391 -130614 195428 19958 -509367 -822193 -598991
14181 -598991 -749740 -512171 -50878 187456 246993 145222 -42981 120222 369599 461481
14171 461481 257613 350314 672829 1039213 938147 402542 243528 425712 919610 856755
14161 856755 427982 -141839 -604313 -828946 -660662 -113456 232633 54840 -113636 -467715
14151 -467715 -795827 -540579 104096 410805 624226 820939 497185 -42594 -425512 -537333
14141 -537333 -130263 84941 -294232 -773580 -1056515 -1136279 -930171 -598123 -194907 -71490
14131 -71490 166200 248088 126663 -29232 -269822 -314737 -85505 323850 527450 411937
14121 411937 696365 587505 347176 76889 -366898 -528905 -410501 -143570 -112952 -59263
14111 -59263 252614 432215 349326 373293 422308 482758 484399 367567 389597 491079 365264
14100 365264 305995 420424 519148 418358 -94821 -312524 18054 -131932 -408421 -126770
14090 -126770 119440 236242 137895 -49132 328345 588668 329096 125791 -41338 -65771
14080 -65771 72947 191216 321434 634092 681196 465188 507028 537873 502511 476355 108014
14069 108014 -402633 -535313 -454429 -346506 -553802 -580391 -480899 -387135 -166995 -118085
14059 -118085 -23959 -37294 -173564 94381 310415 309982 104696 -168971 -257225 -317508 -538622
14048 -538622 -685019 -646320 -722690 -578988 72296 836698 1152027 1038942 851960 867103
14038 867103 774595 502437 450817 1023496 1411433 1007995 389841 124701 -17646 -215044
14028 -215044 -446860 -137333 -44771 -331204 -365493 -83978 21549 -211159 -1011084 -1370684
14018 -1370684 -1069467 -714680 -386274 -389474 -640415 -780193 -752395 -780387 -719655 -573742
14008 -573742 -547836 -605154 -488686 -221666 -133063 40228 230826 222825 449243 558597
13998 558597 597851 350570 -177088 -485221 -464902 -49571 -28544 -224390 -43911 218262
13988 218262 287204 418334 263045 187130 77044 -126206 -126169 140062 493931 293596 47090
13977 47090 23333 324798 477964 204515 -438170 -791583 -620688 -272780 16350 -132927
13967 -132927 -442112 -214463 329241 825129 390021 -289927 -671373 -608947 -120643 280228
13957 280228 82543 -282869 -694268 -988002 -588342 -588062 -1034722 -895262 -591802 -323871
13947 -323871 -41895 317300 348167 28723 -467829 -388480 -19957 393731 419627 185272
13937 185272 113510 -302425 -918532 -1312362 -1237457 -766608 -838393 -951681 -683646 -307617
13927 -307617 -179984 -278030 -243542 -22392 -287032 -907951 -959242 -933219 -1042292 -921350
13917 -921350 -457630 -246340 -589205 -764888 -470600 -404896 -231848 364880 614599 635789
13907 635789 701677 923865 1160091 1186788 741104 431226 295933 -20181 -214419 -34516
13897 -34516 23966 -198156 -36540 116963 -49152 -28225 -48519 -40983 -75238 -241782 -498361
13886 -498361 -967267 -690957 -371451 -389784 -253554 -66580 -331442 -692357 -906623 -984636
13876 -984636 -781939 -442644 -321414 -349519 -288121 -308990 -368084 -477448 -405020 -335931 -634424
13865 -634424 -876427 -776395 -547458 -187508 224481 358471 137862 -404377 -651004 -258001
13855 -258001 73665 453230 597607 559577 424515 23050 -227136 256242 889602 786747
13845 786747 513381 359007 280069 403361 388587 439699 583633 820455 665008 460866
13835 460866 268813 296246 344241 -66366 -335440 -389694 -182331 -294118 -387055 -75128
13825 -75128 119907 -404048 -865345 -907036 -1009644 -880326 -573520 -323826 -210800 -184882
13815 -184882 -96339 -336216 -352566 -36994 118423 129897 368614 353517 122187 390823
13805 390823 280618 -260206 -175341 -172825 -207457 -117549 55361 266578 211434 47033 -265688
13794 -265688 -829240 -888554 -442645 -22524 60097 -41967 -319186 -374354 -178174 -52051
13784 -52051 142880 151493 -128180 -14808 345387 411535 144433 -478087 -949681 -883290
13774 -883290 -504046 -263530 -168853 -181148 -97025 -234157 -620161 -442678 -623352 -1244879
13764 -1244879 -1500814 -1316274 -957882 -622504 -384433 -458311 -873385 -1068884 -797958 -506022
13754 -506022 -141329 125886 2125 -172135 -40190 -47333 -130527 -549313 -800311 -483472
13744 -483472 -230004 -351329 -560158 -626219 -811723 -904832 -863213 -619415 -457200 -368623
13734 -368623 -683157 -991527 -691665 -390185 -216364 347268 619887 335555 203460 326528
13724 326528 457240 638941 566917 391792 33313 -33265 234489 367247 553015 693727
13714 693727 508273 209398 -64354 -430092 -758303 -732585 -781631 -585843 32953 384034
13704 384034 204004 4107 -88366 -334124 -486736 -411471 -270927 -142259 -315611 -1041218
13694 -1041218 -1453759 -1646273 -1580963 -1110531 -410033 -145590 -632979 -911512 -1010443 -1307400
13684 -1307400 -1432461 -1292666 -1236777 -1235174 -1146993 -910778 -1012218 -1185647 -1161730 -1285599
13674 -1285599 -1205541 -970785 -855065 -994760 -1096156 -912274 -677663 -647376 -562567 -564870
13664 -564870 -708128 -745726 -698220 -530744 -428628 -361264 -324715 -483816 -270076 -250268
13654 -250268 -435810 -23159 293546 -36674 -398864 -430965 -460391 -755944 -880556 -1056683
13644 -1056683 -946516 -1154200 -1426051 -1221194 -603191 -301872 -534842 -645558 -910006
13635 -910006 -1251043 -1045139 -618085 -321825 -116131 -65456 -138256 -223465 -207008 -319017
13625 -319017 -445169 -759499 -811727 -687263 -714829 -792663 -974176 -1023273 -705683 -424786
13615 -424786 -151790 -176352 -253647 -467402 -855491 -605851 -163102 21572 128619 282493
13605 282493 279941 318778 314078 400575 759104 643303 299298 132917 85058 187123 215036
13594 215036 228936 91107 257243 497989 840493 1053921 776772 571784 664090 624813
13584 624813 653069 581353 164022 -145657 -550854 -983536 -1206741 -1139500 -817151 -150038
13574 -150038 518774 430891 -183603 -503567 -200484 607536 947218 699534 417407 -143952
13564 -143952 -514532 -249823 -21663 5963 -13752 221555 363338 297673 -161426 -437061
13554 -437061 -228294 -51347 222151 325055 385150 290421 322643 106313 105536 316318 539431
13543 539431 846662 946685 1189642 1383965 1235700 1083820 917844 496729 300725 350593
13533 350593 336713 209713 104645 99614 -219282 -628953 -933450 -1265942 -1048749 -680315
13523 -680315 -240809 -27715 75362 388951 464815 90158 -126660 -97123 -110947 -585142
13513 -585142 -716130 -503320 -415583 -488408 -653283 -381236 171332 779403 702465 387517
13503 387517 -193230 -610932 -218030 -186594 -366027 -426232 -471832 -478836 -525021 -523987 -523953 -390646
13491 -390646 -161175 -109979 52961 370828 825097 1300970 1260680 1349257 1510879 1424006
13481 1424006 859860 520195 877356 1209464 1060882 941810 1048342 927343 753270
13472 753270 782364 861481 815790 533849 215922 -223182 -293856 174103 139550 28602
13462 28602 -25307 352057 601379 58802 -629759 -695568 -113306 51098 -230459 -328551
13452 -328551 -62341 91106 436907 306138 -191891 -649161 -690958 -376443 -484479 -509307
13442 -509307 -321721 -340255 -635925 -517686 -293006 -296091 -412193 -444149 -155299 -21679
13432 -21679 -278490 -895183 -976346 -901454 -1200274 -1613081 -1687587 -1089533 -802953 -763623
13422 -763623 -193668 -110545 -606333 -648629 -331561 -348871 -414058 -234825 -454915 -762521
13412 -762521 -953103 -665908 -17416 -240213 -472141 -198893 -104757 -402772 -24526 511381
13402 511381 593720 516064 614453 436879 297086 423197 291177 81433 78041 -43232
13392 -43232 -239795 -374504 -429326 -226456 20768 219288 88656 89692 52217 -281428
13382 -281428 -319421 12770 -14484 -363474 -663426 -694485 -659174 -743320 -932900 -627145
13372 -627145 -330556 -66227 27278 -102141 -72728 -341444 -660524 -738832 -306934 -5519
13362 -5519 -72896 -313277 -306081 6486 115820 198189 75638 182404 325875 280382 -170447
13351 -170447 -453850 -484845 -334770 -109105 167434 347079 266891 -180132 -635408 -888908
13341 -888908 -1040793 -757082 -723093 -1049107 -902868 -692166 -560387 -435761 -127652 270492
13331 270492 730651 1013788 847888 666244 354350 283858 600201 729553 740677 536657
13321 536657 557812 618783 830016 1102615 999055 720878 240858 -240134 -564492 -921414
13311 -921414 -882917 -583655 -368615 -386130 -364685 -327709 -497700 -697451 -603441 -346009
13301 -346009 -204895 -147461 -49471 66478 -218054 -471953 -455045 -429599 -346886 -647342
13291 -647342 -1039312 -1031129 -416543 -56355 -208781 -235671 -3635 305858 474274 509369
13281 509369 446910 730583 1154117 1106432 1109701 901975 458874 -14023 -294861 -303188 -417775
13270 -417775 -551323 -511791 -423380 -539586 -899754 -951869 -726464 -662009 -491444 -183461
13260 -183461 19672 153736 200264 19116 167293 438347 706755 618273 487825 324644
13250 324644 96058 86320 116891 329988 615544 668672 693652 570215 558532 968128 1144140
13239 1144140 677705 170949 148691 234813 214260 277453 362130 850218 1089991 732747
13229 732747 669101 780341 745558 733911 425886 -97831 -220926 -64492 -14318 -140550
13219 -140550 -213834 51310 466260 948578 1214394 1225626 1181311 1273777 1110724 916534
13209 916534 1047404 1423871 1899604 2156865 1979827 1706619 1192377 722835 716432 691910
13199 691910 570926 788512 1002253 1225402 1103531 437297 225966 93232 -139720 -160509
13189 -160509 -73560 569125 1276782 1392927 1141195 1139747 1150309 973349 815535 679253
13179 679253 245891 -73251 -103237 156423 575607 687493 687891 592221 628797 609889 505815
13168 505815 534242 912932 1208699 1410304 1807886 1781636 1582123 1651279 1908054 1855364
13158 1855364 1261983 766904 568807 537952 540954 753787 860925 870609 1174904 1672189
13148 1672189 2047843 1754383 1108554 454071 466168 503404 391918 386602 383421 513527
13138 513527 470180 140243 3146 250853 1035677 1900246 2043906 1916387 1574897 1313632
13128 1313632 1170161 994437 851235 763599 585114 376669 158058 209809 171396 75087
13118 75087 409959 1057452 1588361 1688505 995535 28380 -254058 -279564 93963 594013
13108 594013 825011 980064 1356279 1598966 1792990 1644616 1233532 1189076 1138579 1094843
13098 1094843 820535 694055 685064 735580 1004450 1311432 1436381 1682838 1864374 1987290
13088 1987290 1828187 1283705 1361608 1668063 1677400 1336092 749268 171526 330591 594296
13078 594296 487340 387849 596622 1129303 1634546 1575417 1273967 1196980 1371226 1558908
13068 1558908 1584615 1390240 1293987 1023882 1070589 1470900 1750977 1715675 1711874 1489568
13058 1489568 1153154 881648 504624 421325 821113 1401744 1616946 1728430 2051069 2131251
13048 2131251 2075825 2343008 2661608 2794628 2734626 2650673 2752433 2841370 2695010 2430431
13038 2430431 2436768 2569263 2623507 2959472 3311012 3249555 2979018 2785526 2638936 2593284
13028 2593284 2853562 3194615 3335161 3313426 3183602 2953832 2717863 3001448 3333092 3579274
13018 3579274 3687896 3978031 4312294 4067288 3669145 3496603 3771957 4420003 5248376
13009 5248376 5308694 5373237 5956733 6732245 7214855 7097473 7368768 7862415 8499097 9262473
12999 9262473 9775308 10467222 11617617 12681076 13843611 14615728 15055305 16124415 17709273
12990 17709273 19787839 22611997 25743923 29710818 34343560 40153595 47056539 55122796
12982 55122796 65292064 78864644 95633479 116740035 145184441 183328616 233839958
12975 233839958 297220052 365056447 413426779 413948884 367621179 302748327 242224541
12968 242224541 193903228 156822280 128376242 106514948 89517370 76113278 65068094
12961 65068094 56224829 49156406 43226755 38151852 34016382 30917064 28331414 25736395
12953 25736395 23315472 21089592 19390263 18186973 17039943 15945157 14779761 13626026
12945 13626026 13145434 12480985 12034079 11727830 11089993 10819322 10956231 10786313 10266462
12936 10266462 9740443 9208876 8737812 8571409 8545956 8460120 8362144 8262630 8446960 8894008
12926 8894008 9445161 9782018 9821771 9888855 9965543 10642107 11573957 12439970 13267023 14302438
12916 14302438 16023535 17769566 19452943 20260219 19897936 19004455 18363649 18324304 18611507
12907 18611507 19106656 20146402 21408611 22628296 24278399 26393477 29250135 33256691
12899 33256691 37703356 43493998 51272260 60639339 71752628 85636339 102977887 125730408
12891 125730408 156621891 197913463 251984131 319223648 387345813 426600180 412129107
12884 412129107 355411894 287957984 229091899 182944678 147932454 121212937 100562342
12877 100562342 84702423 72470928 62920448 55606995 49372338 43457107 38468722 34511375
12869 34511375 31104628 27937037 25270020 23075330 21304841 19728947 18386525 17419257
12861 17419257 16617187 15385272 14518472 13781145 13107083 12378240 11860253 11824097 11433659
12852 11433659 10732242 9821342 9012784 8870902 8857997 8577355 8669033 8736670 8725085 8964302
12842 8964302 8762899 8288277 8246189 8462787 8863926 8894164 8721436 8625009 8839842 9524076
12832 9524076 9712973 9871248 10282489 10503387 10666132 10790226 11241609 12410385 13347098
12823 13347098 13800645 14390937 15118244 15831953 17310262 19257002 21017037 23199556 26449944
12814 26449944 30369833 34721974 39577730 45641707 53165809 62474000 74444467 89918142
12806 89918142 109158215 133837576 166752025 210472313 267258041 334140666 395324349
12799 395324349 420362776 392931566 332663186 268205845 213418213 171128822 139176783
12792 139176783 114627888 95666619 80564770 68478496 59254430 52015608 45722265
12785 45722265 40229956 35887145 32403786 29299762 26407327 23805509 21416955 19232723
12777 19232723 17870166 16518406 15055956 13860518 12631617 11736611 11131618 10687456
12769 10687456 10190730 9762547 9508706 9260331 8878785 8017321 7358289 7421062 7299570
12760 7299570 6851627 6263690 5784321 5374759 5177552 4933079 4054563 3737758 4125483
12751 4125483 4150698 4249241 4438337 4461027 4104771 3631272 3399727 3013423 2776764 2812867
12741 2812867 2460905 2255056 2192244 2451451 2733531 2640076 2481505 2537043 2681150 2431352
12731 2431352 2122262 2138965 2250433 2138183 2096582 2130823 1707470 1327592 1445218 2225273
12721 2225273 2375946 2300333 2285649 2114596 2032335 2201503 2402604 2528483 2573629 2429092
12711 2429092 2149139 2190666 2204967 2105206 2259906 2451744 2371298 2400289 2508283 2683627
12701 2683627 2676916 2481686 1911273 1533907 1541013 1312822 892202 865186 885333 865912 955697
12690 955697 1026540 956170 992070 1040441 1096640 1242054 1188381 1116545 1070188 1137137 926089
12679 926089 986776 1173185 1129672 1218745 1428578 1113188 721369 611645 757168 937908
12669 937908 1052938 1283303 1624361 1527383 1295130 1180366 1151659 1311764 1193073 871126
12659 871126 509319 183594 289598 114547 -94526 -66190 -98106 -196325 134431 585999
12649 585999 1101204 1139512 739508 553098 177690 111316 503727 622230 510865 964314
12639 964314 1270885 1221625 967219 503427 50733 -14198 343967 874793 1296751 1215826
12629 1215826 850835 499909 169345 -233363 -472362 -124564 304957 507116 650098
12620 650098 334597 163794 281678 148376 -144148 -176341 257968 838615 1098097 583265
12610 583265 26941 -97317 -243774 -615497 -849564 -739249 -738209 -506138 47776 477127
12600 477127 944531 1200250 992719 662861 288566 387778 784385 931121 691718 660083
12590 660083 599505 729607 647490 -50535 -731641 -895040 -683344 -440315 -124398 234661
12580 234661 575275 1135506 1199929 938065 709133 467861 529901 788880 901823 770889
12570 770889 404840 277184 264248 271021 147472 285296 466144 612921 721190 454490
12560 454490 379757 452409 157618 -203905 -282080 -186024 -272783 -382817 -261536 -132725
12550 -132725 304341 628494 334158 144945 583310 776945 703180 692995 667822 532640
12540 532640 446110 288628 -192496 -421168 -184814 54040 -16777 -290350 -257114 160699
12530 160699 269345 195416 133516 278463 615404 986698 887548 509749 674383 750407
12520 750407 266672 -148441 -23488 211297 438299 694581 916270 794127 335543 -63775
12510 -63775 -226924 -46945 2838 -130990 170046 218823 -233968 -186363 223403 220285 86055
12499 86055 150547 289136 346169 151651 -152948 -147692 299733 977512 1062882 650185 714334
12488 714334 817169 835315 543743 180534 25022 -83742 -3780 235088 755995 800120
12478 800120 244361 -61737 258345 245023 -53771 -186251 141622 626048 729154 631083
12468 631083 786686 1077423 832215 493312 253867 197815 408315 179156 -150953 -232860
12458 -232860 -152964 -117873 49679 383326 761064 920882 848397 572638 347551 453967
12448 453967 573693 343544 -75674 -612 114938 -171499 -244017 107800 480078 729304
12438 729304 1233364 1413874 1446382 1173217 775597 737460 504036 155929 -33770 77611
12428 77611 321762 464867 530449 285418 -176795 -138756 244621 622474 994607 1104203
12418 1104203 955348 531090 506615 656814 264195 388230 903131 1213876 1093801 895674
12408 895674 947771 844521 376398 -155977 -231641 -115076 281319 572683 510531 408771
12398 408771 706740 1089396 1284668 1104007 857689 366162 -139152 -408953 -358821 -151776
12388 -151776 -90884 18785 847 -63082 148317 642871 763243 781329 748596 687679 650001
12377 650001 824714 640785 498242 682857 915897 876511 345432 -237707 -560104 -720647
12367 -720647 -525138 -299505 -592513 -894442 -845418 -381566 88612 152718 -18719 -40427
12357 -40427 -143087 144822 486770 362231 272864 113310 -19811 75060 223662 458896
12347 458896 868629 890709 832720 611993 308275 27056 216554 512010 220170 -284123
12337 -284123 -269339 -573424 -944004 -848980 -647669 68201 400443 337734 467117 658179
12327 658179 415966 -99850 -266150 -444656 -1010846 -1057417 -866505 -891471 -1146284 -1112893
12317 -1112893 -938097 -990321 -1139123 -708012 -267112 -192624 -174745 -219635 -254045 -89303
12307 -89303 -50483 -661388 -962468 -774994 -416279 -645687 -808243 -772359 -604067 -608493
12297 -608493 -802636 -898201 -986249 -1159273 -831533 -362945 -166586 -371457 -282011 82910
12287 82910 389940 642052 556382 412163 336724 677680 808785 660439 853275 1206073
12277 1206073 983166 781344 935246 725765 723509 308516 -53341 -65411 -349351 -461199
12267 -461199 -337449 -413379 -589147 -118453 204090 7466 217021 483244 382218 493921
12257 493921 446873 195366 -46601 171442 571210 631945 450126 439622 690759 628049
12247 628049 355486 42366 -140652 -124643 79540 439295 848089 1039990 907012 631806
12237 631806 583290 956246 1230709 1210379 986541 268041 -426650 -416112 -339565 -206245
12227 -206245 -36842 -39962 -135466 32971 87375 20041 255069 378851 328574 375222 494556
12216 494556 168657 -363540 -501559 -304182 -178740 -137085 199384 111175 -505476 -1041183
12206 -1041183 -1100798 -950931 -853766 -912262 -847395 -1003068 -1256957 -1538230 -1844448 -1734226
12196 -1734226 -1464652 -1326303 -1578892 -1646305 -1411828 -1121491 -485681 336592 598908 372602
12186 372602 25994 -297774 -516327 -719872 -666596 -215277 220996 465496 612785 585240
12176 585240 427863 85172 -191141 -215541 263886 964266 1257403 544311 -110981 -210062
12166 -210062 84321 272329 443508 143484 -504132 -778401 -981304 -1021123 -1075817 -806188
12156 -806188 -151393 341602 500469 672570 1024124 1160723 1404662 1009768 408555 162295
12146 162295 -13819 -159520 -296513 -54572 -262259 -692636 -969229 -1418078 -1503063 -951075
12136 -951075 -390522 555 173587 384246 642280 769386 526956 -50574 -515235 -910123
12126 -910123 -1182578 -1047202 -923099 -818032 -771165 -889421 -930180 -559459 -174087 -42170
12116 -42170 -9894 -240801 -737804 -1302584 -1508166 -1174629 -724119 -519214 -420921 -243475
12106 -243475 -167599 -156077 -98655 -435547 -739811 -688290 -507419 -172118 -67030 -219711
12096 -219711 -192748 -109251 -12124 394103 207649 -214648 -399701 -418264 -65507 94600
12086 94600 -275823 -580102 -181208 584999 803597 740201 495877 392736 274510 172672
12076 172672 151356 115143 -60099 -293281 -164967 193645 459811 515843 562587 622756
12066 622756 558322 458492 218233 -20437 197932 609501 522418 298283 169132 412722
12056 412722 560330 541897 634599 706181 656924 364472 224281 -139529 -560479 -1163816
12046 -1163816 -1203590 -1019841 -785684 -714680 -795751 -439633 16985 430019 496134 225512
12036 225512 -165822 -491345 -381780 -13632 217137 331852 112446 -576432 -574178 -304669
12026 -304669 -44824 130768 49916 264803 419543 113860 -125213 -63003 -140183 -274298
12016 -274298 -509465 -680013 -880528 -786771 -410713 -382541 -421625 -356117 -565490 -766418
12006 -766418 -820234 -572785 -190857 -189904 -274449 -324477 -679195 -1057957 -1066870 -712358 -118082
11995 -118082 314680 592477 535654 250112 190295 401066 548723 461417 346328 536426
11985 536426 511476 463505 339544 470618 945918 1070304 718600 78409 -57048 -63907
11975 -63907 -166467 -29935 388292 890480 996164 702473 254488 268591 408055 606116
11965 606116 798549 656217 260327 182447 360969 -110702 -839296 -771067 -296721 96030
11955 96030 2762 -471123 -557816 -359115 -163087 -86540 -47626 242928 240382 251207 485376
11944 485376 377175 140951 -64316 -126661 -138785 -235814 -370401 -576890 -724433 -604497
11934 -604497 -414538 -747080 -1180048 -988270 -648159 -502310 -355574 -275976 51296 258681
11924 258681 238190 501213 325867 -54736 -333696 -406034 -519076 -674088 -736747 -535432
11914 -535432 -543297 -432838 -494784 -889458 -1307293 -1268328 -1032815 -490231 61121 474595
11904 474595 612027 265859 -253339 -834795 -778292 -22615 414986 470378 254174 94576
11894 94576 111224 127103 429229 801292 887218 624677 45436 -454942 -492106 -422265 -415638
11883 -415638 -469053 -419513 -155004 -315282 -736190 -508899 -392292 -421526 -326528 -381404
11873 -381404 91039 241759 -85749 -272873 -366727 -774377 -1281647 -1190708 -734597 -460444
11863 -460444 -32417 406864 787506 1054321 582807 10767 139021 343210 177029 -18257
11853 -18257 -164028 -561407 -637703 -336964 -55542 -418186 -384047 172328 57585 -429867
11843 -429867 -565580 -227982 513459 1227335 1310630 1026566 824997 677528 280207 271807
11833 271807 704161 829884 573657 397909 89463 -201477 -124152 414104 767196 914337
11823 914337 462776 34333 97401 75530 -59979 -242435 -239359 -9390 -160915 -286904
11813 -286904 -56353 -370036 -824630 -907969 -1279294 -1530028 -1233112 -916854 -277686 68751
11803 68751 -327502 -591406 -582907 -570630 -643503 -785072 -675332 -460449 -517399 -827448 -845471
11792 -845471 -392810 -593 185949 362066 468971 625073 699936 658313 520960 434223
11782 434223 388740 302563 554692 542391 102491 -178233 -394106 -1174567 -1317539 -854682
11772 -854682 -767479 -804541 -792983 -793999 -522497 -150861 -91937 176186 466200 755637 950926
11761 950926 995632 417454 -5111 133475 132753 440929 11273 -86868 402130 944845
11751 944845 1165120 1082263 897064 670942 492056 226187 -90938 -257867 -66550 53833
11741 53833 -344947 -407549 -20122 172146 131299 208117 363769 189142 -142493 -193197
11731 -193197 75939 320328 514703 402753 74209 -199744 -437589 -724306 -704975 -491553
11721 -491553 -459563 -638847 -496546 -539679 -754919 -687624 -379043 87601 194263 464786
11711 464786 391469 386762 625116 883637 1054421 770344 507212 705222 660753 210784
11701 210784 -94433 -113094 149130 345435 350586 -221234 -663508 -683494 -548475 -335432
11691 -335432 -346058 -296891 -285169 -475609 -289895 -50553 32201 72699 271684 713904
11681 713904 937294 798494 706996 859649 757005 616624 371044 183138 537894 896192
11671 896192 1039466 1009174 1326267 1028548 665317 716652 568888 80619 160651 574079
11661 574079 510845 319932 -19752 -93195 -465696 -786183 -891430 -635881 -159684 -123149
11651 -123149 -48092 -159871 -573827 -389924 29739 230282 37579 264324 748430 931269
11641 931269 594856 162800 -107761 -519701 -866702 -1025723 -1065022 -1009076 -669621 -243931
11631 -243931 -101147 -227009 -362497 -164598 284256 473932 611804 750145 838624 809259
11621 809259 631855 359078 118607 -155000 -141709 -226199 -643234 -929932 -998322 -1110987
11611 -1110987 -1052364 -803500 -624414 -709806 -438092 -417725 -796031 -801492 -519587 -760292
11601 -760292 -1066861 -818686 -514955 -482895 -144153 383067 697306 556358 145041 -131865
11591 -131865 -214397 167180 367247 466527 583089 317179 18137 -425151 -502552 360920
11581 360920 1313774 1960596 2138416 2168943 2490621 2573163 1870090 1282260 1041304 416638
11571 416638 28545 240559 588217 931153 894529 637595 713426 1121620 1490390 1622067
11561 1622067 1790248 2178991 2149379 1775314 1705207 1906458 2003637 2047217 2014710 1885287
11551 1885287 1746015 1725332 1098836 450412 353619 365168 559177 737923 572792 -87737
11541 -87737 -588199 -94696 416463 -60433 -669711 -684545 -422408 138986 23930 100011
11531 100011 234996 248815 524795 637274 481249 410068 384363 378695 530065 531036 353748
11520 353748 91889 -311842 -527496 -323838 138524 672754 759228 551725 467517 140899
11510 140899 -229962 118887 947304 1006054 886082 1007907 1395186 1297670 634589 176933
11500 176933 128688 201580 18829 -186649 -112169 45491 249096 201602 255671 569399
11490 569399 789679 805058 778190 964764 1411546 1494643 931337 674390 531517 634480
11480 634480 636900 693984 830986 1124313 1361239 1418898 1472420 1216618 982797 844586
11470 844586 810956 731574 277018 100238 472214 723861 580760 480862 848232 899999
11460 899999 1064852 1110704 572391 640121 410067 212026 476091 1081628 1130151 978157
11450 978157 829451 624011 562583 657108 560204 690733 1060977 1377558 1385322 1572139
11440 1572139 1743078 2019492 2361115 2640125 3191068 3898989 4083737 4756783 6246207
11431 6246207 8219401 9801067 11825082 14727126 18824651 24460821 32518923 44370030
11423 44370030 63662953 92745161 125280105 130225234 101836613 72990267 55010895
11416 55010895 45011989 39451718 36899289 36662555 39446716 46063872 57960202 78283392
11408 78283392 108714600 133274026 121018069 87091535 60940502 44450156 34323311
11401 34323311 27103920 21719747 17515700 14609062 12490296 10942058 9778582 8800766
11393 8800766 7656824 6964765 6280618 5567720 4805832 4229331 3960175 3635440 3385711
11384 3385711 3358719 3309451 3312599 3104586 2949013 2882710 2908171 2619885 2228425 1986082
11374 1986082 2319325 2744630 2850293 2746022 2327174 1759662 1617882 1603131 1262993 1064267
11364 1064267 1330132 1590485 1576223 1320616 1512291 1505220 1281626 1308765 1417029 1843912
11354 1843912 2127555 1879775 1884985 1603560 1112085 887470 888677 775005 425779 84271
11344 84271 134954 120134 230880 577068 499090 330541 396121 508827 454769 510974 679834
11333 679834 426463 334855 477800 741478 1322703 1826337 1817871 1539162 1327137 1558322
11323 1558322 2085029 2330266 1807808 1137746 813276 841017 1189257 1273638 1319505 1375821
11313 1375821 1454402 1844680 2702813 2996939 2439670 1952675 1205870 537273 431547 317303
11303 317303 325994 286638 347592 443627 451429 611255 644441 654993 643675 1300453 2194538
11292 2194538 2896358 2713463 1893720 1101006 673244 779599 916207 1279988 1697073
11283 1697073 1686248 1349130 813193 135965 -83691 112350 258408 463377 703369 700529
11273 700529 680895 332597 247363 542750 684466 651373 723835 655559 869160 1209318
11263 1209318 1476464 1482710 1203895 688087 226340 308182 617259 679367 772627 648487
11253 648487 510214 624196 675547 208431 -122588 -12826 218531 606193 942814 1167580
11243 1167580 1091839 999203 1059685 1215066 1227176 1237987 1332037 915950 621998 677950 465234
11232 465234 401501 627974 932474 1197995 1372135 1381392 1155350 895785 946692 562966
11222 562966 312522 460577 731207 617844 165614 323570 766539 1034669 570816 348920
11212 348920 600456 652486 522780 239442 62150 149467 -4784 -45335 -130710 -273781
11202 -273781 -390506 -85563 346307 421344 408258 512025 549297 429341 142544 -240444
11192 -240444 -178675 65007 84932 -199658 -776788 -1366934 -1513898 -1213094 -616651 -132933
11182 -132933 -43770 132586 373679 112153 -143169 127892 411369 621306 826028 827274
11172 827274 773401 417739 635437 989466 688362 106286 135486 454793 736872 773012
11162 773012 585665 -732 -339505 -189446 -101219 -265825 -289672 22826 212695 575618
11152 575618 674826 595512 696422 685379 501937 726701 970458 958751 800635 554154
11142 554154 603472 688411 165631 -466738 -784277 -573580 -380439 -399487 107242 641844
11132 641844 762341 870433 1016707 789517 325231 -249189 -761920 -937278 -537056 104
11122 104 448436 686519 674411 908911 778983 185714 -89406 250975 819393 721884
11112 721884 240218 18493 175514 431711 211688 -465982 -888302 -722320 -662624 -419936
11102 -419936 -196324 -208953 -537013 -712294 -569570 -220691 77302 382660 841637 891940
11092 891940 897477 1076735 1155796 1181200 920916 645039 737434 821858 608033 262103 377895
11081 377895 387609 320864 161213 33432 217828 389910 558026 393645 34466 -131655
11071 -131655 -28466 -191348 -589366 -640379 -730855 -871533 -559785 -347109 -376364 -554500
11061 -554500 -501644 -149199 73385 91125 387194 621267 435979 480699 436433 346764
11051 346764 434360 475875 785261 1128072 1289866 1278713 1023227 717256 439228 261357
11041 261357 680393 1003797 640891 609014 725384 415105 -44382 -349203 -663770 -605830
11031 -605830 -71726 531702 423375 239934 234385 356124 -72593 -739362 -790779 -461059
11021 -461059 -159638 360418 628065 33984 -117329 478926 949257 1217004 1093748 341058
11011 341058 -338193 -188548 181487 185671 53545 197369 242703 353869 688629 715626
11001 715626 813652 654850 255817 -110700 -689884 -672674 -333055 126767 682041 720907
10991 720907 449747 425159 621586 548355 630736 756774 628018 470460 601849 584943
10981 584943 606141 756351 920355 905472 572309 361858 222576 220985 409943 702017
10971 702017 464037 14104 24526 41650 -452369 -872173 -819042 -401552 -116301 330529
10961 330529 961263 1387420 1415302 1425727 1369966 1155185 1215742 1672684 2090573 1774448
10951 1774448 952244 136358 -138519 -180301 -524796 -681311 -703736 -1026045 -739022 -284734
10941 -284734 -73461 249172 544229 744821 944118 919976 1014239 1018998 748765 334273
10931 334273 95965 272864 721670 928706 1035998 712517 445383 701558 932869 773280
10921 773280 480437 324747 70616 290643 462656 579107 442737 308964 226472 210219
10911 210219 456158 229182 -337868 -636480 -482621 -343482 -529931 -748708 -1076429 -1311656
10901 -1311656 -1249501 -1058740 -809696 -873359 -1145287 -1119723 -747108 -306587 164387 596898
10891 596898 642752 135518 -299829 -939316 -1387472 -1242823 -1059076 -1002962 -844051 -675868
10881 -675868 -366500 -98364 221642 406869 477908 586424 352000 -100332 -470907 -588944
10871 -588944 -608438 -398204 -120816 -161688 -41395 -97591 -55357 75291 491325 647952
10861 647952 634578 631032 345030 237355 205343 213521 409445 262844 -63635 -139473 -303825
10850 -303825 -452723 -755265 -771322 -451551 -108569 4961 2880 -188194 -321799 -62772
10840 -62772 183629 109334 -85879 25180 319501 148337 -388616 -433690 -276736 -366238
10830 -366238 -671457 -875679 -822407 -777103 -643916 -352672 -176396 -171440 328465 811025
10820 811025 512587 35491 88425 207335 39235 176997 130301 -76178 -297624 -582335
10810 -582335 -725555 -693994 -812153 -956814 -1089733 -992399 -892071 -1118578 -1228756 -1305555
10800 -1305555 -1173477 -800833 -345090 209440 511271 512096 513181 612722 633118 241551 -98840
10789 -98840 -264382 -187300 90083 218191 134952 -80817 -357142 -441035 -419698 -449046 -609359
10778 -609359 -355293 34066 180413 305440 294027 -195541 -490046 -419456 -265456 -376004
10768 -376004 -646745 -715977 -439244 -86704 -41406 -388602 -562176 -419977 -335957 -338106
10758 -338106 -235469 -388818 -405999 -235232 -309706 -458064 -534389 -289241 -317288 -807617
10748 -807617 -808630 -254602 273471 411341 691128 1041881 1073579 834953 642806 333632
10738 333632 413483 900588 648667 168021 98973 179149 197716 -139684 -253965 -258094 -114077
10727 -114077 41595 466582 1278851 1455568 918410 290559 -13283 29370 469631 896448
10717 896448 646426 264614 236809 27637 -495029 -321798 214910 284842 517195 637013
10707 637013 346405 -27210 42281 182887 111172 -129824 -508415 -939353 -711154 -506581
10697 -506581 -671903 -647958 -461173 -220387 -90415 -366424 -247962 102865 -55820 183169
10687 183169 595224 789994 771027 837337 800726 503328 439152 297197 645297 928448
10677 928448 861955 819428 664552 459858 818735 1374785 1316098 819665 709340 297626
10667 297626 -535527 -738301 -253552 -99493 134859 761366 1175786 938736 572817 431565
10657 431565 111539 -44074 -1291 129204 400721 881932 1251440 1333455 1194256 932207
10647 932207 1031375 1202770 970184 577081 451017 438196 508493 378951 109165 98480
10637 98480 192020 332830 301867 122964 -114783 -319020 -330894 -227569 -489866 -663633
10627 -663633 -119653 609610 603072 166829 369060 689816 398639 283157 694678 934308
10617 934308 1140090 1254123 1001256 559553 303329 162382 121033 -169019 -519541 -578610
10607 -578610 -329227 -373591 -792658 -1193152 -1038498 -479850 -105975 -276499 -393059 -460205
10597 -460205 -600918 -331086 -288860 -139882 220610 364775 266316 320724 391637 596129
10587 596129 385599 36750 -205845 -362932 -503318 -332619 -133370 164766 197183 270366
10577 270366 393571 266795 -9193 -612163 -888510 -754744 -715840 -614881 -566705 -752434
10567 -752434 -604002 -464661 -2187 435159 153520 -433170 -675159 -477958 -274724 -399679
10557 -399679 -425156 92548 427164 139471 -265664 -280184 -335662 -333055 -422919 -656965 -957064
10546 -957064 -1181641 -923994 -839390 -839614 -434808 -274168 -385165 -246978 -33116 490137
10536 490137 379465 -83518 -375030 -641198 -645637 -661621 -721092 -819906 -644689 -216327
10526 -216327 198669 599268 798359 732095 342241 -34084 97650 233058 511099 714500
10516 714500 662615 455994 158967 -124269 -697880 -928132 -493894 -318075 -201601 -468260
10506 -468260 -1046047 -1336759 -1396280 -1110485 -772500 -515460 -343580 -456629 -306652 -221138
10496 -221138 -452422 -523704 -438315 -381855 -235978 -268993 -195120 -9404 -63901 -212676 -691397
10485 -691397 -803725 -712909 -798821 -874949 -885365 -755635 -702398 -838055 -871716 -945416 -1068409
10474 -1068409 -707795 -14321 357646 185420 -165822 -480445 -476838 216284 761452 789228
10464 789228 807296 626645 408103 678708 1090423 1162791 739978 207884 209360 66749
10454 66749 -4250 -260198 -569274 -522041 -171527 -165675 122462 392622 404510 150424 -188888
10443 -188888 -314106 -377250 -163331 -65793 -208141 -323282 -250509 -85577 -24981 -40933
10433 -40933 -23164 323068 532746 282160 -293100 -804837 -904581 -626551 -383854 -299089
10423 -299089 -373812 -458916 -353611 -241838 -10925 -150350 -541166 -845789 -983478 -1157519
10413 -1157519 -1359688 -1432178 -1365025 -1022897 -731347 -712750 -510707 -130101 -155388 -118122
10403 -118122 -57262 -16594 -166197 -665337 -739230 -635576 -520180 -288843 -55993 -355257
10393 -355257 -842615 -1203371 -1225621 -962718 -370794 382653 991092 1098829 892536 713383
10383 713383 632918 261738 -152973 -217872 -96796 -246858 -660005 -739620 -621231 -808737
10373 -808737 -819525 -675263 -447495 -620580 -1077982 -1011305 -544458 -407473 -370194 -347870
10363 -347870 -448816 -283942 -329233 -225643 44156 -50392 -155242 -230323 -209037 126395
10353 126395 318533 147443 -20748 -161750 -162902 1932 165597 -81150 -317494 -199130
10343 -199130 -109632 135463 244228 109252 -182298 -389464 -374731 -17052 269630 66054
10333 66054 -287790 -506044 -903935 -579915 43915 241920 408207 381115 -112682 -629539
10323 -629539 -1107013 -1061210 -341917 291145 339016 -81941 -719078 -1338014 -1413686 -853758
10313 -853758 -393052 -24873 654671 1063248 1006198 945981 1200709 1451897 1431536 1421915
10303 1421915 1275084 882897 430199 64142 20509 -73098 -368509 -561524 -573720 -482911
10293 -482911 -651501 -936226 -939337 -855007 -743829 -702940 -473853 -261971 -137984 -127982
10283 -127982 -321700 -422310 -318388 -364603 -263669 -181850 -146250 -215067 -206772 -407376 -741301
10272 -741301 -1034801 -831131 -363984 -68194 -121600 188081 499938 620360 504943 216829
10262 216829 -78618 -140256 17819 -54795 -196920 -228794 -466305 -572118 -372798 -167579
10252 -167579 -41200 242033 -16508 -635206 -1180226 -1137952 -1103359 -900093 -642274 -262726
10242 -262726 284518 627189 926243 1027855 707349 458358 497325 542364 448551 235150
10232 235150 -157874 -384856 -468037 -583798 -831288 -855306 -630110 -413791 17277 609539
10222 609539 439317 197373 343630 42431 -556891 -1101500 -874296 -382814 -70960 235068
10212 235068 243312 120117 188100 487398 428680 109727 137130 330073 300734 153534 -268837
10201 -268837 -450406 -269168 -629567 -565288 -691894 -959539 -911981 -821430 -358526 27164
10191 27164 9691 300593 352961 287823 594276 1086681 1252511 1006744 919892 1017097 696617
10180 696617 359593 410835 595991 405214 118269 281533 317879 112491 -268308 -459673
10170 -459673 -564780 -638287 -632563 -559171 -151288 -154550 -372866 -882866 -996998 -687908 -194588
10159 -194588 -67518 49391 184493 295852 316121 409743 434791 278097 91784 73487
10149 73487 -21005 172508 462446 627927 765659 736346 527449 349582 43154 -23222
10139 -23222 -50903 -106609 -249756 -515136 -644134 -536429 -442546 -187053 59503 43933
10129 43933 -21565 105727 202829 -4169 -361501 -620272 -383806 -38392 -69 -154394
10119 -154394 -84200 417043 1016532 1116924 660942 107254 -343391 -189267 364873 719751
10109 719751 512586 179124 274056 278349 -38786 -469428 -69297 135597 -410258 -152572
10099 -152572 133875 -133407 -249826 -12494 96603 187238 513159 822965 855069 418378
10089 418378 87096 8286 -101424 -179355 -245969 -413582 -534653 -504418 -439327 -608448
10079 -608448 -807358 -851509 -515615 -395508 -544182 -792692 -1028302 -798715 -211378 190653
10069 190653 454078 255256 -223840 -477142 -762681 -890490 -704959 -568431 -690659 -506265
10059 -506265 -248202 221870 193763 -179852 -180772 133255 466119 477492 42509 -178317
10049 -178317 52306 463244 848497 584995 1768 -13239 225717 447163 504043 208753
10039 208753 69673 105603 -63093 -745967 -1100935 -783249 -623607 -332878 107677 279816
10029 279816 219598 224323 539748 519532 309411 451408 1064625 1446786 1181604 979055
10019 979055 1148738 1460537 1676444 2006016 1969959 1272031 689671 501105 404422 198740
10009 198740 -206573 -327386 -361699 -489700 -584446 -330623 -24019 -308546 -496488 -439802
9999 -439802 -154914 -12354 -285168 -512542 -643615 -940085 -1101008 -1227900 -1084240 -493597
9989 -493597 238434 927538 1359175 1554864 1091123 184983 -282725 -6288 112494 154993
9979 154993 414664 432538 363678 95269 184084 496212 342322 -242822 -304073 -158821
9969 -158821 22856 344441 306098 -44073 -154219 3433 -76574 -340328 -456247 -207952
9959 -207952 219092 427845 620327 704056 85342 -462449 -215682 126720 310684 595833
9949 595833 600561 360955 368833 678914 730038 594468 327156 -67196 -181483 103460 792222
9938 792222 1124043 770801 125551 83874 522446 465575 242710 339498 611357 579639
9928 579639 677479 540283 -21961 -357062 -511763 -448061 -28662 176462 257582 93096
9918 93096 -290824 -304904 -220007 -387293 -418848 -311916 -341293 -46446 -200198 -281161 -112361
9907 -112361 123755 657690 881751 252606 -30005 -5604 122230 282602 108056 -77391
9897 -77391 -163071 107568 237074 -77607 -539816 -612543 -133781 234985 322760 151397
9887 151397 -55562 -39448 255191 113844 -127023 -66685 314195 575388 722878 631004
9877 631004 195870 -333788 -370542 -15267 -65489 -252054 -332208 -190186 -126416 -3270
9867 -3270 251704 163912 140187 338857 411330 458181 509533 313332 292254 503552 563077
9856 563077 476834 86413 -165872 -105016 -276523 -576756 -581622 -148942 10357 -36362 -166285
9845 -166285 -584917 -738321 -899831 -1094999 -860705 -504914 -559099 -450572 94165 190095
9835 190095 -141641 -361958 -702116 -646499 -227990 -146546 -243327 -29004 -133393 -378545
9825 -378545 -99977 523776 1014367 974390 538707 69083 31272 91915 164522 357951
9815 357951 478605 547939 -57539 -819472 -743871 -579480 -493065 -444932 -322134 -347260 -486517
9804 -486517 -745942 -1057649 -1205686 -1305070 -1220269 -1058148 -1030465 -464307 108474 100424 -217176
9793 -217176 -330418 -48502 270154 63702 -314114 -478001 -403544 -217552 -16766 241622
9783 241622 472025 568044 824064 1025534 1188434 1041351 583743 410700 727466 857377
9773 857377 574518 439580 321999 143733 184080 453481 691628 445190 -15812 25588
9763 25588 48252 288450 357345 118048 145127 932681 1655151 1820251 1762617 1498494 1275720
9752 1275720 1058793 938576 963551 442895 -21922 171845 526011 809109 892768 703408
9742 703408 588105 359601 138169 -84302 317226 1123348 1454264 1280169 1224982 1241753
9732 1241753 1020793 890766 784950 301943 -157872 -137286 118713 321543 134075 -61313
9722 -61313 77016 180413 496812 873596 904597 614645 302742 -7824 -19749 30206
9712 30206 -48037 99228 555072 993021 1144134 781911 183437 115931 332213 450635
9702 450635 172505 198753 491969 740608 678657 251831 -147623 -312540 -230926 -78395
9692 -78395 60867 -180585 -363383 -67166 333986 179482 351143 175943 -545793 -1190967
9682 -1190967 -1430636 -1214007 -1088327 -656629 -202529 -278659 -462767 -752343 -729508 -260752
9672 -260752 6666 605446 1180292 1116359 696004 110892 -61762 154131 291183 175689
9662 175689 -41381 -255052 -439017 -282895 -426758 -641827 -807656 -1069489 -1124189 -993438
9652 -993438 -820068 -816402 -680709 -594410 -654970 -609101 -471169 48469 573097 1008323 1583689
9641 1583689 1506221 1199647 1190995 809382 338950 329547 326369 293050 134921 125230 247994
9630 247994 442359 858771 1204991 1201574 752237 392814 145670 -124404 -371186 -540697
9620 -540697 -86185 349498 344484 368877 475652 624207 573922 344418 365918 354313 337223
9609 337223 561067 519097 326386 87422 132457 -16233 -241482 -34930 -140245 -652932
9599 -652932 -1107966 -1026292 -310365 -91545 -383814 -339485 -359767 -783839 -1279018 -1526116
9589 -1526116 -1456045 -1407393 -1003556 -818126 -1039655 -962638 -602270 -101925 63531 -286636
9579 -286636 -221922 101903 112610 326025 365928 9711 -63732 -148617 -97935 154853 451020
9568 451020 751367 796273 451520 -187719 -449373 -719708 -941103 -727616 -464599 -628869
9558 -628869 -778894 -499484 -254878 -107590 107312 377675 513347 514421 193699 186109
9548 186109 243846 276972 171386 -206776 -277500 -30011 181426 194506 661776 934595
9538 934595 647537 18516 -212237 -149963 -282573 -535266 -319929 -252019 -187099 -27926
9528 -27926 171508 87356 -366283 -850806 -713952 -284906 -107570 -130666 -535075 -826337
9518 -826337 -1002523 -1048515 -1025543 -1241860 -1431149 -1119898 -607263 -497789 -656732 -604505
9508 -604505 -314577 -86321 292101 456319 523943 325562 132431 294313 402692 239323
9498 239323 263044 360529 234136 312053 634447 321779 -306942 -612288 -761848 -784515
9488 -784515 -834353 -558992 -402506 -100841 323247 747270 933534 679669 233007 358472
9478 358472 435087 559095 556758 277861 231335 275589 434543 516890 476947 96628 -437845
9467 -437845 -582295 -316024 111925 306503 257355 365375 547839 479215 547789 499612
9457 499612 -131917 -556259 -247713 11640 135150 125897 -226818 -492572 -690207 -452089
9447 -452089 -353944 -501609 -325203 -213831 -113046 59776 145288 -447205 -800810 -505135
9437 -505135 -341222 -432399 -321844 -526160 -1087356 -969811 -350521 -121079 -278959 -204834
9427 -204834 74531 -81487 -121989 -110676 41966 123698 198266 32180 -54090 -221677 -224188
9416 -224188 141066 336032 469067 380362 457136 343156 36877 -295622 -497036 -163759
9406 -163759 297117 646485 656219 303540 103151 -171829 -699383 -1134915 -870657 -585741
9396 -585741 -560217 -180144 268820 268626 281961 125274 -106126 317875 313501 111409 401775
9385 401775 283947 103462 -153287 -261246 -150662 -251606 -530641 -516151 -220327 -38292
9375 -38292 73912 46411 -40099 231338 334511 151591 212688 -132624 -579390 -472837
9365 -472837 40047 401023 371927 384622 458249 235769 -309728 -318410 -230454 -501348 -792395
9354 -792395 -1117922 -1168789 -993280 -353324 560338 618681 243680 35005 -340411 -85828
9344 -85828 351170 252431 192243 -48944 -279599 -22825 214019 378758 559417 719187
9334 719187 1171341 1185942 1003089 768355 624038 507612 421844 673936 649766 417290
9324 417290 172055 -323551 -572449 -574180 -809996 -802955 -262614 51647 -10876 75717 145543
9313 145543 365682 551973 323754 309240 408507 255710 320656 79939 -285748 -520052
9303 -520052 -295990 105656 -17369 -125593 -65189 -283047 -265914 -370464 -612556 -757197
9293 -757197 -603908 -371155 -224653 -163134 -445475 -963297 -1128149 -548601 157631 236646
9283 236646 -129294 -537571 -612379 -377626 -491235 -595421 -595142 -603152 -475369 -71277 181475
9272 181475 302822 360311 209165 16649 -170583 -199896 8200 379115 688055 827774
9262 827774 768942 664211 377294 -415724 -1211262 -1214073 -541131 -196189 -161826 -493282
9252 -493282 -665432 -877927 -1025642 -697213 -280777 -116987 -340499 -557742 -493274 -441935
9242 -441935 -663826 -660119 -683531 -819836 -542609 -95190 289876 642157 792160 885091
9232 885091 1002885 678753 423046 314295 230277 497717 737449 986916 1297672 1452199
9222 1452199 1848228 1843529 1277910 686282 401286 98308 -276246 -560132 -457022 -199457
9212 -199457 -102121 -218313 -475281 -427897 -184310 180505 626702 1234255 1319765 904771
9202 904771 410277 52531 -295640 -313275 -104932 -105624 -66137 207776 533841 866122 1183904
9191 1183904 1037703 393436 -164004 -547422 -693921 -471244 -341151 -519719 -627138 -351407
9181 -351407 -100700 -163582 -271168 -247479 -186128 -232078 -196626 -169390 -164426 -487056 -898377
9170 -898377 -1268572 -1219591 -954579 -959223 -1130402 -1075744 -664077 -326471 -326742 -384134 -162083
9159 -162083 133627 108258 100714 370522 526555 543094 418943 255696 445035 598375
9149 598375 392623 359794 582391 528816 497262 854696 865813 469431 162784 -236120
9139 -236120 -406553 -386773 -311160 18568 513327 695780 389819 187647 -50503 -550862
9129 -550862 -669711 -358175 -80022 89425 2197 -343854 -651678 -483540 -262720 -180797
9119 -180797 -44001 52582 2610 11212 -303135 -978297 -1150174 -971615 -875022 -1128753 -1155191
9108 -1155191 -883379 -679870 -718246 -847237 -892914 -1110340 -1123513 -907195 -520014 -401043
9098 -401043 -630208 -497308 -410068 -493149 -453526 -400030 -295948 218320 709404 497722
9088 497722 353660 428983 427116 182230 -319441 -540974 -61753 680501 724659 125074
9078 125074 -14025 -106076 -372565 -318849 -358593 -598202 -353838 -114271 533599 958354
9068 958354 518468 82960 -39983 -94051 -225146 -302876 95338 692356 863676 666947
9058 666947 423748 103325 -552541 -1167051 -904111 -685025 -754088 -689934 -232269 154382
9048 154382 198727 -43701 -109463 109530 -131423 -541805 -509713 -421313 -346570 -208250 -89104
9037 -89104 111433 259654 643251 555486 79900 -107986 -7175 298347 514033 576524
9027 576524 429996 216560 123602 -401188 -637363 -586134 -419622 -314799 -452746 -363165
9017 -363165 -355546 -937256 -1305203 -1127927 -833903 -710784 -594727 -556668 -468718 -504054 -625741
9006 -625741 -685308 -705633 -796181 -852714 -819012 -816730 -700329 -494849 -570622 -512165 12102
8995 12102 318946 546718 562353 400398 70298 -578448 -797339 -774658 -521935 -331684
8985 -331684 -364896 -382034 -525557 -786314 -430644 340231 763457 576512 106246 68445
8975 68445 386663 618147 877578 1010166 653786 33617 -117085 -98451 -452530 -830300
8965 -830300 -1014474 -793103 -564536 -633754 -743715 -684811 -223538 11075 -128204 54681
8955 54681 307118 557272 630154 721090 865322 493080 -109709 -341077 -513482 -594873
8945 -594873 -564970 -670162 -976571 -730206 -329122 -387438 -618006 -772259 -858948 -783075
8935 -783075 -1047913 -1509981 -1542370 -1517397 -1476572 -1291820 -1090934 -550435 -105841 122702
8925 122702 33233 148976 580430 558811 153635 25183 118001 -77620 -302254 -452389
8915 -452389 -470261 -48683 -113718 -408483 -699998 -858426 -357157 -112721 -199892 -374620
8905 -374620 -517109 -567297 -883341 -773212 -157337 257403 543849 648060 452118 77147
8895 77147 -153061 -261230 -363826 -331808 -80240 252182 168214 28195 -15708 66713 179616
8884 179616 280888 197917 -13639 -177033 -495232 -701031 -594623 -292865 171777 428694
8874 428694 604179 724607 762585 520749 -26619 -80268 289730 543488 331925 158809
8864 158809 229674 208081 18320 271818 295236 240665 250067 188894 186411 385145 522625
8853 522625 438232 245401 -20605 -107327 -70723 2938 102550 -189415 -481980 11497 725705
8842 725705 1026804 1053263 942042 560055 54889 132660 37590 -259298 -71976 258792
8832 258792 305874 225742 354037 334099 144029 -157643 -639714 -1056643 -1214100 -872191
8822 -872191 -577366 -284894 -16161 -222190 -391829 -492735 -166400 229317 309384 365856
8812 365856 225955 225061 606195 399242 116833 55914 15741 49262 106509 238393 -64430
8801 -64430 -324805 116105 614268 703351 294229 221251 345690 280354 -100045 -612929
8791 -612929 -377715 183895 294684 -9912 -248772 -783470 -1310332 -1143999 -402761 161684
8781 161684 181432 162111 -190656 -722935 -611561 -609296 -376561 174049 755108 632396
8771 632396 243564 76863 224759 175918 129000 -129487 -550711 -827541 -991332 -1131223
8761 -1131223 -1382162 -1141418 -279354 340732 595161 685699 686146 635606 417203 338094 291219
8750 291219 155558 -266232 -334872 -230477 -314565 -326364 -336286 -144489 128045 165945 126166
8739 126166 21190 -20024 91224 79562 -241198 -530671 -556254 -265854 116354 246349
8729 246349 143821 4497 2523 -61433 -189066 -109220 -85533 -66922 225462 640410 780500
8718 780500 559906 510288 572989 808567 1134199 1075827 1030808 1017787 814991 718178 603143
8707 603143 203173 -305008 -418947 39660 498926 318989 213604 47624 -92263 97360
8697 97360 231340 248018 315873 360304 296041 371667 405507 163851 245136 183409 -88968
8686 -88968 -208320 -298129 -322085 -623685 -788881 -704340 -461428 9106 391833 457361 353752
8675 353752 268106 287504 194591 302406 529672 698466 824263 714431 405746 219141
8665 219141 286449 172055 58495 629302 1376521 1326392 1108396 942365 853345 689984
8655 689984 157083 -156689 -78793 -35621 98220 11122 -209479 -255394 -104511 25463
8645 25463 87055 124007 -59061 -310036 -438777 -221723 -601623 -1032512 -1061871 -853772
8635 -853772 -562061 -576101 -417560 -381170 -570828 -419248 -490155 -840144 -1157865 -991796
8625 -991796 -715631 -297525 89005 338207 290778 228268 212142 400832 514291 429636
8615 429636 689285 1108111 1427929 1314675 1317497 935417 481775 447033 -133783 -371642
8605 -371642 378 266200 7036 42816 -76536 82090 323922 319604 -17967 -479840
8595 -479840 -485003 -384518 -539749 -610451 -446322 -616851 -858128 -437023 74146 80964 -130937
8584 -130937 -224156 55824 703589 1119327 1093733 944154 785990 831328 757713 420065
8574 420065 501227 733228 496749 224245 273916 73810 -115098 -121860 -143474 -78293 -5142
8563 -5142 29140 26804 77175 193264 261644 27770 -408216 -536319 -239163 95322 153530
8552 153530 -335064 -999425 -1337011 -1377452 -1217123 -921119 -771693 -1027907 -1522525 -1412099
8542 -1412099 -971540 -346526 123716 513097 606500 138301 -110703 51995 -12833 74041
8532 74041 -61208 -50671 174535 267879 93110 118941 407963 352423 244855 407319 284351
8521 284351 68482 -261919 -422963 -100156 147186 135317 -243245 -199735 261311 386077
8511 386077 133450 -91455 -115724 -325546 -614698 -616419 -587302 -582862 -839665 -799756 -486557
8500 -486557 -190464 146923 73017 51628 365460 474577 124908 -405022 -751403 -743741
8490 -743741 -558086 -608914 -756979 -933589 -1231906 -1168403 -945209 -574802 -576062 -1198286
8480 -1198286 -1523897 -1600385 -1371975 -818626 -210020 300914 301457 -66460 66744 12796
8470 12796 -220404 36327 -127574 -590320 -919850 -1222757 -1441902 -1189379 -734841 -645013
8460 -645013 -724002 -868789 -1217021 -1143637 -703985 -545334 -775952 -947315 -1240360 -1129907
8450 -1129907 -589716 -40296 119126 133049 134333 8259 -378655 -625908 -555504 -411835
8440 -411835 -551414 -795431 -630600 -514823 -811271 -812574 -387370 260444 923630 1083359
8430 1083359 651965 734736 1069422 964848 624004 20110 -179067 -253685 -168566 28219
8420 28219 365719 375241 712187 1176832 748575 335462 420633 256529 -125794 -329400
8410 -329400 -94393 -27773 88974 258493 238105 447763 712233 472645 26901 55396
8400 55396 530687 631114 485310 39888 -552869 -769392 -488822 -125270 -259777 -520307
8390 -520307 -162585 637097 701642 260476 158822 101011 256307 656721 592813 143229
8380 143229 -484403 -960073 -776141 -396295 -330452 -497977 -771431 -530454 -39904 214682
8370 214682 470450 689900 607464 389138 392283 588450 888266 1107521 929950 791451
8360 791451 1013307 980496 587108 426864 437086 36401 -49151 103606 294959 398103
8350 398103 545650 514861 118960 -234908 24563 130924 -336117 -901934 -1178243 -1022916
8340 -1022916 -780293 -329619 177262 344119 211581 251327 373225 360161 255206 152691
8330 152691 271140 299408 98529 -193515 -382389 -598873 -781352 -883528 -566991 -49655
8320 -49655 -143806 -912795 -1397689 -1239452 -1056239 -1018036 -1069762 -865745 -848653 -1176969 -1098492
8309 -1098492 -681651 -390912 -257983 -136387 -157459 -279086 -180861 62697 272456 398833
8299 398833 622000 672930 700754 800902 862173 833277 698700 567170 529125 374726 652545
8288 652545 840404 615123 550489 943905 1217059 878257 553732 240306 -304415 -665556
8278 -665556 -547165 -106453 -138506 -470682 -504670 -517089 -171215 117475 -57188 -145936
8268 -145936 -91811 234466 198660 174876 116488 -110144 261558 672659 272729 -158889
8258 -158889 -403840 -803119 -750236 -652035 -597839 -247507 -189466 -322360 -568685 -763683
8248 -763683 -676658 -351033 -100159 8693 -5467 56052 99240 76159 290599 532141 762063
8237 762063 717420 458931 153406 -236076 -584329 -1030690 -1303422 -1200686 -769962 -178172
8227 -178172 195782 55545 -200965 -219220 -153213 -289947 -528088 -492246 65134 333590
8217 333590 327779 588493 543845 179343 -49448 -273882 -160872 298123 748362 1037161
8207 1037161 769958 314166 -255758 -577358 -753711 -609798 -290222 -31869 253009 401456
8197 401456 467784 -47231 -586805 -615655 -144853 219440 283214 95060 214075 517417
8187 517417 296793 2482 45459 190979 147052 56479 169525 404406 495210 405060 600366
8176 600366 822409 657897 322089 268163 553513 680536 331746 -191461 -356351 -283315
8166 -283315 -38934 323700 584973 775862 640238 50074 -376742 -466381 -533866 -845774
8156 -845774 -868420 -511002 -438637 -775996 -866404 -506653 -68069 -3314 -285898 -680007
8146 -680007 -1091643 -1018694 -582661 -411428 -615367 -951061 -930379 -1045879 -1294648 -1319643
8136 -1319643 -1079936 -812478 -656114 -658821 -813505 -782649 -545003 -355350 -405018 -705868
8126 -705868 -1205276 -1278062 -734627 -581903 -644265 -635526 -549264 -826450 -812746 -464830 -426837
8115 -426837 -764024 -770389 -636416 -624346 -285545 82905 105718 -528582 -823661 -520354
8105 -520354 -236721 -142395 -173076 -262169 -304476 -573419 -982118 -918721 -259631 60696 336215
8094 336215 617169 503390 90609 -196492 -15262 298618 504344 693971 578426 216363
8084 216363 -60193 -93089 -700 99140 87151 -89963 71554 379345 633880 600011 611941
8073 611941 611287 206784 -16626 354175 253340 -593212 -1260856 -1503809 -1207254 -497412
8063 -497412 295238 640174 270738 -312787 -745820 -955962 -996824 -783657 -231191 307626
8053 307626 282681 -223471 -703427 -675032 -503205 -643559 -939155 -986889 -684886 -261925
8043 -261925 345592 562034 523481 676688 429463 120383 -51467 -352202 -621731 -778554
8033 -778554 -652133 -421387 -349301 -485186 -624927 -761532 -587441 -379147 -249459 -119557
8023 -119557 -78496 -314666 -398913 -126990 -46900 155469 237486 -6964 -66663 15657 119847
8012 119847 198268 185771 164859 207629 553240 572040 263440 184041 -105326 -520388 -633378
8001 -633378 -426664 -208016 -597847 -1008446 -984571 -794909 -477745 -55475 154478 413380
7991 413380 416819 -288484 -697455 -566702 -313761 79665 376596 454822 315980 -248593
7981 -248593 -413525 8480 285766 216255 -81052 -511040 -697319 -277527 -13854 -325132
7971 -325132 -738180 -1045734 -776610 -297250 -31473 -55933 -139171 -292111 -595530 -501811
7961 -501811 -209019 -107210 -190993 197579 608170 744216 507030 283713 247729 256396
7951 256396 227674 33641 -258428 -723910 -837919 -766522 -914080 -767403 -460703 -337341
7941 -337341 -191019 -13200 92370 87247 494502 890842 1062119 1155620 1226537 910266
7931 910266 506137 334336 246710 154444 -71062 -16269 46182 151945 154408 212829 514372
7920 514372 664227 169850 -266541 -354969 -152124 15785 234400 -2892 -604455 -966211
7910 -966211 -929803 -793717 -462852 97613 167784 -301243 -546752 -746426 -836889 -705599
7900 -705599 -499957 -300941 -76369 316469 239605 227124 304842 161413 -109003 -289765
7890 -289765 -182762 170076 510049 557889 141953 -147787 -199527 -272037 -262345 -196132 -185027
7879 -185027 -184852 -72758 64429 -79075 -188516 -177103 -457961 -800373 -928070 -1014042 -976388
7868 -976388 -746322 -716754 -769388 -937127 -1172073 -719136 -27069 662769 880631 315646
7858 315646 -195064 -571744 -812949 -654861 -425264 -145870 -384901 -979424 -1234226 -862326
7848 -862326 -355343 -188097 -44210 83928 -81692 -306554 -388269 -233097 -337170 -515826
7838 -515826 -496314 -613992 -772322 -414466 -139058 -421651 -441840 -241000 -394230 -834254
7828 -834254 -1019394 -1395881 -1858691 -1636025 -965113 -257887 22306 178063 -139849 -617845
7818 -617845 -557544 -370288 -71029 116392 179019 -259157 -902284 -696469 -149261 -8921
7808 -8921 -140666 13536 116174 216219 274898 207248 271509 325792 283968 218352 411945
7797 411945 360982 129962 414551 558478 145075 -74147 -84918 -61692 315128 413345
7787 413345 -78707 -261327 -179370 -100336 -266805 -482630 -411543 -360826 -369229 -485492 -619733
7776 -619733 -390399 -221653 75040 380125 589154 589795 378846 52586 -93730 -153866
7766 -153866 -231197 -474586 -656287 -472824 -260136 -255688 -46275 263102 172057 -18833
7756 -18833 26988 21187 -301757 -448197 -281492 -178944 -131912 -295573 -697669 -796247 -628365
7745 -628365 -414559 -171912 -315451 -343995 12429 121663 1847 -104132 -329038 -682799
7735 -682799 -799291 -687979 -525487 -507821 -619161 -863362 -949581 -1058360 -1144412 -1179103
7725 -1179103 -918804 -430421 -697021 -1105934 -982002 -1098805 -1498009 -1471803 -1348096 -1374753
7715 -1374753 -1271548 -1015580 -806064 -822364 -688636 -440330 -105119 83327 -429445 -692189
7705 -692189 -932421 -1080715 -429823 -46990 -310101 -399244 -406671 -202650 -115236 -251390
7695 -251390 -167990 -389686 -342071 -300997 -186874 -159151 -181810 -218290 -263196 28115 251664
7684 251664 99686 130816 199922 -5079 -63631 -115059 -192924 -325534 -139660 122110 -74764
7673 -74764 -282564 -542955 -639369 -730766 -689161 -217816 25292 69920 501766 752110 492907
7662 492907 -199837 -620595 -820763 -1278037 -1590242 -1240509 -860682 -828234 -616021 -545508
7652 -545508 -230427 450715 584237 431276 438755 398065 379102 421704 337215 -40682 -293828
7641 -293828 -148103 -92973 -87266 62264 -132624 -45470 68159 -213628 -483632 -546428 -610298
7630 -610298 -387979 -50178 364688 481300 299492 77640 -29708 89243 70911 -60309
7620 -60309 -20890 484758 680522 555709 367370 467669 420661 310574 164547 14214
7610 14214 -11121 -29303 145520 -42872 -457235 -331334 -179929 -112699 -231101 -574000
7600 -574000 -167946 75950 -19669 27282 140920 222221 356093 435031 523739 313293 168499
7589 168499 392462 890205 1152359 862078 364226 49637 19231 -26468 -120022 -77050
7579 -77050 162944 353580 100183 -359457 -600903 -591390 -415310 -4037 373106 386663
7569 386663 193668 239718 -43721 -255487 -289805 -174169 -196048 -229781 30718 -174825
7559 -174825 -438352 -343006 -99638 -211527 -414313 -489617 -346653 -624889 -865995 -686182
7549 -686182 -915770 -1022728 -769318 -546898 -446843 -526666 -654922 -749927 -482934 12672
$$ [...]
##END NTUPLES=NMR SPECTRUM
##END=
