##TITLE=C13_85-2021
 CDCl3,  20000 sc

 30.08.2021
##JCAMPDX= 6.0         $$ Bruker NMR JCAMP-DX V2.0
##DATA TYPE= NMR SPECTRUM
##DATA CLASS= NTUPLES
##ORIGIN= UXNMR, Bruker Analytische Messtechnik GmbH
##OWNER= root
$$ XWIN-NMR		Version 3.5
$$ Tue Aug 31 08:33:05 2021 Russian Standard Time (UT+4h)  she@DPX200
##.OBSERVE FREQUENCY= 50.327896
##.OBSERVE NUCLEUS= ^13C
##.ACQUISITION MODE= SIMULTANEOUS
##.ACQUISITION SCHEME= undefined
##.AVERAGES= 20000
##.DIGITISER RES= 17
##SPECTROMETER/DATA SYSTEM= spect
##.PULSE SEQUENCE= zgpg30
##.SOLVENT NAME= CDCl3
##.SHIFT REFERENCE= (INTERNAL, CDCl3, 0, 222.683)
##AUDIT TRAIL= $$ (NUMBER, WHEN, WHO, WHERE, WHAT)
$$ ##TITLE= Audit trail, XWIN-NMR		Version 3.5
$$ ##JCAMPDX= 5.01
$$ ##ORIGIN= Bruker BioSpin GmbH
$$ ##OWNER= she
$$ F:/spectra/data/she/nmr/c13/1/pdata/1/auditp.txt
$$ ##AUDIT TRAIL=  $$ (NUMBER, WHEN, WHO, WHERE, WHAT)
(   1,<2021-08-31 08:30:58.28 +0400>,<she>,<DPX200>,
      <created by zg, POWCHK disabled, PULCHK disabled
       terminated by command 'halt'
       configuration hash MD5:
       00 E9 B6 7A A2 85 ED C7 34 08 36 98 17 FE 4E 26
       data hash MD5: 32K
       C9 AB 10 6D 16 9B DE 7A 29 B4 92 71 79 E7 5F 02>)
(   2,<2021-08-31 08:31:11.20 +0400>,<she>,<DPX200>,
      <Start of raw data processing
       efp BC_mod = 2 LB = 1 FT_mod = 6 PKNL = 1 PHC0 = -340.937 PHC1 = 38.76238 SI = 32K 
       data hash MD5: 32K
       DC 6D 4C 54 9A E2 A9 47 15 6A 23 6D ED 4C EC 97>)
(   3,<2021-08-31 08:31:13.93 +0400>,<she>,<DPX200>,
      <abs ABSG = 5 
       data hash MD5: 32K
       2A 6C 77 AF DE 25 C5 B2 6E C1 91 28 8F 7F 16 1F>)
(   4,<2021-08-31 08:32:01.79 +0400>,<she>,<DPX200>,
      <pk PHC0 = 5.395556 PHC1 = -10 
       data hash MD5: 32K
       F2 B7 37 DC 57 24 9C 23 EC 7A DA 1E D6 5E FA 36>)
(   5,<2021-08-31 08:32:05.32 +0400>,<she>,<DPX200>,
      <abs ABSG = 5 
       data hash MD5: 32K
       1E 39 B7 C4 EF 45 1C 0A 19 30 14 8B 0B 11 A8 BB>)
$$ ##END=
$$ 
$$ hash MD5
$$ 90 93 49 41 D7 22 77 71 FE C5 8A 3C 53 8B C2 D0
##$RELAX= 
##$RELAX= 
##$RELAX= 
##$RELAX= 
##$RELAX= 
##$RELAX= 
##$RELAX= 
##$RELAX= 
$$ Bruker specific parameters
$$ --------------------------
##$DU= <F:/spectra>
##$EXPNO= 1
##$NAME= <c13>
##$PROCNO= 1
##$TYPE= <nmr>
##$USER= <she>
##$AMP= (0..31)
100 100 100 100 100 100 100 100 100 100 100 100 100 100 100 100 100 100 
100 100 100 100 100 100 100 100 100 100 100 100 100 100 
##$AQSEQ= 0
##$AQ_mod= 1
##$AUNM= <au_zg>
##$AUTOPOS= <>
##$BF1= 50.322709
##$BF2= 200.13
##$BF3= 50.322709
##$BF4= 500.13
##$BF5= 500.13
##$BF6= 500.13
##$BF7= 500.13
##$BF8= 500.13
##$BYTORDA= 1
##$CFDGTYP= 0
##$CFRGTYP= 5
##$CHEMSTR= <none>
##$CNST= (0..31)
1 1 145 1 1 1 1 1 1 1 1 1 1 1 1 1 1 1 1 1 1 1 1 1 1 1 1 1 1 1 1 1 
##$CPDPRG= <waltz16>
##$CPDPRG1= <>
##$CPDPRG2= <waltz16>
##$CPDPRG3= <>
##$CPDPRG4= <mlev>
##$CPDPRG5= <mlev>
##$CPDPRG6= <mlev>
##$CPDPRG7= <mlev>
##$CPDPRG8= <mlev>
##$CPDPRGB= <>
##$CPDPRGT= <>
##$D= (0..31)
$$ [...]
##$SUBNAM4= <"">
##$SUBNAM5= <"">
##$SUBNAM6= <"">
##$SUBNAM7= <"">
##$SUBNAM8= <"">
##$SUBNAM9= <"">
##$SW= 239.972175391363
##$SWIBOX= (0..15)
0 1 3 0 0 0 0 0 0 0 0 0 0 0 0 0 
##$SW_h= 12077.2946859903
##$TD= 32768
##$TD0= 1
##$TE= 0
##$TE2= 300
##$TE3= 300
##$TEG= 300
##$TL= (0..7)
120 120 120 120 120 120 120 120 
##$TP= (0..7)
150 150 150 150 150 150 150 150 
##$TP07= 0
##$TPNAME0= <>
##$TPNAME1= <>
##$TPNAME2= <>
##$TPNAME3= <>
##$TPNAME4= <>
##$TPNAME5= <>
##$TPNAME6= <>
##$TPNAME7= <>
##$TPOAL= (0..7)
0.5 0.5 0.5 0.5 0.5 0.5 0.5 0.5 
##$TPOFFS= (0..7)
0 0 0 0 0 0 0 0 
##$TUNHIN= 0
##$TUNHOUT= 0
##$TUNXOUT= 0
##$USERA1= <user>
##$USERA2= <user>
##$USERA3= <user>
##$USERA4= <user>
##$USERA5= <user>
##$V9= 5
##$VALIST= <valist>
##$VCLIST= <CCCCCCCCCCCCCCC>
##$VD= 0
##$VDLIST= <DDDDDDDDDDDDDDD>
##$VPLIST= <PPPPPPPPPPPPPPP>
##$VTLIST= <TTTTTTTTTTTTTTT>
##$WBST= 1024
##$WBSW= 4
##$XGAIN= (0..3)
0 0 0 0 
##$XL= 0
##$YL= 0
##$YMAX_a= 116921598
##$YMIN_a= -30498542
##$ZGOPTNS= <>
##$ZL1= 120
##$ZL2= 120
##$ZL3= 120
##$ZL4= 120
##$ABSF1= 222.6753
##$ABSF2= -17.32152
##$ABSG= 5
##$ABSL= 3
##$ALPHA= 0
##$AQORDER= 0
##$ASSFAC= 0
##$ASSFACI= 0
##$ASSFACX= 0
##$ASSWID= 0
##$AUNMP= <proc_1d>
##$AZFE= 0.1
##$AZFW= 0.5
##$BCFW= 0
##$BC_mod= 2
##$BYTORDP= 0
##$COROFFS= 0
##$CY= -3
##$DATMOD= 1
##$DC= 0
##$DFILT= <>
##$DTYPP= 0
##$F1P= 0
##$F2P= 0
##$FCOR= 0.5
##$FTSIZE= 32768
##$FT_mod= 6
##$GAMMA= 0
##$GB= 0
##$INTBC= 1
##$INTSCL= 4.134877e-10
##$ISEN= 128
##$LB= 1
##$LEV0= 0
##$LPBIN= 0
##$MAXI= 10000
##$MC2= 0
##$MEAN= 0
##$ME_mod= 0
##$MI= 0.1934396
##$NCOEF= 0
##$NC_proc= 3
##$NLEV= 6
##$NOISF1= 120.0001
##$NOISF2= 80.00006
##$NSP= 0
##$NTH_PI= 0
##$NZP= 0
##$OFFSET= 222.6826
##$PC= 1.4
##$PHC0= -335.5414
##$PHC1= 28.76238
##$PH_mod= 1
##$PKNL= yes
##$PPARMOD= 0
##$PSCAL= 0
##$PSIGN= 0
##$REVERSE= no
##$SF= 50.3227286521846
##$SI= 32768
##$SIGF1= 140
##$SIGF2= 120
##$SINO= 11.81781
##$SIOLD= 32768
##$SREGLST= <13C.CDCl3>
##$SSB= 0
##$STSI= 32768
##$STSR= 0
##$SW_p= 12077.2946859903
##$SYMM= 0
##$S_DEV= 0
##$TDeff= 32768
##$TDoff= 0
##$TI= <>
##$TILT= no
##$TM1= 0
##$TM2= 0
##$TOPLEV= 0
##$USERP1= <user>
##$USERP2= <user>
##$USERP3= <user>
##$USERP4= <user>
##$USERP5= <user>
##$WDW= 1
##$XDIM= 32768
##$YMAX_p= 269706149
##$YMIN_p= -1277268
$$ End of Bruker specific parameters
$$ ---------------------------------
##NTUPLES= NMR SPECTRUM
##VAR_NAME=  FREQUENCY,     SPECTRUM/REAL,   SPECTRUM/IMAG
##SYMBOL=    X,             R,               I
##VAR_TYPE=  INDEPENDENT,   DEPENDENT,       DEPENDENT
##VAR_FORM=  AFFN,          ASDF,            ASDF
##VAR_DIM=   32768,         32768,           32768
##UNITS=     HZ,            ARBITRARY UNITS, ARBITRARY UNITS
##FACTOR=    0.368581032318806, 1,           1
##FIRST=     11205.996152421, 0,             0
##LAST=      -871.298533569341, 0,           0
##MIN=       -871.298533569341, -1277268,    0
##MAX=       11205.996152421, 269706149,     0
$$ Real data points
##PAGE= N=1
##DATA TABLE= (X++(R..R)), XYDATA
$$ [...]
7351c8425l5822q6999M229r4745r7288n0528k4222O5924O4382J72353Q0524j22204
$$ -38425 -74247 -161246 -157017 -251762 -349050 -399578 -423800 -357876 -293494 -121141 -40617 -162821
7339a62821M180Q3027J23001N8320j0910p3394n6382J73812K36566K9215j87640
$$ -162821 -158641 -75614 47387 105707 94797 21403 -34979 138833 375399 404614 216974
7328B16974k57458J09230L17836K12009q9783k72243k02578k79497j7899J25401
$$ 216974 -40484 68746 386582 598591 508808 236565 33987 -245510 -263409 -138008
7318a38008J92227K29340J32636o3088k82647k79701j53217M0670P4862O3342
$$ -138008 54219 283559 416195 353107 70460 -209241 -362458 -321788 -246926 -183584
7308a83584M4173Q9348L5690R8101J22924P920j53605j01371m1388J05416J71696
$$ -183584 -139411 -50063 -14373 83728 206652 214572 60967 -40404 -81792 23624 195320
7297A95320m5139k47655j56903J97021J825N7237K15610L5517K6659P5712J53916
$$ 195320 150181 -97474 -254377 -57356 -55531 1706 217316 252833 279492 355204 509120
7286E09120P6207j91140k00375k64559j65842K0608Q6434M9882r9880k14173j02396
$$ 509120 585327 394187 193812 -70747 -236589 -215981 -129547 -79665 -179545 -393718 -496114
7275d96114j92935J1431K39386Q3319j5314k1910O9345M3187n0432r9379J20436
$$ -496114 -689049 -677618 -438232 -354913 -370227 -392137 -322792 -279605 -330037 -429416 -308980
7264c08980J76064J04475l01l8803J52574J8037K1842q925j01185j11150N4679
$$ -308980 -132916 -28441 -28742 -67545 85029 103066 124908 115983 14798 -96352 -41673
7253d1673K37402o1838l80739r9411L30667K44293J23956j15431r1755k2068k24447
$$ -41673 195729 133891 -246848 -346259 -15592 228701 352657 237226 145471 123403 -101044
7242a01044j39294J22138k0595J06033J44465j44604n4887K827J34328J69753
$$ -101044 -240338 -118200 -138795 -32762 111703 -32901 -87788 -84961 49367 219120
7232B19120N9364P7349m3078p6913j80101k28683k30074k47643j80720r597L16551
$$ 219120 278484 355833 312755 235842 55741 -172942 -403016 -650659 -831379 -840976 -524425
7221e24425M40791K10121j01835j02438j93550k04744j1542J7272K04728K30635
$$ -524425 -83634 126487 24652 -77786 -271336 -476080 -487622 -470350 -265622 -34987
7211c4987P5556p623K11421M3370l05136k71836j00044N0901Q8836K34675Q9247
$$ -34987 40569 32946 244367 287737 -17399 -289235 -389279 -338378 -249542 -14867 74380
7200G4380r6121k9343L0986j47837j60784R1173j7816R9291J25466r0303J4811
$$ 74380 -21741 -51084 -20098 -167935 -328719 -237546 -255362 -156071 -30605 -120908 -106097
7189a06097J28060O807j72510r0639J06849m386k36623L027J93057K74563J94926
$$ -106097 21963 28770 -143740 -234379 -127530 -131916 -368539 -365512 -172455 102108 297034
7178B97034l3322k09635k43001r1415l6605o7366J44937J62554p39m8273P9245
$$ 297034 263712 54077 -188924 -280339 -316944 -384310 -239373 -76819 -77558 -125831 -46586
7167d6586K04451L5931p4924j43631j99358j62890j56613m0824n4177R8656L3676
$$ -46586 157865 193796 118872 -24759 -224117 -387007 -543620 -584444 -638621 -539965 -506289
7156e06289j04534J41270J62323k5531K7164J10873O9254k7656P4544P5317q7440
$$ -506289 -610823 -469553 -307230 -332761 -305597 -194724 -125470 -153126 -78582 -3265 -90705
7145i0705k14539k34651j24148J0942N9370q776O2188J65654K28523J53592j03012
$$ -90705 -305244 -539895 -664043 -653101 -593731 -602507 -540319 -374665 -146142 7450 -95562
7134i5562k24538L6158O540O2895P8509J08723P2782j7173p2171J33086J30411
$$ -95562 -320100 -283942 -277402 -214507 -135998 -27275 45507 28334 -43837 89249 219660
7123B19660r0040l15626k42693J6624J18923J21201J40598J18503J6700l3452
$$ 219660 129620 -186006 -428699 -412075 -293152 -171951 -31353 87150 103850 70398
7113G0398j24278j63553o3806K05513J44368k00134k23255N3935K58491J76125
$$ 70398 -53880 -217433 -281239 -75726 68642 -131492 -354747 -300812 -42321 133804
7103A33804j31463M159J70507j3667l00805m112K93672L73840J12216j57058j7635
$$ 133804 2341 6500 177007 163340 -137465 -141577 152095 525935 638151 481093 463458
7092D63458M208N4633L4073n8083k69371j55677J93873N1718j40023M5948K5127
$$ 463458 467666 522299 556372 498289 228918 73241 267114 318832 178809 224757 249884
7081B49884N2380Q7176l9610J15041J87930k3493m7173N1229l1484l21970k48294
$$ 249884 302264 389440 349830 464871 652801 629308 582135 633364 601880 279910 31616
7070C1616r4418r5337K7394M0201k4328N1051J06542P3785K3945m054j9445O471
$$ 31616 -62802 -158139 -130745 -90544 -114872 -63821 42721 116506 140451 136397 116952 123423
7058A23423l5200j89190j36049j36864N3426J30359J45748K1010O3511k3574j89171
$$ 123423 88223 -100967 -237016 -373880 -320454 -190095 -44347 -23337 40174 16600 -172571
7047a72571p2845J29568J70241O9159j7922k18606l673J67120Q4131j2682l4386
$$ -172571 -245416 -115848 54393 123552 105630 -112976 -116649 50471 134602 121920 87534
7036H7534k5791M1224N7456j18826J9464J16013J64285L7013j1440O0487P8307
$$ 87534 61743 102967 160423 41597 61061 177074 341359 378372 366932 427419 505726
7025E05726j79229j72042k125p0506q4530M9774J16268J8841q6923L3925P7196
$$ 505726 326497 154455 152330 81824 -2706 47068 163336 182177 95254 129179 206375
7014B06375O5577q1686j97385l53026j41482L1537j87183j98463K008K04007R1461
$$ 206375 271952 190266 -7119 -360145 -501627 -470090 -657273 -855736 -853728 -649721 -558260
7003e58260J02201J85661J97655K9262K1839Q1412j06546k74014k8398J43302
$$ -558260 -456059 -270398 -72743 -43481 -21642 59770 -46776 -320790 -349188 -205886
6993b05886K23825l4744j30306K01348K16077Q3472J5987K918P0158P3024P1012
$$ -205886 17939 -16805 -147111 54237 270314 353786 369773 372691 442849 515873 586885
6982E86885j8744J9415J00362k03076l42125p7291J10241J2041J27700N0952j49054
$$ 586885 568141 587556 687918 484842 142717 65426 175667 187708 315408 366360 217306
6971B17306n1612J05609n2326m4848n5181L1223L7225j64373n3630O016J6975
$$ 217306 165694 271303 218977 174129 118948 150171 187396 23023 -30607 -24591 -7616
6960g616M1254k9365J24770k0511j40876R2768J93162J03052n3384j82258n9555
$$ -7616 33638 4273 129043 108532 -32344 60424 253586 356638 303254 120996 61441
6949F1441K7576j5188j89880l22266j41912K34016L23239O9959n4639j07069j61961
$$ 61441 89017 73829 -116051 -438317 -580229 -346213 -22974 46985 -7654 -114723 -276684
6938b76684j40064Q8192K43791O9060L7470o6708j75733o2107K32094J09717J34
$$ -276684 -416748 -328556 -84765 -15705 21765 -44943 -220676 -282783 -50689 59028 59162
6927E9162l4360K0750J12872Q4452L8448R8811P4363R7815k6475j06396J6666
$$ 59162 24802 45552 158424 242876 281324 380135 454498 552313 525838 419442 436108
6916D36108J14919k52428k94379j75185r2942O3414J21763J10821L7202L8333
$$ 436108 551027 298599 4220 -170965 -263907 -200493 -78730 32091 69293 107626
6906A07626Q8497J25137p7259j50694J63032J26683L2181j48481O5108J14139
$$ 107626 196123 321260 244001 93307 256339 383022 415203 266722 331830 445969
6896D45969J04917L3743K4835J72471j6850q1164r8258k9885J2459Q1586m8688
$$ 445969 550886 584629 609464 781935 765085 683921 585663 555778 568237 649823 601135
6885F01135k37352k26403j48653j42981Q7347P7721j31566k12352J38282L05114
$$ 601135 363783 137380 -11273 -154254 -66907 10814 -120752 -333104 -194822 110292
6875A10292r5769k15895j08134P1337J97310L1565J5555k46708l9346M6306j693
$$ 110292 14523 -201372 -309506 -238169 -40859 -9294 6261 -240447 -279793 -233487 -235180
6864b35180j6951k10561M8794L60933J28972m5984j33146J3561M3396J0888r5586
$$ -235180 -252131 -462692 -413898 -52965 76007 30023 -103123 -89562 -46166 -35278 -130864
6853a30864k5355L4227J87535L9031r4106p964j00321j15685j5769J61467K38667
$$ -130864 -156219 -121992 65543 104574 10468 2504 -97817 -213502 -229271 -67804 170863
6842A70863R5272J8534N2387k9414p0450j67341j07025J17328K02879K41119Q5266
$$ 170863 266135 284669 337056 307642 237192 69851 -37174 80154 283033 524152 609418
6831F09418k47751k54505q0405p596J98361J58050J30790J67806M13850J46509
$$ 609418 361667 107162 26757 19161 217522 375572 506362 674168 1088018 1234527
6821A234527N8606N8682J08688m8902j44710k32516n2768m1077J65847J49799
$$ 1234527 1293133 1351815 1460503 1411601 1266891 1034375 981607 940530 1106377 1256176
6811A256176p1430n4902K36000J57421P5775p7276L1795J63318Q2322J21072J51862
$$ 1256176 1184746 1129844 1365844 1523265 1599040 1521764 1553559 1716877 1799199 1920271 2072133
6800B072133J20549J41344k5427n0863j03472j6127L690J50284K83557L17979
$$ 2072133 2192682 2334026 2308599 2257736 2154264 2138137 2141827 2292111 2575668 2893647
6790B893647K90713N09476N70010O84960P36511J111818J305547J686833J830724
$$ 2893647 3184360 3693836 4263846 4948806 5685317 6797135 8102682 9789515 11620239
6781A1620239K617909L376845M565018O131513R304585J4222291K2376380L1717062
$$ 11620239 14238148 17614993 22180011 28311524 37616109 51838400 74214780 105931842
6773A05931842K7720079p486218l2351259k6559147j6963857j0432942o925759
$$ 105931842 133651921 126165703 93814444 67255297 50291440 39858498 32932739
6766C2932739m153034k248938p42468K63505J560447L257519M996572O836438
$$ 32932739 28779705 26530767 25788299 26051804 27612251 30869770 35866342 42702780
6758D2702780R888971J6200370K5697189L2454352J3081428k4249334l1500736
$$ 42702780 52591751 68792121 94489310 126943662 140025090 115775756 84275020
6751H4275020k1223114j3194716r867674q311786o328401m601262l266985k420445
$$ 84275020 63051906 49857190 39989516 31677730 25349329 20748067 17481082 15060637
6743A5060637j718552r91555l35180m47004j582675j941163j518266j161145p22175
$$ 15060637 13342085 12350530 12015350 11568346 9985671 8044508 6526242 5365097 4642922
6734D642922l53185j97597j88332k67045k96928m9322Q1028L3540k4674j00191
$$ 4642922 4289737 4092140 3903808 3636763 3339835 3290513 3371541 3405081 3380407 3280216
6724C280216j01916j40033j47803k11665q7309o4326q4501q8364j89237m12908
$$ 3280216 3178300 3038267 2890464 2678799 2591490 2527164 2442663 2354299 2165062 1752154
6714A752154k95613j28398p8635J13666K85919J75521n3817l77506l42335p9207
$$ 1752154 1456541 1328143 1249508 1363174 1649093 1824614 1770797 1393291 1050956 971749
6704I71749J09934J56108J36260J15554J20810j9146M806K2617j22893r5239o3901
$$ 971749 1081683 1237791 1374051 1489605 1610415 1591269 1596075 1618692 1495799 1400560 1336659
6693A336659n4422j55706m73472l20696m2460N4549j97272j16334J38207L01187
$$ 1336659 1282237 1126531 653059 332363 289903 344452 147180 30846 169053 470240
6683D70240K87720M7031o6751j29479k93354Q915K53315J55829N8794j64933k16244
$$ 470240 757960 804991 738240 608761 315407 324322 577637 733466 792260 627327 411083
6672D11083j10136J16581J30542j70719k46246m3975j3868j0221p9069P2140Q8805
$$ 411083 300947 417528 548070 377351 131105 87130 73262 63041 -16028 56112 144917
6661A44917N017k5579p9360p2169l8191n4701M3040J52277K24474K23320M2981
$$ 144917 149934 124355 44995 -27174 -65365 -120066 -77026 75251 299725 523045 566026
6650E66026p3711j91880q236K42898L2247l47597k74318J27792L03580m2169k46756
$$ 566026 492315 300435 292199 535097 567344 219747 -54571 73221 376801 334632 87876
6639H7876J22120J45232q4648j57233j0130J02712J35700M7433K9797j0005j92183
$$ 87876 209996 355228 270580 113347 103217 205929 341629 389062 418859 408854 216671
6628B16671k74398k47210q1617O6759J84120K16666j926m7591j07633J33950J37309
$$ 216671 -57727 -304937 -386554 -319795 -135675 80991 79065 31474 -76159 57791 195100
6617A95100l8595l7812j03434n3294l2617N0365L24450K77305j50674l13595j35237
$$ 195100 156505 118693 15259 -38035 -70652 -20287 304163 581468 430794 117199 -18038
6606a8038j3288p4347n810J07098M378M4889K46430J88633k48631l79231k39400
$$ -18038 -31326 -105673 -111483 -4385 -7 44882 291312 479945 231314 -147917 -387317
6595c87317J15366M00782M46878Q3003k64098k73347j29333R0039K34826Q1322
$$ -387317 -271951 128831 575709 658712 394614 121267 -8066 81973 316799 398121
6585C98121J7894j93694k55141j69171N4631K02127J39946j25502j67584q9058
$$ 398121 416015 222321 -32820 -201991 -147360 54767 194713 69211 -98373 -187431
6575a87431j0341P7406l5555n5986L5952l3810l3404R6978J03282n2682j1871
$$ -187431 -197772 -120366 -155921 -211907 -175955 -209765 -243169 -146191 -42909 -95591 -107462
6564a07462M29o9974J550K36497R0235r7148K4888J28718P6989P412q1761o4184
$$ -107462 -107033 -177007 -175457 61040 151275 54127 79015 207733 284722 292134 210373 146189
6552A46189K3820P0035K0191J35723J8360j35609k0627k9518p3703j80970n3616
$$ 146189 170009 240044 260235 395958 414318 278709 258082 228564 154861 -26109 -79725
6541g9725J92234K53630J1059j59836j99922Q3478J04996j49403j49293J7560
$$ -79725 112509 366139 377198 217362 17440 100918 205914 56511 -92782 -75222
6531g5222J10288l8222l5951M625J12701J63217n362M321j18859o9300R9368J31553
$$ -75222 35066 -3156 -39107 -34482 78219 241436 236074 240395 121536 52236 151604 283157
6519B83157J39819M7343J36732o0444l36794l69583k00735J39640K22549q9314
$$ 283157 422976 470319 607051 546607 209813 -159770 -360505 -220865 1684 -87630
6509h7630j73879n6444m4579M1303j6744P1009R1693J92169J34098j64868k49452
$$ -87630 -261509 -317953 -362532 -321229 -337973 -266964 -175271 16898 150996 -13872 -263324
6498b63324J93462K16723Q4168J50798O6075R6777j13737l55992k84514r083J73384
$$ -263324 -69862 146861 231029 381827 447902 544679 430942 74950 -209564 -218647 -45263
6487d5263J28230n2366j13956m4240m3545q3637K47196L48221L04345J69122n1775
$$ -45263 82967 30601 -83355 -127595 -171140 -254777 -7581 340640 644985 814107 762332
6476G62332r225O6138k687r0940r7826r7541p1372j21399q1992M998l3972q2406
$$ 762332 753107 819245 816558 725618 627792 530251 458879 337480 255488 260486 226514 144108
6464A44108q054q2916j43525n9568M3788L03698K76647Q5365q7132j6837J1275
$$ 144108 136054 53138 -90387 -149955 -106167 197531 474178 559543 472411 455574 466849
6453D66849j62009k54465j89880j04424J56573L85831L30041M0655j79177k33790
$$ 466849 304840 50375 -139505 -243929 -87356 298475 628516 669171 489994 256204
6443B56204q0927l9555K2004J7505p1510k21457j20988n1549J24762R0585j16425
$$ 256204 175277 135722 157726 175231 103721 -117736 -238724 -290273 -165511 -74926 -191351
6432a91351l3458Q278L0944O0547K6161j61023K6805K72361J75321l5697n1737
$$ -191351 -224809 -216531 -185587 -125040 -98879 -259902 -233097 39264 214585 178888 127151
6421A27151o6135N9128K88362J60992Q476k67404k97819Q2461J50935j2602J02026
$$ 127151 61016 120144 408506 569498 577974 310570 12751 95212 246147 233545 335571
6410C35571J81920J19390L1743j64898k01647j18541j78056j17753o7384o9012
$$ 335571 517491 636881 668624 503726 302079 183538 5482 -112271 -179655 -248667
6400b48667R8918J02518n6725o9244j4585J8312J60982q9400j23501l0955p4065
$$ -248667 -149749 -47231 -103956 -173200 -187785 -169473 -8491 -97891 -221392 -252347 -326412
6389c26412k60169j22246N2059J59457K40832J8496j78652j09775J15838J65982
$$ -326412 -586581 -708827 -656768 -497311 -256479 -237983 -416635 -526410 -410572 -244590
6379b44590J53734P3250R186m7585q3831j25271j6947R956L3784N4174M8013P0769
$$ -244590 -90856 -17606 -8420 -56005 -139836 -265107 -282054 -272098 -238314 -184140 -136127 -65358
6367f5358J74309K20192j21458m3040R1189j10304j74677Q677K7374k4007J12059
$$ -65358 108951 329143 207685 164645 255834 145530 -29147 -20470 6904 -17103 94956
6356I4956J49994R8349K8536j64336j91259j38825j4177P0227Q7739K44695P0558
$$ 94956 244950 343299 371835 207499 16240 -122585 -136762 -66535 21204 265899 336457
6345C36457j72375j01132r848R4856Q6698r8238j68012k0493K9447L2623j42584
$$ 336457 164082 62950 53102 147958 234656 136418 -31594 -52087 -22640 9983 -132601
6334a32601j57503j31966l6201K09324n707j33215M5616P4364R5648K87821L17908
$$ -132601 -290104 -422070 -458271 -248947 -254654 -387869 -342253 -267889 -172241 115580 433488
6323D33488J31043n1020j60658k54445k48372j50491J60792K74201M4739J01539
$$ 433488 564531 513511 352853 98408 -149964 -300455 -139663 134538 179277 280816
6313B80816J89942k27211l49940j60992P8694m3366j69369j0212K00944L28095
$$ 280816 470758 243547 -106393 -267385 -188691 -232057 -401426 -411638 -210694 117401
6303A17401J70295L7425j38603k41522k08817n3902R5652K30872J14471q4954
$$ 117401 287696 325121 186518 -55004 -263821 -317723 -222071 8801 123272 38318
6293C8318n1288m5758l7103J86387N1011k31103j87504M489q9541o8763Q1617
$$ 38318 -12970 -58728 -95831 90556 141567 -89536 -277040 -272551 -362092 -430855 -349238
6282c49238N5896j26986o9949M7814N2528n7897j00250p4367K1267Q3639j5599
$$ -349238 -293342 -420328 -490277 -442463 -389935 -447832 -548082 -622449 -601182 -517543 -533142
6271e33142J8286K37523J29512J1643J40214K40642J77193l395l7640N8230J28918
$$ -533142 -514856 -277333 -147821 -136178 4036 244678 421871 418476 380836 439066 567984
6260E67984Q3622o2783j17320j86115O8294K8447j62551l53560k46243M1198O1044
$$ 567984 651606 588823 471503 285388 353682 382129 219578 -133982 -380225 -339027 -277983
6249b77983n4736j19641j00414Q8325l7217l08754r4219K01371L37271K64470
$$ -277983 -332719 -452360 -552774 -464449 -501666 -810420 -904639 -703268 -365997 -101527
6239a01527J37992m0190K7721l5256j38350O5451p6515r8129K28021J08200q8187
$$ -101527 36465 -3725 23996 -11260 -149610 -84159 -160674 -258803 -30782 77418 -10769
6228a0769n5567K25660R6891j48267j35317k1784O5324p2896l201j6485J08322
$$ -10769 -66336 159324 256215 107948 -27369 -49153 16171 -56725 -59926 -76411 31911
6217C1911J92290P9531M3859J19814J05694M0417j4660j65384k38543j94978j12744
$$ 31911 224201 303732 347591 467405 573099 613516 598856 433472 194929 -49 -112793
6206a12793m3784J66938Q6645R8004K36l4600p336j20942l9960j3182j98134m443
$$ -112793 -156577 10361 97006 195010 195246 160646 153310 32368 -7592 -20774 -218908 -223351
6194b23351p8726k9712R1448p9072q0548K00289L48488J39749j32456k03119p8751
$$ -223351 -302077 -331789 -240341 -319413 -399961 -199672 148816 288565 156109 -47010 -125761
6183a25761J54021J94227L5300N7490J42009K54491J34865q2471q6314k33396
$$ -125761 28260 222487 257787 315277 457286 711777 846642 764171 677857 444461
6173D44461k68597m2943j51221k36849k37582K6686J82144L94136J91559k82182
$$ 444461 175864 132921 -18300 -255149 -492731 -466045 -283901 110235 301794 19612
6163A9612n5228k8295R5808J78860O4445k0569J1449r1428j03675p8461l033l4131
$$ 19612 -35616 -63911 31897 210757 275202 254633 266082 174654 70979 -7482 -10515 -44646
6151d4646L5765o4936k63357P153J11884j15388j36900P6226J39775j56745j63056
$$ -44646 -8881 -73817 -337174 -330021 -218137 -333525 -470425 -394199 -254424 -411169 -574225
6140e74225K6467J0580q3362j54958j54746n4851J31155J62111K06918k3973j09863
$$ -574225 -547758 -537178 -620540 -775498 -930244 -985095 -853940 -691829 -484911 -508884 -618747
6129f18747J51023J45622K80924L08307n2407o1639J61360J08567j36941j49553
$$ -618747 -467724 -322102 -41178 267129 214722 153083 314443 423010 286069 136516
6119A36516n7678j7718K12479R3074k70920j13302j40548k14457o1037P282L3319
$$ 136516 78838 61120 273599 366673 95753 -17549 -158097 -372554 -433591 -426309 -392990
6108c92990N8914M7136M0237J11788l6747R41L4056Q205n9038k9992R6996J86621
$$ -392990 -334076 -286940 -246703 -134915 -171662 -170721 -136665 -128460 -187498 -217490 -120494 66127
6096F6127J38539q6149j56211p5490j68826j32935K21857J52275l6826M4954K34535
$$ 66127 204666 118517 -37694 -113184 -282010 -414945 -193088 -40813 -77639 -32685 201850
6085B01850N7634k73056k36921j42594J1970M2322N5116K11771J63628J34573
$$ 201850 259484 -13572 -250493 -393087 -381117 -338795 -283679 -71908 91720 226293
6075B26293J63518O5475j83892j60412j46248j68447K6067n8717j01921l0791
$$ 226293 389811 455286 271394 110982 -35266 -203713 -177646 -236363 -338284 -369075
6065c69075P5135L7668J8381l7840k38959j95661r0239q319O1794P6299K02284
$$ -369075 -293940 -256272 -237891 -275731 -514690 -710351 -800590 -808909 -747115 -670816 -468532
6054d68532K03237J02135R5765o1982L9272J64660R6697O0591N0116J1799r1969
$$ -468532 -265295 -163160 -67395 -129377 -90105 74555 171252 231843 281959 293758 201789
6043B01789n8421K692J38464J03845P978K709j41548k22185N6771J16915q6277
$$ 201789 143368 146060 284524 388369 396347 399056 257508 35323 92094 209009 122732
6032A22732k14287r8133J03027O2735J02106o1615j51916j60349K0785o050j81979
$$ 122732 -91555 -189688 -86661 -23926 78180 16565 -135351 -295700 -274915 -280965 -462944
6021d62944j36197l8476K27133J31599J5935K1903o0054J51759R2786m1206j98797
$$ -462944 -599141 -637617 -410484 -278885 -262950 -241047 -301101 -149342 -56556 -97762 -296559
6010b96559j97004R6609R4194j39006j40219N5298K99088K75409K13203R7913
$$ -296559 -493563 -396954 -302760 -441766 -581985 -526687 -227599 47810 261013 358926
6000C58926m1503j33392k48202j38997M2396J11449N3887Q2538L356j54404j77746
$$ 358926 317423 184031 -64171 -203168 -160772 -49323 4564 87102 90458 -63946 -241692
5989b41692j84531o2034N42J023j7358J41579J26562J79002K09351n4763j58509
$$ -241692 -426223 -488257 -487715 -486692 -504050 -362471 -235909 -56907 152444 97681 -60828
5978f0828o4239O5476K8811l6012n9934l7294p0670q510Q6598J09479M1168j22152
$$ -60828 -125067 -59591 -30780 -66792 -126726 -164020 -234690 -243200 -156602 -47123 -5955 -128107
5966a28107l15439o718J03745n1768J172Q5756J77647J31953n5496j76695q140
$$ -128107 -443546 -450264 -346519 -398287 -397115 -311359 -133712 -1759 -57255 -233950 -242090
5955b42090N6326K05532P7237j6989N2989Q5844J07776Q383j81761k30707j86865
$$ -242090 -185764 19768 97005 80016 133005 218849 326625 335008 153247 -77460 -264325
5944b64325l03301o6358k4960N3591J57027Q9144J85787K30252R0586o3129j55087
$$ -264325 -567626 -633984 -658944 -605353 -448326 -359182 -173395 56857 147443 84314 -70773
5933g0773m9953N6137L6885N0061J03257J26327J87505j12324j81416N0543J18918
$$ -70773 -120726 -64589 -27704 22357 125614 251941 439446 327122 145706 196249 315167
5922C15167K28575P0729j19722j76440n0543l8998j39815N545O2341p3147j00431
$$ 315167 543742 614471 494749 318309 267766 228768 88953 94498 156839 83692 -16739
5911a6739J37172K6698j78533K1681R3190J18358L114j18742r7033j88752j74142
$$ -16739 120433 147131 -31402 -9721 83469 201827 204941 86199 -10834 -199586 -373728
5900c73728J56291K73687N0701P555J31774l9174J6710N6673o4344l3470n7386
$$ -373728 -217437 56250 106951 114506 246280 207106 223816 280489 216145 182675 125289
5889A25289j13152l3797j32543Q2985J24378k6803q1315j53550J10436K00205
$$ 125289 12137 -21660 -154203 -71218 53160 26357 -54958 -208508 -98072 102133
5879A02133l2811r3200L083O1825J6393J6800Q1482J37536L446o8419j19313j85175
$$ 102133 69322 -23878 -20795 41030 57423 74223 155705 293241 296687 228268 108955 -76220
5867g6220P5405m5407k54903j09992Q6322N1004K01772K26380L042n3101N9759
$$ -76220 -815 -46222 -301125 -411117 -324795 -273791 -72019 154361 157403 104302 164061
5856A64061n6860j40897j09746M8164L0058j05975J04840J84586l4281j09344
$$ 164061 107201 -33696 -143442 -95278 -65220 -171195 -66355 118231 83950 -25394
5846b5394K0043O8201P8055j45664j14668k8585l3349K2911K9777P5643J70280
$$ -25394 -5351 62850 140905 -4759 -119427 -148012 -181361 -158450 -128673 -53030 117250
5835A17250P0367j40713j55037l235n0815p5916O8272L08950K42895j24717o4568
$$ 117250 187617 46904 -108133 -111368 -162183 -238099 -169827 139123 382018 257301 192733
5824A92733j7661n1192p8913n6864j50970j67863K71534J13155n2449O9237m4637
$$ 192733 175072 123880 44967 -11897 -162867 -330730 -59196 53959 1510 70747 26110
5813B6110m0090Q0712K53793J99493r6025j60642j7177j74113j59517j60453k09504
$$ 26110 -13980 66732 320525 520018 423993 263351 246174 72061 -87456 -247909 -457413
5802d57413p0244l4779j40645N6034J91265K27911K08120q9654j92559Q0989J43996
$$ -457413 -527657 -562436 -703081 -647047 -455782 -227871 -19751 -109405 -301964 -220975 -76979
5791g6979N4791N3595j1569Q4543J02699K3084O565k78524l11325O5113K51007
$$ -76979 -22188 31407 19838 104381 207080 230164 236729 -41795 -353120 -288007 -37000
5780c7000K60818J65137j47038j32032j42721r7087n7292j62210r2418N3647J32380
$$ -37000 223818 388955 241917 109885 -32836 -129923 -187215 -349425 -441843 -388196 -255816
5769b55816J06331J10688J17762J40968J82505P1002r1974j99203k48150p6652
$$ -255816 -149485 -38797 78965 219933 402438 473440 381466 182263 -65887 -142539
5759a42539o8421P8938Q6480M5141J96496K54937P4739m6373j19214k30148k80239
$$ -142539 -210960 -132022 -45542 -401 196095 451032 525771 479398 360184 130036 -150203
5748a50203j19537j4867R2601J27167J73786L1337j15184M6835k5976j18780k09925
$$ -150203 -269740 -284607 -192006 -64839 108947 140284 25100 71935 45959 -72821 -282746
5737b82746j43312K24484J11237j20149K0668K12805J04333p1509p5263n5642
$$ -282746 -426058 -201574 -90337 -210486 -189818 22987 127320 55811 -19452 -75094
5727g5094L4301J73967J36617J67239K28291L9901q8628r0059p8720r2795Q692
$$ -75094 -40793 133174 269791 437030 665321 705222 616594 526535 447815 355020 363712
5716C63712n9498j91797j1253j25410j68474o5444P2266K60902J52043j73670
$$ 363712 304214 112417 101164 -24246 -192720 -258164 -185898 75004 227047 53377
5706E3377r7419J99379N9366J669m8831k36474k61617J5777J39681P6470Q565
$$ 53377 -44042 155337 214703 216372 167541 -68933 -330550 -314773 -175092 -98622 -90057
5695i0057j83175j67491P0191J10130Q1401J10969m0617j11404P5039l5892j36971
$$ -90057 -273232 -440723 -370532 -260402 -179001 -68032 -108649 -220053 -145014 -180906 -317877
5684c17877p0815j54184o4077K49932L13989J90111R5113M9060R1789Q7217K2669
$$ -317877 -388692 -542876 -606953 -357021 -43032 147079 242192 291252 383041 470258 492927
5673D92927j47539l01161o9341P0536J42818R4748N9061j95509k04004n8246l1129
$$ 492927 345388 44227 -25114 45422 188240 282988 342049 146540 -57464 -115710 -146839
5662a46839J52464J37084K9722k42004l14809r8216J7097J49871J73509J96508
$$ -146839 5625 142709 172431 -69573 -384382 -482598 -465501 -315630 -142121 54387
5652E4387N3964j89737m0246J75231J84042Q6916m1018j4501j19677k28314r1140
$$ 54387 108351 -81386 -121632 53599 237641 324557 283539 269038 149361 -78953 -170093
5641a70093J09883J02599Q3225J12149K077k08438k06225k50658k50092k61249
$$ -170093 -60210 42389 125614 237763 239840 31402 -174823 -425481 -675573 -936822
5631i36822m9455L00114J56030P7351J11051J62654J8227O366l3060k70020j36644
$$ -936822 -986277 -686163 -530133 -452782 -341731 -179077 -160850 -154484 -187544 -457564 -594208
5620e94208J63444K04120R5369K36791J92586l9972l8100j13578k96813k37920
$$ -594208 -430764 -226644 -131275 105516 298102 258130 220030 106452 -190361 -428281
5610d28281K2721O9034j02341P8379K3770j77340q4017q9580r3885J62986J67114
$$ -428281 -405560 -336526 -438867 -360488 -336718 -514058 -598075 -687655 -781540 -618554 -451440
5599d51440m5357j18889n2307M1906J56641K48192J77250J33488J12797O5002
$$ -451440 -496797 -615686 -667993 -626087 -469446 -221254 -44004 89484 202281 267283
5589B67283p7973k20471N8369R3384j48031m9243p5173q4172j49415r9670J55573
$$ 267283 189310 -31161 27208 120592 -27439 -76682 -151855 -236027 -385442 -485112 -329539
5578c29539L12716J31261k09580j51658P8320J29613J80386j6658k81622k80126
$$ -329539 -16823 114438 -95142 -246800 -168480 -38867 141519 124861 -156761 -436887
5568d36887K9949J70447j0632j24040n0312N8094K3765K2625n5121L0084J90560
$$ -436887 -406938 -236491 -247123 -371163 -421475 -363381 -339616 -316991 -372112 -342028 -151468
5557a51468J84795N6060N0640j0457n6203n8938j73182j0154J83892J03378l7177
$$ -151468 33327 89387 140027 129570 73367 14429 -158753 -168907 14985 118363 81186
5546H1186n673q2050q9186j07414j77029L4630K22604J00098j413m9267m5118
$$ 81186 75513 -6537 -95723 -203137 -380166 -345536 -122932 -22834 -24247 -73514 -118632
5535a18632k40730j05148J08521o6325j00454n2648r4215N7737L57152L13576
$$ -118632 -359362 -464510 -355989 -422314 -522768 -575416 -669631 -611894 -254742 58834
5525E8834L3919j33095j46060j22079R0965J25653J00149l6043j84611j91503
$$ 58834 92753 -40342 -186402 -308481 -217516 -91863 8286 -27757 -212368 -403871
5515d03871j37188K2274J13637N3078m1714q7460p4453K02040L11937R9148P5155
$$ -403871 -541059 -518785 -405148 -352070 -393784 -481244 -555697 -353657 -41720 57428 132583
5504A32583j2896L4899P9256j7795r9927l4858Q0947J54883J22571Q7559J75725
$$ 132583 119687 154586 233842 216047 116120 81262 162209 317092 439663 527222 702947
5493G02947M886j66612l34289j01925m1486J0884K283j37229L9990J05522R4206
$$ 702947 707833 541221 206932 105007 63521 74405 76688 -60541 -20551 84971 179177
5482A79177K5776o6968j52411j11453J35896K39336J77354j03809j67427j70509
$$ 179177 204953 137985 -14426 -125879 10017 249353 426707 322898 155471 -15038
5472a5038J2560O0335j30338n3845J37742M3379k14851j25100M5435j1469r3390
$$ -15038 -2478 57857 -72481 -126326 11416 54795 -160056 -285156 -239721 -251190 -344580
5461c44580L4431J67482n4833j74049R483J6976M527R244P8647J13603P5904O7049
$$ -344580 -310149 -142667 -197500 -371549 -362066 -345090 -340563 -331319 -252672 -139069 -63165 3884
5449C884J34849m7737k47243k66296r0998R2474K79183K04679J45898J23467J3960
$$ 3884 138733 90996 -156247 -422543 -513541 -421067 -141884 62795 208693 332160 346120
5438C46120p3521k6170k17887j58518R2018J02618O3375J8777k7028o645j2725
$$ 346120 272599 246429 28542 -129976 -37958 64660 128035 146812 119784 113139 100414
5427A00414j12126l5245n1208J03247J43492L5187K548k7116j13200q0391n8557
$$ 100414 -11712 -46957 -98165 5082 148574 183761 186309 159193 45993 -34398 -92955
5416i2955M4049O5037P7560J85839J85606P0503j76419k01247O6107o2207j34019
$$ -92955 -48906 16131 93691 279530 465136 535639 359220 157973 224080 161873 27854
5405B7854j51344J03965J26371O6364m9620k71133Q1381K39986J58817K29285
$$ 27854 -123490 -19525 106846 173210 123590 -147543 -66162 173824 332641 561926
5395E61926p0426j54150q3744j45743J6123k57194r9179J10326J87224J20022
$$ 561926 491500 337350 253606 107863 123986 -133208 -232387 -122061 65163 185185
5385A85185J52284l5130j50194j01555o3213p4209l7169m3422j63028j54661k4966
$$ 185185 337469 302339 152145 50590 -12623 -86832 -124001 -167423 -330451 -485112 -510078
5374e10078K00427P3329j5372r4626K5467J8312m585J27385j08874l17945N0878
$$ -510078 -309651 -236322 -251694 -346320 -320853 -302541 -307126 -179741 -288615 -606560 -555682
5363e55682K75171J95498j02558q5074J34526J71557j03886k33706o5828r3624
$$ -555682 -280511 -85013 -187571 -272645 -138119 33438 -70448 -304154 -369982 -463606
5353d63606R4761J46557M9693N8722j51884k5485K31499J53639J09812j08288
$$ -463606 -368845 -222288 -172595 -113873 -265757 -291242 -59743 93896 203708 95420
5343I5420n6081K63119J2004q5847N5161o2490j22287k6233n0391q42L8370L189
$$ 95420 39339 302458 314462 228615 283776 221286 98999 72766 22375 21533 59903 63092
5331F3092k7269K8844j32831n8369N435j08634R408J01577k2919o3775L6791J04655
$$ 63092 35823 64667 -68164 -126533 -121098 -229732 -220324 -118747 -141666 -205441 -168650 -63995
5319f3995K444m5255K093j3438N2749J63151K1236j97499j43456j18108q1806
$$ -63995 -61551 -106806 -104713 -118151 -65402 97749 118985 -78514 -221970 -340078 -421884
5308d21884n6578L1210J75132J30488j48137k71457p2215J24204J39812J62229
$$ -421884 -478462 -447252 -272120 -141632 -289769 -561226 -633441 -509237 -369425 -207196
5298b07196J73122K9935j23731j84217l5115p4261K0149P995j00899J88346J86345
$$ -207196 -34074 -4139 -127870 -312087 -347202 -421463 -401314 -393319 -494218 -305872 -119527
5287a19527o7897j9697J80625J07766K22720J99687j44779k46869m3355O7910
$$ -119527 -187424 -207121 -26496 81270 303990 503677 358898 112029 68674 136584
5277A36584k7302j46103m0866J49657O8021L0795j7548n8050j37365j31717N4069
$$ 136584 109282 -36821 -77687 71970 139991 170786 153238 95188 -42177 -173894 -119825
5266a19825K0888k5190o2813J40599K51315K65498J64201n6957l3617o4292p3662
$$ -119825 -98937 -124127 -186940 -46341 204974 470472 634673 577716 544099 479807 406145
5255D06145Q4891R4978R4780K1124j21628j52039q6408j31975j91899L1163j10916
$$ 406145 491036 586014 680794 701918 580290 428251 341843 209868 17969 49132 -61784
5244f1784m9915J03699P7756J13126L6700O085K03354L6996o2759j35198r9794
$$ -61784 -111699 -8000 69756 182882 219582 225667 429021 466017 403258 268060 168266
5233A68266L0484J93468k6645l27953l2445J72814L384o4666j4152J21166J19086
$$ 168266 198750 392218 365573 37620 5175 177989 181373 116707 102555 223721 342807
5222C42807J26183j22243m51887j18608Q5412p6085j62525J82961J35071n2659
$$ 342807 468990 346747 -105140 -223748 -138336 -214421 -376946 -193985 -58914 -111573
5212a11573L8838J3995J8479M1570o023K06575J07674j42521O3916J08108o7122
$$ -111573 -72735 -58740 -40261 1309 -4714 201861 309535 167014 230930 339038 271916
5201B71916j25499q440N5866M2622p3435q8827J09516K30442J03280j19168j92404
$$ 271916 146417 137977 193843 236465 163030 74203 183719 414161 517441 398273 205869
5190B05869l00846k42479P5344L68103M5825j73568J9806Q2827J8663k1023j53357
$$ 205869 -94977 -337456 -262112 105991 151816 -21752 -1946 80881 99544 78521 -74836
5179g4836p733K7204p3093j16800k20575Q694J93795K26376K09735j02394j77010
$$ -74836 -82569 -55365 -128458 -245258 -465833 -457139 -263344 -36968 172767 70373 -106637
5168a06637m1350M5920K43736J16239J31914K20963J35814j20934k47015j56053
$$ -106637 -147987 -102067 141669 257908 389822 610785 746599 625665 378650 222597
5158B22597o9559o2815J19338L06895J59935p4729j10988j23782q5906q2074j65128
$$ 222597 153038 90223 209561 516456 676391 601662 490674 366892 280986 198912 33784
5147C3784o7067l7557l1069J71075K93355m7000k47330l9616Q6804L1153J9512
$$ 33784 -33283 -70840 -101909 69166 362521 315521 68191 28575 115379 146532 166044
5136A66044k72877k51934q9563Q8606K35526o1823k68453j64176L9704L34385
$$ 166044 -106833 -358767 -448330 -359724 -124198 -186021 -454474 -618650 -578946 -244561
5126b44561L26165J19419j2710j03397l15423k66607J49352M53983L63511J66677
$$ -244561 81604 201023 188313 84916 -230507 -497114 -347762 106221 469732 636409
5116F36409m5729k69860k04856Q533m257j68800j28552O8804J70363L30291P8676
$$ 636409 590680 320820 115964 124497 120240 -48560 -177112 -108308 62055 392346 471022
5105D71022j66272J33789K78294J4196j23293m7426p7654k31021m9819n5022p4023
$$ 471022 304750 438539 716833 731029 607736 560310 482656 251635 201816 146794 72771
5094G2771m9350J5021n6171O1591l6680j48143p3053Q5549R9807r602J16599J41409
$$ 72771 23421 38442 -17729 43862 7182 -140961 -214014 -128465 -28658 -38260 78339 219748
5082B19748J07403R8289j39937k95254p2481K5768n0455q6689P6661Q7043k47956
$$ 219748 327151 425440 285503 -9751 -82232 -56464 -106919 -193608 -116947 -29904 -277860
5071b77860j65314K34637K51046J79436k4382p9139J66430J67584J59028J74157
$$ -277860 -443174 -208537 42509 221945 197563 118424 284854 452438 611466 785623
5061G85623N9222J8281j7167k76459l37153j31839j7573J363N9179q522l8139
$$ 785623 844845 863126 845959 569500 232347 100508 82935 84298 143477 134955 96816
5050I6816k34822j06474J48044Q0353K670N4186J1027M1934k1190k3827J5412
$$ 96816 -138006 -244480 -96436 -16083 -13413 40773 51800 93734 72544 48717 64129
5039F4129l8395l53273j78864J11087K66681J34677J46133J64102j57043k72218
$$ 64129 25734 -327539 -506403 -395316 -128635 6042 152175 316277 159234 -112984
5029a12984j01015J03998J12463K33661J68128J72295k48549m82604p8705M9957
$$ -112984 -213999 -110001 2462 236123 404251 576546 327997 -154607 -233312 -183355
5019a83355R3047K33065K42832j0113l5037J29142n1920l72728k03653J50707
$$ -183355 -90308 142757 385589 375476 340439 469581 417661 44933 -158720 -8013
5009h013K75886J38620K0148k74562j69102J94990L56225J8694j74115k18348
$$ -8013 267873 406493 426641 152079 -17023 177967 534192 552886 378771 160423
4999A60423l31994k89674j7497O5405K48729K91730N9954m1397J73776P6659j34918
$$ 160423 -171571 -461245 -478742 -413337 -164608 127122 187076 145679 319455 396114 261196
4988B61196K1723J17894p121m5806m4627J31061K14761k09025l44037j17839P7481
$$ 261196 282919 400813 393692 347886 303259 434320 649081 440056 96019 -21820 55661
4977E5661J75952K08114J82602j35608j54609L6070R6886J01948O3854J85244
$$ 55661 231613 439727 622329 486721 332112 368182 465068 567016 630870 816114
4967H16114J47624k10348k62064p5713J98170J25397Q3971J11670K9678j882J99622
$$ 816114 963738 753390 491326 415613 613783 739180 823151 934821 964499 962617 1162239
4956A162239N33635O0048l86442J38653L82793J93999j26128m11365k49594r2422
$$ 1162239 1695874 1755922 1369480 1508133 1890926 2084925 1958797 1547432 1297838 1205416
4946A205416k36837O5674L10081K60574J10588n4392o8071j25744n0250J02068
$$ 1205416 968579 1034253 1344334 1604908 1715496 1661104 1593033 1467289 1417039 1519107
4936A519107J04689k5448j35513N075K92699K40695J44113L78472M17224L38387
$$ 1519107 1623796 1598348 1462835 1467910 1760609 2001304 2145417 2523889 2941113 3279500
4926C279500L35021N93177O01904O90949Q55524R31558J165753J784054K237018
$$ 3279500 3614521 4207698 4809602 5500551 6356075 7287633 8453386 10237440 12474458
4917A2474458K823143L297530L947152N099952O710503R159477J3213938J9895868
$$ 12474458 15297601 18595131 22542283 27642235 34352738 43512215 56726153 76622021
4909G6622021L1237039M9540363O8593911M3712815l6841641o7453008m6713964
$$ 76622021 107859060 157399423 225993334 269706149 232864508 165411500 118697536
4902A18697536k6872140j5587376j4118544j3472022j0501850p109284n199740
$$ 118697536 91825396 76238020 62119476 48647454 38145604 31036320 25836580
4895B5836580m029048l130771k350906k197805k081194j952032j444659j010648
$$ 25836580 21807532 18676761 16325855 14128050 12046856 10094824 8650165 7639517
4887G639517p89221p19868m00359k75192l49275n73221m27065l52663k20904m03784
$$ 7639517 6850296 6130428 5730069 5454877 5105602 4532381 4105316 3752653 3531749 3127965
4877C127965l07695k33827k57381j45925j11247j63162j33623k05145p4841J9627
$$ 3127965 2820270 2586443 2329062 2183137 2071890 1908728 1775105 1569960 1495119 1514746
4867A514746K52043Q7631K82710K68408K39577N16883M44683j48806l42058l03764
$$ 1514746 1766789 1854420 2137130 2405538 2645115 3161998 3606681 3457875 3115817 2812053
4857B812053r7476k18787l70266l90940k78647k31935j14706k30089j03138P7967
$$ 2812053 2714577 2495790 2125524 1734584 1455937 1224002 1109296 879207 776069 854036
4847H54036K65082P6435j92941k26633j76599n4572L09252J64956m6557J1459
$$ 854036 1119118 1195553 1002612 775979 599380 544808 854060 1019016 972459 983918
4837I83918j9180j84270o0115K0860k500M9383n3240k20214l3451N8180J43561
$$ 983918 964738 780468 720353 741213 738713 788096 734856 514642 481191 539371 682932
4826F82932J36180n7771j20347k6228q7798K8711K48870J44827k36285k06408
$$ 682932 819112 761341 640994 614766 526968 555679 804549 949376 713091 506683
4816E06683q2802r4044j49109j0572m9126P8125k1831k09844o5407Q0606p3806
$$ 506683 423881 329837 180728 170156 121030 199155 177324 -32520 -97927 -17321 -91127
4805i1127M766J14506J38150O9620J64096R6266r2379j42576j04984o4512n258
$$ -91127 -86361 28145 166295 235915 400011 496277 403898 261322 156338 91826 86568
4794H6568j02106l7579o2428j5280n1336J34254R3563K9926N5918Q0618O7789
$$ 86568 -15538 -53117 -115545 -130825 -182161 -47907 45656 75582 131500 212118 279907
4783B79907L0696p0797M1841M1480r387j63888j03602K5271l1100N829N2300J0551
$$ 279907 310603 239806 281647 323127 313740 149852 46250 71521 40421 46250 98550 109101
4771A09101L2276p6170j33320j530J33339J29162M0694o3210L8339P0192L3024
$$ 109101 141377 65207 -68113 -69643 63696 192858 233552 170342 208681 278873 311897
4760C11897j70430j01859j25970r0531m2074J59060J05289l9661n0670J49599
$$ 311897 141467 39608 -86362 -176893 -218967 -59907 45382 5721 -44949 104650
4750A04650Q2680j17360m5675J9428M8679J32685Q6440r7586M9619L27007J99877
$$ 104650 187330 69970 24295 43723 92402 225087 311527 213941 263560 590567 790444
4739G90444P7862p0414k80846k68461j75458j53922R7036K8460K4233m7669q100
$$ 790444 868306 797892 517046 248585 73127 -80795 16241 44701 68934 21265 13165
4728A3165N9463j4570L6280L6835o9359o9758N9527J6622j41983m3106J81540
$$ 13165 72628 58058 94338 131173 61814 -7944 51583 68205 -73778 -116884 64656
4717F4656J41639l2384j25429l2990k5070P6346K14540J07110k07631k03276n640
$$ 64656 206295 173911 48482 15492 -9578 66768 281308 388418 180787 -22489 -28129
4706b8129P8079m0861j73107p835N7217J1751J0488j61409j32908N7150P8295
$$ -28129 49950 9089 -164018 -171853 -114636 -102885 -92397 -253806 -386714 -329564 -251269
4695b51269J74490K91167L10105Q7855j25937k08296k96096j59241K8269L37083
$$ -251269 -76779 214388 524493 612348 486411 278115 -17981 -177222 -148953 188130
4685A88130K07265j61923k62734k00354K8313J75247K66361k0739r9516K7448
$$ 188130 395395 233472 -29262 -229616 -201303 -26056 240305 219566 120050 147498
4675A47498J4084m7273P2968j33582k06725j129L00810J94016o8642p6128n0115
$$ 147498 161582 114309 187277 53695 -153030 -154159 146651 340667 272025 195897 145782
4664A45782j66415j64340j46571q1535k2613J02189J32354J43433J10269p2841
$$ 145782 -20633 -184973 -331544 -413079 -435692 -333503 -201149 -57716 52553 -20288
4654b0288o3859m3416Q3992j3126J29502L62541J47987j49805j00673j47894j79003
$$ -20288 -84147 -127563 -43571 -56697 72805 435346 583333 433528 332855 184961 5958
4643E958r5177L651K17131J15712K1274p2747j21743P665N8310J43076R2454L7615
$$ 5958 -89219 -85568 131563 247275 268549 195802 74059 81724 140034 283110 375564 413179
4631D13179k37897k46371j43527R2160J73471N1596l0612q2241o184p4260k72957
$$ 413179 175282 -71089 -214616 -122456 51015 102611 71999 -10242 -16426 -90686 -363643
4620c63643j69889K29424L23255J96780L56880K62667j20958j77336j25861q3835
$$ -363643 -533532 -304108 19147 215927 572807 835474 714516 537180 411319 327484
4610C27484k5796n1973L7553P6368q0340n0974l5423j44411k44497k58676j22252
$$ 327484 301688 249715 287268 363636 283296 232322 196899 52488 -192009 -450685 -572937
4599e72937M9140j3637K0435K01484K34068Q1595p6989o0388l546n0037p1447
$$ -572937 -523797 -537434 -516999 -315515 -81447 148 -76841 -137229 -140775 -190812 -262259
4588b62259k46857p4176K89464J58102j03670m9049K82524K06009j29973j26758
$$ -262259 -509116 -583292 -293828 -135726 -239396 -288445 -5921 200088 70115 -56643
4578e6643q1421j16644O4705J16676K93305K74702J14259m0584K2111o8587k29028
$$ -56643 -138064 -254708 -190003 -73327 219978 494680 608939 568355 590466 521879 292851
4567B92851j88897p3720j2221J25395P2408N8150l8883k34986j66989p5223j2095
$$ 292851 103954 30234 18013 143408 215816 273966 235083 97 -166892 -242115 -254210
4556b54210j7588R5919J17231j9890K2769K04066K89097O3882j82283j72992j42388
$$ -254210 -271798 -175879 -58648 -78538 -55769 148297 437394 501276 318993 146001 3613
4545C613j13030O1325J84095L23026M6409k69679l40535k47489j18494j7794K45556
$$ 3613 -109417 -48092 136003 459029 505438 235759 -104776 -352265 -470759 -488553 -242997
4534b42997J52330q4771j4999M1930Q6514O882M0161j1876q5170m9411K4409J08608
$$ -242997 -90667 -175438 -190437 -148507 -61993 -55111 -14950 -26826 -111996 -161407 -136998 -28390
4522b8390L2881j03632M0361J0719p928q5204Q031K69620M3091k89762j0025J82180
$$ -28390 4491 -99141 -58780 -48061 -55989 -141193 -133162 136458 179549 -110213 -120238 61942
4510F1942K99088J46391j4612q2226j3116Q9830j90477l88095j05404J5755p6723
$$ 61942 361030 507421 492809 410583 397467 487297 296820 -91275 -196679 -180924 -257647
4499b57647p6855K11991K26147K20527j4030k27266m153R5218j31237j17075j7576
$$ -257647 -334502 -122511 103636 324163 310133 82867 78714 173932 42695 -74380 -91956
4488i1956J9269J8672J53978J50987n0283k28358j01821N3236m657N4574K1644
$$ -91956 -72687 -54015 99963 250950 200667 -27691 -129512 -76276 -80933 -26359 -4715
4477d715j1006O0234K00802J8196n0264k3550j33516j48632j51726q046r16P3278
$$ -4715 -15721 44513 245315 263511 213247 189697 56181 -92451 -244177 -252223 -253139 -179861
4465a79861J70017O0768m0140N6820R010K9307M6070J8621j29488k935K07548
$$ -179861 -9844 50924 10784 67604 76614 105921 151991 170612 41124 38189 245737
4454B45737P2631k56675k53067k1316J87354L26295K13202L6228l4597j00692
$$ 245737 318368 61693 -191374 -212690 -25336 300959 514161 550389 515792 415100
4444D15100o6827J01845K634l01770k62328J15908J70229J02111q5211m1634O3447
$$ 415100 348273 450118 452752 150982 -111346 4562 174791 276902 191691 150057 213504
4433B13504j3372L9298j10737k00099M9789P592r1655K8820K5988j1772L9775
$$ 213504 200132 239430 128693 -71406 -21617 -14025 -105680 -76860 -50872 -62644 -22869
4422b2869Q5995J05021n4860J40789K56388l2468r7529l61131k69211j410K15135
$$ -22869 63126 168147 113287 254076 510464 477996 380467 19336 -249875 -251285 -36150
4411c6150K53082K08620k15967l48053k11306K0002J10846J27692J34427k1814
$$ -36150 216932 425552 209585 -138468 -349774 -329772 -218926 -91234 43193 21379
4401B1379m9451J10816k17368j06461j4371N4231l360j6129M7207J44600J56007
$$ 21379 -28072 82744 -134624 -241085 -255456 -201225 -204585 -220714 -173507 -28907 127100
4390A27100N6069m1795p5291J8934K90555K48542K1335j33833l30616j33158l9821
$$ 127100 183169 141374 66083 85017 375572 624114 645449 511616 181000 47842 8021
4379H021N2030L17253J55314j82323j17613j17282J02141J04400k23147j57741
$$ 8021 60051 377304 532618 350295 232682 115400 217541 321941 98794 -58947
4369e8947J48356J89096o1940j02820K17718J50898j40839k37088M2805J36838
$$ -58947 89409 278505 216565 113745 331463 482361 341522 104434 147239 284077
4359B84077K54758K5027j16770j24699k02330k53867J08783K04061j44041j0851
$$ 284077 538835 563862 447092 322393 120063 -133804 -25021 179040 34999 24148
4349B4148J31540l9931j50555j16980P9499J91013R0373l2111l8237O5918J02476
$$ 24148 155688 115757 -34798 -151778 -72279 118734 209107 176996 138759 204677 307153
4338C07153j17809j70788j06706o0201R8149j7884j02297J9975k7537R2889K22729
$$ 307153 189344 18556 -88150 -148351 -50202 -68086 -170383 -150408 -177945 -85056 137673
4327A37673K25121M2540k93554l61665j82593p1584r2349Q714n6301n0867L29103
$$ 137673 362794 405334 111780 -249885 -432478 -504062 -596411 -587697 -643998 -694865 -365762
4316c65762P7514n1385j21365k7856J60640L8014J89653L45161L17771j400k30105
$$ -365762 -288248 -339633 -460998 -488854 -328214 -290200 -100547 244614 562385 560985 330880
4305C30880M3519K54698J89704R461j34615k43399j09363k5406j70077r9386J60650
$$ 330880 374399 629097 818801 828262 693647 450248 340885 315479 145402 46016 206666
4294B06666l1073o4253N7522K0191n9198M0486P2830j31772j68450l1963k5600
$$ 206666 175593 111340 168862 189053 129855 170341 243171 111399 -57051 -89014 -114614
4283a14614n7030M52Q1505J61750M5574n072J39800J87034j6634j39962J1294
$$ -114614 -171644 -171192 -89687 72063 117637 112565 252365 439399 422765 282803 294097
4272B94097J08613J85852j23732l04365j14733M5898M0013J31598J38635L30890
$$ 294097 402710 588562 464830 160465 45732 91630 131643 263241 401876 732766
4262G32766L27476J62639N4248k4398J42065L77724J90178j01526k41418j24803
$$ 732766 1060242 1222881 1277129 1252731 1394796 1772520 1962698 1861172 1619754 1494951
4252A494951l14314j58858r854m621q0525J30298Q696L6982P7644J92846K24440
$$ 1494951 1180637 1021779 1011925 1007304 926779 1057077 1065773 1102755 1180399 1373245 1597685
4241A597685J21767J95877L71811K30877K05218L24790M81007K73544K74820L49510
$$ 1597685 1719452 1915329 2287140 2518017 2723235 3048025 3529032 3802576 4077396 4426906
4231D426906M04764M66120Q11488R20782J256974J497246K342047K994991L539558
$$ 4426906 4831670 5297790 6109278 7030060 8287034 9784280 12126327 15121318 18660876
4222A8660876M115851N397944O610406Q869725J1839604J7693424K7585670M4601663
$$ 18660876 22776727 28174671 34785077 43654802 55494406 73187830 100773500 145375163
4214A45375163O4720558N9073086j1249320o7499187n8498096l7557387k2625896
$$ 145375163 210095721 269168807 257919487 190420300 131922204 94364817 71738921
4207G1738921j5350936j1200139q947281o703229n404718m190224l116058k436518
$$ 71738921 56387985 45187846 36240565 29537336 24132618 19942394 16826336 14389818
4199A4389818k259567j673912j466967j002532q86476p12014n43790l81984o55159
$$ 14389818 12130251 10456339 8989372 7986840 7100364 6388350 5844560 5462576 4807417
4190D807417n28283m67169j53993l87334l43736k67799m7212j12706K6344j46267
$$ 4807417 4279134 3811965 3657972 3270638 2926902 2659103 2611891 2499185 2525529 2379262
4180B379262j24413k95558k72183k54030l3706j610j13687j35577l3533o3720
$$ 2379262 2254849 1959291 1687108 1433078 1399372 1397762 1284075 1148498 1114965 1051245
4170A051245L0349M5356l4953p701J7731o4035M4064K03798L54206L4268j74686
$$ 1051245 1081594 1126950 1091997 1084296 1102027 1037992 1082056 1285854 1640060 1674328 1499642
4159A499642k7773n9628j92279k41679o5051n6925k39211k40031q6379j1581L5770
$$ 1499642 1471869 1412241 1219962 978283 913232 856307 617096 377065 290686 279105 314875
4148C14875K95166J90889o1455j78740l50890m34711k38965N2595K93837K24195
$$ 314875 610041 800930 739475 560735 209845 -224866 -463831 -411236 -117399 106796
4138A06796J52311O6086n1897j38479j6518k7974j12847p5867P7393R3392K11058
$$ 106796 259107 325193 273296 134817 118299 90325 -22522 -98389 -20996 72396 283454
4127B83454J21891l6786p4537j07531r6801p1128J01919N8017J36102O2403j77343
$$ 283454 405345 368559 294022 186491 89690 18562 120481 178498 314600 377003 199660
4116A99660l0841J39810Q7113p7258R9153R3748k5913P4370J20066L3952l00434
$$ 199660 168819 308629 395742 318484 417637 511385 485472 559842 679908 713860 413426
4105D13426l39375j42808m6421l4859j1441L7659K28211K70977R2321J0867J89190
$$ 413426 74051 -68757 -115178 -150037 -161478 -123819 104392 375369 467690 478557 667747
4094F67747J88097j4061j95856m9262K59184R8644j16004k09039k32250p9949
$$ 667747 855844 841783 645927 596665 855849 954493 838489 629450 397200 317251
4084C17251j34979j34920J0831J06668J87127n7455j61042J6976l5698j65526
$$ 317251 182272 47352 58183 164851 351978 294523 133481 150457 114759 -50767
4074e0767J6645K15693l6824l75673j17629K19688L35244Q3668P4943K06031J06368
$$ -50767 -34122 181571 144747 -230926 -348555 -128867 206377 290045 364988 571019 677387
4063F77387j07269k41578o3464Q3326l6785q8279j3809K5787Q419j4483k4812
$$ 677387 570118 328540 265076 348402 311617 223338 209529 235316 243735 229252 204440
4052B04440k414J70972J61607j91796j99388r3725J9800j37159j13776l8552K7340
$$ 204440 202026 372998 534605 342809 143421 49696 69496 -67663 -181439 -219991 -192651
4041a92651j8283J51666L8910n8302R9553J43099n181j00108J93039j8046j64171
$$ -192651 -210934 -59268 -20358 -78660 20893 163992 158811 58703 251742 233696 69525
4030F9525l1472r9415j70493N5951K55513K86555L0893k13425j77341L4629J40954
$$ 69525 38053 -61362 -231855 -175904 79609 366164 397057 183632 6291 40920 181874
4019A81874m7191k4851O8218J79413R7794j46872r3056P650J98250N5011q5662
$$ 181874 134683 109832 178050 357463 455257 308385 215329 222979 421229 476240 390578
4008C90578j11473p2404k6742j964J00329P9898M5332j16434n4382J58008R3706
$$ 390578 279105 206701 179959 177995 278324 358222 403554 287120 232738 390746 484452
3997D84452j07856l08457l03886j07248j5736j12448N4873Q9923J9781J17412
$$ 484452 376596 68139 -235747 -342995 -358731 -471179 -416306 -326383 -306602 -189190
3987a89190K13518N6948q2595P3263J7298O841N294N1923K9302n6410j80710m7429
$$ -189190 24328 81276 -1319 71944 89242 96083 101377 153300 182602 126192 -54518 -101947
3975a01947L7619p7461J6627J84155Q7724j68723j15387n2293J0317j9928M3081
$$ -101947 -64328 -141789 -125162 58993 146717 -22006 -137393 -189686 -179369 -199297 -156216
3964a56216j5955P0298J84009K15567m2364k10480R0667J19299k56971j81338
$$ -156216 -172171 -101873 82136 297703 255339 44859 135526 254825 -2146 -183484
3954a83484K0837J56040J10923R2613k6355l2014j42655l2881J89109K64112P4968
$$ -183484 -162647 -6607 104316 196929 170574 138560 -4095 -36976 152133 416245 491213
3943D91213L2372K870j53919j82898j78959m9065N4861j53749k50464k3180J01609
$$ 491213 523585 526455 372536 189638 10679 -38386 16475 -137274 -387738 -410918 -309309
3932c09309J49266J35721O0333o6180l10729q800K76444J4110j2711J41588J80683
$$ -309309 -160043 -24322 36011 -30169 -340898 -349698 -73254 -59144 -71855 69733 250416
3921B50416J60001J95928J30116j56005l16011k42981L9340M9498p9045j60178
$$ 250416 410417 606345 736461 580456 264445 21464 60804 110302 31257 -128921
3911a28921j31261N4142J44426J60448k8438k28340J3278K30558J0361O9413J79122
$$ -128921 -260182 -206040 -61614 98834 70396 -157944 -144666 85892 96253 165666 344788
3900C44788J701j15131j2323j5323j35262n3602J9769m889J44231j7355j80282
$$ 344788 346489 231358 219035 203712 68450 14848 34617 29728 173959 156604 -23678
3889b3678j5956K11852K58700O1871l9320Q3998L3387j05118j33497k32585j46187
$$ -23678 -39634 172218 430918 492789 453469 537467 570854 465736 332239 99654 -46533
3878d6533J24399K35856P1064l21786j15186K05857J06397R4432l7247l70727
$$ -46533 77866 313722 384786 63000 -52186 153671 260068 354500 317253 -53474
3868e3474k89447p1521j07298L6134O722O673J44310N3861K44053J37271j66155
$$ -53474 -342921 -414442 -521740 -485606 -478884 -472211 -327901 -274040 -29987 107284 -58871
3857e8871j81375p1420L0131J38525L12158m6997k84445o6665J8297J7673K16727
$$ -58871 -240246 -311666 -281535 -143010 169148 122151 -162294 -228959 -210662 -192989 23738
3846B3738J98343n475P6442j66791k63518j18935K66601L84154J64234j97871
$$ 23738 222081 216606 293048 126257 -137261 -256196 10405 394559 558793 360922
3836C60922j77964P9450r3794k08056j80691N4184J78214J46943K866q6679k16734
$$ 360922 182958 262408 168614 -39442 -220133 -165949 12265 159208 162074 75395 -141339
3825a41339r1579J66309K11746J09034Q8065J7765k4655k1093k08522k21705J1788
$$ -141339 -232918 -66609 145137 254171 342236 360001 335346 314253 105731 -115974 -104186
3814a04186Q0162l6015j42620k25351j54K20726J18652M9418J91137j5623j44275
$$ -104186 -24024 -60039 -202659 -428010 -428164 -207438 -88786 -39368 151769 136146 -8129
3803h129k14419j03877q4087j80822K01495K94325K77413K13250N9570n5032j06990
$$ -8129 -222548 -326425 -410512 -591334 -389839 -95514 181899 395149 454719 399687 292697
3792B92697L0210R5230n0333Q7136j30198j86832M9662K44006J71284j50320j93178
$$ 292697 322907 418137 367804 454940 324742 137910 187572 431578 602862 452542 259364
3781B59364n7275m7300k80028j78381J29397K41372j4281k77322j29525p9199
$$ 259364 202089 154789 -125239 -303620 -174223 67149 52868 -224454 -353979 -433178
3771d33178k2477m1345J09899K00036J79509O2345J16470j125J5702L4687M4308
$$ -433178 -455655 -497000 -387101 -187065 -7556 54789 171259 170134 185836 220523 264831
3760B64831J2561j52686j25846l53613l36234j48997J60712L12852K69575J66757
$$ 264831 277392 124706 -1140 -354753 -690987 -839984 -679272 -366420 -96845 69912
3750F9912l7986r8670J82751L29426J44405l7088j05733r2044k79068m03030j63456
$$ 69912 31926 -66744 116007 445433 589838 552750 447017 354973 75905 -327125 -490581
3739d90581J96472L02256J68150O0059j76312k16096j31265n4362J28414L0138
$$ -490581 -294109 8147 176297 236356 60044 -156052 -287317 -341679 -213265 -183127
3729a83127o172p8183j11822j17109k08996k04453N114J58427P4243J05359K64120
$$ -183127 -189299 -267482 -379304 -496413 -705409 -909862 -904748 -746321 -672078 -566719 -302599
3718c02599J04201j06656N9254J73588K40980J72781J71977J34990j59714l53283
$$ -302599 -198398 -305054 -245800 -72212 168768 341549 513526 648516 488802 135519
3708A35519k78572O1906J63613l7126j36274j24761k3400J54872L87483L69540
$$ 135519 -143053 -81147 82466 45340 -90934 -215695 -239095 -84223 303260 672800
3698F72800P1381j14077r0210O4142K4578K4957j83235k40515k01809p9066j04547
$$ 672800 744181 630104 539894 604036 628614 653571 470336 229821 28012 -51054 -155601
3687a55601j26318O8941Q1927Q8544O8399j80891j85859j40355M2243L02854O6485
$$ -155601 -281919 -212978 -131051 -42507 25892 -154999 -340858 -481213 -438970 -136116 -69631
3676f9631m6616J16830R4179M955o5447j56697j28796L5290q5226j03771R4835
$$ -69631 -116247 583 94762 99717 34270 -122427 -251223 -215933 -301159 -404930 -310095
3665c10095K00605M1897j40646j21J11557K04119R4889j33556j04187j1669j36312
$$ -310095 -109490 -67593 -208239 -208360 -96803 107316 202205 68649 -35538 -47207 -183519
3654a83519j00734J79484J80475n2316j80225j42547j0986l1180O3715J80066
$$ -183519 -284253 -104769 75706 23390 -156835 -299382 -310368 -341548 -277833 -97767
3644i7767L5450j32303J12244J61064J40264J17998M1167q1781j8761P7053r4554
$$ -97767 -62317 -194620 -82376 78688 218952 336950 378117 296336 277575 354628 260074
3633B60074j10521j4766L6694k39578j32504L1472J2038K00919K45233j2859q7972
$$ 260074 149553 134787 171481 -68097 -200601 -169129 -157091 43828 289061 276202 188230
3622A88230R3161K8439P0092k278o6965M063Q1750N0699m1008P5023P1266k45716
$$ 188230 281391 309830 379922 377644 310679 314742 396492 447191 406183 481206 552472 306756
3610C06756k47004m7217l592j41994k70713j14428q746P6914K15404P2636j26204
$$ 306756 59752 12535 8943 -133051 -403764 -518192 -526938 -450024 -234620 -161984 -288188
3599b88188o4785L2630l6532R8497J47833J09115m8203q3539r4112k0435J17717
$$ -288188 -352973 -320343 -356875 -258378 -110545 -1430 -49633 -133172 -227284 -247719 -130002
3588a30002J58052P385J03968J75951k1316k99172q5694K9848P2806N4089p6918
$$ -130002 28050 35435 139403 315354 294038 -5134 -90828 -60980 11826 65915 -11003
3577a1003J75780J63851K6460p679O9305j23245l02266n3667J0606O1040J59129
$$ -11003 164777 328628 355088 347409 416714 293469 -8797 -62464 -51858 9182 168311
3566A68311J27632R3360j14629o6408Q4317o0275k19242j42405j69074N2880K74710
$$ 168311 295943 389303 274674 208266 292583 232308 13066 -129339 -298413 -245533 29177
3555B9177J35567j72941k01100N1606j73044j87484L7069K70027K89927J52122
$$ 29177 164744 -8197 -209297 -157691 -330735 -518219 -481150 -211123 78804 230926
3545B30926r6676o5089J43723Q1510J18432P2097j54003N072J38250J8114N4324
$$ 230926 134250 69161 212884 294394 412826 484923 330920 335992 474242 492356 546680
3534E46680O8012J49887p8904k21869o5897Q1573o7785j92543j09775M9071J01046
$$ 546680 614692 764579 685675 463806 397909 479482 411697 219154 109379 158450 259496
3523B59496J61923J6820l33131j87311M0756j09006k62311j17963K13172J46461
$$ 259496 421419 438239 105108 -82203 -41447 -150453 -412764 -530727 -317555 -171094
3513a71094J09254L43621Q9802Q2699J26304j5050r5078k76078l84984r7619m7282
$$ -171094 -61840 281781 371583 454282 580586 565536 470458 194380 -190604 -288223 -335505
3502c35505j99188J59677L99272J36573N9894J9188M191l3808j5098P6504K6307
$$ -335505 -534693 -375016 24256 160829 220723 239911 244102 210294 195196 271700 298007
3491B98007M8745n8352k82785p5442K70599Q8475M0787o7414r3741k2307k40883
$$ 298007 346752 288400 5615 -69827 200772 289247 330034 262620 168879 146572 -94311
3480i4311o4674J65882J02147n3605N1720P4584l3832M9235O0385j65762j21724
$$ -94311 -158985 6897 109044 55439 107159 181743 147911 197146 257531 91769 -29955
3469b9955Q9785J99960K02826R6143q0948r5022j53060k43486j78641k29195j79079
$$ -29955 59830 259790 462616 558759 477811 382789 229729 -13757 -192398 -421593 -600672
3458f00672K4088J78780J77329J91513K19594J98006j46980k89051j55429L28
$$ -600672 -576584 -397804 -220475 -28962 190632 388638 241658 -47393 -202822 -202494
3448b02494J42943O6815m89o1005K17924O3432j05997j2299J08610O3632j16101
$$ -202494 -59551 7264 6775 -54230 163694 227126 121129 108830 217440 281072 164971
3437A64971k4974p0790j44968l5040J87395k7077k41150j34277j05889J09443
$$ 164971 139997 69207 -75761 -110801 76594 49517 -191633 -325910 -431799 -322356
3427c22356J78787J06422j014j8242J17294J05366j15715r1956p9346j6467R6787
$$ -322356 -143569 -37147 -38161 -56403 60891 166257 50542 -41414 -120760 -137227 -40440
3416d0440P9913K2689l7219M247J4256j8191k0828J2287J87334K24694j29388
$$ -40440 39473 62162 24943 29190 43446 25255 4427 16714 204048 428742 299354
3405B99354l29799j03885L4631R3680J63784J27118r4797k48872k21215j7141
$$ 299354 -30445 -134330 -99699 -6019 157765 284883 190086 -58786 -280001 -297142
3395b97142J64871J31791K04414J02603j34236k11021k57207k38330q1458j16578
$$ -297142 -132271 -480 203934 306537 172301 -38720 -295927 -534257 -615715 -732293
3385g32293K52228L16788J45101k9684j02627P3119j26137l01898j64398J32917
$$ -732293 -480065 -163277 -18176 -47860 -150487 -77368 -203505 -505403 -669801 -536884
3375e36884K03134O0955O6793M2239O9127J30730O7173j10718r1572M1046l2994
$$ -536884 -333750 -272795 -206002 -163763 -94636 36094 103267 -7451 -99023 -57977 -90971
3364i0971q7342p9641m4043j13402j68003j29402k11191o7364K06163J57221j24765
$$ -90971 -178313 -257954 -301997 -415399 -583402 -712804 -923995 -991359 -785196 -627975 -752740
3353g52740J49845L13398K30923o7782j83272M8997O1478J9299J53864K76557
$$ -752740 -602895 -289497 -58574 -126356 -309628 -260631 -199153 -179854 -25990 250567
3343B50567J00924J01943K1031j83497k80514k59285J29248K05177Q8785j71080
$$ 250567 351491 453434 474465 290968 10454 -248831 -119583 85594 174379 3299
3333C299j83389j37925q1948j08091j05204J40877L78054K52538J07033l3543
$$ 3299 -180090 -318015 -399963 -508054 -613258 -472381 -94327 158211 265244 231701
3323B31701j88189j75890P8150L0879n5433j17133k02497j45564M3502K6536j1169
$$ 231701 43512 -132378 -54228 -23349 -78782 -195915 -398412 -543976 -500474 -473938 -485107
3312d85107J58359K47958K06983M09232J25948l43450k53179p8802P2263L6034
$$ -485107 -326748 -78790 128193 537425 663373 319923 66744 -12058 60205 96239
3302I6239O4236J07851j04928k59121j9216J1148O5927o8902K0561J2978K7861
$$ 96239 160475 268326 163398 -95723 -114939 -103791 -37864 -106766 -86205 -73227 -45366
3291d5366J54139M131l1123m3984j28989j51530k5047J45113R9378J19713J33512
$$ -45366 108773 112904 81781 37797 -91192 -242722 -267769 -122656 -23278 96435 229947
3280B29947j06359k41807r8879J3379k11847o5533M87202L26927L0864j06261
$$ 229947 123588 -118219 -217098 -203719 -415566 -481099 6103 333030 363894 257633
3270B57633R311q943m3279j40520k06711M6369J78838J58559N8709j0674k42726
$$ 257633 266944 258001 214722 74202 -132509 -86140 92698 251257 309966 299292 56566
3259E6566l89122j30528K02093J47520j13278j29139J4137j9519O8291J35440
$$ 56566 -332556 -463084 -260991 -113471 -226749 -355888 -341751 -361270 -292979 -157539
3249a57539J76026Q1685O2438j40490k28797K5593J99334n5189r3468J86652J10240
$$ -157539 18487 100172 162610 22120 -206677 -181084 18250 -36939 -130407 56245 166485
3238A66485r6267j39871j8517J25392J48915Q0768j9222k51378r2241K05640J36818
$$ 166485 70218 -69653 -88170 37222 186137 266905 247683 -3695 -95936 109704 246522
3227B46522P0836P481k56656k03272L5833l3489j26459l8021l2021K000K32149
$$ 246522 317358 324839 68183 -135089 -99256 -132745 -259204 -297225 -329246 -327246 -95097
3216i5097K80486M1500M4532l634l14446j65533k3160k9002P3243J52422O1384
$$ -95097 185389 226889 271421 267787 -46659 -212192 -235352 -264354 -191111 -38689 22695
3205B2695K2153J15660j6875m6284p8909L7927q6533j31458R1064K27356J99287
$$ 22695 44848 160508 143633 97349 18440 56367 -30166 -161624 -70560 156796 356083
3194C56083j63499l13174q1840O4672J23197K5523J8558k9533j34415j28111J11817
$$ 356083 192584 -120590 -202430 -137758 -14561 10962 29520 -13 -134428 -262539 -150722
3183a50722J41309o252J05412N9916O7933J00576L260p5007m7656j58524j90410
$$ -150722 -9413 -15665 89747 149663 217596 318172 321432 246425 198769 40245 -150165
3172a50165j37232p8319J42606p328j35760N4136Q3375J01669L9132J21349M2604
$$ -150165 -287397 -365716 -223110 -230438 -366198 -312062 -228687 -127018 -87886 33463 76067
3161G6067k778Q6530Q4012J5121j07105r2563J53800N3475j38843j66935l7440
$$ 76067 73289 159819 243831 258952 151847 59284 213084 266559 127716 -39219 -76659
3150g6659J41751M9873m3824k412j71239j47507J81669K16267n1298m0374R9547
$$ -76659 65092 114965 71141 68729 -102510 -250017 -68348 147919 96621 56247 155794
3139A55794R7470R5379J48735Q2208j88988k4772j74055l68910j84500j72051
$$ 155794 253264 348643 497378 579586 390598 365826 191771 -177139 -361639 -533690
3129e33690j966K51206K58899K30701O5989l9732o3906j40344j99686j86732J8086
$$ -533690 -535656 -284450 -25551 205150 271139 231407 167501 27157 -172529 -359261 -341175
3118c41175J54472J69648m3870k17854j44035p6236K5282Q8874K51929J61651
$$ -341175 -186703 -17055 -60925 -278779 -422814 -499050 -473768 -384894 -132965 28686
3108B8686J8345P6041R8203J8549p2025j05049l6423j3673N8723J33609O7766
$$ 28686 47031 123072 221275 239824 167799 62750 26327 12654 71377 204986 272752
3097B72752Q2579J00416n1872j52901m1458j11133k17535j27161r4025o5737J47568
$$ 272752 355331 455747 403875 250974 209516 98383 -119152 -246313 -340338 -406075 -258507
3086b58507J26364J10395k1405j29959j33503p6922J02347r539o3201J3362K54981
$$ -258507 -132143 -21748 -43153 -173112 -306615 -383537 -281190 -290729 -353930 -340568 -85587
3075h5587J88759K47374O558j98285j20514P7353j5764l25812k04947J8199N4280
$$ -85587 103172 350546 357104 158819 38305 115658 99894 -225918 -430865 -412666 -358386
3064c58386K4070L22150J06707j74864M5643J46153R5537m1591j36851n3240n8346
$$ -358386 -334316 -12166 94541 -80323 -34680 111473 207010 165419 28568 -24672 -83018
3053h3018Q4866N8625j42883n9125Q6377n5346j18793K1860N6856r532o1788k055
$$ -83018 1848 60473 -82410 -141535 -55158 -110504 -229297 -207437 -150581 -160113 -221901 -223956
3041b23956J16024Q3839N4581K2736j31343k11197k15336j57559L8483K05087
$$ -223956 -107932 -24093 30488 53224 -78119 -289316 -504652 -662211 -623728 -418641
3031d18641J69630K1184j50153l16144n7970L9053K56633K11874L5561j03419
$$ -418641 -249011 -227827 -377980 -694124 -752094 -713041 -456408 -244534 -208973 -312392
3021c12392o7416n489P7839L06295K71849j2255j33139j13614j16684m4360L5527
$$ -312392 -379808 -385297 -307458 -1163 270686 258431 125292 11678 -105006 -149366 -113839
3010a13839J17097K10754J12754n3220r0665k31837j94915o987J55951J93558
$$ -113839 3258 214012 326766 273546 182881 -48956 -243871 -250858 -94907 98651
3000I8651J56806J4807Q7183N5400l5354N1533l1527k36272j81355q8377r6097
$$ 98651 255457 270264 357447 412847 377493 429026 397499 161227 -20128 -108505 -204602
2989b04602Q1159M8845j12226r3474J2122n9438j43674K31J67842J66928P0216
$$ -204602 -123443 -74598 -186824 -280298 -268176 -327614 -471288 -471057 -303215 -136287 -66071
2978f6071R2500K18886j8442k20903n1443j04074K3328J79084J48171k61109l23931
$$ -66071 26429 245315 226873 5970 -45473 -149547 -126219 52865 201036 -60073 -384004
2967c84004k72113j99955j01593L35345M03075N2275J3149J79510O5460j16638
$$ -384004 -656117 -856072 -957665 -622320 -219245 -166970 -153821 25689 91149 -25489
2957b5489j65617J3545L0010k19913j94971o8495K20416L02742N8550l1738K437
$$ -25489 -191106 -177561 -147551 -367464 -562435 -630930 -410514 -107772 -49222 -80960 -78523
2946g8523J39973J93845K50067J49340j54939l11236j54404n2984L4439l1612
$$ -78523 61450 255295 505362 654702 499763 188527 34123 -18861 15578 -16034
2936a6034j15811P4483R344R2559P7573l6080J13642O1286j97206l46127j32204
$$ -16034 -131845 -57362 -48018 44541 122114 86034 199676 260962 63756 -282371 -414575
2925d14575l2348J0880l2001l0285K37293K79051K47550P7908j81156j29082q9399
$$ -414575 -446923 -436043 -468044 -498329 -261036 18015 265565 343473 162317 33235 -56164
2914e6164M4129J12651J4514N4207r3995j94004p9471R3456P9231j8082J1091
$$ -56164 -12035 100616 115130 169337 75342 -118662 -198133 -104677 -25446 -43528 -32437
2903c2437k19803k57161o0395Q0354N673l5257k34374r1830K04989J69761J36549
$$ -32437 -252240 -509401 -569796 -489442 -483769 -519026 -753400 -845230 -640241 -470480 -333931
2892c33931J46685L17365K28229O8836m4064j27965Q2134j75607m72313l63837
$$ -333931 -187246 130119 358348 427184 383120 255155 337289 161682 -310631 -674468
2882f74468m8180K00101K79287J76611j66528j04129K453m8912O9884K37071O4387
$$ -674468 -722648 -522547 -243260 -66649 -233177 -337306 -334853 -383765 -313881 -76810 -12423
2871a2423k1130J8120J2922o1629J56785L34245J28317J6264p9688j27979j59508
$$ -12423 -33553 -15433 -2511 -64140 92645 426890 555207 571471 491783 363804 204296
2860B04296O279O6211k36316l32712r6101J99644M9942Q9292O9627L1068J34381
$$ 204296 210575 276786 40470 -292242 -388343 -188699 -138757 -49465 20162 51230 185611
2849A85611M3506m0303j07976m145J19555l6500o4909N4775L1450k25551k28047
$$ 185611 229117 188814 80838 76693 196248 159748 94839 149614 181064 -44487 -272534
2838b72534Q1773J13591J73438L2178N3266j1383L5045k0195l72062l48914j43816
$$ -272534 -190761 -77170 96268 128446 181712 170329 205374 185179 -186883 -535797 -679613
2827f79613L3295J57950J51849O5862K3938L4481R3096k3326k4876K56279L29542
$$ -679613 -646318 -488368 -336519 -270657 -246719 -212238 -119142 -142468 -167344 88935 418477
2816D18477P4472l18946k31093J09846Q4825Q2317K9436j34468j96262M5322Q7257
$$ 418477 492949 174003 -57090 52756 137581 219898 249334 114866 -81396 -36074 51183
2805E1183j9182m5084r62j9891L7345L8725J53012j0804l49078k09458o7707k9162
$$ 51183 32001 -13083 -14045 -33936 3409 42134 195146 184342 -164736 -374194 -441901 -471063
2793d71063J9134K13750K53480L9168J9106m3635O9402M8407L146O4013l4436
$$ -471063 -451929 -238179 15301 54469 73575 29940 99342 147749 150895 214908 180472
2782A80472o5289j32259l07582k68709k80686o3807K61893K15497O2003M0551
$$ 180472 115183 -17076 -324658 -593367 -874053 -937860 -675967 -460470 -398467 -357916
2772c57916J59160J12484J47844K33445J28706J66024R4998r6751M5220m3905
$$ -357916 -198756 -86272 61572 295017 423723 589747 684745 587994 633214 589309
2762E89309j86871q2588P9586O1479j3823M522o1971k50443j73514o5027n3955
$$ 589309 402438 319850 399436 460915 447092 451614 389643 139200 -34314 -99341 -153296
2751a53296K5002n5761m018J34222J73763K3396J32518p9508o6826K2160J10089
$$ -153296 -128294 -184055 -188073 -53851 119912 143308 275826 196318 129492 151652 261741
2740B61741O0414k93554n8061J30052o6690j78428Q8956J58177m672j4386L4557
$$ 261741 322155 28601 -29460 100592 33902 -144526 -55570 102607 97935 83549 118106
2729A18106j1183k13710p8159J7493K4918J0564J23446L0270J54621Q6089j42404
$$ 118106 106923 -106787 -184946 -167453 -142535 -131971 -8525 21745 176366 262455 120051
2718A20051M0673K82027k1531j36882j45736m6442k7481j75975j73677n912P4944
$$ 120051 160724 442751 421220 284338 138602 92160 64679 -111296 -284973 -290885 -215941
2707b15941J56739K5978p2231k8406J10136K5998l615K2292j43512m8148O3393
$$ -215941 -59202 -33224 -105455 -133861 -23725 2273 -1342 20950 -122562 -170710 -107317
2696a07317j31573j43076O0625N0779J6976n7681P0961j7717p051J18725O2194
$$ -107317 -238890 -381966 -321341 -270562 -253586 -311267 -240306 -258023 -265074 -146349 -84155
2685h4155o12n9993J72369J74280j59504j32422j48434p4687O5612q9903j19597
$$ -84155 -84767 -144760 27609 201889 42385 -90037 -238471 -313158 -247546 -337449 -457046
2674d57046J00666J79009J08151n9193n0801J7432k4695L7803J91017J39664k1606
$$ -457046 -356380 -177371 -69220 -128413 -179214 -161782 -186477 -148674 42343 182007 160401
2663A60401J10696J28733J17757J76824K1185M3340Q3914q3219k48948j53043
$$ 160401 271097 399830 517587 694411 715596 758936 842850 759631 510683 357640
2653C57640j56734l5279j1650n4100j20235j76034q0749r56J22957J44269J58305
$$ 357640 200906 165627 153977 99877 -20358 -196392 -277141 -278097 -155140 -10871 147434
2642A47434L43948K48819R584l03393j93006j78201l02417p3372J84988J90001
$$ 147434 491382 740201 749785 446392 253386 75185 -227232 -300604 -115616 74385
2632G4385L3167o4638K6084K64735Q2579n606M8759n8005J06851j24966j72989
$$ 74385 107552 42914 68998 333733 416312 410706 459465 401460 508311 383345 210356
2621B10356M4680m5730r2209o0052j074J24725J07307j22094k55342k06260m1924
$$ 210356 255036 209306 117097 57045 55971 180696 288003 165909 -89433 -295693 -337617
2610c37617k4679m8049R8255P0531O575Q5162K62463p2489k63182J14083J18550
$$ -337617 -362296 -410345 -312090 -241559 -234984 -149822 112641 40152 -223030 -108947 9603
2599I603p1173o9560k9773J86830P7151j41154j75684m0866j3823j96596J11536
$$ 9603 -61570 -131130 -160903 25927 103078 -38076 -213760 -254626 -268449 -465045 -353509
2588c53509L64734K68253M0923j47672q9280l04417j06604R9896Q7912L8695J88066
$$ -353509 11225 279478 320401 172729 83449 -220968 -327572 -227676 -139764 -101069 86997
2577H6997J38319O6399K91879J46142l8179j14146k79954j72266l9472M5448J67991
$$ 86997 225316 291715 583594 729736 691557 577411 297457 125191 85719 131167 299158
2566B99158O5180j30034j48306q7145k2774N4426K4978j76562j50453O6789N0229
$$ 299158 364338 234304 85998 -1147 -23921 30505 55483 -121079 -271532 -204743 -154514
2555a54514K91359K36417O7163j07033j31046R1531m061j07856j56392J85643
$$ -154514 136845 373262 440425 333392 202346 293877 289816 181960 25568 211211
2545B11211Q0781n1286j59323m6814J86470J56440J802j59051p4195n2554j5658
$$ 211211 291992 240706 81383 34569 221039 377479 379281 220230 146035 93481 77823
2534G7823O5377q01P138J81486J38625j37608l50573J02257Q4390m9431L046O7912
$$ 77823 143200 142399 149537 331023 469648 332040 -18533 83724 168114 118683 121729 189641
2522A89641q8513l08657K3661R2275j39437j83664k678L8328j26558j09390L9153
$$ 189641 101128 -207529 -183868 -91593 -231030 -414694 -417372 -379044 -505602 -614992 -575839
2511e75839J26195J27399K20059J52514J68878K00920P2961j48856k17707j60477
$$ -575839 -449644 -322245 -102186 50328 219206 420126 493087 344231 126524 -33953
2501c3953n4391o5308j72154j37333J71962L0113j32002n4435L78661M15838j04695
$$ -33953 -88344 -153652 -325806 -463139 -291177 -261064 -393066 -447501 -68840 346998 242303
2490B42303j19466Q3908l0804j37392J4277J5208o8351m2980O4965J19543j65881
$$ 242303 122837 206745 175941 38549 52826 68034 -317 -43297 21668 141211 -24670
2479b4670k97618r6171M0546J1366o9889J3474J70443P1250L2907P8767O9443
$$ -24670 -322288 -418459 -377913 -366547 -436436 -422962 -252519 -181269 -148362 -69595 -152
2468a52R1490L4760k3276M3419R5042q1217j17457j3511n780q3848r5313k50898
$$ -152 91338 126098 102822 146241 241283 160066 42609 29098 23318 -60530 -155843 -406741
2456d06741q4054K07718K47411J82849J2744r0537j68729K266J67861K24763J15122
$$ -406741 -490795 -283077 -35666 147183 159927 69390 -99339 -97073 70788 295551 410673
2445D10673J1879j38152j81825L7264J69725P3212L8816O5137j30829l13256j24679
$$ 410673 422552 284400 102575 139839 309564 382776 421592 486729 355900 42644 -82035
2434h2035Q5102M8561J26278O6247m6928j8178n049j0912J7189m798k3551Q2883
$$ -82035 3067 51628 177906 244153 197225 179047 173998 163086 180275 175477 151926 234809
2422B34809p5667j94472j2855J30723Q4841K06771J87450p2656j15652j79695
$$ 234809 159142 -35330 -48185 82538 167379 374150 561600 488944 373292 193597
2412A93597j90542l04590n2102M4403m4059j97972n7684J81457K23359J47457
$$ 193597 3055 -301535 -353637 -309234 -353293 -551265 -608949 -427492 -204133 -56676
2402e6676j67717k07273l2939J10849J65720J16026K42254R1570j66869j28030
$$ -56676 -224393 -431666 -464605 -353756 -188036 -72010 170244 261814 94945 -33085
2392c3085J13455M92r0573p9575K781J37113n3354j79118j56995j17651j23848
$$ -33085 80370 80862 -9711 -89286 -86505 50608 -2746 -181864 -338859 -456510 -580358
2381e80358r3248l4606J85732K14195M838J45860K87734M64033K74892J86917
$$ -580358 -673606 -708212 -522480 -308285 -303447 -157587 130147 594180 869072 1055989
2371A055989K78266L87120P21982J206378J607418K364293L649953M420522J473111
$$ 1055989 1334255 1721375 2443357 3649735 5257153 7621446 11271399 15691921 17165032
2362A7165032l179328m007006k856272j761869j218685r83350p38413o10203l91857
$$ 17165032 13985704 9978698 7122426 5360557 4141872 3158522 2420109 1809906 1418049
2353A418049k57709k58525r1663P5941j21001r1012k7907K3612R1339m9233j25275
$$ 1418049 1160340 901815 810152 886093 765092 674080 646173 669785 761124 711891 586616
2342E86616j15711m9186o9065j36748n8598N8649R0528k8859k31655p0205Q6978
$$ 586616 470905 421719 352654 215906 157308 215957 306485 277626 45971 -24234 62744
2331F2744K7197j07887L0595J53549j7889p1324r9138k20556M585J11319n5858
$$ 62744 89941 -17946 12649 166198 148309 76985 -22153 -242709 -238124 -126805 -182663
2320a82663j0423r9596R2645L17549J30272j20941o8911l0836j8938J024Q3107
$$ -182663 -193086 -292682 -200037 117512 247784 126843 57932 27096 8158 9182 92289
2309I2289k9358q1138j50402j85913K8390K33149K56444j43902j89724O44P7421
$$ 92289 62931 -18207 -168609 -354522 -326132 -92983 163461 19559 -170165 -169521 -92100
2298i2100J11755K33480K03827J05876j56990k53205m4324J5508j28905k35423
$$ -92100 19655 253135 456962 562838 405848 152643 108319 123827 -5078 -240501
2288b40501K5807K23932J39171O5883k9629j96312k78862l64312k3638K01210
$$ -240501 -214694 9238 148409 214292 184663 -11649 -290511 -654823 -678461 -477251
2278d77251j24776j14753M7930J72523J48729N3322l506p091Q6870K58335K06987
$$ -477251 -602027 -716780 -668850 -496327 -347598 -294276 -297782 -304873 -218003 40332 247319
2267B47319r0591j84390j82594j67622k2711L6773J21174Q5870L5438K8252p0217
$$ 247319 156728 -27662 -210256 -377878 -400589 -363816 -242642 -156772 -121334 -93082 -163299
2256a63299j34533j37970N7564K02225J87805N3974L452n2104l2732M8642j96734
$$ -163299 -297832 -435802 -378238 -176013 11792 65766 69218 17114 -15618 33024 -163710
2245a63710k1370J66171J88456m4871k55649k51821q8201J9879N7174o311J1255
$$ -163710 -185080 -18909 169547 124676 -130973 -382794 -470995 -451116 -393942 -400253 -388998
2234c88998r1260j92359r8362l09874j96415J6414K97138K79791k0747M6454K38273
$$ -388998 -480258 -672617 -770979 -1080853 -1277268 -1260854 -963716 -683925 -704672 -658218 -419945
2223d19945K2736j31036K0405J96207J26754j0280J05763K56392L32484j6218
$$ -419945 -397209 -528245 -507840 -311633 -184879 -195159 -89396 166996 499480 483262
2213D83262k25086j89901p6504K02979L9534k68071r7717K51029J94504l7880
$$ 483262 258176 68275 -8229 194750 234284 -33787 -131504 119525 314029 276149
2203B76149O5085r7606j89546j57249m2675k6258k6752j5459L814q1541L2365
$$ 276149 341234 243628 54082 -103167 -145842 -172100 -198852 -214311 -210497 -292038 -259673
2192b59673R7304J25472M2783k8809N893L9441k347j01344N1102J93348M9849
$$ -259673 -162369 -36897 5886 -22923 -17030 22411 20064 -81280 -30178 163170 213019
2181B13019m0861K4351L1710m3951k54486k63463k53280l5982J79580J87256P7355
$$ 213019 172158 196509 228219 184268 -70218 -333681 -586961 -622943 -443363 -256107 -178752
2170a78752j29381l0118K6338N8938K5040R9100J11104J22774J62750p2613j1150
$$ -178752 -308133 -338251 -311913 -252975 -227935 -128835 -17731 105043 267793 195180 184030
2159A84030K36727o5526l29623j62473J04060L01405K19136j4482j56219o8946
$$ 184030 420757 355231 25608 -136865 -32805 268600 487736 473254 317035 248089
2149B48089J6177l02867l31510j7995N3317l5099p0126K7090K15051L35222L0203
$$ 248089 264266 -38601 -370111 -388106 -334789 -369888 -440014 -412924 -197873 137349 167552
2138A67552j11014J5007J60324J05600j580o6904K5674K0403r5499j46260k52570
$$ 167552 56538 71545 231869 337469 335889 268985 294659 315062 219563 73303 -179267
2127a79267k42622P667j10529j44126K3601J85579K80541J15924k6789j16898
$$ -179267 -421889 -414222 -524751 -668877 -645276 -459697 -179156 -63232 -90021 -206919
2117b06919j45792M7695J48421j1357j14793l6614k1478j06527K1630K05041J38854
$$ -206919 -352711 -305016 -156595 -167952 -282745 -319359 -340837 -447364 -425734 -220693 -81839
2106h1839M1827K9877p9979J3453j16140j33944R4931J42181o8193q8454J51961
$$ -81839 -40012 -10135 -90114 -76661 -192801 -326745 -231814 -89633 -157826 -246280 -94319
2095i4319K20007r6389r2516M2107R9740J57169n2512p9399l1327j9723l11048
$$ -94319 125688 29299 -63217 -21110 78630 235799 183287 103888 72561 52838 -258210
2084b58210j31881M1745K08972J46699o6672Q7270O218j39254n1541Q162j4928
$$ -258210 -390091 -348346 -139374 7325 -59347 27923 34141 -105113 -156654 -148492 -163420
2073a63420j5781k1991k3589q526J68555J28980j85432j96232j57582O7327J99261
$$ -163420 -179201 -201192 -224781 -233307 -64752 64228 -121204 -317436 -475018 -407691 -208430
2062b08430K57812J29212j3028m2808J25040j1526J079P1251k0323l8572j00135
$$ -208430 49382 178594 165566 122758 247798 236272 237351 308602 288279 249707 149572
2051A49572j58937j36703J29373N4533J28965J57688M2165J03963J29345j05021
$$ 149572 -9365 -146068 -16695 37838 166803 324491 366656 470619 599964 494943
2041D94943k44266p4141Q4192m6194o7575o5985j16713J52785J44554k66601k80655
$$ 494943 250677 176536 260728 214534 146959 80974 -35739 117046 261600 -5001 -285656
2030b85656J1197o7110j32814K20600L05064p1664k09838P1623J21670N4771J44411
$$ -285656 -274459 -341569 -474383 -253783 51281 -20383 -230221 -158598 -36928 17843 162254
2019A62254n8556j30871j8516k857q9523j12315M5651J86978j1695j18686R8670
$$ 162254 103698 -27173 -45689 -48546 -138069 -250384 -204733 -17755 -29450 -148136 -49466
2008d9466Q9610Q04q2909L0874O0669p8312l6128r4773r9653o4897r3345l7878
$$ -49466 40144 40948 -41961 -11087 49582 -28730 -64858 -159631 -259284 -324181 -417526 -455404
1996d55404J66539P2560j00343n1855J0584J36471J89096M8296j05429j23852
$$ -455404 -288865 -216305 -316648 -368503 -357919 -221448 -32352 15944 -89485 -213337
1986b13337k7198J43857J68417O6715J28921N2038M2426p1023k11634k85212o8549
$$ -213337 -240535 -96678 71739 138454 267375 319413 361839 290816 79182 -206030 -274579
1975b74579J34639O6396K7913N8284J22000J04500j02611j38871q084L8630K57565
$$ -274579 -139940 -73544 -45631 12653 134653 239153 136542 -2329 -10413 28217 285782
1964B85782K17237J94746K6116j49854p7700j28818j28048j44402j24838l43550
$$ 285782 503019 697765 723881 574027 496327 367509 239461 95059 -29779 -373329
1954c73329k47966K02550K63563R7822L8829J36539k275l8288l1612J51923J24901
$$ -373329 -621295 -418745 -155182 -57360 -18531 118008 115733 77445 45833 197756 322657
1943C22657o435r1136k49044k05325n1107L25638L97182N574j35588j29285q0089
$$ 322657 316222 225086 -23958 -229283 -280390 45248 442430 448004 312416 183131 103042
1932A03042J52072P2605k9316J8503K8705O8048o9208l22440j35157q007m8224
$$ 103042 255114 327719 298403 316906 345611 413659 344451 22011 -113146 -121153 -169377
1921a69377m4805Q7857P327j24352j09892k6647K4716J10337R4097K16954J78719
$$ -169377 -214182 -126325 -118998 -243350 -353242 -379889 -355173 -244836 -150739 66215 244934
1910B44934l5576p4459N7063M1920k64960j59102l7438m8299J65016L93626K42435
$$ 244934 209358 134899 191962 233882 -31078 -190180 -227618 -275917 -110901 282725 525160
1899E25160P1134q587j65614j51217j22798j52188J8215J32504K7975P73O8754
$$ 525160 596294 587707 422093 270876 148078 -4110 14105 146609 174584 175357 244111
1888B44111J7071j93681p6869P2442k0510j21643m1656N3171R8535J52122L8855
$$ 244111 261182 67501 -9368 63074 42564 -79079 -120735 -67564 30971 183093 221948
1877B21948O265q6360j1691j21759j58914L3253m0230j20203J41176Q6707m5107
$$ 221948 228213 141853 130162 8403 -150511 -117258 -157488 -277691 -136515 -49808 -94915
1866i4915R0577O1606j04039p1569j16793k61544o8190J33311J29446L2543J25765
$$ -94915 -4338 57268 -46771 -118340 -235133 -496677 -564867 -431556 -302110 -269567 -143802
1855a43802R5136j73239k44000j42142O4015J4280M9895K16386J93948Q8792J62972
$$ -143802 -48666 -221905 -465905 -608047 -544032 -529752 -479857 -263471 -69523 19269 182241
1844A82241J743l8903J17780J97839r9179l01769j11731J12636J00471j4431k7784
$$ 182241 183984 145081 262861 460700 361521 59752 -51979 60657 161128 146697 118913
1833A18913j01813j33707K8152J21118J81063J79961l1782j25675q1726o2792
$$ 118913 17100 -116607 -88455 32663 213726 393687 361905 236230 154504 91712
1823I1712k1777q6550k4942J2704n3828j12439o6629m4855j22495J66226M59914
$$ 91712 69935 -16615 -41557 -28853 -82681 -195120 -261749 -306604 -429099 -262873 197041
1812A97041K96639j1495j27159p4656Q9465J13184M7367j5715L6033M3405k74963
$$ 197041 493680 482185 355026 280370 369835 483019 530386 514671 550704 594109 319146
1801C19146j36890m5167j35256J69024O8084n622k094L931R6896J497j18147k90202
$$ 319146 182256 137089 1833 170857 238941 233319 231225 235156 332052 333549 215402 -74800
1789g4800k88047k23015j41977J26000K04971Q2602L40514L18181J19808M8322
$$ -74800 -362847 -585862 -727839 -601839 -396868 -314266 26248 344429 464237 512559
1779E12559j30803k46703k07824m7525k513J28389J05510L9843J9180l9870n5787
$$ 512559 381756 135053 -72771 -120296 -122809 5580 111090 150933 170113 130243 74456
1768G4456L1036k6744k337j18120L1208N2407M8081M1150M8087J63302O0115N9408
$$ 74456 105492 78748 76411 -41709 -10501 41906 89987 131137 179224 342526 402641 462049
1756D62049j46298m30548k72585l9652Q8896K56045K87892p4713k28638q0477
$$ 462049 315751 -114797 -387382 -427034 -338138 -82093 205799 131086 -97552 -178029
1746a78029L0123K43895J75491m6219j82219J7777j3656N5479l3349j20737k5902
$$ -178029 -147906 95989 271480 225261 43042 60819 47163 102642 69293 -51444 -77346
1735g7346p7681j3374N3319p1187r0047p2007k1107M5804P1362l8667q1282m4140
$$ -77346 -155027 -168401 -115082 -186269 -276316 -348323 -369430 -323626 -252264 -290931 -372213 -416353
1723d16353J01745K19023K59011J47556q0811K1727r1788l01517k17126J1256
$$ -416353 -314608 -95585 163426 310982 230171 251898 160110 -141407 -358533 -347277
1713c47277J13283q7284o8513J26013J42666K64956K24502k8996j09144k15208
$$ -347277 -233994 -321278 -389791 -263778 -121112 143844 368346 339350 230206 14998
1703A4998q9732L6297k35801j69008M918o5738K1826K01563J10417m6116j42210
$$ 14998 -74734 -38437 -274238 -443246 -438328 -504066 -482240 -280677 -170260 -216376 -358586
1692c58586j83033k62859o6235L06659J89923M0473J46547m80j3553l7923o3139
$$ -358586 -541619 -804478 -870713 -564054 -374131 -333658 -187111 -187591 -201144 -239067 -302206
1681c02206O7001O5234J36797R8975J04241K09614J81358j900k21519j37717M6473
$$ -302206 -235205 -169971 -33174 65801 170042 379656 561014 559114 337595 199878 246351
1670B46351r5578P5352J37596L1122k59415k98089r5069M0950R2923K03734J86457
$$ 246351 150773 226125 363721 394843 135428 -162661 -257730 -216780 -123857 79877 266334
1659B66334o3135L366l9807j49493k50544l72657r5318J93178K57724J54397O9996
$$ 266334 203199 206565 166758 17265 -233279 -605936 -701254 -508076 -250352 -95955 -25959
1648b5959n3373j01803j3083j8298M2891J70772J77918p9627k83470n2940L136
$$ -25959 -79332 -181135 -194218 -212516 -169625 1147 179065 99438 -184032 -236972 -233836
1637b33836l44064k07339R9290M55541M67348j1987k26496R2817J49116J64594
$$ -233836 -577900 -785239 -685949 -230408 236940 224953 -1543 91274 240390 404984
1627D04984L9961k03019k00044l1265M6767j30876j66763L1849K22351K75820
$$ 404984 444945 241926 41882 10617 57384 -73492 -240255 -208406 13945 289765
1617B89765P731q2229p6319k2795Q5532l3749j80002m3044J56097J06129R105
$$ 289765 297496 215267 138948 116153 201685 167936 -12066 -55110 100987 207116 216221
1606B16221q9075j32352r5243j15899M3091L7847j35571n5669J14822R9219O3206
$$ 216221 127146 -5206 -100449 -216348 -173257 -135410 -270981 -326650 -211828 -112609 -49403
1595d9403K8747j50182j65528Q4728J42215J27366J16010L1181j08362o5255J29710
$$ -49403 -20656 -170838 -336366 -251638 -109423 17943 133953 165134 56772 -8483 121227
1584A21227K1955K9373K7513j4850J29978O8256q4853r6882j38269n4826q9556
$$ 121227 143182 172555 200068 185218 315196 383452 298599 201717 63448 8622 -80934
1573h0934k36416L8572N7861r3258o0017k3630J97100R6881r7924J3637K64244
$$ -80934 -317350 -278778 -220917 -314175 -374192 -397822 -200722 -103841 -201765 -188128 76116
1562G6116M4186l12045k10571j37012j50740J76863K30564J05449L4891P373J2774
$$ 76116 120302 -191743 -402314 -539326 -690066 -513203 -282639 -177190 -142299 -134926 -122152
1551a22152m3678n8152k2689l1794P4405J28323K09588R6035j08885M4427Q8873
$$ -122152 -165830 -223982 -246671 -278465 -204060 -75737 133851 229886 121001 165428 254301
1540B54301o7271j36232K5034k9122l0959P4215k6518k51559k28689j5838q2097
$$ 254301 187030 50798 75832 46710 15751 89966 63448 -188111 -416800 -432638 -514735
1529e14735k313J75998L7304K01580P7229j01465K8774J56593n2943J14202n220
$$ -514735 -517048 -341050 -303746 -102166 -24937 -126402 -97628 58965 6022 120224 115004
1518A15004j28892p3005j49310r8123L6290L76160J97796j28153k53111j75881
$$ 115004 -13888 -86893 -236203 -334326 -298036 78124 275920 147767 -105344 -281225
1508b81225j5149M6504n9780M3796J49520j344j12917o7784J32281J9638l0604
$$ -281225 -296374 -249870 -309650 -265854 -116334 -117678 -230595 -298379 -166098 -146460 -177064
1497a77064J61487K3885n868K37962J01920j13083Q247m830j7353l2431o1673
$$ -177064 -15577 8308 2440 240402 342322 229239 237486 232656 215303 182872 121199
1486A21199N6806q6955j77063j29505l5298J22821j3867L0915J49470k2413k23032
$$ 121199 178005 91050 -86013 -215518 -250816 -127995 -141862 -110947 38523 16110 -206922
1475b06922j19714k2495n5577j6285n8598Q2272K05362L34448K61994p8384l25429
$$ -206922 -326636 -349131 -404708 -420993 -479591 -397319 -191957 142491 404485 326101 672
1464F72k69082r0247J05005K2247j60602j01417l5610J73482L53314J23388p7873
$$ 672 -268410 -358657 -253652 -231405 -392007 -493424 -529034 -355552 -2238 121150 43277
1453D3277k36972j31593K81994L77864P5335j52274k20121k74836r121m1573m8186
$$ 43277 -193695 -325288 -43294 334570 409905 257631 37510 -237326 -246447 -288020 -336206
1442c36206J6831j4914J08412K18646K60581K53732k1509J1255l0670J0725m8826
$$ -336206 -319375 -334289 -225877 -7231 253350 507082 485573 496828 466158 476883 428057
1431D28057j70819o5644R110o1192k44394j45967O1112J19903J41216J47604J04375
$$ 428057 257238 191594 200704 139512 -104882 -250849 -189737 -69834 71382 218986 323361
1420C23361j2693l26434l35378r4309J35354K60250J24397j81049l5624j9618
$$ 323361 310668 -15766 -351144 -445453 -310099 -49849 74548 -106501 -142125 -161743
1410a61743j6301L3253o733R0399j00028k46269j16998M4727J85356J23453O7136
$$ -161743 -178044 -144791 -151524 -61125 -161153 -407422 -524420 -479693 -294337 -170884 -103748
1399a03748J27717K53959J52171j67429j35265L2153N2733N8358k8991K2488J5464
$$ -103748 23969 277928 430099 262670 127405 159558 212291 270649 241658 264146 279610
1388B79610j54627M7709J18651l3659k18628j02019J29429K02958K1354J00196
$$ 279610 124983 172692 291343 257684 39056 -62963 66466 269424 290778 390974
1378C90974K93404K0680m43047j48245J2479j03709j11957j12857K7120K60212
$$ 390974 684378 705058 262011 113766 126245 22536 -89421 -202278 -175158 85054
1368H5054K64290o4552j83754l2379j83321j93913N0699J09610j77242r6542J07258
$$ 85054 349344 284792 101038 68659 -114662 -308575 -257876 -148266 -325508 -422050 -314792
1357c14792m0478R3655K54994J9284L5996j6684M8279R278r0389n3561j57369
$$ -314792 -355270 -261615 -6621 12663 48659 31975 80254 89532 -857 -54418 -211787
1346b11787n3459o765r6371j65040o5012Q8461J4620N7296m3444j49002m7322
$$ -211787 -265246 -272011 -368382 -533422 -598434 -509973 -495353 -438057 -481501 -630503 -677825
1335f77825Q9404J57572J40180n3970k9330J57106Q1505J86521K46532J80720
$$ -677825 -588421 -430849 -290669 -344639 -373969 -216863 -135358 51163 297695 478415
1325D78415k7048k4831L365J6622K9053J14763j0016j38326j12246n7059J3877
$$ 478415 451367 426536 429901 446523 475576 590339 580323 441997 329751 272692 286569
1314B86569K21418M2354p4220K9051P7598m2944k09999l06276j49998J0809j1891
$$ 286569 507987 550341 476121 505172 582770 539826 329827 23551 -126447 -115638 -127529
1303a27529r9176K2987q3012J6027J00417j44177N2889J39959J08878J65219N1119
$$ -127529 -226705 -203718 -286730 -270703 -170286 -314463 -261574 -121615 -12737 152482 203601
1292B03601j02007j80563o8575K9875J6047O1063L7918r0961m2202r5843j9364
$$ 203601 101594 -78969 -147544 -117669 -101622 -40559 -2641 -93602 -135804 -231647 -251011
1281b51011n8590j82292J36081L44428J06523j67945q5515Q4872N6178j02557
$$ -251011 -309601 -491893 -355812 -11384 95139 -72806 -158321 -73449 -17271 -119828
1271a19828j9311k0133l4923l754J29473J41345k7211J98923K45444J01707j33940
$$ -119828 -139139 -159272 -194195 -197949 -68476 72869 45658 244581 490025 591732 457792
1260D57792r4833j17965j66685r6113L0997J14239K632M555k0092n331P5715M9603
$$ 457792 362959 244994 78309 -17804 13193 127432 130064 134619 114527 109196 184911 234514
1248B34514J78m1210n2523j8594r6606j42549O5518J19905R2691K442j52465l01640
$$ 234514 234692 193482 140959 122365 25759 -116790 -51272 68633 161324 163766 11301 -290339
1236b90339j55811j0710J0023K85611K15122p1440j34330n9268j095j7604P9102
$$ -290339 -446150 -456860 -446837 -161226 53896 -17544 -151874 -211142 -212237 -229841 -150739
1225a50739P2897K929j98932k22446j91105p6126K33490K09583J92698k5914k77376
$$ -150739 -77842 -74913 -273845 -496291 -687396 -763522 -530032 -320449 -127751 -153665 -431041
1214d31041k65761q0172Q5112O0070K89447K74515Q1215K1832n049Q2870J475
$$ -431041 -696802 -776974 -691862 -631792 -342345 -67830 13385 35217 30168 113038 114513
1203A14513j81299k42110j80478l9876m0424J18612N26357L30517m6468j3656
$$ 114513 -66786 -308896 -489374 -529250 -569674 -451062 75295 405812 359344 345688
1193C45688r3841j78805k8322J79886K42626J22150n7074k46673l05829j19114
$$ 345688 251847 73042 44720 224606 467232 589382 532308 285635 -20194 -139308
1183a39308J70074L62847K79528J04080n4080l24282r1152J94628J34469j64247
$$ -139308 30766 393613 673141 777221 723141 398859 307707 502335 636804 472557
1173D72557j88830o5885Q7638r7970p9808k05956k23582q6280m2778K38725R3566
$$ 472557 283727 217842 305480 207510 127702 -78254 -301836 -388116 -430894 -192169 -98603
1162i8603M3373L76131K13925q9687k58377j10222j25827j40799m9625N9628J39575
$$ -98603 -55230 320901 534826 445139 186762 76540 -49287 -190086 -239711 -180083 -40508
1151d0508J3959J45524J79061P4287K4404q6468p8191j66123k79834j16930J04235
$$ -40508 -26549 118975 298036 372323 396727 310259 232068 65945 -213889 -330819 -226584
1140b26584J63884L0181M018J29732J43265L5559k33309j73347J51268J68073
$$ -226584 -62700 -32519 -28501 101231 244496 280055 46746 -126601 24667 192740
1130A92740j40794j88715L4291J20093Q1943j7506L2030P7329N3309O4695r0870
$$ 192740 51946 -136769 -102478 17615 99558 82052 114082 191411 244720 309415 218545
1119B18545n1798j24689J22517k0062k29963k8656q7436r855J46051q154j05701
$$ 218545 166747 42058 164575 144513 -85450 -114106 -201542 -211397 -65346 -73500 -179201
1108a79201N3590J57678M5190q4702L4244J6392j04028J563L501K4286K71665
$$ -179201 -125611 32067 77257 -7445 26799 43191 -60837 -59274 -55773 -31487 240178
1097B40178J05142j69692o1132Q9235O2334l28499l83695K00079J96554k9021
$$ 240178 345320 175628 114496 203731 266065 -62434 -446129 -246050 -49496 -78517
1087g8517k4157J4547q9110N4409k1756K31439J33996m3921P4386J58953R9496
$$ -78517 -102674 -88127 -177237 -122828 -144584 86855 220851 176930 251316 410269 509765
1076E09765r3607j72931j16362j00706L3321M3458j81009l3739l5137J44054R5179
$$ 509765 416158 243227 126865 26159 59480 102938 -78071 -111810 -146947 -2893 92286
1065I2286j76085J994j5407r4494q3037j14625M0281K54606J90126k8204j4231
$$ 92286 -83799 -81805 -97212 -191706 -274743 -389368 -349087 -94481 95645 67441 53210
1054E3210J06789R1371Q183k47501q0610O8240k0057j25127q2485J4935p550j21404
$$ 53210 159999 251370 259553 12052 -68558 -318 -20375 -145502 -227987 -213052 -220602 -342006
1042c42006j1705N813o0636J46512M9955l7944K8758p1961P1241Q9757J42351
$$ -342006 -353711 -347898 -408534 -262022 -212067 -250011 -221253 -293214 -221973 -132216 10135
$$ [...]
##END NTUPLES=NMR SPECTRUM
##END=
