##TITLE=C13_83-2021
 CDCl3,  20099 sc

 25.08.2021
##JCAMPDX= 6.0         $$ Bruker NMR JCAMP-DX V2.0
##DATA TYPE= NMR SPECTRUM
##DATA CLASS= NTUPLES
##ORIGIN= UXNMR, Bruker Analytische Messtechnik GmbH
##OWNER= root
$$ XWIN-NMR		Version 3.5
$$ Thu Aug 26 09:05:35 2021 Russian Standard Time (UT+4h)  she@DPX200
##.OBSERVE FREQUENCY= 50.327896
##.OBSERVE NUCLEUS= ^13C
##.ACQUISITION MODE= SIMULTANEOUS
##.ACQUISITION SCHEME= undefined
##.AVERAGES= 20100
##.DIGITISER RES= 17
##SPECTROMETER/DATA SYSTEM= spect
##.PULSE SEQUENCE= zgpg30
##.SOLVENT NAME= CDCl3
##.SHIFT REFERENCE= (INTERNAL, CDCl3, 0, 222.675)
##AUDIT TRAIL= $$ (NUMBER, WHEN, WHO, WHERE, WHAT)
$$ ##TITLE= Audit trail, XWIN-NMR		Version 3.5
$$ ##JCAMPDX= 5.01
$$ ##ORIGIN= Bruker BioSpin GmbH
$$ ##OWNER= she
$$ F:/spectra/data/she/nmr/c13/1/pdata/1/auditp.txt
$$ ##AUDIT TRAIL=  $$ (NUMBER, WHEN, WHO, WHERE, WHAT)
(   1,<2021-08-26 08:37:58.60 +0400>,<she>,<DPX200>,
      <created by zg, POWCHK disabled, PULCHK disabled
       terminated by command 'halt'
       configuration hash MD5:
       00 E9 B6 7A A2 85 ED C7 34 08 36 98 17 FE 4E 26
       data hash MD5: 32K
       02 E6 02 B3 BA 30 3B C6 2E 98 53 DD 51 AA DC A1>)
(   2,<2021-08-26 09:03:53.25 +0400>,<she>,<DPX200>,
      <Start of raw data processing
       efp BC_mod = 2 LB = 1 FT_mod = 6 PKNL = 1 PHC0 = -333.2299 PHC1 = 26.36238 SI = 32K 
       data hash MD5: 32K
       F2 CC 6D 47 C2 84 9A B5 65 FF EC 8A 5C 62 D8 F4>)
(   3,<2021-08-26 09:04:00.57 +0400>,<she>,<DPX200>,
      <abs ABSG = 5 
       data hash MD5: 32K
       22 7D 38 B8 F6 38 28 FB C1 67 1A 8D 14 28 12 F0>)
(   4,<2021-08-26 09:04:39.79 +0400>,<she>,<DPX200>,
      <pk PHC0 = -2.630246 PHC1 = 5.600002 
       data hash MD5: 32K
       3B 98 53 9C 14 39 9B 5D 49 70 18 2D 05 10 3B 57>)
(   5,<2021-08-26 09:04:43.07 +0400>,<she>,<DPX200>,
      <abs ABSG = 5 
       data hash MD5: 32K
       53 35 38 5E 70 89 0E E5 5D 14 93 1C 79 A1 8D 6F>)
$$ ##END=
$$ 
$$ hash MD5
$$ 58 F2 27 3B 8B 5F 11 B6 C0 37 B8 FA 42 21 2E DE
##$RELAX= 
##$RELAX= 
##$RELAX= 
##$RELAX= 
##$RELAX= 
##$RELAX= 
##$RELAX= 
##$RELAX= 
$$ Bruker specific parameters
$$ --------------------------
##$DU= <F:/spectra>
##$EXPNO= 1
##$NAME= <c13>
##$PROCNO= 1
##$TYPE= <nmr>
##$USER= <she>
##$AMP= (0..31)
100 100 100 100 100 100 100 100 100 100 100 100 100 100 100 100 100 100 
100 100 100 100 100 100 100 100 100 100 100 100 100 100 
##$AQSEQ= 0
##$AQ_mod= 1
##$AUNM= <au_zg>
##$AUTOPOS= <>
##$BF1= 50.322709
##$BF2= 200.13
##$BF3= 50.322709
##$BF4= 500.13
##$BF5= 500.13
##$BF6= 500.13
##$BF7= 500.13
##$BF8= 500.13
##$BYTORDA= 1
##$CFDGTYP= 0
##$CFRGTYP= 5
##$CHEMSTR= <none>
##$CNST= (0..31)
1 1 145 1 1 1 1 1 1 1 1 1 1 1 1 1 1 1 1 1 1 1 1 1 1 1 1 1 1 1 1 1 
##$CPDPRG= <waltz16>
##$CPDPRG1= <>
##$CPDPRG2= <waltz16>
##$CPDPRG3= <>
##$CPDPRG4= <mlev>
##$CPDPRG5= <mlev>
##$CPDPRG6= <mlev>
##$CPDPRG7= <mlev>
##$CPDPRG8= <mlev>
##$CPDPRGB= <>
##$CPDPRGT= <>
##$D= (0..31)
$$ [...]
##$SUBNAM4= <"">
##$SUBNAM5= <"">
##$SUBNAM6= <"">
##$SUBNAM7= <"">
##$SUBNAM8= <"">
##$SUBNAM9= <"">
##$SW= 239.972175391363
##$SWIBOX= (0..15)
0 1 3 0 0 0 0 0 0 0 0 0 0 0 0 0 
##$SW_h= 12077.2946859903
##$TD= 32768
##$TD0= 1
##$TE= 0
##$TE2= 300
##$TE3= 300
##$TEG= 300
##$TL= (0..7)
120 120 120 120 120 120 120 120 
##$TP= (0..7)
150 150 150 150 150 150 150 150 
##$TP07= 0
##$TPNAME0= <>
##$TPNAME1= <>
##$TPNAME2= <>
##$TPNAME3= <>
##$TPNAME4= <>
##$TPNAME5= <>
##$TPNAME6= <>
##$TPNAME7= <>
##$TPOAL= (0..7)
0.5 0.5 0.5 0.5 0.5 0.5 0.5 0.5 
##$TPOFFS= (0..7)
0 0 0 0 0 0 0 0 
##$TUNHIN= 0
##$TUNHOUT= 0
##$TUNXOUT= 0
##$USERA1= <user>
##$USERA2= <user>
##$USERA3= <user>
##$USERA4= <user>
##$USERA5= <user>
##$V9= 5
##$VALIST= <valist>
##$VCLIST= <CCCCCCCCCCCCCCC>
##$VD= 0
##$VDLIST= <DDDDDDDDDDDDDDD>
##$VPLIST= <PPPPPPPPPPPPPPP>
##$VTLIST= <TTTTTTTTTTTTTTT>
##$WBST= 1024
##$WBSW= 4
##$XGAIN= (0..3)
0 0 0 0 
##$XL= 0
##$YL= 0
##$YMAX_a= 108170627
##$YMIN_a= -25340827
##$ZGOPTNS= <>
##$ZL1= 120
##$ZL2= 120
##$ZL3= 120
##$ZL4= 120
##$ABSF1= 222.6826
##$ABSF2= -17.31421
##$ABSG= 5
##$ABSL= 3
##$ALPHA= 0
##$AQORDER= 0
##$ASSFAC= 0
##$ASSFACI= 0
##$ASSFACX= 0
##$ASSWID= 0
##$AUNMP= <proc_1d>
##$AZFE= 0.1
##$AZFW= 0.5
##$BCFW= 0
##$BC_mod= 2
##$BYTORDP= 0
##$COROFFS= 0
##$CY= -3
##$DATMOD= 1
##$DC= 0
##$DFILT= <>
##$DTYPP= 0
##$F1P= 0
##$F2P= 0
##$FCOR= 0.5
##$FTSIZE= 32768
##$FT_mod= 6
##$GAMMA= 0
##$GB= 0
##$INTBC= 1
##$INTSCL= 4.134877e-10
##$ISEN= 128
##$LB= 1
##$LEV0= 0
##$LPBIN= 0
##$MAXI= 10000
##$MC2= 0
##$MEAN= 0
##$ME_mod= 0
##$MI= 0.1934396
##$NCOEF= 0
##$NC_proc= 2
##$NLEV= 6
##$NOISF1= 120.0001
##$NOISF2= 80.00006
##$NSP= 0
##$NTH_PI= 0
##$NZP= 0
##$OFFSET= 222.6753
##$PC= 1.4
##$PHC0= -335.8601
##$PHC1= 31.96238
##$PH_mod= 1
##$PKNL= yes
##$PPARMOD= 0
##$PSCAL= 0
##$PSIGN= 0
##$REVERSE= no
##$SF= 50.3227290194735
##$SI= 32768
##$SIGF1= 140
##$SIGF2= 120
##$SINO= 11.81781
##$SIOLD= 32768
##$SREGLST= <13C.CDCl3>
##$SSB= 0
##$STSI= 32768
##$STSR= 0
##$SW_p= 12077.2946859903
##$SYMM= 0
##$S_DEV= 0
##$TDeff= 32768
##$TDoff= 0
##$TI= <>
##$TILT= no
##$TM1= 0
##$TM2= 0
##$TOPLEV= 0
##$USERP1= <user>
##$USERP2= <user>
##$USERP3= <user>
##$USERP4= <user>
##$USERP5= <user>
##$WDW= 1
##$XDIM= 32768
##$YMAX_p= 404076518
##$YMIN_p= -2229235
$$ End of Bruker specific parameters
$$ ---------------------------------
##NTUPLES= NMR SPECTRUM
##VAR_NAME=  FREQUENCY,     SPECTRUM/REAL,   SPECTRUM/IMAG
##SYMBOL=    X,             R,               I
##VAR_TYPE=  INDEPENDENT,   DEPENDENT,       DEPENDENT
##VAR_FORM=  AFFN,          ASDF,            ASDF
##VAR_DIM=   32768,         32768,           32768
##UNITS=     HZ,            ARBITRARY UNITS, ARBITRARY UNITS
##FACTOR=    0.368581032318806, 1,           1
##FIRST=     11205.6284273983, 0,            0
##LAST=      -871.666258592022, 0,           0
##MIN=       -871.666258592022, -2229235,    0
##MAX=       11205.6284273983, 404076518,    0
$$ Real data points
##PAGE= N=1
##DATA TABLE= (X++(R..R)), XYDATA
$$ [...]
15742a86885J67967J21238j12464l81884m42151l60026k21872j78240k31128k51218
15732b076663j01389L82434O62820O25682K23179j35642j99056j64369k9085L93430
15722d18659N63084N01859J33437J3332k48886k75458o7835L08820K13363l23253
15712C99804o19834m75996K14183O22014N2016n57415k90979K59572N20779j63125
15702c8981j27862k54702l12587K7549N6873m2607L0576K57543J48180o8771j77937
15691e02726N7245N5380l9556Q634r9302J41690J62270K63810J67187j04515J88192
15680B98309j33259n47474m11911j99506k26305q95K56497L24200L12528J60792
15670a67024j91021j25693p5171n1600J7023O74639K81184j23572J37957K14052
$$ plain form
15742 -186885 -18918 102320 -10144 -392028 -834179 -1194205 -1416077 -1594317 -1825445 -2076663
15732 -2076663 -2178052 -1795618 -1132798 -507116 -283937 -419579 -618635 -783004 -812089 -418659
15722 -418659 144425 646284 779721 793053 544167 268709 200874 509694 723057 399804
15712 399804 -220030 -696026 -481843 140171 192187 -365228 -656207 -396635 124144 -38981
15702 -38981 -166843 -421545 -734132 -706583 -649710 -692317 -661741 -404198 -256018 -324789 -502726
15691 -502726 -445481 -390101 -429657 -421023 -520325 -378635 -216365 47445 214632 110117 298309
15680 298309 165050 -382424 -794335 -993841 -1220146 -1221041 -964544 -640344 -327816 -167024
15670 -167024 -358045 -483738 -558909 -610509 -593486 81153 362337 238765 376722 590774
15660E90774Q3353O7558n0996j67543l01701m05282k91131L7646L52349N04948
15650D19975L8225l48664K30455L06759j12482J20083J23639j07325j71331k63362
15640B35972o08923n34002p4307L59309K45747k0004k17909l38749K15369M59843
15630b77654J6220j91513p2772J28040L73792K68676L4232p6140k99847o72072
15620g69038n40515m53246j84242L2400j07731J48482M82855L71958J51173J60951
15610g06953L33949j33423p0771Q2885K38750L47709j64069j80230m67562j60489
15600h80204m5480m78743N6597M77705Q04371N75406K31143L24774J24461q88417
15590C01613m39595N51282R3240j38763j64191J37323M11248L56691J60436j60008
$$ plain form
15660 590774 674127 741685 690689 523146 221445 -183837 -474968 -437322 -84973 419975
15650 419975 458200 109536 339991 646750 534268 654351 777990 670665 499334 235972
15640 235972 -372951 -906953 -981260 -621951 -376204 -396208 -614117 -952866 -737497 -277654
15630 -277654 -261434 -452947 -525719 -397679 -23887 244789 279021 202881 -96966 -769038
15620 -769038 -1309553 -1762799 -1947041 -1914641 -2022372 -1873890 -1391035 -1019077 -867904 -706953
15610 -706953 -373004 -506427 -577198 -494313 -255563 92146 -71923 -252153 -719715 -880204
15600 -880204 -925684 -1404427 -1347830 -870125 -65754 509652 740795 1065569 1190030 301613
15590 301613 -137982 413300 506540 367777 203586 340909 752157 1108848 1269284 1109276
15580A109276n66938l30693R5854J22485K50934K24373r5823l08894n3772j87736
15570B59066k18505m2352J61153j59729m51577K5298j18516m2648O75404P27563
15560H15157j59846o90142m64723k86691K58245N34780m2913n74676k32853J81719
15550f61943K58233j53059m44264m4411p3884r7057L34704J53161J5309j2914
15540g26125j54522K13420Q4153m318J24793l38544k45818J70730J19186n1733
15530h08778o7262L593k74293k39325j10257L70309N29484M05790N11944R1078
15520D12283k22852k62941m49824k12537J50139j1029J34198P3214L20529P84231
15510G15411L62050n82904l87661J68696K5629q9408K88143L65179Q324k93715
$$ plain form
15580 1109276 542338 211645 307499 429984 680918 905291 809468 500574 446802 259066
15570 259066 40561 -1791 159362 -367 -451944 -426646 -545162 -587810 87594 815157
15560 815157 655311 -34831 -499554 -786245 -528000 6780 -36133 -610809 -843662 -661943
15550 -661943 -403710 -556769 -1001033 -1045444 -1119328 -1216385 -881681 -728520 -713211 -726125
15540 -726125 -880647 -667227 -583074 -587392 -462599 -801143 -1046961 -876231 -757045 -808778
15530 -808778 -876040 -872447 -1146740 -1386065 -1496322 -1126013 -596529 -190739 321205 412283
15520 412283 189431 -73510 -523334 -735871 -585732 -596761 -462563 -389349 -68820 715411
15510 715411 1077461 494557 106896 275592 301221 211813 499956 865135 873459 579744
15500E79744m30299n55766K0748N65320r8704n69358n36739r2525K32401L21752
15490e63426J92553L4408K93804J0248K00348K79536L31701K66712j06904L0550
15480I69530o3502l15801j74271o06274k58200L43592n7125j57984l94155l33533
15470a047723O20728M80933J41676l92151o38867K66549O62941L80010l04550
15461A69546m58783n9797Q3672L4910M6756K65648K08989Q0275Q1390M9773l43946
15450A58433p35534l47466J24119j0379n24443m32817Q677O5564L57625M76259
15440h59962O94012N75888K81406r5637m08384K781L48297J47744n08765o41983
15430d64603j13153L9268p7779P5j02239k4522L21766O34815K33497L08481K87788
$$ plain form
15500 579744 149445 -406321 -385573 179747 81043 -488315 -1025054 -1117579 -885178 -563426
15490 -563426 -370873 -336465 -42661 -32413 167935 447471 779172 1045884 938980 969530
15480 969530 906028 590227 415956 -190318 -448518 -104926 -162051 -320035 -714190 -1047723
15470 -1047723 -426995 53938 195614 -196537 -835404 -568855 94086 474096 169546
15461 169546 -289237 -349034 -265362 -230452 -183696 81952 290941 371216 452606 502379 158433
15450 158433 -577101 -924567 -800448 -810827 -1335270 -1768087 -1759410 -1693846 -1336221 -859962
15440 -859962 -165950 409938 691344 595707 187323 190104 538401 686145 177380 -464603
15430 -464603 -577756 -538488 -616267 -616192 -718431 -742953 -421187 213628 447125 755606 1043394
15419A043394o9547l56068k78783k55684J36729M01235J22758l63978n53320l93373
15409e66637m16748l8373L55118L48987M84315r9907n18141o48237m1531N87078
15399e54076J59022j01774o343k73989j69788J31178J27328q3669o1497J29320
15389g04288K19598K1074L38381K76183M38970K74368m69354m72960J81798N1609
15379A55379R0899L23468Q7072N3570k36599k01874n8087j18311m291J78840J07196
15368C77262J30332m36847n65361J67489L88414K04832o1621m03594k0280P62678
15358E43304M34912j54228k88940M5167L35377l83429p06327p83792l33230M00131
15348h91055Q09986L22939k12909J20655K13512M8058K32226J26073P2924n2704
$$ plain form
15419 1043394 973847 617779 338996 83312 220041 621276 744034 380056 -173264 -566637
15409 -566637 -983385 -1021758 -666640 -317653 166662 66755 -451386 -1099623 -1141154 -554076
15399 -554076 -395054 -496828 -503171 -777160 -946948 -815770 -688442 -772111 -833608 -704288
15389 -704288 -484690 -463616 -125235 150948 589918 864286 394932 -78028 103770 155379
15379 155379 246278 569746 656818 710388 473789 271915 213828 95517 91226 270066 377262
15368 377262 507594 70747 -494614 -327125 61289 266121 204500 -199094 -219374 543304
15358 543304 978216 823988 535048 580215 915592 532163 -174164 -957956 -1291186 -891055
15348 -891055 -81069 241870 28961 149616 363128 411186 643412 769485 842409 789705
15338G89705l75281j07908n9692K09995K74253k38168k22563j0833k33646k23169
15328a97307J15838K11668q8410J69827P2008k00284j89228j81765p00239o60938
15318a648830j52915J83610L80108K99383L56374K95907N9914J50123K52097J23138
15308B98909l93637n23726k52267j20441L39941N19602J82871k85284k91083O0783
15298d64332N7323J03067K0600J55406L85143L85955L90211J39487n4001l61944
15288G56915m10472l18496K42191J39880l42101o32770K1732K28123L40361K57993
15278B83356K77668J35685j46313r5280j33273k49448l12686l19632j83906P3941
15268f69888N7531J02113O8966J57111M1040j52654m17155k40091q3150k44179
$$ plain form
15338 789705 414424 306516 246824 456819 731072 492904 270341 259508 25862 -197307
15328 -197307 -81469 130199 41789 211616 283624 83340 -105888 -287653 -987892 -1648830
15318 -1648830 -1801745 -1618135 -1238027 -938644 -582270 -286363 -226449 -76326 175771 298909
15308 298909 -94728 -618454 -870721 -991162 -651221 -131619 51252 -234032 -525115 -464332
15298 -464332 -407009 -303942 -283342 -127936 257207 643162 1033373 1172860 1118859 756915
15288 756915 346443 27947 270138 410018 67917 -564853 -543121 -314998 25363 283356
15278 283356 561024 696709 550396 455116 321843 72395 -240291 -559923 -743829 -669888
15268 -669888 -612357 -510244 -441278 -284167 -243127 -395781 -812936 -1053027 -1136177 -1380356
15258a380356J94409M56516K47929j17460j91447P4830J7352o1557l11831J90314
15248h81301P15382K04148j39545o78841p08036k03631K4423J6095J70247K67549
15238a213510J21601J75353K18173M11150M06517P2320K19489K1098k25609J67414
15228C73996L07223p1675l22279R2339N85167L79846o1516m13910o14265m64128
15218b09202k98620j76219L43265L95006J96237j70048l15933k65146k29113j8336
15208g48109K75690j68949k68054l3352L48374M60767k343k63085M3960K29018
15198a26083L41073j23225l26118j57060J35436L22695L69290K58452j14226l10519
15188B69715m44582J0069J15405J95149J74614k41614j67643j23083M2340L32244
$$ plain form
15258 -1380356 -1185947 -729431 -481502 -598962 -790409 -715579 -698227 -759784 -1071615 -881301
15248 -881301 -165919 38229 -101316 -780157 -1488193 -1691824 -1667401 -1651306 -1481059 -1213510
15238 -1213510 -1091909 -916556 -698383 -287233 119284 191604 411093 432191 206582 373996
15228 373996 681219 609544 287265 379604 964771 1344617 1283101 869191 254926 -209202
15218 -209202 -507822 -684041 -340776 54230 250467 80419 -235514 -500660 -729773 -748109
15208 -748109 -472419 -641368 -909422 -942774 -594400 -133633 -135976 -399061 -355101 -126083
15198 -126083 214990 91765 -234353 -391413 -255977 66718 436008 694460 580234 269715
15188 269715 -174867 -164798 -49393 145756 320370 78756 -88887 -211970 -169630 162614
15178A62614M98128J69475r6607k37049r4851j62122l10695q4671K47465j41499
15168d9812n97827j06113O7701J73729K72144Q0408J3419k94834J3107P40872
15158C12794L50351k86810l29594J5984N9689j4633j06256l0921r4413Q8658j54188
15147a89339l02193k05162m3993K68583n169K90291K37526j03804j82513k147
15137b37920K70031K18177l21902k98264O0823J55672L9598j55L33937J94207
15127D14204p3948j22546j34525j379M988J7695J0212l6551L93441K89571K63784
15116A024946l30197q07008m28615j30758j27851l7590l4277J98531n3467j90547
15106i16833L79577R45996O67234L39826j40889j35143n37544r76728o07511J73550
$$ plain form
15178 162614 660742 830217 733610 496561 401710 239588 -71107 -155778 91687 -49812
15168 -49812 -647639 -753752 -686051 -512322 -240178 -159770 -146351 -441185 -428078 312794
15158 312794 663145 376335 46741 62725 122414 107781 1525 -29396 -123809 -35151 -189339
15147 -189339 -491532 -696694 -740687 -472104 -477273 -186982 50544 -53260 -235773 -237920
15137 -237920 32111 250288 -71614 -369878 -309055 -153383 -113785 -113940 219997 414204
15127 414204 340256 217710 83185 81806 86794 104489 114701 78150 471591 761162 1024946
15116 1024946 694749 -112259 -540874 -671632 -799483 -837073 -871350 -672819 -726286 -916833
15106 -916833 -537256 408740 1075974 1415800 1274911 1139768 602224 -374504 -982015 -808465
15096h08465N1383k58686R5570K39086O6508k0886J04721K76047O16477N65839
15086I27594j05716n48480q36147o01290m67773k25037K42901R5627j22545L41116
15076a299750L55249K97893j19758k35513J68658M14985M92254j9129r7267L46549
15066C04171K02579J04001j49405l27988m67045l28951L30187K31951j3644j32608
15056b46752j64721K365J59146j94563q341L32290J60089o2698k75172l87725
15046f86082L3934M99594K32287K03552l46949n68538J00331L16437J80904j30209
15036a64739k7071J7205n3183M3911l25091l79242J03002K84811L21255j59569
15026c38711l33602l14568J02464J3966j47719K61502K47709k73358k21254l62054
$$ plain form
15096 -808465 -757082 -1015768 -920198 -681112 -614604 -635490 -530769 -254722 361755 927594
15086 927594 821878 273398 -562749 -1164039 -1631812 -1856849 -1613948 -1518321 -1640866 -1299750
15076 -1299750 -944501 -646608 -766366 -1001879 -833221 -418236 74018 54889 -42378 304171
15066 304171 506750 610751 461346 133358 -333687 -662638 -332451 -100500 -114144 -246752
15056 -246752 -411473 -409108 -249962 -444525 -452866 -120576 39513 -23185 -298357 -686082
15046 -686082 -652148 -152554 79733 283285 -63664 -632202 -531871 -215434 -34530 -164739
15036 -164739 -191810 -174605 -227788 -183877 -508968 -888210 -785208 -500397 -179142 -338711
15026 -338711 -672313 -986881 -884417 -870451 -1018170 -756668 -508959 -782317 -1003571 -1365625
15016a365625j26456M33533M95921M54593M2072l5771K07944k01352j36818L60605
15006A28646R2205k10967k4104L7913J72434K0253n0998L027j95751K27318L40004
14995E39980q917k03601q7290n6770l93092l03428J85445M21574o289o30035k32046
14984g74469K86016M42779J97106J39991M03447L34842k02818q08959o94493J8919
14974f57639K72298J79292o8801m51470k18189J33705P5919K1220k7436p5112
14964h16213P4253J11995l21279k4905J31662Q4622j0896q2393K15595K9508Q6341
14953e21710J36728K46717K05562j80009o03018M0604P04115L71003r9855Q5700
14943C85837L06935p7406m12741Q1839J07563L13137K36438m3389J73399k12435
$$ plain form
15016 -1365625 -1492081 -1058548 -562627 -108034 -65962 -101733 106211 -95141 -231959 128646
15006 128646 220851 9884 -14220 23693 196127 216380 165382 168409 -27342 199976 539980
14995 539980 531063 327462 240172 183402 -209690 -513118 -327673 93901 87612 -542423 -774469
14984 -774469 -488453 -45674 151432 291423 694870 1029712 826894 17935 -676558 -657639
14974 -657639 -385341 -206049 -274850 -726320 -944509 -810804 -734885 -713665 -741101 -816213
14964 -816213 -741960 -629965 -951244 -976149 -844487 -759865 -770761 -853154 -637559 -608051 -521710
14953 -521710 -384982 -138265 67297 -112712 -715730 -675126 28989 399992 300137 385837
14943 385837 692772 615366 202625 284464 392027 705164 941602 898213 1071612 859177
14933H59177k99234j70433J52864N93030N28575k52584o09466l98513k11052K89675
14923D82039j47345m18345J04383R8152j54259j79479J15759O1522K22032R2676
14913B77135l72261r8123J76284k79394l28946P866M53417K82815J66824K64868
14903E50485m64186l73524J92450K71318J5658n78252j79879K89239M65639K79725
14893D68673n03925j82881K87812N6234l84943L3501K52198M6593N0893k65517
14883a41362l50192N3697K74362q9755P3424J68179J77526J16860K14278l23074
14873A73943n49059j1310J08714L60627P5015J62346M74075m3496o49169j76891
14863g5205j68231j83856L70517L3049m41557l42751K47728N1311j95075P2880
$$ plain form
14933 859177 559943 389510 542374 1135404 1663979 1411395 801929 403416 192364 482039
14923 482039 334694 -83651 20732 118884 -35375 -214854 -99095 -37573 184459 277135
14913 277135 -95126 -193249 -16965 -296359 -625305 -617439 -164022 118793 285617 550485
14903 550485 86299 -287225 -94775 176543 192201 -386051 -565930 -276691 188948 468673
14893 468673 -35252 -218133 69679 125913 -259030 -225529 26669 73262 124155 -141362
14883 -141362 -491554 -437857 -163495 -253250 -179826 -11647 165879 282739 497017 173943
14873 173943 -375116 -386426 -277712 82915 157930 320276 794351 750855 101686 -75205
14863 -75205 -243436 -427292 -56775 -23726 -465283 -808034 -560306 -508995 -704070 -631190
14853f31190r1386m47536k32282L13193K01272K2422O7594O48452O29946R5664
14843E76149j85645k41367N2199J01685k2860j87565n6522J17995K38995p6948
14833C16116p22643m40188J28048J0639M02104Q04350M64049m26246p04091m72755
14823f40617O7866O58978K44858j48989k23734k26337K8853R9071k53907k14748
14813f08706K50868K12177k7543K1921L79366M3362k36420r7307J14595N48058
14803F00371O9679j79795J45684J67907J4121k3693m77601j49596L45025k83117
14793B28985n27569p4596j79197k62284J66919K56037k3015J39628O5356M4853
14783a64883k30556k54399J70346K16840k7389m15017q8663M96699K25096n0877
$$ plain form
14853 -631190 -722576 -1170112 -1402394 -1089201 -887929 -865507 -797913 -149461 480485 576149
14843 576149 390504 149137 201336 303021 280161 92596 36074 154069 393064 316116
14833 316116 -406527 -846715 -718667 -708028 -305924 498426 962475 536229 -167862 -640617
14823 -640617 -572751 86227 331085 182096 -41638 -267975 -239122 -140051 -393958 -608706
14813 -608706 -357838 -145661 -173204 -151283 228083 271445 35025 -62282 52313 600371
14803 600371 670050 490255 635939 803846 817967 794274 316673 167077 512102 228985
14793 228985 -298584 -373180 -552377 -814661 -647742 -391705 -414720 -275092 -209736 -164883
14783 -164883 -395439 -649838 -479492 -262652 -290041 -705058 -793721 -297022 -71926 -122803
14773a22803Q1324m63706o52207J07374O54319M33494j04040j65315J17857K11183
14763I7480K4667J77790j01705l01214k40475J09676J75208J0460j95168k17529
14753d60810o8752K38285J42476N3556Q5088k84347k00556K36555L80716j83459
14743f1248l11374J71719K86439r2359n0423J99556P0449J98568l15991k72654
14733a77318J00999M7638R5833J86096L30219J0640j60346k63572k38826K77540
14723B08903K98074k2718j57006j02775j10332p5280O2492N18179K90156n756
14713I03937j0629k47938n66167m69210O7578J01297j36150j70574K08357L33737
14703A4238J04009n2962J91174M473k34244P4949L37209J85018k76995p1800j73334
$$ plain form
14773 -122803 -41479 -505185 -1157392 -1050018 -395699 37795 -66245 -231560 -113703 97480
14763 97480 122147 299937 198232 -102982 -343457 -233781 -58573 -48113 -243281 -460810
14753 -460810 -529562 -291277 -148801 -95245 -10157 -294504 -495060 -258505 122211 -61248
14743 -61248 -372622 -200903 85536 -6823 -57246 142310 212759 411327 95336 -177318
14733 -177318 -76319 -28681 67152 253248 583467 594107 433761 170189 -68637 208903
14723 208903 506977 484259 327253 224478 114146 38866 101358 619537 909693 903937
14713 903937 893308 645370 79203 -390007 -322429 -221132 -357282 -527856 -319499 14238
14703 14238 118247 65285 256459 260932 26688 101637 438846 623864 346869 275069 101735
14692A01735n16134j62352k77066l92568K46047N01911l6968P8299O0583k00959
14682e97472j16024M61057L36750L8304k23181m5382j8007J97430J39781n7150
14672A16106M28455J79798j03989K46219K9970l95321k12085k4115m9583K39624
14662D55079M5330K76641K83684J7348k66722q37473l32087L19097M4862m22637
14652d16878l13518j32406k97349J06233L80316J95952J80608M98668N8667k92677
14642c2384m23370k50821k7805K33141L08767K1267m1528j73599J30396J31352
14632a24584n0063L04055J79363k13832k4798j19631n6370J76394j57216l34990
14622d21672n8650K84047J54676j01538K7429m1908K36675L59357K686p50762
$$ plain form
14692 101735 -414399 -576751 -853817 -1246385 -1000338 -498427 -535395 -457096 -396513 -597472
14682 -597472 -713496 -252439 84311 122615 -100566 -145948 -163955 33475 173256 116106
14672 116106 544561 724359 620370 866589 896559 501238 289153 265038 215455 455079
14662 455079 500409 777050 1060734 1078082 811360 -26113 -358200 -39103 5759 -416878
14652 -416878 -730396 -862802 -1160151 -1053918 -673602 -477650 -297042 201626 260293 -32384
14642 -32384 -455754 -706575 -734380 -501239 -192472 -171205 -212733 -386332 -255936 -124584
14632 -124584 -174647 129408 308771 94939 70141 -49490 -105860 70534 -86682 -421672
14622 -421672 -480322 -196275 -41599 -143137 -115708 -157616 79059 438416 441102 -309660
14612c09660p81990j7675M99779Q8194P3277k1949m21839r8431O0612r2600k10298
14601a232580p2337J37496J47986J0281N1261O2244m4385J29955M98859K87336
14591b3884J35815J49377M401l4882P824p5222L90139P18184P5528l08095K50222
14580A289407k0038n88815o49399o60208q4364L9103j58971j55849n7732k87422
14570a334288p9259N67466R4281l92435j22236L52330N57489L04843P5751k96855
14560b72913l55057Q6069L50106J05745j20778M4210J49219J28042j50022k80716
14550c16095k30970K18020M76653M33793J66045m64708k04340J82179J43454k47757
14540A56274l56587j4546J64997J38880m4879j33156J61934K39515J38364j16228
$$ plain form
14612 -309660 -1091650 -1109325 -609546 -521352 -448075 -470024 -891863 -990294 -929682 -1022282 -1232580
14601 -1232580 -1304917 -1167421 -1019435 -1009154 -957893 -895649 -940034 -810079 -311220 -23884
14591 -23884 111931 261308 265709 230827 238651 163429 553568 1271752 1347280 1039185 1289407
14580 1289407 1269369 680554 31155 -629053 -713417 -674314 -833285 -989134 -1046866 -1334288
14570 -1334288 -1413547 -846081 -751800 -1144235 -1266471 -914141 -356652 -51809 23942 -272913
14560 -272913 -627970 -541901 -191795 -86050 -206828 -162618 -13399 114643 -35379 -316095
14550 -316095 -547065 -329045 147608 581401 747446 282738 78398 260577 404031 156274
14540 156274 -200313 -214859 -49862 89018 44139 -89017 72917 312432 450796 334568
14530C34568j28633j35688m2667J117j40438p4556J77668J81030j84117j66002
14520a77718m1681O1333k01539j36792k09145l0481L33899L87588j3766k85807
14510c14109n72337m24001J74359J05792J87271K15412J74731J23274j86280j63078
14500f78966L68116O52831K16127l1031J29645n8770l04295m92688m54340M1353
14490f12018J62417J11236K80301J53071k78145l68746l09069m4615L31904K68495
14480c05169J25153K58843M62658J00268P2735q8230j86231k31650J45491l0224
14470C23644l20197J36533M40797j04123m66829l32982m50112J51373M70989j18726
14460b69633o70470n58782L9356L95685K69088L5959J20817m3659o5828Q044l54299
$$ plain form
14530 334568 205935 70247 27580 28697 -111741 -186297 -8629 172401 -11716 -177718
14520 -177718 -219399 -158066 -359605 -496397 -705542 -736023 -402124 -14536 -28302 -314109
14510 -314109 -886446 -1310447 -1136088 -1030296 -843025 -627613 -452882 -329608 -515888 -678966
14500 -678966 -310850 341981 558108 527077 656722 597952 293657 -199031 -653371 -612018
14490 -612018 -449601 -338365 -58064 95007 -183138 -551884 -860953 -905568 -573664 -305169
14480 -305169 -180016 78827 541485 641753 714488 626258 440027 208377 353868 323644
14470 323644 3447 139980 580777 476654 9825 -323157 -773269 -621896 -150907 -269633
14460 -269633 -940103 -1498885 -1459529 -1063844 -794756 -758797 -637980 -681639 -747467 -739423 -1093722
14449a093722R8836O45662O33929M25656k59017p25899l64703p3113K21461L8651
14439d52259j51429M46805O38346L15154N5601J74431j97390n14974l38334R395
14429a4654k8676j22139R9903J69948N5402j52736l93025o47859n75257k02568
14419a811661L18243L64285L05440j3066r0565R2867k42811J57642M2054p09435
14409a587007l20183K31589J86056J9926J19446K0388L2608K76868j23280m12791
14399a556380k02449N41939K54812j83431k89122K49685P11819K85927N38484
14390C51284K95469k84644l65087r1038L5890M29015N02140O9820j84534l19821
14380D38494l04855J25021Q9936O6836r2516q4742m7414K97637J76233l18853
$$ plain form
14449 -1093722 -994886 -349224 284705 710361 451344 -274555 -639258 -712371 -490910 -452259
14439 -452259 -603688 -156883 481463 796617 852218 1026649 829259 314285 -24049 -14654
14429 -14654 -43330 -165469 -65566 104382 159784 7048 -385977 -1033836 -1609093 -1811661
14419 -1811661 -1493418 -1129133 -823693 -836759 -927324 -834457 -1077268 -919626 -877572 -1587007
14409 -1587007 -1907190 -1675601 -1489545 -1469619 -1350173 -1329785 -1297177 -1020309 -1143589 -1556380
14399 -1556380 -1758829 -1216890 -962078 -1145509 -1434631 -1184946 -473127 -187200 351284
14390 351284 646753 362109 -2978 -94016 -58126 370889 873029 942849 758315 438494
14380 438494 133639 258660 348596 415432 322916 238174 190760 488397 664630 345777
14370C45777l84083l01238M9857p4336l51037k63263K29277L52601J70182j04648
14360c30911j50346m9581k6693R4456L60910L76336J31880k80460o3459J30112
14350A92244j99434j9965L92829J81608k13621k56814j41125k51960J464L17893
14340C119K4053r1428l91654k57886J52756L80351M38222l8163k35536J94925
14330A78759j53256P0535O3236m62236n3040K28194L71415L59315J02341j87954
14320E17309j56695l75999n81699l68339M14495K67710m4294r4044m4634q4624
14310e50814k17415M6200J79066J48321L69419M96128L42692j32086k62279j05844
14300C13388k71589o8196k80358k9808J46253q892J63076K72790L29177J38353
$$ plain form
14370 345777 -38306 -339544 -289687 -364023 -715060 -978323 -749046 -396445 -226263 -330911
14360 -330911 -481257 -530838 -557531 -463075 -102165 274171 406051 125591 62132 192244
14350 192244 -7190 -27155 365674 547282 333661 76847 -64278 -316238 -314774 3119
14340 3119 27172 -64256 -455910 -713796 -561040 -180689 257533 219370 -16166 178759
14330 178759 25503 96038 159274 -302962 -356002 -127808 243607 602922 705263 517309
14320 517309 360614 -15385 -597084 -965423 -550928 -283218 -327512 -421556 -466190 -550814
14310 -550814 -768229 -722029 -542963 -394642 -25223 470905 813597 681511 419232 313388
14300 313388 41799 -26397 -306755 -336563 -190310 -199202 -36126 236664 565841 704194
14290G04194k2615R4632r3793n2898j66937k47843j05826K7355L4325K81247J68252
14279F20093j51909j96123q2385m9976l12057M9516J69071M4568J08563L75150
14269E74511N27634j13298o78847k36545M795j44286j37491J81695K90811J82638
14259D51617P0858j40450m43525k01299M6740j56901k7313M04971J26062k04397
14249g3637j71200q261J33848J20340J87579K66242l34460m81915l76118k74614
14239a012196o1638k25122j5751O2222R6011J19579j71300J51815O34409K56200
14229a65771J0243J5004k30888Q8374M06876L7492j97666J1018M47087K47814
14219F69583n73235o86837l43670l01609J02813L62566k20270l73294K98827Q24486
$$ plain form
14290 704194 681579 776211 682418 629520 462583 214740 108914 136269 170594 451841 620093
14279 620093 468184 272061 189676 139700 -172357 -122841 46230 90798 199361 574511
14269 574511 1102145 988847 310000 73455 78250 -66036 -203527 -21832 268979 451617
14259 451617 522475 382025 -61500 -262799 -216059 -372960 -400273 4698 130760 -73637
14249 -73637 -244837 -253098 -119250 1090 188669 454911 120451 -361464 -737582 -1012196
14239 -1012196 -1073834 -1298956 -1314707 -1252485 -1156474 -1036895 -1208195 -1056380 -421971 -165771
14229 -165771 -155528 -140524 -371412 -283038 123838 161330 -36336 -25318 421769 669583
14219 669583 96348 -590489 -934159 -1235768 -1132955 -770389 -990659 -1363953 -1065126 -240640
14209b40640N86391R4389q8862j07332j58010j98476l43634o2246K97290J50090
14199g1040j08969m38316l57148J97268N00956K68183N9738N1428J72899K9010
14189C04009m87314m39332l78526j03892K05242J82118j58589K4029m1341q2608
14179i76204j80633K1351Q1003N1435K55945L01691J61800l83691m01074r788
14169a078165K05625K29533K82319O9927l9641l60954R5539M01268l72617n56843
14159a124009j75327K12291J57292p2507k68884K05261K87650K18940l588n42583
14149a105464l28279K26550O57470J44754J32142K68492K46732O0712J19389J20837
14139E43335j606j26143j53114m46415m75432K607J35855m8896R5156j1643J48583
$$ plain form
14209 -240640 345751 440140 351278 243946 85936 -112540 -456174 -518420 -221130 -71040
14199 -71040 -180009 -618325 -975473 -778205 -277249 -9066 50672 102100 274999 304009
14189 304009 -183305 -622637 -1001163 -1105055 -899813 -717695 -876284 -852255 -893596 -976204
14179 -976204 -1156837 -1135486 -1054483 -1003048 -747103 -445412 -283612 -667303 -1068377 -1078165
14169 -1078165 -872540 -643007 -360688 -290761 -330402 -691356 -595817 -194549 -567166 -1124009
14159 -1124009 -1299336 -1087045 -929753 -1002260 -1271144 -1065883 -778233 -559293 -562881 -1105464
14149 -1105464 -1433743 -1207193 -549723 -404969 -272827 -4335 242397 303109 422498 543335
14139 543335 541729 415586 262472 -183943 -659375 -656768 -520913 -569809 -474653 -486296 -337713
14128c37713j2785L1665J28425K37900J59900K9061K17554o7002o76740k16360
14118e06095O35986L78628J77799J73957r4043k76183n94487m42626j82450p480
14108g36994J39016K60134K87627L94760j31428l13367k56616j88469q5560J13940
14098e16957L71941J79599R207j55235J28906K40990j73115j45097O9026j07097
14088i7832m12606j93072n8811q8910j11356k41030J35135J32605K04350K14984
14078e16543k15337j97197l25388J73653L78765J30713N0496k22005J79813M44499
14068a18531R8704k02j48790l12884l97595k7524K27307m51133l15962J79617
14058a266993N23501O72259L01616K2626m1240P257k18081k86930j74365M1968
$$ plain form
14128 -337713 -350498 -318833 -190408 47492 207392 236453 454007 387005 -289735 -506095
14118 -506095 129891 508519 686318 860275 766232 490049 -104438 -547064 -729514 -736994
14108 -736994 -597978 -337844 -50217 344543 213115 -100252 -356868 -545337 -630897 -516957
14098 -516957 -145016 34583 43790 -111445 17461 258451 85336 -59761 9265 -97832
14088 -97832 -510438 -703510 -762321 -851231 -962587 -1203617 -1068482 -935877 -731527 -516543
14078 -516543 -731880 -929077 -1254465 -1080812 -702047 -571334 -520838 -742843 -563030 -118531
14068 -118531 -19827 -20029 -168819 -481703 -879298 -906822 -679515 -1130648 -1446610 -1266993
14058 -1266993 -743492 -71233 230383 253009 211769 219026 945 -285985 -460350 -418382
14048d18382L02651L22787J09461J71284K48947M66384M8312m45808k83149j08508
14038D13979M4258P2306k02514o21516l52793n2428L49846J44308K55212M50473
14028E01131L9489n61592Q8628N86363P9743k08561l83531l88421n0788K72728
14018b4811J33245P2312k4729o4j98017j73878k9796m692J23030K67336J35740
14007B75676K13305M4941l87507j3655J73661q993k6314K2415l53105k45049l3783
13996c38408K48108M08980Q5471o1465r7607j70952J81832J70519r8912j62094
13986A65472k21940m21792n7554K63802N17343N4176K39275K25850m50802n85714
13976b71884k01224l12552n8149K86512M52581K97060r0068J44355M25014J51120
$$ plain form
14048 -418382 -115731 207056 316517 487801 736748 1203132 1251444 805636 522487 413979
14038 413979 458237 530543 328029 -293487 -646280 -698708 -348862 -204554 50658 501131
14028 501131 540620 -20972 67656 654019 733762 525201 141670 -246751 -297539 -24811
14018 -24811 108434 180746 156017 155953 -42064 -215942 -245738 -250430 -127400 139936 275676
14007 275676 488981 533922 146415 132760 306421 297428 271114 293529 -59576 -304625 -338408
13996 -338408 -90300 318680 404151 342686 245079 74127 255959 426478 327566 165472
13986 165472 -56468 -478260 -535814 -272012 245331 299507 538782 764632 313830 -271884
13976 -271884 -473108 -785660 -843809 -557297 -104716 192344 102276 246631 671645 822765
13966H22765m23382l34538k4695m5285l4637J56393K03694J44178R1951m3445
13956E12999J8227O3771k73191k79810j98434j0460N2224J30327j8055k73380
13946b75782k01923J84542N89068K45419K92605K93819j18472j17062J37077N196
13936A034487m47632l12606l89150K30593M04271j04690j05180L0159j1404J05883
13926D34731L14897j47387l09216j61260J88742J41713P6129R8853L22876K50204
13916A210282k66214n2798r669K50723M5986j41091n907N351J51803j51607o15289
13905D21570n73584l44601K29787K96631r5034o1237R8401L23276m9257l15589
13895f9637j14083J59253N5404n3202J99771J6584p4788K51934M98745j19103
$$ plain form
13966 822765 399383 64845 40150 -5135 -39772 116621 320315 464493 556444 512999
13956 512999 531226 594997 321806 41996 -156438 -166898 -114674 15653 -2402 -275782
13946 -275782 -477705 -293163 295905 541324 833929 1127748 1009276 892214 1029291 1034487
13936 1034487 586855 274249 -114901 115692 519963 415273 310093 340252 328848 434731
13926 434731 749628 602241 293025 131765 320507 462220 538349 637202 960078 1210282
13916 1210282 944068 891270 881601 1132324 1178310 1037219 1031312 1036663 1188466 1036859 421570
13905 421570 -152014 -496615 -266828 29803 -65231 -126468 -28067 295209 245952 -69637
13895 -69637 -183720 -24467 30937 -22265 177506 194090 119302 371236 869981 750878
13885G50878l17452j83896j1370J93673R9616q2929k77726R18n7179L7171K07674
13874C59378q2825o4004r5988k08114R4508L4905J10L8224j34136l15867K87502
13863h6307L45222J24913m4621J40M50020n813l90675l45242j26893L02733L24087
13852E47564K03339L32717J41517k19137m56652l98388l65354j80195j91313j85593
13842g71495P118k50404l59445r2752L03248K32446L59694J53661l28284j11634
13832h57847L52307N06585R6452N9670l50732o17860l62911k817j03481l01551
13822a582185j29499L31262K52887J93031L39420N09609J65084j16474k6779K09344
13812A45700J47252j01439j70088n15874j45617J61276J06130r351K53941L45116
$$ plain form
13885 750878 433426 249530 238160 431833 531449 448520 170794 171712 114533 151704 359378
13874 359378 276553 212549 116561 -91553 2955 37860 37970 76194 -57942 -373809 -86307
13863 -86307 258915 383828 339207 339347 789367 783554 392879 47637 -79256 223477 547564
13852 547564 750903 1083620 1225137 1006000 549348 150960 -214394 -394589 -585902 -771495
13842 -771495 -764377 -1014781 -1374226 -1466978 -1163730 -931284 -571590 -417929 -746213 -857847
13832 -857847 -505540 1045 97497 157167 -193565 -811425 -1174336 -1177153 -1280634 -1582185
13822 -1582185 -1711684 -1380422 -1127535 -934504 -595084 -85475 79609 -36865 -63644 145700
13812 145700 292952 191513 21425 -494449 -640066 -478790 -372660 -382011 -128070 217046
13802B17046O1791m0432o07402n66014l65251k9667N06570P15202M03943J45002
13792D40788K8835k26080k5246l3684J54657J26352k77056m34351J9284P999l01108
13781e19610k94953J37537N37663J76830j81191k50923n18351l26037q6815P4453
13771a251397M90646K19761K14046J98184L8716K38732j08410m29382o60051j75304
13761a224459N12019O81936K73413r8322j50332o0701m8653K4600l64631k24803
13751f79933n8249K60760M15720K66408k68035n68440l19063m27840m1021J82679
13741a237014j10143K1600M09022O31148N47581K61572L53343N1133l35027p06430
13731a13215n35814o9153L63100K08056R3221K08097K31426P0717j3475p0553
$$ plain form
13802 217046 278837 238405 -368997 -935011 -1300262 -1329929 -823359 -108157 295786 440788
13792 440788 469623 243543 218297 184613 339270 465622 188566 -245785 -226501 -218502 -519610
13781 -519610 -814563 -677026 -139363 37467 -143724 -394647 -912998 -1239035 -1325850 -1251397
13771 -1251397 -760751 -540990 -326944 -128760 -90044 148688 40278 -389104 -1049155 -1224459
13761 -1224459 -712440 -30504 242909 144587 -5745 -66446 -115099 -90499 -455130 -679933
13751 -679933 -738182 -477422 -61702 204706 -63329 -631769 -950832 -1378672 -1419693 -1237014
13741 -1237014 -1347157 -1325557 -916535 -285387 262194 523766 877109 928242 593215 -113215
13731 -113215 -649029 -718182 -355082 -147026 -53805 154292 385718 456435 442960 372407
13721C72407j56160l21942n8781K32407K49926J32657K7746l08641l74177k47045
13711d51603k1194l2237k88165n77892j69496M83338L91125Q3263P4096J67232
13701c41533J58489j60891Q6407J40744J87080M1954j21541l4192J8027p8930
13691a04386J24778J85406j81544k25459j52463r7542K34278N50387K96513n35610
13681I4358n55156j29640k09883j57874J45751K98500M07022N60727j91748l36558
13671g4501l03112j89798R4654N13579O22994L14351m2899l46027n81501l34900
13661c27160O9208J16964k09617j15126r2080L8408J84563O5173K97209j19654
13651i2112l30067l3351K09671q9461j41110j87593n50973j71823K86436J43625
$$ plain form
13721 372407 216247 -105695 -164476 67931 317857 450514 478260 169619 -204558 -451603
13711 -451603 -472797 -505034 -793199 -1371091 -1540587 -1057249 -666124 -582861 -508765 -341533
13701 -341533 -183044 -343935 -257528 -116784 70296 112250 -9291 -43483 -25456 -104386
13691 -104386 20392 205798 24254 -201205 -353668 -451210 -216932 333455 629968 94358
13681 94358 -460798 -590438 -800321 -958195 -812444 -513944 -106922 453805 262057 -74501
13671 -74501 -377613 -567411 -472757 40822 663816 978167 935268 589241 7740 -327160
13661 -327160 -257952 -140988 -350605 -465731 -557811 -519403 -334840 -269667 27542 -92112
13651 -92112 -422179 -455530 -245859 -335320 -476430 -664023 -1214996 -1386819 -1100383 -956758
13641i56758J38302O52315P50988M71817J68920j89559j0339l0188k73761l25256
13631C96481m38393j49561k83450k70207l40389L37817N78202M35952L3362n0038
13621B49776m8080j18569m11141m68159J82122O50815M36996K35595J85452J76125
13611A070932J47137k4089j58525N7931P8402k83954m19176l75729j89119j42037
13601b38227m2127k97709M6391k7253j52639L9488M1162J06533J89547J55456
13591a79378J31684K52479L57069j44856j69350K93466M67975P1910m97154m77997
13581A05848k96297l75354l07292L89403N40600Q0831K20582l1688q9378J42243
13571C79498J41277j3369j20198k33996l76891J35905J65928j09314j47205j2558
$$ plain form
13641 -956758 -818456 -166141 584847 1056664 1225584 1036025 1025686 995498 721737 396481
13631 396481 -41912 -191473 -474923 -745130 -1085519 -747702 -169500 266452 299814 249776
13621 249776 201696 83127 -328014 -796173 -614051 36764 473760 709355 894807 1070932
13611 1070932 1218069 1193980 1035455 1093386 1171788 887834 468658 92929 -96190 -238227
13601 -238227 -280354 -578063 -531672 -558925 -711564 -672076 -630914 -524381 -334834 -179378
13591 -179378 -47694 204785 561854 416998 247648 541114 1009089 1080999 583845 105848
13581 105848 -190449 -565803 -873095 -483692 56908 137739 358321 326633 237255 379498
13571 379498 520775 507406 387208 153212 -223679 -87774 78154 -31160 -178365 -190923
13561a90923M53882L80797K5767L49114L65263n20370p61122j66322n9766m03062
13551e26742k08990N2854K37155K9390j03486K52138K12138k88615k99472L54429
13541b89201M27525K58088n06171k58938K98162N2271O9402K0791m3656l42060
13531c13787o1503j7876j39202J24862R7076q937J00451o0070R2099K21175k83258
13520b48970k15749K8929p2842J70805M08627K77278j10698m9831l6563J30163
13510B81149j45929m72724J22219J13131L18623K67679j7339o2733J45061J57008
13500G06145L5847l03903l14508q2206n5454R29K12755M689n32205q9014N80892
13489A63967N62555j2172l26700l04734J94694L13388j48464j79667o8766l22659
$$ plain form
13561 -190923 262959 643756 669523 1018637 1383900 863530 102408 -63914 -123680 -526742
13551 -526742 -735732 -682878 -445723 -416333 -519819 -267681 -55543 -344158 -643630 -289201
13541 -289201 138324 396412 -109759 -368697 -70535 -18264 51138 71929 28273 -313787
13531 -313787 -375290 -393166 -532368 -407506 -310430 -319367 -218916 -278986 -186887 34288 -248970
13520 -248970 -464719 -435790 -508632 -337827 70800 348078 237380 187549 150986 281149
13510 281149 135220 -337504 -215285 -102154 216469 484148 466809 404076 549137 706145
13500 706145 741992 438089 123581 41375 -14079 -13150 199605 204294 -327911 -416925 163967
13489 163967 726522 714350 387650 82916 277610 590998 442534 262867 194101 -128558
13479a28558M5886J56307j93803k42551J6311K31950L97736L25809j68006J18445
13469E59526L73521K07951k19896j45396K43404L5162k46417k4373r9051l03815
13459C80616o7746J93935k18351k56737q7033l08345k14498q136j00882l45912
13449a033089q1778M07763N75448J38338k57458k59461J66592K18872J06477M28477
13439D10181L24433j68520l38728j09189K19008L89324J74702J76872l7987l56415
13429F83681k99887n9537p0975l14106j13375Q602j62491l5781L25561L28247
13419B89939N49752K78257k88670k42272J93253j40105j61712j78085n2828J83698
13409D31227l8719j69317M4802N5149N0241K58540N1077l35324l31178l10753
$$ plain form
13479 -128558 -82672 73635 -120168 -362719 -346408 -114458 283278 609087 441081 559526
13469 559526 933047 1140998 921102 775706 1019110 1054272 807855 783482 684431 380616
13459 380616 312870 506805 288454 31717 -55316 -363661 -578159 -586295 -687177 -1033089
13449 -1033089 -1114867 -707104 -131656 6682 -250776 -510237 -343645 -124773 -18296 410181
13439 410181 734614 566094 227366 118177 337185 726509 901211 1078083 1040096 683681
13429 683681 383794 324257 253282 -60824 -174199 -165597 -328088 -363869 -38308 289939
13419 289939 839691 1117948 829278 587006 780259 640154 478442 300357 247529 431227
13409 431227 392508 223191 267993 323142 373383 631923 683000 347676 16498 -294255
13399b94255r0690K31854K81211M13134Q5148j33104p189l362K1545j13637n5407
13388C35248j76780L2559K11384J06502K88130k20520r50367n51882K24442O63339
13378c7945L76482n2085q2851J82958m7748n06833J18639J57947J29201r3575
13368A44190m26690k42483j25234M3333J00537K5303R2490Q9170j47046J16607
13358c29823O75210N62771K77626k34192j58409k50833Q9180J2489n4838L97430
13348I86611J69115l30426k47869k77455j41344J93522o3540m12279k07205L28005
13338b865K65136p3229j08851k56909o0089J4380K81277L61719O3100K21055K25651
13327I30375l86454l12369K19128J02370J50549J5772l85466o00982l84319j20320
$$ plain form
13399 -294255 -384945 -153091 128120 541254 626402 493298 486109 482747 504292 390655 335248
13388 335248 158468 191027 402411 508913 797043 576523 -373844 -925726 -701284 -37945
13378 -37945 338537 286452 203601 386559 338811 -168022 -49383 108564 237765 144190
13368 144190 -282500 -524983 -650217 -606884 -506347 -481044 -388554 -299384 -446430 -329823
13358 -329823 345387 908158 1185784 951592 793183 542350 631530 644019 589181 986611
13348 986611 1155726 825300 577431 299976 158632 352154 288614 -123665 -330870 -2865
13338 -2865 262271 189042 80191 -176718 -236807 -222427 58850 420569 483669 704724 930375
13327 930375 543921 231552 450680 553050 703599 719371 333905 -267077 -651396 -771716
13317g71716L35487L81999L11728K2567o6375n6231m7153K10670J31734J30404
13307E83114K17368J01738O5805j66630l41551Q2907k7748P177J41146K5259l03237
13296C85348l28803j07156J17637k6350k07318r6291j34477K40221K37067J6473
13286I6351J39901l48934P5026N59523k2637m95037l55174p2590O9950K11269
13276a42352l30619k78552L80541K51665J01309J55576j674j14541l25288k41192
13266e45127K20118L65382L89831J37706L20064J56257R3875j22963k82209K43389
13256I76323k48321p21217j59988L45079K98290q8862m9113M311k78867l82787
13246c05152m07000j19193K99829M98494K26888R243J47215K52238J40538j12016
$$ plain form
13317 -771716 -436229 -54230 257498 280065 213690 157459 110306 320976 452710 583114
13307 583114 800482 902220 968025 801395 459844 542751 515003 522180 663326 688585 385348
13296 385348 56545 -50611 67026 40676 -166642 -262933 -397410 -157189 79878 96351
13286 96351 236252 -112682 -37656 521867 499230 4193 -350981 -423571 -353621 -142352
13276 -142352 -472971 -751523 -370982 -119317 -18008 137568 135894 21353 -303935 -545127
13266 -545127 -325009 40373 430204 567910 887974 1044231 1138106 1015143 732934 976323
13256 976323 728002 6785 -153203 191876 490166 401304 352191 356502 77635 -305152
13246 -305152 -712152 -831345 -531516 -33022 193866 203109 350324 602562 743100 631084
13236F31084J39947K9438m84422m8607O6872J21726J68947k08705j64507J62893
13226D14666j13598j87710K6361n59L03613M07673j92404m83400k15720k9318
13216g0396r7382K50997R5133o3575j43431M6559L21526J69840k81583L05479
13206E33167L26258j98395m22903n95752l19469J9847M8455j44626J77880M47555
13196a27983K93184K82539K7609j84512k68317r6334L25551L70295K00274K91751
13186A114057N0770K4507M0877J1807j70639j82245k35410l47453m02295j76466
13176b72490N36267K90551K2143J30735P4290L07936K73482l81200n27159p1614
13166C82941Q324q2950J25122L35880K21585n1123K02830L75472n4816l35147
$$ plain form
13236 631084 771031 800469 316047 267440 334312 456038 624985 416280 251773 414666
13226 414666 301068 113358 139719 139160 442773 850446 658042 174642 -41078 -70396
13216 -70396 -167778 83219 178352 114777 -28654 17905 339431 509271 227688 533167
13206 533167 859425 661030 238127 -357625 -677094 -657247 -608792 -753418 -575538 -127983
13196 -127983 165201 447740 475349 290837 22520 -73814 251737 622032 822306 1114057
13186 1114057 1164827 1189334 1230211 1242018 1071379 889134 653724 306271 -96024 -272490
13176 -272490 263777 554328 576471 707206 781496 1089432 1362914 981714 454555 382941
13166 382941 391265 308315 433437 769317 990902 939779 1142609 1518081 1463265 1128118
13156A128118m68886n62564l16570J53411N57128K73831l79512l51714M24424
13147D57666O23611J51843r0142J39570O657K4747K56306P4752j10722n15463
13137A018825l62330L24214N00302J69704l04076l15359p9405J63050j42722l62807
13127F09396O1874j66350l71009K6879j29182m18560q0827K38380P4714L78763
13117B24078O99569L13566N2070q1458p9497m25844k99227P9491N3017l08893
13107B26872r2241K86683J22537J25741J16319K20049M59240K85616m3336k297
13097A705183P5462j20226k49592j81737N561L36604L37350k77333l39731K16256
13087A507797M18143L8006j36905M4740J47077J52137m8463o7483R2210M3572
$$ plain form
13156 1128118 659232 96668 -219902 -66491 490637 764468 384956 33242 457666
13147 457666 1081277 1233120 1142978 1282548 1289205 1313952 1570258 1645010 1534288 1018825
13137 1018825 656495 980709 1481011 1650715 1346639 1031280 951875 1114925 972203 609396
13127 609396 671270 504920 133911 160790 31608 -386952 -467779 -229399 -154685 224078
13117 224078 923647 1237213 1289283 1207825 1128328 702484 403257 482748 535765 226872
13107 226872 134631 421314 543851 669592 785911 1005960 1465200 1750816 1707480 1705183
13097 1705183 1780645 1660419 1410827 1229090 1234651 1571255 1908605 1631272 1291541 1507797
13087 1507797 1925940 1963946 1827041 1871781 2018858 2170995 2122532 2055049 2147259 2190831
13077B190831k46131l99749k88391l6344n0097Q5825L9470R6437J95400J45926
13067A733177p6751j90398r6399j23437l87618N019L35865J82958k27320j45389
13057A009707J24680Q6526J90809J68605M7438R2184J06298N0056k976J97892
13047B071219L12404k5315k70645J82686O27085K89423k18651l20671k5012J54643
13037B777166L00801k32356m80407R5163N89426K44583j89123j41641J48894M05517
13027C518023M08455j36886n1123O31975K85401k57149j25230L69977N35045l19126
13017D859362m73921J94167M83769L16309K580l81990L7426P29351O75753O34635
13007G077441L83352J23013J60675L57368J93283R5169N15522J010644J056278
$$ plain form
13077 2190831 1944700 1544951 1256560 1220216 1170119 1255944 1295414 1391851 1587251 1733177
13067 1733177 1656426 1466028 1369629 1246192 858574 863593 1199458 1382416 1155096 1009707
13057 1009707 1134387 1220913 1411722 1580327 1627765 1719949 1826247 1876303 1873327 2071219
13047 2071219 2383623 2358308 2087663 2270349 2897434 3186857 2968206 2647535 2622523 2777166
13037 2777166 3077967 2845611 2365204 2460367 3049793 3294376 3105253 2963612 3112506 3518023
13027 3518023 3926478 3789592 3738469 4370444 4655845 4398696 4273466 4643443 5178488 4859362
13017 4859362 4385441 4579608 5063377 5379686 5382266 5000276 5037702 5767053 6442806 7077441
13007 7077441 7460793 7583806 7744481 8101849 8295132 8390301 8905823 9916467 10972745
12998A0972745R31722N04039Q30537J475694J597105J791702K230173K493524
12990B2827241K787291L493473M497984N398504P138189Q634637R836438J2292066
12982G6905823J6230346K1367095K8288434L8138792N0385592O1631609O2791703
12975C55739394L8271556r708559m9739101o1665098n4833336m3575141l3266058
12968A41223657k5185329j9428292j4872830j1628496r771822q007883o063875
12961D6265130n254980m921342l976464l019588k574948k384500j993989j667479
12953B0471840j645033j417521j234215r42490n71127r12059p07841j90848n99817
12944A2250889o53130m24184n96839m99117n07314l71186k30675l45363m01307
$$ plain form
12998 10972745 11904467 12408506 13239043 14714737 16311842 18103544 20333717 22827241
12990 22827241 25614532 29108005 33605989 39004493 46142682 54777319 64613757 76905823
12982 76905823 93136169 114503264 142791698 180930490 231316082 292947691 355739394
12975 355739394 394010950 384302391 334563290 272898192 218064856 174489715 141223657
12968 141223657 116038328 96610036 81737206 70108710 60336888 52329005 46265130
12961 46265130 41010150 36088808 32112344 29092756 26517808 24133308 22139319 20471840
12953 20471840 18826807 17409286 16175071 15232581 14661454 13749395 13041554 12850706 12250889
12944 12250889 11597759 11173575 10576736 10077619 9570305 9199119 8968444 8623081 8221774
12935H221774K40522J86399l33219j74073L27938K31568k7871K6940R4235J03386
12925H897599L47498M60312N98438N40675M53151J055341J783498K023803K367462
12916A8527777K042839K32176r26841j418203m77681R846J77462M35270N74490
12907A9177135Q91982P99722J561905K273527K700657M132121N318305N578100
12899D2433454O641608Q637606J0726203J3226214J6836661K2568674L0726382
12892A51796802M1079970N3838070O5361603O2495253K9504820k2286950n7372396
12885C24417172o3366023n4022078m1825552l1160528k3264396j7809979j4101268
12878G8867348j1384956q883478p234532n925460m957885m631022m062160l179877
$$ plain form
12935 8221774 8462296 8648695 8315476 8141403 8469341 8700909 8673038 8699978 8794213 8897599
12925 8897599 9245097 9705409 10303847 10844522 11297673 12353014 14136512 16160315 18527777
12916 18527777 20570616 20802792 19875951 18457748 17980067 17989913 18167375 18602645 19177135
12907 19177135 20069117 20868839 22430744 24704271 27404928 31537049 36855354 42433454
12899 42433454 49075062 57712668 68438871 81665085 98501746 121070420 151796802
12892 151796802 192876772 246714842 312076445 374571698 404076518 381789568 324417172
12885 324417172 261051149 207029071 165203519 134042991 110778595 92968616 78867348
12878 78867348 67482392 58598914 51364382 45438922 40481037 35850015 31787855 28607978
12870B8607978k591664k122824j812795j941355j443022j479715j372854o76043
12862A5167706n91669q96145n86297m36118p59245j079529r80909m80898m5153
12853I311743k43156p1775N2148k71156o79762l81678J62137K84002L1341j2229
12843H181615P2747q382J60633k99021q7675J57424O1994j71620L56652K38554
12833H662921j70145P8400N85289O79202Q25246Q99576O20614M27257N14031Q07677
12823A3930068O09599N86047J093421J600019K001164K502827K655223L337134
12815B8315502M006781M922330N842814P152882R102131J1396956J4138087J8103094
12807A02980577K4163754L2459329M3153700N5821019O4850857N5610787J7017516
$$ plain form
12870 28607978 26016314 23893490 22080695 20139340 18696318 17216603 15843749 15167706
12862 15167706 14576037 13679892 13093595 12657477 11898232 10818703 9837794 9356896 9311743
12853 9311743 9068587 8996812 9048960 8777804 8098042 7716364 7878501 8162503 8193844 8181615
12843 8181615 8254362 8245980 8406613 8107592 8019917 8177341 8239335 8067715 8424367 8662921
12833 8662921 8492776 8571176 9156465 9835667 10660913 11560489 12181103 12608360 13122391 13930068
12823 13930068 14539667 15125714 16219135 17819154 19820318 22323145 24978368 28315502
12815 28315502 32322283 37244613 43087427 50240309 59342440 70739396 84877483 102980577
12807 102980577 127144331 159603660 202757360 258578379 323429236 379040023 396057539
12800C96057539l1832140n9032154o0183289m9871753l8883294k9263356k1679621
12793A05311932j6853707j3456383j0658076q629814p156487n844081n069130
12786C7644254m375685l761018l073190k389012k154834j679393j630266j691388
12778A6889468j815150j452252j146843o52312p84238j171262j023711p34902
12770H108798j57500j71695m00135k09400j60774p5973o60027j025521q13840
12761D433933k2211M35761N3969k86056l44319m51244m40442q4574j57852j5498
12751C121467K43850J35692J35499l29488j34772M43328J32955m18100m53697
12742B876734j69557j4718l9979O7042j06172k8212k1803m9132K58091J80426
$$ plain form
12800 396057539 364225399 305193245 245009956 195138203 156254909 126991553 105311932
12793 105311932 88458225 75001842 64343766 55713952 48557465 42713384 37644254
12786 37644254 33268569 29507551 26434361 24045349 21890515 20211122 18580856 16889468
12778 16889468 15074318 13622066 12475223 11822911 11038673 9867411 8843700 8108798
12770 8108798 7951298 7779603 7379468 7170068 7009294 6933321 6273294 5247773 4433933
12761 4433933 4411722 4847483 4901452 4615396 4271077 3819833 3379391 3294817 3136965 3121467
12751 3121467 3365317 3501009 3636508 3307020 3172248 3615576 3748531 3330431 2876734
12742 2876734 2707177 2692459 2652480 2719522 2613350 2585138 2563335 2514203 2772294 2952720
12732B952720j40353j37134k91349n89893m98700K00921N64475m106l07633j58863
12722A590085K55335O38767J66937l24699k29535r5416k17604k99296j8438L61285
12712A827421K67032L17937M5051l77790l47334O354P6634j3036q1521O6706J48763
12701A936217J07276J75666L0079m18843q82691l38503J00743M56164L92028p0946
12691A487190n24108n31260p4367J11628K06650K62499R2685J84838J08847k07674
12681A116928K24236J63934l18897J67633L34496P1209k35209k48593M3643J20266
12671A439646o4580J0583l3648M727o4736j57817k25368j08599O3618l10745m90820
12660F2261k203L65953K11181k22742k99076j11222j007l12224j35187J23598
$$ plain form
12732 2952720 2812367 2675233 2383884 1793991 1295291 1496212 2060687 2056581 1748948 1590085
12722 1590085 1845420 2484187 2651124 2326425 2096890 2001474 1783870 1484574 1466136 1827421
12712 1827421 2094453 2412390 2457441 2079651 1732317 1738671 1815305 1802269 1720748 1787454 1936217
12701 1936217 2043493 2219159 2249238 1830395 947704 609201 709944 1166108 1558136 1487190
12691 1487190 963082 431822 357455 469083 675733 938232 1030917 1215755 1324602 1116928
12681 1116928 1341164 1505098 1186201 1353834 1688330 1759539 1524330 1275737 1319380 1439646
12671 1439646 1375066 1385649 1352001 1356728 1291992 1134175 908807 800208 863826 553081 62261
12660 62261 60058 426011 637192 414450 115374 4152 3145 -309079 -444266 -320668
12650c20668K11911M59539N63368K65373l35571k28519m16278o06259j81312L51539
12640b36877M00076k9585l93202l7005J25316R3361K68391L12105K97605j11547
12630F88638l28764j295K27853N38868N87351K57099J5614m25213l73698K8015
12620A214468k56973m12861l50310l5752O1854m67784j80465L68461N64924K96235
12610H01797L13355Q3162k01153k01470l65330j18885K74086L86582J4305l42482
12600F43967l18945R5472P3995L6687K11378N7615l28915j68096K60294k90347
12590B73105l19572j9895l5842j50495K30889L36256J28347L26705P7868o75674
12580A71692o28764m06576k26982N1561L37875O48647P82236K67233j04902J71420
$$ plain form
12650 -320668 -108757 350782 914150 1179523 843952 615433 199155 -407104 -588416 -236877
12640 -236877 163199 133614 -259588 -296593 -171277 -77916 190475 502580 800185 688638
12630 688638 359874 358579 586432 1125300 1712651 1969750 1985364 1560151 1186453 1214468
12620 1214468 957495 544634 194324 158572 220426 -247358 -427823 -59362 505562 801797
12610 801797 1115152 1198314 997161 795691 430361 311476 585562 972144 986449 643967
12600 643967 325022 420494 494489 531176 742554 800169 471254 303158 563452 273105
12590 273105 -46467 -66362 -102204 -252699 -21810 314446 442793 769498 847366 171692
12580 171692 -457072 -863648 -1090630 -1039069 -701194 -52547 729689 996922 892020 1063440
12570A063440O54930N18568r7891k46140k75558l81756j55089p8548j83193k47654
12560E71109k29133J6273k9459p6906K14116N02394J80685m3538j32299K6444
12550I99686m1023j16826j33102j7900K0266k4721l76611m34933j7078J9826k01355
12539c23771p9245L67059L23577k36226j97418K74224O85783K74473q2135l05361
12529G00960l14731J69443M86512P1326O3146P7319k88220j36284j13279L3430
12519G49622K33063K75542R3590j86624l19615j96062L18637K66044l53225l7785
12509H43187N1821j46634j46133l05657r3794j7101L9083L29044q193m40866l46943
12498b42186n08011p0769N64889O88361M12634M2281j00406o8672n0924r0291
$$ plain form
12570 1063440 1718370 2236938 2139047 1892907 1617349 1235593 1080504 1001956 818763 571109
12560 571109 341976 358249 328790 251884 466000 968394 1149079 1105541 973242 999686
12550 999686 958663 841837 708735 690835 711101 686380 309769 -125164 -142242 -122416 -323771
12539 -323771 -403016 -35957 287620 51394 -146024 128200 813983 1088456 1006321 700960
12529 700960 386229 555672 1042184 1113510 1176656 1253975 965755 829471 716192 749622
12519 749622 982685 1258227 1351817 1165193 845578 649516 968153 1234197 880972 843187
12509 843187 895008 748374 602241 296584 202790 185689 224772 553816 545623 104757 -242186
12498 -242186 -750197 -820966 -256077 432284 844918 887199 786793 718121 667197 576906
12488E76906k16902k80690k83158p7811L70403l0691L719O7699k18611n8370J57007
12477I501J20930J68865j5892n2520O3608l01229k18524k2848J1236K45780j21850
12466a12943j9546O829K33941K59014J48047K29347O1743O3170J42785J06797
12456A119184J59325j22649l01915k75467k85243J02371L99987l06998j17247
12447C71348N24087p3024k85476k04366j72788m6296j80895o5221J52828J44089
12437A64286K01243k67875n11132j60584M88658M32922m2551K9502n9381r2814
12427A82274l77380p9479M06760K64162L41981N74441P9657l15499j86999L81462
12417A271380J54230j35904l02127l36304P1185j98952k24626j93832L3664N75802
$$ plain form
12488 576906 360004 79314 -203844 -281655 88748 58057 61776 129475 -89136 -147506 9501
12477 9501 130431 299296 283404 230884 294492 -6737 -225261 -248109 -236873 8907 -112943
12466 -112943 -132489 -125660 108281 367295 515342 744689 806432 869602 1012387 1119184
12456 1119184 1278509 1155860 853945 578478 293235 395606 795593 488595 371348
12447 371348 895435 822411 536935 332569 159781 113485 -67410 -132631 20197 164286
12437 164286 365529 97654 -413478 -574062 -85404 347518 304967 334469 275088 182274
12427 182274 -195106 -274585 132175 396337 738318 1312759 1392416 1076917 889918 1271380
12417 1271380 1425610 1289706 987579 651275 722460 523508 298882 105050 138714 714516
12407G14516L14280m82073o04061k78087K38714M81845K88612K68885M30847p0516
12397A302962n05973m77364k02064j45281l86971j25821K33002N66745M07877
12388F67112J30489J15772k00650k90887k70896n54168l280O52773M25312k81155
12378C90422m53039P0998j29982J00495M18229P7643k44601m80832M6651R0117
12368a13899L5182m2598m18660p3298L21950K45600K39930J72065j43804J05278
12358C27746j0350J2638J10176K66862J97870k27096R3651j36139n65638o54296
12348e84576m06942J9886K81214L44000M25114M20615L51721L61217k09172k65822
12338G37255l32550l37851k26188j66066m6685K26765M44587K7123m86192k78588
$$ plain form
12407 714516 1028796 546723 -57338 -335425 -96711 385134 673746 942631 1373478 1302962
12397 1302962 796989 319625 117561 -27720 -414691 -540512 -307510 259235 667112
12388 667112 797601 913373 712723 421836 150940 -403228 -406508 246265 671577 390422
12378 390422 -62617 8381 -121601 -21106 397123 474766 230165 -250667 -204016 -113899
12368 -113899 -78717 -121315 -539975 -613273 -291323 -45723 194207 366272 222468 327746
12358 327746 317396 330034 440210 707072 904942 677846 771497 635358 69720 -584576
12348 -584576 -991518 -971632 -690418 -346418 78696 499311 851032 1212249 1003077 737255
12338 737255 404705 66854 -159334 -325400 -372085 -145320 299267 326390 -159802 -438390
12328d38390J17776J20412j10649j95833R750K34941K27319L20648J93042l04337
12318A74679k14105j59587k73469N2027N5476n1110L07162L95233q3994l91736
12308a89424J75353J27660p9753r946m8419P0489j2193o721j72350k1957p2194
12297b39455j83840R4678K93620N13547L44107j43538k73809m31658j62420J3703
12287a75065n0991m0093J21420K48104J85217R0188L16087K93248n5486l86223
12277E46406j21092J55454K62896J94349J11149O9879k99703n84251k22275N79973
12267F92785J49702o35033l66214l68604k87938l22613o1647L67899M09508l00296
12257g22451m56972K13121O18013N34477K22601j19841l58103K61451J19700m81036
$$ plain form
12328 -438390 -320614 -200202 -310851 -506684 -496934 -261993 -34674 285974 479016 174679
12318 174679 -39426 -199013 -472482 -420455 -364979 -416089 -108927 286306 202312 -189424
12308 -189424 -14071 113589 33836 23890 -24529 45960 33767 27046 -145304 -167261 -239455
12297 -239455 -423295 -328617 -34997 478550 822657 679119 405310 -26348 -188768 -175065
12287 -175065 -226056 -266149 -144729 103375 288592 378780 694867 988115 932629 546406
12277 546406 425314 580768 843664 1038013 1149162 1219041 919338 335087 112812 692785
12267 692785 842487 207454 -158760 -527364 -815302 -1137915 -1199562 -831663 -422155 -722451
12257 -722451 -1179423 -966302 -348289 186188 408789 288948 -69155 192296 311996 -169040
12247a69040n54314M4947K57824J16663J43896M73211K57254o2035j61898J03007
12237D49515k1527M7864J62873O03704L91658q8117l60858l61419j29253m82984
12227B11456j57159q04m66019l31634J62896L83119R4680J92397M63668M32644
12217I85244K24561j59767j73352o375R3275j31703q0942R0450k52101m92454
12207I6836o8007N2971J02059Q2539M4189K84689J58650k72393K6699K85017k46916
12196E46333n14876J86586M22956n9024k53868J81680M4019l83279k54465j48624
12186b32562j97038n7430J19367j12918j0675M3041J4249Q9523j10010j61558
12176f16011K81057M94088K3784o84190m63329K44556M36614J83943m59114l76019
$$ plain form
12247 -169040 -723354 -678407 -420583 -303920 -160024 313187 570441 508406 346508 449515
12237 449515 427988 475852 638725 1242429 1634087 1545970 1185112 823693 694440 211456
12227 211456 54297 53493 -412526 -744160 -581264 -198145 -103465 88932 552600 985244
12217 985244 1209805 1050038 876686 870311 963586 831883 750941 841391 589290 96836
12207 96836 28829 81800 183859 266398 310587 595276 753926 481533 508232 793249 546333
12196 546333 31457 218043 640999 581975 328107 509787 553806 170527 -83938 -232562
12186 -232562 -429600 -487030 -367663 -480581 -491256 -448215 -433966 -344443 -454453 -616011
12176 -616011 -334954 159134 182918 -501272 -964601 -720045 -283431 -99488 -558602 -934621
12166i34621J70856L59432j94447m14096R1944Q09866P49626J29784l06335l27691
12156A34318j1051N4971k54110q5925k1753l0514K07380J10030l53759k63786
12146e14199j52992o5510j9871j42893j6059k46415j77444J52071K67609K12905
12136g02798m4408o9241j86801j50228L13222L78927p7131n14585o38352l463
12126a694858O18052O10637O58019M89655K19385j00087r0301M3847J71117J4128
12116I39594k66873k1180m51016l40862J57607K47857N1825j17490J26839R6609
12106D22910J36750l79525n36403k30879P3090K98234J4583Q1682J91740K34415
12096C06597K7063m35945n67528q65260k75681M32056L56914M70233P42885M63994
$$ plain form
12166 -934621 -763765 -404333 -598780 -1012876 -920932 -111066 638560 768344 462009 134318
12156 134318 123267 178238 -75872 -161797 -183550 -214064 -6684 103346 -250413 -514199
12146 -514199 -667191 -732701 -752572 -895465 -911524 -1157939 -1335383 -1183312 -915703 -702798
12136 -702798 -747206 -816447 -1003248 -1153476 -840254 -461327 -538458 -1053043 -1691395 -1694858
12126 -1694858 -1076806 -466169 191850 681505 900890 800803 710502 754349 925466 939594
12116 939594 672721 651541 200525 -140337 17270 265127 316952 199462 326301 422910
12106 422910 559660 180135 -356268 -587147 -514057 -215823 -201240 -119558 72182 306597
12096 306597 333660 -102285 -669813 -1535073 -1810754 -1378698 -1021784 -551551 191334 655328
12086F55328N5297L2654l0051R0620k59985M7060K88422K32082L34556j687n3064
12075A391232k32002n81027n37454j3874K05675N0998j49712K5059J61105L23387
12065F43387L56472J55796r6396N9601J25604j36768J798n8363l44499m97488
12055B09144l08814k5006l9755j53419N9286j45145j22882K25359K07249j00058
12045a94041J55742J52623N1194N00444N51495K87446l325j40317l4929R2594
12035A418926R284R899N8573j53434j38399K60087J25454l88201n30029K7615
12025F99775K522j53191l47550m02720k78776J64023L25153N4285j94196l5791
12015a66466k0534n0598p9404k6149J65547N14143N31744K12833k32830j35835
$$ plain form
12086 655328 710625 743279 713228 803848 543863 590923 879345 1111427 1445983 1444296 1391232
12075 1391232 1159230 578203 40749 26875 232550 283548 133836 158895 320000 643387
12065 643387 999859 1155655 1059259 1118860 1244464 1107696 1109494 1051131 706632 209144
12055 209144 -99670 -124676 -164431 -317850 -258564 -403709 -526591 -301232 -93983 -194041
12045 -194041 -38299 114324 165518 665962 1217457 1504903 1501578 1361261 1326332 1418926
12035 1418926 1428210 1438109 1496682 1343248 1204849 1464936 1590390 1202189 672160 699775
12025 699775 702297 549106 201556 -201164 -479940 -315917 9236 63521 -130675 -166466
12015 -166466 -187000 -237598 -317002 -343151 -177604 336539 868283 1081116 848286 712451
12005G12451k91287n38159j07265J37314m84979j47543L54803J67808n7500l96804
11995f51161l73870j59379M54386P72419L66268R7932k2544J67887J60480m45071
11985C67347k13553m9279k19084K23105n2151j60170M83652K39001l02566L2721
11975C49023L4898M5595N79394M43938j75905n37070n07983l52725j15086j47463
11965c83384k99635l28621k09516M5417L78601J97152l85395l39228J54866L61725
11955h08018K95888M49171K50972q6191J17342N12347O474l88966j61652j25648
11945F1719l79579L90834O77226R2519J75703P7690q8727p3985p33266m67806
11935b67672j8525j10319j12713l40430p6667p405m8339Q5005M5774j29943J87459
$$ plain form
12005 712451 421164 -116995 -224260 -86946 -571925 -719468 -364665 -196857 -254357 -651161
11995 -651161 -1025031 -1184410 -730024 42395 408663 506595 484051 651938 812418 367347
11985 367347 153794 104515 -114569 108536 56385 -103785 379867 618868 316302 349023
11975 349023 383921 429516 1008910 1452848 1276943 739873 231890 -120835 -235921 -383384
11965 -383384 -683019 -1011640 -1221156 -1175739 -797138 -599986 -985381 -1324609 -1169743 -808018
11955 -808018 -512130 -62959 188013 101822 219164 731511 737985 349019 187367 61719
11945 61719 -317860 72974 750200 842719 1018422 1096112 1007385 933400 200134 -267672
11935 -267672 -286197 -396516 -509229 -849659 -926326 -933731 -982070 -897065 -851291 -981234 -793775
11924g93775Q1853L4018j5930n0111j0765r4515J50131L93053K11040l85975l19406
11913h00382K04129K3089J7054M1598j85032l6830L68681M76148L97051Q8375
11903E93881j29360j32699k79505j57797K26819K80200K2538q4757K09450J8956
11893E67726m55504m93738k52738l0018J30649L01466M9492L7596J99284J95150
11883B49365O0606P001O3248K68357R3712o1531Q0362L14953n1939l19419n2005
11872F52710k80872N9988M0605k39503n6079K69884K13792M04991P6936l43320
11862G99132Q970N65996K70309l36502j54165k11057m40079j00198L8551L14535
11852G55492K25578o0394K61736K75936k72302k08252J15558K9308k03365j65183
$$ plain form
11924 -793775 -711922 -677904 -693834 -743945 -754710 -849225 -699094 -306041 -95001 -480976 -800382
11913 -800382 -596253 -573164 -556110 -514512 -699544 -736374 -367693 108455 505506 593881
11903 593881 464521 331822 52317 -105480 121339 401539 424077 339320 548770 567726
11893 567726 112222 -381516 -634254 -664272 -533623 -232157 -182665 -145069 54215 249365
11883 249365 309971 316972 380220 648577 742289 680758 761120 1076073 1024134 704715 652710
11872 652710 371838 431826 472431 232928 176849 446733 660525 1065516 1142452 799132
11862 799132 808102 1374098 1644407 1307905 1153740 942683 502604 402406 440957 755492
11852 755492 981070 920676 1182412 1458348 1186046 977794 1093352 1122660 919295 754112
11842G54112k3798p252L50747K53959l94090p12822n57204j21991M52548L96960
11832C91169R7063k47670j79853k13784k80808Q1741p6893Q9710L80491J52976
11822A94142r4417k5744p0089l5551K6271k3811M66138J15857r0858J57341j0699
11811F08580k11100J20764J22263n38820q7650J73200O4970L09334J80443n3687
11801F88297j19059n83603l83570j56607j40378J95720N39510k11498l35057J8965
11791d87280M74455L64766m96138m43659J35289j3640K67260L42469N18762N30199
11781A192483L19132n8917l70318K354q5569K85927L92185K46250Q50401J417461
11771D191389O72984o76633r07502n81569k58328M48276J063554J787097J960069
$$ plain form
11842 754112 730314 723062 1073809 1327768 933678 220856 -336348 -458339 -5791 391169
11832 391169 488232 240562 60709 -153075 -433883 -352142 -429035 -339325 41166 194142
11822 194142 99725 73981 3892 -31659 -5388 -29199 436939 552796 461938 619279 608580
11811 608580 397480 518244 640507 101687 14037 187237 252207 561541 741984 688297
11801 688297 569238 -14365 -397935 -554542 -694920 -499200 40310 -171188 -506245 -487280
11791 -487280 -12825 351941 -144197 -587856 -452567 -466207 -198947 143522 662284 1192483
11781 1192483 1511615 1452698 1082380 1084734 999165 1285092 1677277 1923527 2773928 4191389
11771 4191389 4864373 4187740 3280238 2698669 2440341 2888617 3952171 5739268 7699337
11762G699337J39433j622932j293621p17090m80408J35636L58007L66105N3271
11753D637738q26292j127335J09624K11296o16469k21838k60278m59003p7205
11744A370238j06862l04591k93733l10900K13147J72586M27116M92679l4829k07211
11734A417640j11118j29051k03583j7378J09303l05802k17051Q2912M85997Q3704
11724A195573m36326k37718J74580K26973N16150K10150r8446j26226l62992P7915
11714A139633N27076L97558r7545o8996N9952k11419l28327k64229j14092J21562
11704A161173P8210K48388K84465M44269N97497N13775N68898R17490J211438
11695F025603J716149J985459K078595K332410L239530M521342O348653Q384952
$$ plain form
11762 7699337 7838770 6215838 4922217 4205127 3724719 3860355 4218362 4584467 4637738
11753 4637738 3811446 2684111 2793735 3005031 2388562 2166724 1906446 1447443 1370238
11744 1370238 1263376 958785 665052 354152 567299 739885 1167001 1659680 1624851 1417640
11734 1417640 1306522 1177471 973888 956510 1065813 760011 542960 625872 1111869 1195573
11724 1195573 759247 521529 696109 923082 1439232 1649382 1550936 1424710 1061718 1139633
11714 1139633 1666709 2064267 1966722 1897726 1957678 1746259 1417932 1153703 1039611 1161173
11704 1161173 1239383 1487771 1772236 2216505 2814002 3327777 3896675 4814165 6025603
11695 6025603 7741752 9727211 11805806 14138216 17377746 21899088 28247741 36632693
11687C6632693J2531193J9293004L0234562M3110357L5524524j3653864m4320378
11680A19352091l4535393k1379648j2525847q241919m696410k430825o79803P07481
11672C5569727L125031N500334J0172958J6370673K7438224M0820509L8185289
11665A77182745p774946m3998665l7662262k4573481j5359076j0498530p736811
11658B9578974n687586l723152k788852k721789k488230j221747q34557q24317
11650I288744q33347q95286q94171o85215m63589l70827q97013j033842m49668
11641B765786R2237L88737N9114l89469j26014J66112l59246n27457J173N79490
11631B650463L78280j44393j60165m60936l47954q9092l5930J88648j12286m29515
$$ plain form
11687 36632693 49163886 68456890 98691452 141801809 177326333 163672469 119352091
11680 119352091 84816698 63437050 50911203 42669284 37972874 35542049 34862246 35569727
11672 35569727 38694758 44195092 54368050 70738723 98176947 138997456 177182745
11665 177182745 169407799 125409134 87746872 63173391 47814315 37315785 29578974
11658 29578974 23891388 20168236 17379384 14657595 12169365 10947618 10113061 9288744
11650 9288744 8455397 7560111 6665940 5980725 5517136 5146309 4249296 3215454 2765786
11641 2765786 2858023 3246760 3305874 2916405 2790391 2956503 2597257 2069800 2070973 2650463
11631 2650463 3028743 2884350 2724185 2263249 1915295 1826203 1790273 1978921 1866635 1437120
11621A437120m4345L22307K81493K05420M2475l84358k33538n0740r8607q8614
11611A388613j60781n38355l60000j10443k59474l70861m33348J56131L90959
11602b97559K94087L67385L41633M19017n6336l84931N0593M64573N6937o63217
11592E92182m20517q6120K0468L3214L55032M03577j37197m52047o9641J98290
11582D37241L05395L33175N71626J10001k49640l52487j06921K35283R108j08907
11572A183874M44301M71296j28658p48209j169505l10605M14018K32388n4287
11563C34613n05504m32833N3979J93820J72456L17614M34062K54934M8953L36732
11553A208826J87721J05042j94663p49741m43546k99355J11559K64081k674k16814
$$ plain form
11621 1437120 1392775 1715082 1996575 2201995 2244470 1860112 1626574 1575834 1477227 1388613
11611 1388613 1227832 689477 329477 219034 -40440 -411301 -844649 -688518 -297559
11602 -297559 -3472 363913 705546 1124563 1068227 683296 733889 1198462 1255399 592182
11592 592182 171665 85545 106013 139227 494259 897836 760639 308592 238951 437241
11582 437241 742636 1075811 1647437 1757438 1507798 1155311 1048390 1283673 1292781 1183874
11572 1183874 1628175 2099471 1970813 1222604 53099 -257506 156512 388900 334613
11563 334613 -170891 -603724 -549745 -355925 -183469 134145 568207 823141 872094 1208826
11553 1208826 1396547 1501589 1306926 557185 113639 -185716 -74157 189924 187250 -29564
11543b9564q2816k60613m23836L02628L13585m6372J21811L42055P8636Q7526
11533D03040O04842K77033k55319l70281M53909M55239k96982q19601l18946j10322
11523B2612M32845L58261j07767p8553l22315m17226J39899N19511m39949J5722
11513A23040N21822r0823k33938k36483P9673L85936L71523K85691m1680k59892
11503I04869l24676J03974J05723K8392k38358l60036q0743l0263K98804L51547
11493G59233J85151O4827k13526j27293J48413L9401j07301K4524m9401j88224
11483E35804l47994o07810l09235M3946K07993N19407N49659L50979K50059j32360
11473A060448k26883j55326j60809j2929q7730l60153m17144j67886l3148M18033
$$ plain form
11543 -29564 -112380 -372993 -796829 -494201 -180616 -226988 -105177 236878 315514 403040
11533 403040 1007882 1284915 1029596 659315 1113224 1568463 1271481 451880 132934 22612
11523 22612 455457 813718 705951 627398 305083 -112143 27756 547267 107318 123040
11513 123040 644862 554039 320101 83618 163291 549227 920750 1206441 1164761 904869
11503 904869 580193 684167 789890 818282 579924 219888 139145 108882 407686 759233
11493 759233 944384 1009211 795685 668392 816805 856206 748905 773429 724028 535804
11483 535804 187810 -420000 -729235 -685289 -477296 42111 591770 942749 1192808 1060448
11473 1060448 833565 678239 517430 504501 416771 56618 -360526 -528412 -561560 -143527
11463a43527M64260k78097m50383k80465j82186R7594R17081O95744j68743j43855
11453E27423J10800o8879p558P7796J970k4264n0447J1812j29974k30202j03642
11442A14835K737J88491j0977m643J72063L68606K60703J97968J76086l89907
11432A075962q54002m89376N3714J55205R628J10380J45504J32887P3920r1029
11422C22793j10336j68201K4851j48930k52950N2433K61156K94291J1418l0754
11412B55771M18511L20629m34388k77448J44743j21415J28593J45626k10246k92909
11402G7467L80863L59481j43974j58401j43687l22029J19137R5158j98058j35713
11392f9756m5988J02490N74439L65869m7568m73085k71424M704n3125J49067K99954
$$ plain form
11463 -143527 320733 42636 -407747 -688212 -870398 -772804 144277 840021 671278 527423
11453 527423 638223 569344 561786 639582 641552 617288 566841 578653 448679 218477 114835
11442 114835 117572 306063 295086 290443 462506 831112 1091815 1289783 1465869 1075962
11432 1075962 221960 -267416 -213702 -58497 -48869 61511 207015 339902 413822 322793
11422 322793 212457 44256 69107 -79823 -332773 -280340 -19184 275107 286525 255771
11412 255771 674282 994911 560523 283075 427818 306403 434996 580622 370376 77467
11402 77467 458330 817811 673837 515436 371749 49720 168857 264015 65957 -69756
11392 -69756 -115744 -13254 561185 927054 879486 406401 134977 139681 86556 235623 535577
11381E35577M06192L77496K38078O2257k45112m82397r2506N5438K3172k1790
11371H56405L8695K14475p4488k35845p2012K10972J3190l10343q7217j55225
11361C98607n0599o3940l09069j09354K56474L90580J76400j28354m09510l44230
11351a92995J3413K19650P8024L57466L58037K48432L02951l142n13656m77879
11341C90301r2407o3421Q4979J78366P7075l24719j57173r2847p1892O6943M94678
11330D89883M58840O3750k01458r2200j00573m32279m74967n1224q2586k9571
11320d52385L82041J17414O3958J18650m36508J9288Q48573K12177k97736k74668
11310C00804J67183M25521L33560m7248q56264n39658j45358l92833k74007j47453
$$ plain form
11381 535577 941769 1319265 1557343 1619600 1374488 892091 799585 855023 878195 856405
11371 856405 895100 1109575 1035087 799242 727230 938202 951392 641049 553832 398607
11361 398607 348008 284068 -25001 -134355 122119 512699 689099 560745 151235 -192995
11351 -192995 -179582 40068 118092 475558 833595 1082027 1384978 1381836 868180 390301
11341 390301 297894 234473 319452 497818 574893 250174 93001 154 -71738 -4795 489883
11330 489883 948723 1012473 811015 718815 618242 185963 -289004 -340228 -422814 -452385
11320 -452385 -70344 47070 111028 229678 -206830 -187542 661031 873208 575472 300804
11310 300804 467987 893508 1227068 1179820 323556 -216102 -361460 -754293 -1028300 -1175753
11300a175753J65502N94095M04669J82957Q1311j7075n0156j40194j53949j9308
11290a27901Q0497j10343n07453k89851K42945K93751J24004R7113L18784K63408
11280C84954k4377l63155n10271m63650l75666p5588J2583J54680q9158J04563
11270a245085L91219K89558K04453K6866K59546K4202k70825k4027N2108J15356
11260a76629R9832j98155j37097K2350J28436J68130j95244m61027l80913O5709
11250a064608M47809K68905L12011L43430N6617J94335M01295K12879J57976m86791
11240H43858n44089j52938N0475L12163K28376m76587o29214Q5520K91258J59996
11230A68818Q2381J05339p0397N2791L25585Q1079J26436K02012k08694k59368
$$ plain form
11300 -1175753 -1010251 -416156 -11487 171470 252781 235706 185550 45356 -108593 -127901
11290 -127901 -47404 -157747 -665200 -955051 -712106 -418355 -294351 -197238 121546 384954
11280 384954 360577 -2578 -512849 -976499 -1352165 -1427753 -1415170 -1260490 -1349648 -1245085
11270 -1245085 -853866 -564308 -359855 -332989 -73443 -49241 -320066 -344093 -291985 -176629
11260 -176629 -76797 -274952 -412049 -389699 -261263 -93133 -288377 -749404 -1130317 -1064608
11250 -1064608 -616799 -347894 -35883 307547 364164 558499 959794 1172673 1330649 843858
11240 843858 299769 146831 197306 509469 737845 261258 -367956 -282436 8822 168818
11230 168818 251199 356538 286141 338932 664517 745596 872032 1074044 865350 605982
11220F05982n93683n35496j91546K10643K65865r1140j37107N593L58892J70737
11210F8740l70419m67750j23130O6882j27574k14191j17083J10329M4521J51341
11200i78334J78711j02737k22749j80433k47035R0113M92438R7871j17259j09294
11190a098708l3466J29468J93303L52618L69912Q8689j94425l64388k39040l05964
11180a102001j86977L27802M07038K62425M37559J40931P2804j38722l77906k83553
11170d40600k32795K37566K44720J07819O8864L11027J2984j35596r27j38828
11160C4234l37176l83521m52811k2567L66366R0936K11672K94143R9462j8073
11150a17335J32694R1452J25069R2216L8857o2414J85415P4383k08756m22675
$$ plain form
11220 605982 12299 -523197 -714743 -504100 -238235 -329375 -466482 -460889 -101997 68740
11210 68740 -301679 -769429 -892559 -825677 -953251 -1167442 -1284525 -1174196 -1129675 -978334
11200 -978334 -799623 -902360 -1125109 -1305542 -1552577 -1462464 -970026 -872155 -989414 -1098708
11190 -1098708 -1132174 -1002706 -809403 -456785 -86873 1816 -192609 -556997 -796037 -1102001
11180 -1102001 -1288978 -961176 -554138 -291713 145846 286777 359581 220859 -157047 -440600
11170 -440600 -673395 -435829 -191109 -83290 -14426 296601 309585 173989 173062 34234
11160 34234 -302942 -686463 -1139274 -1161841 -795475 -704539 -492867 -198724 -99262 -117335
11150 -117335 15359 106811 231880 324096 362953 300539 485954 560337 351581 -71094
11140g1094k34025Q3512K82008M51371L10330j26805l9819k10940l14217j00279
11130C0042j37320L77314K05062K79974R5853l407l9294L4633j12060k4324n3529
11119F52944k34270m36600O1608P93202K43229k23256k79006k53931l64527J37436
11109I6829L43513n24118k29466L76373N61905J93716k43047K09155K32143l24353
11099F92650o21120m70796o0671N41590O93640o7828l55607k35069k43645J86134
11089E9278j1310k42281M9194K86139k8906m02495l26543n801K09558N14910O32546
11078G34289J9034k12956m26486k76248J93703J7257k42128m42701l90106r3358
11068a119700q3322j12330P6612J85521J57874N3224K47830L89709M34256N57732
$$ plain form
11140 -71094 -305119 -221607 60401 511772 822102 695297 655478 444538 130321 30042
11130 30042 -107278 270036 475098 755072 850925 847518 808224 842857 730797 706473 652944
11119 652944 418674 -17926 43682 836884 1080113 856857 577851 323920 -40607 96829
11109 96829 440342 -83776 -313242 63131 625036 818752 575705 784860 1017003 692650
11099 692650 71530 -399266 -459937 81653 775293 707465 351858 116789 -126856 59278
11089 59278 47968 -194313 -145119 141020 112114 -290381 -616924 -622725 -413167 101743 734289
11078 734289 753323 540367 113881 -162367 31336 48593 -193535 -636236 -1026342 -1119700
11068 -1119700 -1203022 -1315352 -1238740 -1053219 -895345 -842121 -594291 -204582 229674 787406
11058G87406j39307m47311m1803L61579j28328o65622j55933r1797j69944J20840
11048e70220K12467n1890j02151L91484P85461O12690p8919m03205k82310j72787
11038C40620k07887k09292j79741R6143L89860O0442j60510j60089J65165N9691
11028A94402m1053p7522K43738K43595p3687l00145J18895O47629P5946n57096
11018D74702l22099j37469l2626j60900R7877j58025k51692n7145J71472L29211
11008d6694K24933J31520K55639L4988l6082J79222m9835j71446O8176J72197
10998G62618l12455n03216O7700K1665N1154J72175j23186l8871n5500k73894
10988b31810J85631N82814p8462o56785q47329p19397M9355J64225N7347J11770
$$ plain form
11058 787406 648099 200788 158985 520564 392236 -273386 -429319 -521116 -691060 -570220
11048 -570220 -357753 -409643 -511794 -120310 665151 1277841 1198922 795717 513407 340620
11038 340620 132733 -76559 -256300 -160157 229703 290145 129635 -30454 134711 194402
11028 194402 153349 75827 319565 563160 489473 189328 308223 955852 1031798 474702
11018 474702 152603 15134 -17492 -178392 -80515 -238540 -490232 -547377 -375905 -46694
11008 -46694 178239 309759 565398 600386 564304 743526 693691 522245 590421 762618
10998 762618 450163 -53053 14647 36312 87466 259641 136455 97584 42084 -231810
10988 -231810 -46179 536635 458173 -198612 -1045941 -1765338 -1715983 -1551758 -1494411 -1382641
10978a382641L14434O95008N75164M91711N0111m08694n20113m91482l23884o2371
10968a062757M47706P57099M90674O00754M43484k50065p03647l52444j28964
10959B41840L84211K9930k56709l0108J16844K22470j09699k65251J83906J83914
10949G01348j01303p3300k95056R7851J54242k33752k54964j87950K4418K15314
10939D6848o6020j20626R3970j34996j08375J52260J09381j14760k20745k86365
10929f49428k99628l30383k05782M1269R6607J10942J6579L44488K23112l2277
10919f84501K57881M46874P1786j66898j35768p7202k32170j68889j014k82793
10909i72694m2434M01191N15411L32805L05853K66228l679m94417m82815q2404
$$ plain form
10978 -1382641 -1068207 -373199 201965 693676 743787 335093 -185020 -676502 -1000386 -1062757
10968 -1062757 -615051 142048 632722 1233476 1676960 1426895 723248 370804 241840
10959 241840 626051 655981 399272 369164 486008 708478 598779 333528 517434 701348
10949 701348 600045 526745 231689 329540 483782 250030 -4934 -192884 -168466 46848
10939 46848 -19172 -139798 -45828 -180824 -289199 -136939 -27558 -142318 -363063 -649428
10929 -649428 -949056 -1279439 -1485221 -1443952 -1347345 -1236403 -1219824 -875336 -652224 -684501
10919 -684501 -426620 20254 92040 -74858 -210626 -287828 -519998 -688887 -689901 -972694
10909 -972694 -1015128 -613937 -98526 234279 540132 806360 802681 308264 -174551 -256955
10899b56955k31520J24378M28328J30805o9049k75372L3452M97934j03942n69739
10889b91680k15723J27163L34398N30318L51373l78336n14350O0455j08135k35586
10879c40103k18120J14892P13952K42497m07450m32180m5409j28582n0713J38009
10869d13207K81505J66977o5017M11807M14861j42262j87505k6428k29312k06371
10859E048j87754r6905K20929J91604L13411O9196k89580m28854k41105j47770
10849e91780k2417L18760M53597L63178M2718Q2787j10618j40430Q2122K99653
10839G77570K07103J6185L2890m22534n20542k09811p6211P0541K060l5742N08200
10828C49709L16669n19311m99170K1682O39743J91220k89742J94169J11082l38236
$$ plain form
10899 -256955 -488475 -364097 64231 195036 125987 -149385 -115933 382001 278059 -291680
10889 -291680 -507403 -380240 -45842 484476 835849 457513 -56837 3618 -104517 -340103
10879 -340103 -558223 -443331 270621 513118 105668 -326512 -371921 -500503 -551216 -413207
10869 -413207 -131702 35275 -29742 382065 796926 654664 467159 440731 211419 5048
10859 5048 -182706 -279611 -58682 132922 446333 515529 225949 -202905 -444010 -591780
10849 -591780 -614197 -295437 158160 521338 564056 646843 536225 395795 477917 777570
10839 777570 984673 1000858 1033748 611214 90672 -119139 -195350 -124809 -122749 -158491 349709
10828 349709 666378 147067 -352103 -330421 309322 500542 210800 404969 516051 177815
10818A77815l07219p0184L11520L70165j8081j55721R2924O9292k46125j46126
10808G8260L36892O05434n3514r4164j10556l11863l98467m6501O35m10256l38720
10797g42820K00871N62084K82530j53702j76413K12776J49809m41722n65093J09447
10787e62233K81747o8257Q7552j7565m7060L42020L48465K38348K08268p9381
10777G31904k35691l96531j84643M82977L24909J07968J50266J40957k67293j63967
10767F90856j3040k77143k35643J29493L15466K907M5824j8081Q0781O248m09161
10756C18507j26289k51536m74901k44646L11462N21986J76686Q9388n0252k0616
10746B49789j30639l71723o98863j09692N03021J43197q1276K37430K05539k6418
$$ plain form
10818 177815 -129404 -199588 111932 482097 464016 308295 401219 470511 224386 78260
10808 78260 415152 1020586 967072 872908 762352 450489 52022 5521 6156 -404100 -742820
10797 -742820 -541949 20135 302665 148963 -27450 185326 335135 -106587 -671680 -562233
10787 -562233 -280486 -348743 -261191 -278756 -325816 16204 364669 603017 811285 731904
10777 731904 496213 99682 -84961 398016 722925 830893 981159 1122116 854823 690856
10767 690856 677816 400673 165030 294523 609989 612896 658720 640639 721420 727668 318507
10756 318507 192218 -59318 -534219 -778865 -467403 54583 231269 320657 270405 249789
10746 249789 119150 -252573 -951436 -1061128 -558107 -414910 -496186 -258756 -53217 -79635
10736g9635M5857k20558m44188K13935K42736Q8070j84146R9631K19576k2313
10726d1035R7671j59067m2225M25230N21100O51940J44495m61088k67226k16938
10716F52857K78715m307n07817l24173N6749R1627k0758r8525o0333k04815k35654
10705c76434k28252P5000L64037J47224M51561O60121K49130j10914l57638l76857
10695D96978l46473j89526J8614K19707n1028n47467m77757J52224Q30581P85320
10685H91173n6997k79426J88687K03114K72336j44132q36684p25458j90681J94118
10675d83950K98086l7950m2515J12617J6088J76761J55904O4019j49387k52345
10665a42672K79864K69719j10931K49274M82689J3844k14993j32942k91524l00837
$$ plain form
10736 -79635 -33778 -254336 -698524 -484589 -241853 -153783 -337929 -238298 -18722 -41035
10726 -41035 56636 -102431 -144656 280574 801674 1453614 1598109 1137021 869795 652857
10716 652857 931572 927265 419448 95275 152024 243651 222893 124368 64035 -140780 -376434
10705 -376434 -604686 -529686 -165649 -18425 433136 1093257 1342387 1231473 873835 496978
10695 496978 150505 -39021 -20407 199300 148272 -399195 -876952 -724728 105853 891173
10685 891173 834176 554750 743437 946551 1218887 1074755 238071 -487387 -678068 -483950
10675 -483950 -185864 -223814 -266329 -153712 -137624 39137 195041 259060 109673 -142672
10665 -142672 137192 406911 295980 545254 1027943 1041787 826794 693852 402328 101491
10655A01491l2413n50J88791L64032R4341J01689m337m66888n34723j19601J02678
10644b05490J27778j87004M0527m4893O0332O4307k81119Q4377K40506M5260j05669
10633a61088J69631J47329k45549k52043L87063j78063l83611J26432L92503K64785
10623B67389k82296k93938l6641k15416k63772O04430O18149J69020J40523N0060
10613G57508l2438J64877k15060n46564k63566j24411K08833L15634K90141q9759
10603D65195M9523M92856K13819k77465n70205n41916k89873j52069J72620K60546
10593a76969K39608J18983k21780k70685L14845M7077l57980k39620J51605L73907
10583b1009J97469J02401K73615N59609r4985m71975j09582O0650l41907m09831
$$ plain form
10655 101491 69078 68528 257319 621351 715692 817381 813044 346156 -188567 -308168 -205490
10644 -205490 -77712 -264716 -224189 -269082 -208750 -144443 -425562 -341185 -100679 -55419 -161088
10633 -161088 8543 155872 -89677 -341720 45343 -132720 -516331 -389899 2604 267389
10623 267389 -14907 -308845 -345486 -560902 -824674 -220244 397905 566925 707448 757508
10613 757508 725070 889947 674887 128323 -135243 -259654 -50821 264813 554954 465195
10603 465195 514718 1007574 1221393 943928 373723 -168193 -458066 -610135 -437515 -176969
10593 -176969 62639 181622 -40158 -310843 4002 51079 -306901 -546521 -394916 -21009
10583 -21009 176460 278861 552476 1112085 1017100 545125 435543 496193 154286 -255545
10573b55545l0989j82173m45029k5616M66981J10486m24077m04144O3289O62884
10563d63933N03451k32599q00148m55962P7242O70760J95648k65333j92014k32644
10553a195532J67941M30270J39303m9589j26610P0868O2105k11088N5790L70448
10543b86094L12569j92908o14702k34110O9713J83422R0242J54076Q8120j24769
10533e54441k56762l76682K52506Q53870J99937j70409k03228j33974l00707l13533
10523a003423k3484Q3168J72967J10733K31162J01532K34601j00108n44849J00667
10513f37034N97628M37981l8968k88299k12535j45457K12703K77682O1233l34847
10503f9913o21703n28865J98414M74821K28506P5101j45096k42851m2797O4492
$$ plain form
10573 -255545 -286534 -468707 -913736 -939352 -472371 -361885 -785962 -1190106 -1126817 -463933
10563 -463933 39518 -193081 -993229 -1449191 -1371949 -701189 -505541 -770874 -962888 -1195532
10553 -1195532 -1027591 -597321 -458018 -507607 -634217 -563349 -501244 -712332 -656542 -286094
10543 -286094 26475 -166433 -781135 -1015245 -945532 -762110 -671868 -517792 -429672 -554441
10533 -554441 -811203 -1187885 -935379 -81509 118428 -51981 -255209 -389183 -689890 -1003423
10523 -1003423 -1026907 -943739 -770772 -660039 -428877 -327345 -92744 -192852 -737701 -637034
10513 -637034 -39406 398575 359607 71308 -141227 -286684 -73981 203701 264934 -69913
10503 -69913 -691616 -1220481 -1022067 -547246 -318740 -243639 -388735 -631586 -674383 -609891
10493f09891M0462O2930K23946K81596Q0724m47461m13693J68219J161L7386P7008
10482d97613J68558L33864K47112K55912n0956l40200J47252L14616N4561p0695
10472E62411p9858k0162K725o1674M1588n5639k42478l02636K21209N28183M27858
10461A021527J65339j5273n57269l79970j04026n56909m61206o15929k57137L82286
10451a378567K13733K14285O22716K09947j49824L9869N3440k08765J59806O56300
10441D32940O00180Q5874k33903k52784m21388o25851l03820k18150R6999M45055
10431c94848m1993k92529r2973J79264N88240J20347k48650K2833J67319p0820
10421f3810j21986k69806k5288N49687j16241L8595P46798L09962l07678l83083
$$ plain form
10493 -609891 -569429 -506499 -282553 -957 79767 -367694 -781387 -613168 -612007 -574621 -497613
10482 -497613 -329055 4809 251921 507833 456877 116677 263929 578545 633106 562411
10472 562411 482553 462391 465116 403442 445030 389391 146913 -155723 65486 593669 1021527
10461 1021527 1186866 1171593 614324 234354 130328 -426581 -887787 -1503716 -1760853 -1378567
10451 -1378567 -1164834 -950549 -327833 -117886 -267710 -227841 -174401 -383166 -223360 432940
10441 432940 1033120 1118994 885091 632307 210919 -414932 -718752 -936902 -839903 -394848
10431 -394848 -436841 -729370 -822343 -643079 -54839 65508 -183142 -160309 7010 -63810
10421 -63810 -185796 -455602 -480890 68797 -47444 -8849 737949 1047911 740233 357150
10411C57150J40132P3637O5538L18924K91772J83996K9966m8665j50524j98574
10401A063352k98556k93303L00905M21135n0265m56363n40119l04439k20859j13261
10391d91773M18006M52996K18783m21269m61325J25933J86542M5833K32102K63165
10381E68993k25700l18013l21374m592L79693K22756R6673K30363K79557J76501
10371A084857j09044j6569l83805j87773j78625l60546l26589j48141M27923K01273
10361B961k03992j8181J86918L93733L27915K7843K48753L07171k49616m42125
10351E81380k51614j68662J10192J32062j95823J08928K29951j74041k60180L5923
10341A48116R2148r3164k35402m92170k91823Q9808j49304k50202L59774P79804
$$ plain form
10411 357150 497282 570919 636457 955381 1247153 1431149 1461115 1412450 1261926 1063352
10401 1063352 764796 471493 772398 1193533 1143268 686905 146786 -157653 -378512 -491773
10391 -491773 -73767 379229 598012 176743 -284582 -158649 27893 73726 305828 568993
10381 568993 343293 25280 -296094 -300686 79007 301763 398436 628799 908356 1084857
10371 1084857 975813 959244 575439 387666 209041 -151505 -478094 -626235 -198312 2961
10361 2961 -201031 -219212 -32294 361439 689354 717197 965950 1273121 1023505 581380
10351 581380 329766 161104 271296 403358 207535 316463 546414 372373 112193 148116
10341 148116 240264 147100 -88302 -580472 -872295 -782487 -931791 -1181993 -822219 -42415
10331d2415M14790j1324l01300k19622m9283j06944k58967P9516O45734K62581
10321D12766j70463q2337J60706K3821r2868q4556J99428K33566j32980k15424
10311B51659k47998R0279M86408J92047j83591l43023o34562m12301K38361O69534
10301A06813K47269j58254N4026j03214l28503l62236j19180K1383K10160N04690
10291G2954J02120j65320o3269K3274J29783j5523r4310J08301O0497L66645M22568
10280I47720L66777J51512l3909k31507k81382O7111O5759k00648j16062j51551
10270E83820j60018O1219N15113K66599j5475k8428o99468p00516l14596K8593
10260d63157N83822N43237j91386o86712m33165j88643L06126L24443L0008M7731
$$ plain form
10331 -42415 372375 361051 59751 -159871 -209154 -316098 -575065 -495549 150185 412766
10321 412766 242303 159966 320672 344493 251625 167069 366497 600063 467083 251659
10311 251659 3661 93940 580348 772395 588804 245781 -388781 -801082 -562721 106813
10301 106813 354082 195828 249854 146640 -181863 -544099 -663279 -641896 -431736 72954
10291 72954 175074 9754 -53515 -30241 99542 84019 -10291 98010 158507 525152 947720
10280 947720 1314497 1466009 1432100 1200593 919211 986322 1052081 851433 735371 583820
10270 583820 423802 485021 1000134 1266733 1251258 1222830 523362 -177154 -491750 -463157
10260 -463157 120665 663902 472516 -214196 -647361 -836004 -529878 -205435 -175427 -127696
10250a27696K5829r084K55551J58560l8718l70215j57265m922l33380j95715K39945
10239e57110N30421K13816J08370N41431K86680m0392j44484j19693J75324K37021
10229A231384n7601m20828O4590o0794o03818l47080J17929J24393o977P3200
10219A14398M64847J54335O8024l25722k92793j01501J40127K63911M57662J03079
10209A046367m92313m68568J60611L7531N2509J36523L72111n9808o00282r4416
10199I0265P0801l04724j36628n5170L37385N81964O86897J67331o08780m35612
10189C93729o07449j78885M06440K30291l86733k65272N0644K12020J45520j51512
10179a51207k36841k5822j09108m08038j27565k85522J48326N35088L49412J14515
$$ plain form
10250 -127696 -101867 -110951 144600 303160 264442 -105773 -263038 -267960 -601340 -797055 -557110
10239 -557110 -26689 187127 295497 836928 1123608 1083216 938732 819039 994363 1231384
10229 1231384 1173783 752955 817545 756751 152933 -194147 -76218 48175 41198 114398
10219 114398 579245 733580 801604 475882 183089 81588 221715 485626 943288 1046367
10209 1046367 554054 85486 246097 283628 336137 472660 844771 784963 184681 90265
10199 90265 161066 -143658 -280286 -335456 1929 583893 1270790 1438121 829341 393729
10189 393729 -213720 -392605 13835 244126 -142607 -407879 -357235 -145215 305 -151207
10179 -151207 -388048 -413870 -522978 -931016 -1058581 -1344103 -1195777 -660689 -311277 -196762
10169a96762q6612k06091k52496J2903J27702L12933M05261p977n20478n76499
10159i88116n00546k07996J58649M96961N90091L12090J05680K68403J38554j65593
10149B08177k83266l55327N6834K26225J09243Q2470q6902M070K4480K04561J80732
10138C71297q8827l00715j02304n5475J24790j89862m22787l25784k17821J8953
10128a188535M28600j5655l59941R63J48280L69599L23911J3086L02513N19540
10118E42361Q6565J35944N66293L40051l5123k2299l87173m25715r7550J51121
10108H54475j48484l48073o040k0921l78848l18345j47945q0379J25030J16251
10098c53279j79203N1080J1252j19367N2649N13509K92470k12453n46436k63810
$$ plain form
10169 -196762 -283374 -489465 -741961 -729058 -601356 -288423 116838 108861 -411617 -988116
10159 -988116 -1488662 -1696658 -1538009 -1041048 -450957 -138867 -33187 235216 373770 208177
10149 208177 -75089 -430416 -373582 -147357 -38114 44356 -42546 -38476 -13996 190565 371297
10138 371297 282470 -18245 -120549 -176024 -51234 -241096 -663883 -989667 -1207488 -1188535
10128 -1188535 -759935 -775590 -1135531 -1134568 -986288 -616689 -292778 -279692 22821 542361
10118 542361 628926 764870 1331163 1671214 1636091 1613792 1226619 800904 703354 854475
10108 854475 705991 357918 351878 330957 -47891 -366236 -514181 -594560 -469530 -353279
10098 -353279 -532482 -481402 -470150 -589517 -536868 -23359 269111 56658 -489778 -753588
10088g53588K0047M36112K98272r7599j77520k99389P1573L50015o5778l40711
10078e58566j4824k31155Q1486O7490m00180j81786M86506O47968N17073J38362
10068E52374j49275j92489k73266k17239M14463Q46266J2834o30008l84192j10002
10058a30534J05942j50165k93707o6328K10080J95121K7178J38783l01085l33540
10048e98255J05668j36848j92036M26242L57027J36979j81533k95838J11763K53152
10038a3679K53617J5182K1168K3196J55820J92014j39608Q67Q6821J46454k83264
10027D58588l56138m4435L25656K93182l5236k92485m12349q5545K11168J63082
10017B25488j4554n9296j16692l64656m67566o5661j10571k07927K35228M96893
$$ plain form
10088 -753588 -733541 -297429 843 -96756 -274276 -573665 -502092 -152077 -217855 -558566
10078 -558566 -573390 -804545 -723059 -655569 -1055749 -1237535 -751029 -103061 414012 552374
10068 552374 403099 210610 -62656 -279895 134568 980834 993668 363660 -20532 -130534
10058 -130534 -24592 -174757 -468464 -534792 -324712 -129591 -102413 36370 -264715 -598255
10048 -598255 -492587 -629435 -821471 -395229 -38202 98777 -82756 -378594 -266831 -13679
10038 -13679 239938 255120 276288 299484 455304 647318 507710 508577 595398 741852 458588
10027 458588 102450 58015 383671 676853 641617 349132 -63217 -148762 62406 225488
10017 225488 210934 151638 34946 -329710 -797276 -862937 -973508 -1181435 -946207 -449314
10007d49314J55427J45061J44051M29095Q5974k55609l57981m24340k20522M89053
9997b59105J71747j17096k53719Q2328N16824j76483l37394J22372J09969l42908
9987d83465l30483R5467K27845L04735O767p7536m2652j32343J1404j50675K32091
9976c38845K90461j16068k05679j68261J72479K95283J93136l4352k82453k14002
9966d08301k5928o3876R1175L78677J93234K04771K89840q1598l48225k44652
9956a4883O9144Q7061n96383m89260K08091K84071J44263l36386k48111L28J06815
9945g85250J43579q5147n5560L38896N52126J73655J51612j53705k21975M1193
9935I9424K98482N12255O81917K653n49111l84725n71157j45432L95726L77750
$$ plain form
10007 -449314 -293887 -148826 -4775 424320 510294 254685 -103296 -527636 -748158 -259105
9997 -259105 -87358 -204454 -458173 -375845 140979 -35504 -372898 -250526 -140557 -483465
9987 -483465 -813948 -718481 -490636 -185901 -179134 -256670 -299322 -431665 -420261 -570936 -338845
9976 -338845 -48384 -164452 -370131 -538392 -365913 -70630 122506 88154 -194299 -408301
9966 -408301 -434229 -498105 -406930 -28253 164981 369752 659592 577994 229769 -14883
9956 -14883 54261 141322 -455061 -944321 -736230 -452159 -307896 -644282 -892393 -892065 -785250
9945 -785250 -641671 -726818 -782378 -443482 108644 282299 433911 280206 58231 99424
9935 99424 397906 910161 1592078 1594731 1045620 660895 89738 -55694 340032 717782
9925G17782j31888n20364m35347j00482j64655j89865k00768k59207L47831M20818
9915e16145J00514J1824K16526M57248K58154k32835l64421k43945M41834Q20712
9905I49466M01265O9037j99338k91928l9386m23469o24799j23052K9087K10005
9895d3112M10917O09991M1369l38168m97995j88564K06027N1018j8747n58052
9885c25316l73809r051k24232N7432L12173J16040P0073L72657K01786M0294J44757
9874C82804K56197L81979J00154j09875K07070L8311l26713l52663k13142j48454
9864B15668m1303K45904J17191k26432k82661k20578J3756j01681L1332J03653
9854a45151m2729n7838l7381L07988L84642J99153K73656J7702l76150m09695
$$ plain form
9925 717782 585894 65530 -369817 -470299 -634954 -824819 -1025587 -1284794 -936963 -516145
9915 -516145 -415631 -403807 -187281 269967 528121 295286 -69135 -313080 128754 949466
9905 949466 1350731 1419768 1220430 928502 889116 465647 -159152 -282204 -253117 -43112
9895 -43112 367805 977796 1019165 680997 183002 -5562 200465 251483 232736 -325316
9885 -325316 -699125 -708176 -932408 -874976 -562803 -446763 -376690 -4033 197753 238047 382804
9874 382804 639001 1020980 1121134 1011259 1218329 1256640 929927 577264 364122 215668
9864 215668 174365 420269 537460 311028 28367 -192211 -178455 -280136 -248804 -145151
9854 -145151 -187880 -245718 -283099 24889 409531 608684 882340 900042 523892 114197
9844A14197P1452O7172K26487Q3855k88841l90166j29351j8216J9276j28987J2693
9833c60429k52175l93605K83J1395Q770P750q7595k3786L85215J26726l26845
$$ plain form
9844 114197 185649 252821 479308 563163 274322 -115844 -245195 -263411 -244135 -373122 -360429
9833 -360429 -612604 -1006209 -1005926 -994531 -985761 -978011 -1065606 -1089392 -704177 -577451 -904296
$$ [...]
##END NTUPLES=NMR SPECTRUM
##END=
