##TITLE=C13_80-2021
 CDCl3,  19700 sc

 24.08.2021
##JCAMPDX= 6.0         $$ Bruker NMR JCAMP-DX V2.0
##DATA TYPE= NMR SPECTRUM
##DATA CLASS= NTUPLES
##ORIGIN= UXNMR, Bruker Analytische Messtechnik GmbH
##OWNER= root
$$ XWIN-NMR		Version 3.5
$$ Wed Aug 25 08:35:47 2021 Russian Standard Time (UT+4h)  she@DPX200
##.OBSERVE FREQUENCY= 50.327896
##.OBSERVE NUCLEUS= ^13C
##.ACQUISITION MODE= SIMULTANEOUS
##.ACQUISITION SCHEME= undefined
##.AVERAGES= 19700
##.DIGITISER RES= 17
##SPECTROMETER/DATA SYSTEM= spect
##.PULSE SEQUENCE= zgpg30
##.SOLVENT NAME= CDCl3
##.SHIFT REFERENCE= (INTERNAL, CDCl3, 0, 222.683)
##AUDIT TRAIL= $$ (NUMBER, WHEN, WHO, WHERE, WHAT)
$$ ##TITLE= Audit trail, XWIN-NMR		Version 3.5
$$ ##JCAMPDX= 5.01
$$ ##ORIGIN= Bruker BioSpin GmbH
$$ ##OWNER= she
$$ F:/spectra/data/she/nmr/c13/1/pdata/1/auditp.txt
$$ ##AUDIT TRAIL=  $$ (NUMBER, WHEN, WHO, WHERE, WHAT)
(   1,<2021-08-25 08:33:51.09 +0400>,<she>,<DPX200>,
      <created by zg, POWCHK disabled, PULCHK disabled
       terminated by command 'halt'
       configuration hash MD5:
       00 E9 B6 7A A2 85 ED C7 34 08 36 98 17 FE 4E 26
       data hash MD5: 32K
       40 E5 4D 41 91 C6 36 25 65 9D E5 0E 85 8E 47 93>)
(   2,<2021-08-25 08:33:53.32 +0400>,<she>,<DPX200>,
      <Start of raw data processing
       efp BC_mod = 2 LB = 1 FT_mod = 6 PKNL = 1 PHC0 = -334.125 PHC1 = 27.76238 SI = 32K 
       data hash MD5: 32K
       9A CD F1 77 86 F5 9B 2A 8F 2D 6D 8E ED DD 57 E0>)
(   3,<2021-08-25 08:33:57.00 +0400>,<she>,<DPX200>,
      <abs ABSG = 5 
       data hash MD5: 32K
       E7 71 7D AE AA CD 72 28 5A 54 33 68 0D AE B4 23>)
(   4,<2021-08-25 08:35:01.43 +0400>,<she>,<DPX200>,
      <pk PHC0 = 0.8950377 PHC1 = -1.400001 
       data hash MD5: 32K
       27 19 4B 1E CD E8 74 36 B3 BB 4E E9 3D 77 C2 21>)
(   5,<2021-08-25 08:35:04.87 +0400>,<she>,<DPX200>,
      <abs ABSG = 5 
       data hash MD5: 32K
       D6 04 B8 A2 F5 9C 99 75 B9 98 C7 9E 6F B3 42 A0>)
$$ ##END=
$$ 
$$ hash MD5
$$ D1 51 A5 2B 0D 56 72 CB DA 6C DE D8 DC 45 E8 38
##$RELAX= 
##$RELAX= 
##$RELAX= 
##$RELAX= 
##$RELAX= 
##$RELAX= 
##$RELAX= 
##$RELAX= 
$$ Bruker specific parameters
$$ --------------------------
##$DU= <F:/spectra>
##$EXPNO= 1
##$NAME= <c13>
##$PROCNO= 1
##$TYPE= <nmr>
##$USER= <she>
##$AMP= (0..31)
100 100 100 100 100 100 100 100 100 100 100 100 100 100 100 100 100 100 
100 100 100 100 100 100 100 100 100 100 100 100 100 100 
##$AQSEQ= 0
##$AQ_mod= 1
##$AUNM= <au_zg>
##$AUTOPOS= <>
##$BF1= 50.322709
##$BF2= 200.13
##$BF3= 50.322709
##$BF4= 500.13
##$BF5= 500.13
##$BF6= 500.13
##$BF7= 500.13
##$BF8= 500.13
##$BYTORDA= 1
##$CFDGTYP= 0
##$CFRGTYP= 5
##$CHEMSTR= <none>
##$CNST= (0..31)
1 1 145 1 1 1 1 1 1 1 1 1 1 1 1 1 1 1 1 1 1 1 1 1 1 1 1 1 1 1 1 1 
##$CPDPRG= <waltz16>
##$CPDPRG1= <>
##$CPDPRG2= <waltz16>
##$CPDPRG3= <>
##$CPDPRG4= <mlev>
##$CPDPRG5= <mlev>
##$CPDPRG6= <mlev>
##$CPDPRG7= <mlev>
##$CPDPRG8= <mlev>
##$CPDPRGB= <>
##$CPDPRGT= <>
##$D= (0..31)
$$ [...]
##$SUBNAM4= <"">
##$SUBNAM5= <"">
##$SUBNAM6= <"">
##$SUBNAM7= <"">
##$SUBNAM8= <"">
##$SUBNAM9= <"">
##$SW= 239.972175391363
##$SWIBOX= (0..15)
0 1 3 0 0 0 0 0 0 0 0 0 0 0 0 0 
##$SW_h= 12077.2946859903
##$TD= 32768
##$TD0= 1
##$TE= 0
##$TE2= 300
##$TE3= 300
##$TEG= 300
##$TL= (0..7)
120 120 120 120 120 120 120 120 
##$TP= (0..7)
150 150 150 150 150 150 150 150 
##$TP07= 0
##$TPNAME0= <>
##$TPNAME1= <>
##$TPNAME2= <>
##$TPNAME3= <>
##$TPNAME4= <>
##$TPNAME5= <>
##$TPNAME6= <>
##$TPNAME7= <>
##$TPOAL= (0..7)
0.5 0.5 0.5 0.5 0.5 0.5 0.5 0.5 
##$TPOFFS= (0..7)
0 0 0 0 0 0 0 0 
##$TUNHIN= 0
##$TUNHOUT= 0
##$TUNXOUT= 0
##$USERA1= <user>
##$USERA2= <user>
##$USERA3= <user>
##$USERA4= <user>
##$USERA5= <user>
##$V9= 5
##$VALIST= <valist>
##$VCLIST= <CCCCCCCCCCCCCCC>
##$VD= 0
##$VDLIST= <DDDDDDDDDDDDDDD>
##$VPLIST= <PPPPPPPPPPPPPPP>
##$VTLIST= <TTTTTTTTTTTTTTT>
##$WBST= 1024
##$WBSW= 4
##$XGAIN= (0..3)
0 0 0 0 
##$XL= 0
##$YL= 0
##$YMAX_a= 99091421
##$YMIN_a= -27103794
##$ZGOPTNS= <>
##$ZL1= 120
##$ZL2= 120
##$ZL3= 120
##$ZL4= 120
##$ABSF1= 222.6826
##$ABSF2= -17.31421
##$ABSG= 5
##$ABSL= 3
##$ALPHA= 0
##$AQORDER= 0
##$ASSFAC= 0
##$ASSFACI= 0
##$ASSFACX= 0
##$ASSWID= 0
##$AUNMP= <proc_1d>
##$AZFE= 0.1
##$AZFW= 0.5
##$BCFW= 0
##$BC_mod= 2
##$BYTORDP= 0
##$COROFFS= 0
##$CY= -3
##$DATMOD= 1
##$DC= 0
##$DFILT= <>
##$DTYPP= 0
##$F1P= 0
##$F2P= 0
##$FCOR= 0.5
##$FTSIZE= 32768
##$FT_mod= 6
##$GAMMA= 0
##$GB= 0
##$INTBC= 1
##$INTSCL= 4.134877e-10
##$ISEN= 128
##$LB= 1
##$LEV0= 0
##$LPBIN= 0
##$MAXI= 10000
##$MC2= 0
##$MEAN= 0
##$ME_mod= 0
##$MI= 0.1934396
##$NCOEF= 0
##$NC_proc= 2
##$NLEV= 6
##$NOISF1= 120.0001
##$NOISF2= 80.00006
##$NSP= 0
##$NTH_PI= 0
##$NZP= 0
##$OFFSET= 222.6826
##$PC= 1.4
##$PHC0= -333.2299
##$PHC1= 26.36238
##$PH_mod= 1
##$PKNL= yes
##$PPARMOD= 0
##$PSCAL= 0
##$PSIGN= 0
##$REVERSE= no
##$SF= 50.322728650468
##$SI= 32768
##$SIGF1= 140
##$SIGF2= 120
##$SINO= 11.81781
##$SIOLD= 32768
##$SREGLST= <13C.CDCl3>
##$SSB= 0
##$STSI= 32768
##$STSR= 0
##$SW_p= 12077.2946859903
##$SYMM= 0
##$S_DEV= 0
##$TDeff= 32768
##$TDoff= 0
##$TI= <>
##$TILT= no
##$TM1= 0
##$TM2= 0
##$TOPLEV= 0
##$USERP1= <user>
##$USERP2= <user>
##$USERP3= <user>
##$USERP4= <user>
##$USERP5= <user>
##$WDW= 1
##$XDIM= 32768
##$YMAX_p= 414908692
##$YMIN_p= -2387328
$$ End of Bruker specific parameters
$$ ---------------------------------
##NTUPLES= NMR SPECTRUM
##VAR_NAME=  FREQUENCY,     SPECTRUM/REAL,   SPECTRUM/IMAG
##SYMBOL=    X,             R,               I
##VAR_TYPE=  INDEPENDENT,   DEPENDENT,       DEPENDENT
##VAR_FORM=  AFFN,          ASDF,            ASDF
##VAR_DIM=   32768,         32768,           32768
##UNITS=     HZ,            ARBITRARY UNITS, ARBITRARY UNITS
##FACTOR=    0.368581032318806, 1,           1
##FIRST=     11205.9961520387, 0,            0
##LAST=      -871.298533951598, 0,           0
##MIN=       -871.298533951598, -2387328,    0
##MAX=       11205.9961520387, 414908692,    0
$$ Real data points
##PAGE= N=1
##DATA TABLE= (X++(R..R)), XYDATA
$$ [...]
15953H24664l49822l68505n09363k59876L02216K23319p9750l00046l79348Q3238
15943h13273K69455K09963J85937K89108J1476k71489O172O44153J68629m48555
15933B51576m86819k9044K37709K00858J35245j10712m08316M966K24874K56592
15923B76929L2337J41763N53650K79796j38175m79516l57038m9018N1277q2751
15913B29254k50526l03730l73940l74861k64532J57032L60338L88882M71849l3479
15903F287l26757J08458n0443n92500m81055L888J39651J73448M50156N5802r9351
15892f12416r671o7798N7941j555L61962O05441O22955K37367l24726k52647l63428
15881B53425m38964Q2719J11891k11640j20279k38069J07050M14952K82256J25270
$$ plain form
15953 824664 474842 106337 -403026 -662902 -360686 -137367 -217117 -517163 -896511 -813273
15943 -813273 -543818 -333855 -147918 141190 152666 -118823 -112651 531502 700131 251576
15933 251576 -235243 -264287 -26578 174280 309525 198813 -209503 -204537 20337 276929
15923 276929 309266 451029 1004679 1284475 1146300 666784 309746 260728 312005 229254
15913 229254 -21272 -325002 -698942 -1073803 -1338335 -1181303 -820965 -432083 39766 6287
15903 6287 -320470 -212012 -262455 -854955 -1336010 -1332122 -1192471 -1019023 -568867 -513065 -612416
15892 -612416 -622087 -689885 -631944 -633499 -271537 333904 956859 1194226 869500 616853 253425
15881 253425 -185539 -102820 9071 -202569 -322848 -560917 -453867 -38915 243341 368611
15871C68611N6296l46738o60336k30185J23556L87467p056l54696k72988J44628
15861g91441J79714m432L27296K4079j46074L7364k85517m825K49331K05040J45052
15850f4413k5922M4151J44030l546k25372j04297j40001j9286M3958P7878n3870
15839c26690j66654O6915L82301J34107K84508J34628N9236O6281j57369j08867
15829C68396p0304k50562o42415k96058L76177J30152J36883K66930k21141p36214
15819i38156k13154L62327K45062K35721L2232l73388k34836l7672J18918M02815
15809d00131L52774N8545p845n37949q73496j78732Q49261O95416Q0589J15758
15799A54190J02320k2255n4936l3641L6471m6960l50600j01695J78992J88238
$$ plain form
15871 368611 424907 78169 -582167 -812352 -688796 -301329 -308385 -663081 -936069 -791441
15861 -791441 -611727 -616159 -288863 -264784 -410858 -373494 -659011 -663836 -414505 -209465 -64413
15850 -64413 -90335 -46184 97846 94300 -131072 -235369 -375370 -394656 -350698 -272820 -326690
15839 -326690 -493344 -426429 -44128 89979 374487 509115 568351 634632 477263 368396
15829 368396 298092 47530 -594885 -890943 -514766 -384614 -247731 19199 -201942 -938156
15819 -938156 -1151310 -788983 -543921 -308200 -275968 -649356 -884192 -921864 -802946 -400131
15809 -400131 -47357 11188 3343 -534606 -1408102 -1586834 -737573 -42157 38432 154190
15799 154190 256510 234255 179319 145678 182149 135189 -215411 -317106 -138114 50124
15789E0124K54064q1976k74813J60046K52098J96956j52688j85837J47395j24864
15779B40505m26557r0871Q735J81410R8671j22542J0966L10191K68915n2448R376
15768D36351m4315k80624k81448j17989J2142J36955L93529L33175K39514k64261
15758E63029q59190m51557j64006l18786J4268N2017J01453K10812N87972P85074
15748E21086J60938m68488n57298J8598M73876K25332r7507l44072P2398p5834
15738g0971o0029K21430j12128k30966k98830R3131R1055j95415n13805p5777
15728a152305L65016q5893L1219K69099j15564j39550J44143L62988L68964J2764
15718F0881j46588j9549L00090Q4378l6420J34072J33616j79111j50757k24673
$$ plain form
15789 50124 304188 222212 -52601 107445 359543 556499 403811 217974 365369 240505
15779 240505 -186052 -276923 -268188 -86778 11893 -110649 -99683 210508 479423 426975 436351
15768 436351 392036 111412 -170036 -288025 -275883 -138928 254601 587776 827290 563029
15758 563029 -296161 -747718 -911724 -1230510 -1216242 -1164225 -1062772 -851960 -263988 521086
15748 521086 682024 213536 -343762 -325164 148712 374044 276537 -67535 4863 -70971
15738 -70971 -131000 90430 -21698 -252664 -551494 -458363 -367308 -562723 -1076528 -1152305
15728 -1152305 -787289 -873182 -841963 -572864 -688428 -827978 -683835 -320847 48117 60881
15718 60881 -85707 -105256 194834 279212 242792 376864 510480 331369 180612 -44061
15708d4061r1421M30062N04091K43310J05843j47751l71706m10586j11753J73056
15698B79084J3329p981n3692j25519P4238M95203N26733L77280k08162n62917
15688H07596l54009o55829q83740k98040K38443K07246J41245L15537L51189K78469
15678A48107j00019o535n1834k80065m433N4403o1596j79218l93730J1562M16853
15667d46505L77675M16522k65763l10089n0296k40243j88439J66306K11666o8421
15657c97587j58615l6292J4181K79594K36792l76177n30514Q2660K84001L16209
15647b85748M99854N73932K52379k45681j95809j48318m70931q0659K50489N14458
15637F63966O20497j8283n16889o65203J2878M00542K75778j08089j88888M067
$$ plain form
15708 -44061 -135482 294580 798671 1041981 1147824 1000073 628367 217781 106028 279084
15698 279084 292413 284432 230740 105221 179459 674662 1201395 1578675 1370513 807596
15688 807596 453587 -202242 -1085982 -1384022 -1145579 -938333 -797088 -481551 -130362 148107
15678 148107 48088 41553 -10281 -290346 -294779 -240376 -301972 -481190 -874920 -863358 -446505
15667 -446505 -68830 347692 81929 -228160 -278456 -518699 -707138 -540832 -329166 -397587
15657 -397587 -556202 -592494 -578313 -298719 -61927 -438104 -968618 -885958 -601957 -285748
15647 -285748 214106 788038 1040417 794736 598927 450609 -20322 -100981 149508 663966
15637 663966 1284463 1266180 749291 84088 96966 497508 773286 665197 476309 480376
15627D80376J97680L2379o78419p93345k16473j92766j12409J92360M74643N17490
15617i8484J91522r1630J30583j32430l39653J20182K75432J20558k27176K64057
15607B12961J55634j38035N6466j24717m9412J12136R7808p1461j68202J15299
15597A98477M77578K65763j95537l80189j42295L03275P1810k60150k53680j43897
15587e8845j0114K7359Q0333l17732l69951l4219J76612L23850Q9065n09839l82879
15576i86360M0621N1498P5264J63167K51051J79619J11302j73693J67810p7101
15566a96822l6921N94377L42795K02042K11351l0208n31400o89994k02517L13886
15556b3411K48223M3360j66040l98432l03294r6525O6987L46858M95225J78801
$$ plain form
15627 480376 678056 710435 32016 -761329 -977802 -1170568 -1282977 -1090617 -615974 -98484
15617 -98484 93038 1408 131991 -439 -340092 -219910 55522 176080 -51096 212961
15607 212961 368595 230560 287026 162309 112897 225033 322841 251380 83178 198477
15597 198477 676055 941818 746281 366092 223797 527072 598882 338732 85052 -58845
15587 -58845 -68959 -41600 38733 -278999 -648950 -683169 -506557 -182707 -93642 -603481 -986360
15576 -986360 -945739 -894241 -818977 -655810 -404759 -225140 -113838 -287531 -119721 -196822
15566 -196822 -233743 360634 703429 905471 1116822 1086614 555214 -134780 -337297 -23411
15556 -23411 224812 268172 102132 -296300 -599594 -696119 -629132 -282274 212951 391752
15546C91752P2642O6912J1685k34458m1457J44622m38890o61773j39891J31830
15536f97026K30600K38620M31118L36986m4493k00249l63423k06705l17343r0210
15526f82125K89311L4913J72292l2929j14396K3544p6944k01414j07877n5087
15516g50712o48K40187J80367L85805L63970l13708k31532M9609J6742K51279
15506A91359r7001l70814j97233o523n8211l30252k59507L87059O04828M53023
15496C16728M40883O30708Q607l64618n76178l23196m0835J4256j0505j58623
15486f2773O127O1648K03205k17319n89541l67821j52552J86703J99740L534L72180
15475c56869N39300r0376n58318k78966J59271J61514K10997O4097k06829m62233
$$ plain form
15546 391752 464394 531306 542991 308533 267076 411698 -27192 -688965 -828856 -697026
15536 -697026 -466426 -227806 203312 540298 495805 295556 -67867 -274572 -591915 -682125
15526 -682125 -392814 -357901 -185609 -218538 -332934 -309390 -386334 -587748 -695625 -750712
15516 -750712 -751360 -511173 -330806 54999 418969 105261 -126271 -76662 -59920 191359
15506 191359 94358 -276456 -473689 -480212 -538423 -868675 -1128182 -741123 -136295 316728
15496 316728 757611 1388319 1396926 1032308 456130 132934 92099 106355 95850 -62773
15486 -62773 -56646 5002 208207 -9112 -598653 -966474 -1119026 -932323 -732583 -729049 -356869
15475 -356869 182431 92055 -466263 -745229 -585958 -424444 -213447 -149350 -356179 -818412
15465h18412j73726L54961O30856K90424o9530k00543k20583m12275l25487j59037
15455a103352J17410L32648L11187J45000j61679l40593p71929p17845J5264J054402
15445a119487R45142M04673q2560k59744l7617M9744M11285J03164k1551L41951
15435G35000M30978J95415J70905j4930m71016l18783m25516n41032k55901K47718
15425b47162O22314K52841N9107Q0720J83419K40252m24451o73095m94907l02992
15415g03954j65794j84293K9477M01070j18091m32336m98214J1386K82310K32540
15405a145899N91182P22911K67281j10386l35251k29217k30820l65941l01017
15396a137157j25230j10513j30712K93057L19961n7648n0689L31822K54779J53098
$$ plain form
15465 -818412 -992138 -637177 -6321 284103 214573 14030 -206553 -618828 -944315 -1103352
15455 -1103352 -985942 -653294 -342107 -197107 -358786 -699379 -1471308 -2189153 -2173889 -1119487
15445 -1119487 -174345 230328 147768 -111976 -149593 -99849 311436 414600 393049 735000
15435 735000 1165978 1361393 1532298 1517368 1046352 727569 302053 -238979 -494880 -247162
15425 -247162 375152 627993 687100 767820 951239 1191491 767040 93945 -400962 -703954
15415 -703954 -869748 -1054041 -1024564 -623494 -741585 -1173921 -1672135 -1660749 -1378439 -1145899
15405 -1145899 -554717 168194 435475 325089 -10162 -239379 -470199 -836140 -1137157
15396 -1137157 -1262387 -1372900 -1503612 -1210555 -890594 -948242 -998931 -667109 -412330 -259232
15386b59232L65602K94634J8735N4931k07831k16204j93549j03419m7386k43073
15376e36792l76034K56657J80882k41107l31170O3184J78732L93496L59703L38123
15366B85674O9579k77946j97514J54409M24697J11336j44054l46112l88087n5095
15356c63113L3579j49765j43258J96045L17551n7912j97410J48138J15653k44027
15346c44519k95867m42828j3147J84474J77418J7902J9888J16813J64831r9212
15336e14247J494J76655J87258J28965j53468j21455k23783j47224J49485K41939
15326b74381R4690l4132j27769J07849K15106M5487J24893L72147J40137l0484
15316F33543P7095j07435j75558P049K50300P714l98499m04224k24434K23877
$$ plain form
15386 -259232 106370 401004 419739 474670 266839 50635 -142914 -246333 -293719 -536792
15376 -536792 -912826 -656169 -475287 -716394 -1047564 -984380 -805648 -412152 -52449 285674
15366 285674 355253 77307 -120207 34202 458899 570235 426181 80069 -308018 -363113
15356 -363113 -329534 -479299 -622557 -426512 -108961 -166873 -364283 -216145 -100492 -344519
15346 -344519 -640386 -1083214 -1096361 -911887 -734469 -716567 -696679 -579866 -415035 -514247
15336 -514247 -512753 -336098 -148840 -19875 -173343 -294798 -518581 -665805 -516320 -274381
15326 -274381 -179691 -213823 -341592 -233743 -18637 26850 151743 523890 664027 633543
15316 633543 710638 603203 427645 434694 684994 692708 294209 -110015 -334449 -110572
15306a10572P882K5491M4466j89747k05360M5634K70786L99924M58637K73833
15296A020974j35590m85485m61655o32158m14770O9915L17338R1948N77281K22129
15286A69927l34184J29433K78899J38226L10947j56782m42446l80870n46169j13737
15276i46756K47498J19835L26813M5478k07342K68779M88380j13752o34900j55204
15266e61171L54957M02384L98914p1839m34907l08296l9016j5542K0821J14926
15256a38769L00864K18093M67623J37657k36639k47076n0830N4269j61107L23249
15246F67334K21864m12304m99398j98310R1684L48972K37964j13949k98483n9838
15236a4464P6499k99924j19136Q3332J13549K04845L40103N52119l74016o03184
$$ plain form
15306 -110572 -102690 -77199 -32733 -222480 -427840 -382206 -111420 288504 747141 1020974
15296 1020974 885384 399899 -61756 -693914 -1108684 -1038769 -721431 -629483 -52202 169927
15286 169927 -164257 -34824 244075 382301 693248 536466 94020 -286850 -833019 -946756
15276 -946756 -699258 -579423 -252610 -207132 -414474 -145695 342685 228933 -405967 -561171
15266 -561171 -206214 196170 595084 523245 88338 -219958 -258974 -274516 -253695 -138769
15256 -138769 162095 380188 847811 985468 748829 501753 450923 505192 344085 667334
15246 667334 889198 476894 -22504 -220814 -129130 219842 457806 343857 45374 -14464
15236 -14464 62035 -237889 -357025 -273693 -160144 44701 384804 936923 562907 -40277
15226d0277l35249m57546o5959L67936K99520j25692l21961O3874P03687M47283
15216E35616p6217n81887o83440r8630q7969O9476L28506j98188k42601K03727
15206h31607J49005k26697j10679K01565N902L91789K19113j11742n497J68394
15196a50454K2062j48398L263J92254l0918m96895l4705R0641L34598J97733o1603
15185h2422J76307k36636l65276r1371l01084j15483N1360R6067J12861K83172
15175d72505M18630K47085P0868l50935j67648L68714N72486r5019n77840l90051
15165c76215j71956J24622N0534j68491K48873M80690L82259K53189l06500l78746
15155A38259j98423k04630k76078k71245J47497M15279L36155M996L4973m6919
$$ plain form
15226 -40277 -375526 -833072 -899031 -531095 -231575 -357267 -679228 -615354 88333 535616
15216 535616 459399 -122488 -805928 -904558 -992527 -923051 -594545 -792733 -1035334 -831607
15206 -831607 -682602 -909299 -1019978 -818413 -812511 -420722 -201609 -313351 -318848 -150454
15196 -150454 -128392 -276790 -273527 -81273 -112191 -609086 -643791 -553150 -218552 -20819 -82422
15185 -82422 93885 -142751 -508027 -599398 -900482 -1015965 -964605 -868538 -755677 -472505
15175 -472505 -53875 193210 264078 -86857 -254505 114209 686695 591676 13836 -376215
15165 -376215 -548171 -423549 -373015 -541506 -292633 188057 570316 823505 517005 138259
15155 138259 -60164 -264794 -540872 -812117 -664620 -249341 86814 91810 126783 79864
15145G9864Q261j11954k41049j5372N4159J24744K92872J80389k50414j24727
15135c227K68044K8788J29900n7459n81219m56745j02547K23680J38408N8813
15125c53564L61154M35259K52001R4905j84922j70349L6892J07536l56234k79702
15115e7024O6959K2154j8096j92169j07405P783J96744r2521J07847J74494R7766
15104B06532J257j55545l13502k24138l9500n03238k70633L95706L79521O930
15094e16610k76836k4958M86409L17674O860j17497k43309l25594J06168k14177
15084h01870j32485L0248L53079O61138J51793k5782J13107k8307o4570l79433
15074a23082l37136J2105L22756J33910k28350j61050L23738K28995j71057m16068
$$ plain form
15145 79864 88125 -23829 -264878 -280250 -226091 -101347 191525 371914 121500 -3227
15135 -3227 264817 293605 423505 366046 -215173 -671918 -774465 -550785 -412377 -353564
15125 -353564 7590 442849 694850 789755 604833 434484 471376 578912 222678 -57024
15115 -57024 9935 32089 13993 -178176 -285581 -277798 -81054 -173575 -65728 108766 206532
15104 206532 207789 52244 -261258 -485396 -524896 -1028134 -1298767 -903061 -523540 -516610
15094 -516610 -793446 -818404 -331995 -14321 -7461 -124958 -368267 -693861 -587693 -801870
15084 -801870 -934355 -904107 -551028 110110 261903 236121 349228 320921 256351 -123082
15074 -123082 -460218 -448113 -125357 8553 -219797 -380847 -57109 171886 829 -415239
15064d15239m54963l12327j70647p5648k95715L7583N26058M78054L91070M95406
15054B03632K34134k42934m75185j19494j58307l29016j11923M50035Q22101Q10480
15044A083523j3510n87888j60928K2286J07805J31678O0851q0595k91745J43999
15034D15476N4310j16754m86125m04631K01500K46276J9086O1749K8084q3632
15024f4661k24943R9461N75081N6669l79996k87878j74510J31159p116l21177
15014e97911J4361M23712J03977l57346l49969L0835K27379l4875r9230n4215
15004f93282q613N941K2565K15955K06981k61871n5463q3859L4957K96313j4219
14993c34595M394p6744Q1076J55117N9014J01540j86357j12867j10524l29944
$$ plain form
15064 -415239 -870202 -1182529 -1353176 -1428824 -1724539 -1686956 -1160898 -682844 -291774 203632
15054 203632 437766 194832 -280353 -399847 -558154 -887170 -999093 -549058 273043 1083523
15044 1083523 1070013 482125 321197 343483 451288 582966 643817 563222 271477 415476
15034 415476 469786 353032 -133093 -537724 -336224 -89948 -70862 -9113 18971 -64661
15024 -64661 -289604 -190143 384938 441607 61611 -226267 -400777 -269618 -276734 -597911
15014 -597911 -583550 -159838 -55861 -413207 -763176 -732341 -504962 -539837 -639067 -693282
15004 -693282 -701895 -695954 -673389 -457434 -250453 -512324 -567787 -651646 -616689 -320376 -334595
14993 -334595 -330201 -406945 -325869 -170752 -111738 -10198 -196555 -309422 -419946 -749890
14983g49890j62919K28970O09368K72851L2542M58504L49313l04111m71221o03828
14973c40421q1267K57131p3329j05784m9038J18909j37095J84413j91314j99759
14963f17554K14378j60449r5912J21390J86787Q7503K26018J25589j58385k49021
14953c19656P7569k66N5576k04916K7020R0670J16351n2334j19903L45673p3039
14942e7255j89716O525N1654J53641J19593j91908k36167k01664l31543k77116
14932a153956J48943L88946J35892L34315N24734p7046l47261n3778p6012l2594
14922b07817L5310J68040J44644j91014J45341M0265n72447l97037P0851L1397
14912g32467N9303K46828J14933J00546o425O9853r9636j59799K73905j45615
$$ plain form
14983 -749890 -912809 -683839 -74471 198380 230922 689426 1038739 734628 263407 -340421
14973 -340421 -421688 -164557 -237886 -343670 -392708 -273799 -410894 -226481 -417795 -617554
14963 -617554 -403176 -563625 -659537 -538147 -351360 -263857 -37839 87750 -70635 -319656
14953 -319656 -242087 -242353 -186777 -391693 -364673 -274003 -157652 -209986 -329889 15784 -57255
14942 -57255 -246971 -240446 -188792 -35151 84442 -107466 -343633 -545297 -876840 -1153956
14932 -1153956 -1005013 -616067 -480175 -145860 378874 301828 -45433 -99211 -175223 -207817
14922 -207817 -172507 -4467 140177 -50837 94504 134769 -437678 -834715 -763864 -732467
14912 -732467 -673164 -426336 -311403 -210857 -217282 -147429 -247065 -406864 -132959 -278574
14902b78574N6060M63699J39486l35913k12618J70082P3826j13152j40201k56329
14892d33634k30446J25486M73540J99004R173J13494J19305k93575j69400K70795
14882A83742L00363J62537j85368k59293j81125l30014j13445J61642j58016n30932
14872i49909j38115J07609R2798J6905k99507k33530L68380L76752J64283J33523
14862c60811L62020O04923K75056j90674k76906O5039L0038k18916j2375J18439
14852C95833p9670m54902o51718J18143L93105L30677L17113J72424K79423m74251
14842C46177q08656o30588j53977Q994k2351k1548m8547K3531j44156J6381K59278
14831a175462N934j24281l4614N4075l3065l85837k72749j7552L11350L70075
$$ plain form
14902 -278574 -222514 241185 380671 44758 -167860 2222 76048 -37104 -177305 -433634
14892 -433634 -664080 -538594 -65054 133950 143123 256617 375922 82347 -87053 183742
14882 183742 484105 646642 461274 201981 20856 -309158 -422603 -260961 -418977 -949909
14872 -949909 -1088024 -980415 -887617 -870712 -1170219 -1403749 -1035369 -658617 -494334 -360811
14862 -360811 1209 606132 881188 690514 413608 478647 508685 289769 277394 395833
14852 395833 316163 -138739 -790457 -672314 -279209 51468 368581 541005 820428 346177
14842 346177 -462479 -1093067 -1247044 -1238050 -1260401 -1281949 -1330496 -1306965 -1451121 -1434740 -1175462
14831 -1175462 -1169528 -1293809 -1328423 -1274348 -1307413 -1693250 -1965999 -1983551 -1672201 -1302126
14821a302126L13878O2843l0671R0130J60247M0047k32655o17110l44487L73975
14811a485929N81273K15852K71719k88019j40931L82396K77442K64000L32200
14802D10003p886p6045j68006k77567j3454K89235K12047J61595r4904k31479
14792B03539j97660m96959j51239J02345m44489m14674K78458N91234M39323k44492
14782c34614k43429K2690R9796L92621J77388l63282k58586M12448J34514l37141
14772b97595k13619J1282L3461M8633R634o9563m6482j87595j88935j2057M81410
14761d31426L01592R9466K72919K31616M6388r1342l7969J59321K12632J42966
14751I06163P6256m30093o81071l37426J62368J27320n0043K4838j39633M6580
$$ plain form
14821 -1302126 -988248 -925405 -956076 -865946 -705699 -665652 -898307 -1515417 -1859904 -1485929
14811 -1485929 -904656 -688804 -417085 -705104 -846035 -463639 -186197 77803 410003
14802 410003 402117 326072 158066 -119501 -132955 156280 368327 529922 435018 203539
14792 203539 5879 -491080 -642319 -539974 -984463 -1399137 -1120679 -529445 -90122 -334614
14782 -334614 -578043 -555353 -455557 -62936 114452 -248830 -507416 -94968 39546 -297595
14772 -297595 -511214 -499932 -466471 -417838 -408204 -477767 -524249 -711844 -900779 -912836 -431426
14761 -431426 -129834 -30368 242551 474167 520555 429213 391244 550565 763197 906163
14751 906163 982419 552326 -128745 -466171 -303803 -176483 -226526 -201688 -341321 -294741
14741b94741L03593j57131m1408N347j44788J36163Q3832L30146K21125k59489
14731A82649m7299L11381j98043n99511k18832J13972l72l80866l79323j22918
14721a339162K41856l3381o9268M39708N81523K45924J83653j6169m17763j53416
14711c36495j59813k19650j24024J58464k05025k11986J21073L46346m1291Q1738
14701e90663L58924J43629K24682K64696n8733n83229m07890l09762o6763K83190
14691g41919O6044o9580O9214K36160j14332j97984n5734K14791K27118o1216
14681d27438l20982P1972L02868K38124K33110Q6951K78355Q3442K04365M6444
14671G97211O314j81923o03829o58197k62259N39202O43051J0627k66317J18257
$$ plain form
14741 -294741 8852 -148279 -189687 -184340 -329128 -192965 -109133 221013 442138 182649
14731 182649 135350 446731 248688 -350823 -569655 -455683 -456055 -836921 -1216244 -1339162
14721 -1339162 -1097306 -1130687 -1199955 -760247 -178724 67200 250853 234684 -183079 -336495
14711 -336495 -496308 -715958 -839982 -681518 -886543 -1098529 -977456 -631110 -672401 -590663
14701 -590663 -231739 -88110 136572 401268 342535 -240694 -648584 -958346 -1025109 -741919
14691 -741919 -675875 -745455 -676241 -440081 -554413 -752397 -808131 -593340 -366222 -427438
14681 -427438 -748420 -676448 -373580 -135456 97654 184605 462960 546402 750767 797211
14671 797211 803525 621602 17773 -640424 -902683 -363481 279570 290197 23880 142137
14661A42137J46626r0440r3546Q7230o043K24387J93584J05488m07799m11099
14651a09475J01441M12978K12782j49906p3043K83250K96607k3163k53355n82862
14641A15254o23661J02637l4621o9129o9196k5014L05652J99064Q3398J41457
14631A25841N0342k24827j47174R5233n6985j27853J29806K9278j57701K97483
14621A3443O72308M45285k20228r35034n65084k66090l26499j41702O59265O84685
14611B0349J31073l84184j46003J62458L17769J47599k69057k12936J18920m7364
14601a61376k05947l61525m67443j38885L20560M55784K70686N78540O58051K72727
14591A221172k26515n59780m67865r1138J18921l28165k44344n8531K32484L26590
$$ plain form
14661 142137 288763 198323 104777 192007 185964 410351 603935 709423 301624 -109475
14651 -109475 -8034 404944 617726 467820 394777 678027 974634 951471 698116 115254
14641 115254 -508407 -405770 -440391 -509520 -578716 -603730 -298078 -99014 -15616 125841
14631 125841 176183 -48644 -195818 -100585 -157570 -285423 -155617 -126339 -284040 13443
14621 13443 685751 1131036 910808 -24226 -589310 -855400 -1181899 -1323601 -664336 20349
14611 20349 151422 -232762 -378765 -216307 101462 249061 -19996 -232932 -114012 -161376
14601 -161376 -367323 -728848 -1196291 -1335176 -1014616 -558832 -288146 290394 948445 1221172
14591 1221172 994657 434877 -32988 -124126 -5205 -333370 -577714 -636245 -403761 -77171
14581g7171j90067j43356K72214n052J16769M99461q9526k03834j59127k19298
14571a98987k31718k69045k61986j0785j32896l52399j70942r4940L95489Q19878
14561e08331O34815J36051j9277K72006K02463k43231l20202j31493k00671J03741
14551g4129K81364P3234j40552m82425n98364p5281K02605K49451L64912O03410
14541D04225K62059j08242m56889k05092K61897N24368K37382j02568k41948k44919
14531C30273J49973K75737J7151k16876k56783l93163l07576J46400P5230j64309
14521c43943n2873j15145k8314r6135K09541N22430N22859P6977j65202o3201
14511D66994N6904j15478l15816j55928k19922k38762L41263L17360J16091k28785
$$ plain form
14581 -77171 -267238 -410594 -138380 -143432 -26663 472798 383272 179438 20311 -198987
14571 -198987 -430705 -699750 -961736 -972521 -1105417 -1457816 -1628758 -1723698 -1328209 -508331
14561 -508331 126484 262535 243258 515264 717727 474496 154294 22801 -177870 -74129
14551 -74129 207235 280469 139917 -342508 -940872 -1016153 -813548 -564097 -199185 404225
14541 404225 666284 558042 101153 -103939 157958 682326 919708 817140 575192 330273
14531 330273 480246 755983 773134 556258 299475 -93688 -401264 -254864 -179634 -343943
14521 -343943 -396816 -511961 -540275 -636410 -426869 95561 618420 695397 530195 466994
14511 466994 523898 408420 92604 -63324 -283246 -522008 -180745 136615 252706 23921
14501B3921j88495R994j00658m98205n25876l57733j18895L40266M94650J19949
14491h01082Q4682N66587J62519n5364N8763m14975j33424J17659m4267j66141
14481f25043k21096m42327Q3787M75504K01664j27019m9411L8290o9080p3772
14471h08503K24792N49796J5895l78361r2967q458j11306J7316j368J35480P4917
14460c82767j91649j11326K6659Q8267K7893J34734J67830Q9784K8541j97908
14450c19942l55576l02252m00197k05567L68239P52839N36044O0928j18352J61384
14440A77548k3889l69941k23441j74595J17205K48300L46744k73710q64186k09668
14430a249633K80668M23987O49397M73892k13928m30682j96947j1711k30548j12951
$$ plain form
14501 23921 -164574 -154580 -255238 -753443 -1279319 -1637052 -1755947 -1415681 -921031 -801082
14491 -801082 -716400 -149813 12706 -42658 16105 -398870 -532294 -414635 -458902 -625043
14481 -625043 -846139 -1288466 -1204679 -729175 -527511 -654530 -703941 -665651 -734731 -808503
14471 -808503 -583711 -33915 -18020 -396381 -489348 -497806 -609112 -591796 -593164 -457684 -382767
14460 -382767 -574416 -685742 -659083 -570816 -542923 -408189 -240359 -150575 -122034 -319942
14450 -319942 -675518 -977770 -1377967 -1583534 -1215295 -462456 73588 134516 16164 177548
14440 177548 153659 -216282 -439723 -614318 -497113 -248813 97931 -175779 -1039965 -1249633
14430 -1249633 -968965 -544978 104419 578311 364383 -66299 -263246 -274957 -505505 -618456
14420f18456l3265o4889P5605j18268l28164j60859J93868L42424N15938L70575
14410A74509P2523l93115k85678K86065L46477n599k00768m69486l44444r9436
14400i18952K95971J23658L46710M75576L29222J7097R5575J69184l18465k07480
14390D08096j35273O6721k8358o6291m09660p96813k46933L18729M99887J8414
14380c71481n95257l37747j12709K13054N47467J00638k80991O2054J53415L20904
14370c00653Q8954l5761j53815l39223q6464K60860M39557k22661m43550M173
14360g88583K35650O5144k76262j72991K67454L68812J00934o4100o59405l61372
14350a284719R3050o6150j03744K07094M79017J59930J77303M5800j49173q5611
$$ plain form
14420 -618456 -651721 -716610 -641005 -759273 -1087437 -1248296 -1054428 -712004 -196066 174509
14410 174509 247032 -146083 -431761 -145696 200781 195182 -5586 -475072 -819516 -918952
14400 -918952 -622981 -499323 -152613 322963 652185 669282 764857 934041 615576 408096
14390 408096 272823 339544 311186 244895 -164765 -961578 -1208511 -889782 -389895 -371481
14380 -371481 -966738 -1304485 -1417194 -1204140 -656673 -556035 -837026 -774972 -621557 -300653
14370 -300653 -211699 -247460 -401275 -740498 -826962 -566102 -126545 -349206 -792756 -788583
14360 -788583 -552933 -487789 -764051 -937042 -669588 -300776 -199842 -263942 -923347 -1284719
14350 -1284719 -1191669 -1257819 -1361563 -1154469 -675452 -515522 -338219 -292419 -441592 -527203
14340e27203J23881J74666Q5834K84623Q8480m40912j55838L44805N58086L96432
14330I32854k71656n18480l47384j74310N97693O87146K11108P6775j28664k93017
14320G72065k04874j46327j00966j06198k75688k60875L3115L67620K69529J79509
14310E26910j1377j77650n861Q2374m58637o34621N3709L33617L24160j3989j59922
14299a41287j73643j3994k54988k66716R529J98352K37732j63587j36116N17829
14289a86889L38589j16988j16178q5579l35820Q3207K91467K06512L13009J00863
14279D92193l40208j98208l8411K24957L4581q6120N334q1429j41651l36539k2253
14268d87754K08331J79447J28001j35171m75939o02528R1628K77446k72032k96879
$$ plain form
14340 -527203 -403322 -228656 -142822 141801 230281 -210631 -366469 -21664 536422 932854
14330 932854 661198 142718 -204666 -378976 218717 905863 1116971 1193746 1065082 772065
14320 772065 567191 420864 319898 213700 -61988 -322863 -289748 77872 347401 526910
14310 526910 515533 337883 332022 414396 -44241 -678862 -625153 -291536 32624 18635 -141287
14299 -141287 -314930 -328924 -583912 -850628 -841099 -642747 -405015 -568602 -704718 -186889
14289 -186889 151700 34712 -81466 -167045 -502865 -419658 -128191 78321 391330 492193
14279 492193 151985 -46223 -84634 140323 174904 88784 94118 12689 -128962 -465501 -487754
14268 -487754 -279423 -99976 28025 -107146 -583085 -1185613 -1093985 -816539 -1088571 -1385450
14258a385450Q5460M88145O39128J86155k56079J21635M60406J49564k32638p9017
14248A77309l6763j84545L01143M36856l02343k40763l15025L1662m9623m75878
14238f57970k47718K35286J65819j84954l32P5140p4362J88898K55865K48206
14228C878M05270K20951m34220k31449l8865l02564m10157K11667O41774O61279
14218G27564L25693j1944j37114j67270o9942k49908l3204l32966p07948j73355
14208h30394L35712K15097J37493M41095L09086n29132k83574j33753j59032o9828
14198e67230k02529j03582K51618O0572k38940J19172k6334M3599J05108M54614
14188a03932Q85067K29639M0271J64768l9106j10417j45680j25533m4553j92951
$$ plain form
14258 -1385450 -1299990 -811845 -172717 13438 -242641 -121006 339400 488964 256326 177309
14248 177309 140546 -43999 257144 694000 391657 150894 -164131 -132469 -182092 -657970
14238 -657970 -905688 -670402 -504583 -689537 -689869 -614729 -689091 -500193 -244328 3878
14228 3878 409148 630099 195879 -35570 -74435 -376999 -787156 -575489 66285 727564
14218 727564 1053257 1041313 904199 736929 666987 417079 383875 50909 -657039 -830394
14208 -830394 -494682 -279585 -142092 299003 608089 78957 -204617 -338370 -497402 -567230
14198 -567230 -769759 -873341 -621723 -561151 -800091 -680919 -707253 -663654 -558546 -103932
14188 -103932 781135 1010774 1051045 1215813 1176707 1066290 920610 795077 750524 557573
14178E57573m1423L74196P2401l86582J4628L71394K83202j77754o84211j81280
14168B02144L55181J34561m7062l80431n85324k07566j18452j53462o6182N3170
14158h13423L37638J49589l9690j2828J9335l26603l15739K43828k9899r9543
14148h87335L9749M83884M93066L10850L02567k71209j71177m0217J01587K99749
14138F61514q3847J67479L35419m15301n28092r6791j22659Q1760J20154j32204
14128a2568k63931k58238l13212k21479L73454M37256Q7415l03040k04174j30353
14118h08870J58672L39272L62944M53238K34336k08407m04991n84683k89144J81851
14108e65782L12234J78195n5757O1857O404M7094J13644J33096L1249k73755m10373
$$ plain form
14178 557573 516150 890346 962747 576165 590793 962187 1245389 1067635 383424 202144
14168 202144 557325 691886 644824 264393 -320931 -528497 -646949 -800411 -866593 -813423
14158 -813423 -475785 -326196 -365886 -378714 -359379 -685982 -1001721 -757893 -787792 -887335
14148 -887335 -847586 -363702 129364 440214 742781 471572 300395 260178 361765 661514
14138 661514 577667 745146 1080565 665264 137172 40381 -82278 -518 119636 -12568
14128 -12568 -276499 -534737 -847949 -1069428 -695974 -258718 -171303 -474343 -678517 -808870
14118 -808870 -650198 -310926 52018 505256 739592 531185 126194 -458489 -747633 -565782
14108 -565782 -253548 -75353 -131110 -69253 -62849 -15755 97889 230985 262234 -11521 -421894
14097d21894k1532k6097o9963L50348J42599k7397k63857l92075L10614L74412
14087d4842O4637J8145n1453l6166k15363k39380j8591J34132K06534J73238k71733
14076b80842m60270q459N5410j07501J74719O27979K98221l40622l68225J1959
14066c97631L60597p8457k29048J13328L60317o3213l41731p2155K1808M93761
14056A67576M14173o0114P0651L28218p3658k12010L830m0511l32596m71725k97464
14045e03630l35797k52076M89513Q87765L29743k82933k70233k533k32608n46164
14035g18953K22136M02081k9867l79724m97659l54881j19019L37239O24651M27895
14025h6101L7623q5543Q5719J29646j22630O1875L22633M0902J96943L48320L39801
$$ plain form
14097 -421894 -443426 -469523 -539486 -189138 -46539 -73936 -337793 -729868 -419254 -44842
14087 -44842 19795 37940 -13513 -49679 -265042 -504422 -523013 -388881 -182347 -9109 -280842
14076 -280842 -741112 -749571 -694161 -801662 -626943 1036 299257 -41365 -409590 -397631
14066 -397631 -37034 -115491 -344539 -231211 129106 65893 -275838 -347993 -326185 167576
14056 167576 581749 521635 592286 920504 846846 634836 638666 598155 265559 -206166 -503630
14045 -503630 -839427 -1091503 -601990 285775 615518 332585 62352 59819 -172789 -718953
14035 -718953 -496817 -94736 -124603 -504327 -1001986 -1356867 -1475886 -1138647 -513996 -86101
14025 -86101 -48478 -134021 -48302 81344 -41286 20589 343222 384124 581067 929387 1269188
14014A269188P0321J70064l3001m17962j31554m98977l12546J61662J60636M87546
14004I25377K21454m25918l13410k26825k46645j98371k76898k12434j42251o3662
13994i59583L3370K96869J22538k07232L9870K66373K56526J72996J18202j51497
13984a1568l72726j87578N51290K94550l48523j79894K76451K66336j3476j54190
13974A20672k85101p5342J07657j98771O5787L98132J40054l29758j28602L87018
13964B01746J93541l04443k77741l05365n4891K17106K75161k15222o33642o10747
13954a514497l06393k0588l0909K34139M52238L48816L08822L18845K50999K1934
13944F3406k76955J07393P5065Q000J00686L45041K19543l15262n69672m23112
$$ plain form
14014 1269188 1339509 1509573 1476572 1058610 927056 428079 115533 277195 437831 925377
14004 925377 1146831 720913 407503 180678 -65967 -264338 -541236 -753670 -895921 -959583
13994 -959583 -926213 -629344 -506806 -714038 -674168 -407795 -151269 21727 139929 -11568
13984 -11568 -384294 -571872 -20582 273968 -74555 -254449 22002 288338 274862 120672
13974 120672 -164429 -239771 -132114 -330885 -265098 133034 273088 -56670 -185272 201746
13964 201746 395287 90844 -186897 -492262 -547153 -330047 -54886 -270108 -903750 -1514497
13954 -1514497 -1820890 -1841478 -1872387 -1638248 -1186010 -837194 -528372 -209527 41472 63406
13944 63406 -213549 -106156 -31091 -23091 77595 422636 642179 326917 -242755 -665867
13934f65867l64399k2652J83047L83888M53940J19737p068K79283J33941j8031
13924D75819m11919l94500j37371j0869m9765L21486J04622j37254l6964j14101
13914c90816j46931j85838j14041j19091k95079j09398M2904M49046N80525K27713
13904f1006j47909k21019n3541L1922j12062J59862K417j41290k59931K41306
13894e61251N55598N04467N27194L16674l3554l68582j69204m30543m38793l1389
13884a29383m5108J13691M66442M05732K97165J26685M0163m09313o62693l13029
13874a09648J11416P1320r6068J4100J80812N1392K60464Q1402k79199k52843
13864C3148L49473M11431J76883K9027p0710j27533j06471l15845m14385l22054
$$ plain form
13934 -665867 -1030266 -1052918 -869871 -485983 -32043 87694 80626 359909 493850 475819
13924 475819 63900 -330600 -467971 -478840 -528605 -207119 -102497 -239751 -276715 -390816
13914 -390816 -537747 -723585 -837626 -956717 -1251796 -1361194 -1318290 -869244 -288719 -61006
13904 -61006 -208915 -429934 -483475 -451553 -563615 -403753 -401336 -542626 -802557 -561251
13894 -561251 -5653 498814 1026008 1342682 1309128 940546 771342 340799 -97994 -129383
13884 -129383 -174491 -60800 405642 811374 1108539 1235224 1275387 866074 203381 -109648
13874 -109648 1768 73088 -22980 -8880 171932 223324 483788 565190 285991 33148
13864 33148 382621 794052 970935 999962 929252 801719 695248 379403 -34982 -357036
13854c57036m01480j93127L16566O15313M7362k16095O2209L61523K86187m30264
13844I1158k50856K63607L6781k81211k23981J35012j6064p1371K10530N32745
13834D26350L77175k2930m79655m88095K03512p0563j89221J67817L28408j80226
13824G2572l36428k06201O0313K37056L94072M08790J68242L9781K06541K8075
13814A072813m87726m13582L0673j98315j37015J90689K12561L75290O022m01066
13804B50344M7775k09762n11158k43146k26385J57386L66923K81983m2435k70334
13794c98809K05806K97827M69477k21k32079k20936m9542L13737J73250l95423
13784A63087j03282R5062k37388j43390k15202k40157j62741l77628j28005L49663
$$ plain form
13854 -357036 -758516 -951643 -635077 -19764 27598 -188497 -126288 235235 521422 91158
13844 91158 -159698 103909 140690 -140521 -364502 -229490 -245554 -316925 -106395 426350
13834 426350 803525 780595 300940 -187155 16357 -54206 -243427 -75610 252798 72572
13824 72572 -263856 -470057 -409744 -172688 221384 630174 798416 838197 1044738 1072813
13814 1072813 585087 171505 202178 3863 -133152 57537 270098 645388 651410 250344
13804 250344 298119 88357 -422801 -665947 -892332 -734946 -368023 -86040 -128475 -398809
13794 -398809 -193003 104824 574301 574080 342001 121065 71523 385260 558510 163087
13784 163087 59805 154867 -82521 -225911 -441113 -681270 -844011 -1221639 -1349644 -999981
13774i99981K46424k69667k33774M8456J63042M00835Q6604L365L92668M34620
13764B72592K00725j0917m4247j87679j43758R8494r4112m3636r5979m61373k04372
13753g14262J27551K9912j57540o7260k3408l3519K54390J00502L7122L26816
13743a19696J89779R0850K74947l5154j16650l8914l14910N2918L67527J38562
13733D89259j09862J08794M33998j37961j22874j74917n42824n49493n998J1454
13723f00424j12913m3972K27085M92858n7232k33422j61191Q7327n8724q8698
13713e49306j33752J5075P4369l07436l00256j0415J81939l7219m35546q3414
13703a585961K68442J26985K34430L57211k2397m40282k25908j6036j3574N81929
$$ plain form
13774 -999981 -753557 -1023224 -1256998 -1208542 -1045500 -644665 -558061 -554696 -162028 272592
13764 272592 473317 462400 418153 230474 86716 185210 91098 47462 -48517 -509890 -714262
13753 -714262 -586711 -556799 -714339 -781599 -805007 -838526 -584136 -483634 -446512 -119696
13743 -119696 70083 160933 435880 400726 284076 245162 -69748 -16830 350697 489259
13733 489259 379397 488191 922189 784228 661354 486437 -56387 -605880 -611878 -600424
13723 -600424 -713337 -757309 -530224 -37366 -94598 -328020 -489211 -401884 -460608 -549306
13713 -549306 -683058 -667983 -593614 -901050 -1201306 -1211721 -1029782 -1067001 -1502547 -1585961
13703 -1585961 -1317519 -1190534 -956104 -598893 -621290 -1061572 -1287480 -1303516 -1317090 -735161
13693g35161O99472K41506m61204p01769j17064J22787M24430J47692l21939m62048
13683a163298j95368L11177N96388O06692L57283P3198l26614o47647j20997M7587
13673d61599q1278O3566J01740j58349k84207K81542N41165L3502q5632R4650
13663D5100j56076o2799L09138K7767k78075m38879m28236j76880j82330p1025
13653a412295N66433M04885L5313J8120j57427J44125j3350o73636k74185K92746
13643a069271K83295K08734M1781o8520N9744K14518J33820M36920k42617m04533
13633d06129k97599m2263M82084K5434n20476l62087K8354N4843J84228M93005
13623c60606k1268m92612l49679Q5849Q7523L42671Q37116M40032k66478l49595
$$ plain form
13693 -735161 -35689 205817 -255387 -957156 -1074220 -951433 -527003 -379311 -701250 -1163298
13683 -1163298 -1358666 -1047489 -451101 155591 512874 586072 259458 -388189 -509186 -461599
13673 -461599 -542877 -479311 -377571 -535920 -820127 -538585 2580 36082 -49550 45100
13663 45100 -110976 -173775 135363 163130 -114945 -553824 -982060 -1158940 -1341270 -1412295
13653 -1412295 -845862 -440977 -405664 -387544 -544971 -400846 -414196 -1087832 -1362017 -1069271
13643 -1069271 -785976 -577242 -535461 -603981 -544237 -329719 -195899 241021 -1596 -406129
13633 -406129 -703728 -745991 -263907 -238473 -758949 -1121036 -1092682 -1037839 -853611 -360606
13623 -360606 -381874 -874486 -1224165 -1138316 -1050793 -708122 128994 569026 302548 -47047
13613d7047J80317J72077k83942j4023k64274m54720m9600J5407l455K46972L00139
13602b02149k626m29089n01460r3943k39019K95614N79924L29250L0983l15455
13592e47970r5056K57591K78870J21983j07902o6906J12033Q8393k10418M0024
13582a29358R9738L27759J99697R9238n09134l66226K51295Q5761K89990L18631
13572F67391J51786M8679r0682j26458k32423j89870k03347P4822K50690M62802
13562H13390m11186m61177l4032k05957k18894o9903j43812N3932M87925N39888
13552C50174j97644l98226n64075n69801j44694J43274R0570L21160N25891K95338
13542a48033J70409k77118m9384L02972l08412n85401j67254m0160P3445P1994
$$ plain form
13613 -47047 133270 305347 21405 7382 -256892 -711612 -761212 -745805 -749260 -502288 -202149
13602 -202149 -204775 -633864 -1135324 -1229267 -1468286 -1172672 -592748 -263498 -232515 -547970
13592 -547970 -643026 -385435 -106565 15418 -92484 -159390 -47357 41036 -169382 -129358
13582 -129358 -29620 298139 497836 597074 87940 -278286 -26991 58770 348760 667391
13572 667391 819177 867856 777174 650716 418293 228423 25076 99898 350588 813390
13562 813390 402204 -58973 -93005 -298962 -517856 -587759 -731571 -677639 -189714 350174
13552 350174 152530 -245696 -809771 -1379572 -1524266 -1380992 -1290422 -969262 -443371 -148033
13542 -148033 22376 -254742 -304126 -1154 -309566 -894967 -1062221 -1102381 -1028936 -956942
13532i56942M60898P33355L02405r057l14325n04837o37997l9077J88143K18917
13522e58517L24434k28711j34439K36245O1760j75751j32197J20219N73587M57699
13512E44329j61271n57854l27631M7413J95059K47064n2874l41200o278j02243
13502e15486k57634j47040j18364K70489J99964R7904P3787r9498K44450L58711
13492A07283l02668n16101m8080L161K35892K28915j05991j4526P1965K71522
13482f8628J42997p1695k17622j79510l44117O2698K45000o7037M11538N4805
13472c1571l12348J05822M12801J27073J6813O42l9592l29730j39560k4678k45036
13461d59364j34952J18601j32962m77759p1649L04102K66737K40260K66616L58346
$$ plain form
13532 -956942 -496044 237311 539716 530659 216334 -288503 -926500 -965577 -777434 -558517
13522 -558517 -234083 -462794 -597233 -360988 -299228 -474979 -607176 -486957 86630 544329
13512 544329 383058 -174796 -502427 -455014 -259955 -12891 -65765 -406965 -413243 -515486
13502 -515486 -773120 -920160 -1038524 -768035 -568071 -470167 -396380 -495878 -251428 107283
13492 107283 -195385 -711486 -759566 -756405 -520513 -291598 -397589 -412115 -340150 -68628
13482 -68628 74369 2674 -214948 -394458 -738575 -675877 -430877 -497914 -86376 -31571
13472 -31571 -343919 -238097 174704 301777 318590 319232 279640 -50090 -189650 -214328 -459364
13461 -459364 -594316 -475715 -608677 -1086436 -1158085 -853983 -587246 -346986 -80370 277976
13451B77976J09353J23667K69184J2394k13392J9129N751k02532j04957Q9305
13441C85878k26870K13499M32286k73156n35514l16381k61342m5358K57539j03509
13431d72928q380P1405p6652K2528J81197N70827L32571k80057n11115o21692
13421g92296j55584J98131m1383K65030n3963L6635L63700Q8358r1201k17430
13411d00003k56071j65528m7563P4203K37372L23549R4439j43510j03122m08411
13401g94645m61801o2784R1345J72307M80669K97592j69813j08448N5708J97275
13391c02595j93916l76040O4326j1872j40972K32996K38848l4740r7939L38000
13381b83904k1328j52937J45425N16284L41808K18380k53695j98465j04197q7467
$$ plain form
13451 277976 387329 510996 780180 792574 579182 598311 604062 401530 296573 385878
13441 385878 159008 372507 804793 531637 -3877 -320258 -581600 -626958 -369419 -472928
13431 -472928 -481308 -409903 -486555 -464027 -282830 287997 620568 340511 -170604 -792296
13421 -792296 -947880 -749749 -791132 -526102 -580065 -543430 -179730 -91372 -182573 -400003
13411 -400003 -656074 -821602 -869165 -794962 -557590 -234041 -139602 -283112 -386234 -794645
13401 -794645 -1256446 -1319230 -1227885 -1055578 -574909 -277317 -447130 -555578 -499870 -302595
13391 -302595 -496511 -872551 -808225 -820097 -961069 -728073 -489225 -523965 -621904 -283904
13381 -283904 -305232 -458169 -312744 203540 545348 763728 510033 311568 207371 119904
13371A19904j0141m29412k84898P9024K69096l28685k87544k2296o9406j5200
13361i79558j94422J2336J88462M24028M15312K11916L08493k74688n70065J61925
13351b96261L57660l6203J85651J07237J5833Q0057l55752m05807R5385q0686
13341c32886l07436J923j42869q0899K64639O40328M55810J31513k09486l81794
13331C8843Q0458L34443j547j06091R9336j8517K35733j57673o12183m87673j99257
13320g94128K46840N25851L07877j39037l36246j86357l79266P2534N09595P05042
13310E32705L95761m95242o22486l07476j34293J46883K65594L19029L1107p3163
13300E8419L51182J59620k75406J35775J23719L5168J33370O6237M8332j56467
$$ plain form
13371 119904 109763 -319649 -604547 -525523 -256427 -585112 -872656 -894952 -964358 -979558
13361 -979558 -1173980 -1161644 -973182 -549154 -133842 78074 386567 111879 -458186 -296261
13351 -296261 61399 25196 210847 318084 333917 413974 58222 -347585 -252200 -332886
13341 -332886 -640322 -638399 -781268 -862167 -597528 42800 498610 630123 420637 38843
13331 38843 119301 453744 452197 346106 445442 426925 662658 504985 -107198 -594871 -794128
13320 -794128 -547288 -21437 286440 147403 -188843 -375200 -754466 -681932 -172337 532705
13310 532705 928466 433224 -189262 -496738 -631031 -484148 -218554 100475 131582 58419
13300 58419 409601 569221 293815 429590 553309 588477 721847 788084 836416 679949
13290F79949j86954j3297K5513Q1270k07391m97920j78508K99580L71246j8560
13280C54928N3009J5633J22242J25251L55615L645j91448j89748j06834K68952
13270H11245K49486q4403o02601m77785N5528L72541L42976J93600j67733j5574
13260F77280M61868J41007m1170N4638n55381m51445k04063p3157l10193k81322
13250e81938J57649P0437o3027M17284N67015n7417k81197J89669J02593L91016
13240I12084M73885K37312j93115l91702M24092K18984j63935k35374l70836m40701
13230D70694k50706j3444j79547m7590J96214o5804N2510J38546o343l55593k89978
13219c51041m5064k60571k20872o5084L9696K19599O49436P83495J08580j60459
$$ plain form
13290 679949 492995 479698 505211 586481 379090 -118830 -297338 2242 373488 354928
13280 354928 407937 423570 545812 671063 1026678 1030323 838875 649127 542293 811245
13270 811245 1060731 976328 373727 -104058 -48530 324011 666987 860587 692854 677280
13260 677280 1139148 1280155 1238985 1293623 738242 286797 82734 9577 -300616 -581938
13250 -581938 -424289 -353852 -416879 405 567420 510003 228806 418475 521068 912084
13240 912084 1385969 1623281 1430166 1038464 1462556 1681540 1517605 1282231 911395 470694
13230 470694 219988 206544 26997 -20593 175621 109817 162327 300873 294530 -61063 -351041
13219 -351041 -396105 -656676 -877548 -942632 -902936 -683337 -33901 749594 858174 697715
13209F97715K5237J92343L59422j26259l34891o6175q0396j44964o09590j46067
13199b33625J08158M0323n7459K1460J00988M16033M19266k40520j90696O4206
13189D48134M14185P0022j66758j09319k00303l29761P2109K13221o3805K12186
13179E59911K35070N0324R764j16251j31859p7619k10927j85888R2290K47644
13169D72459J31038J52542L50307J11120j31710j92226j80030l32331l16284m87445
13159d22560j68369J01976K83709K12875O9767r9092L2725M6608m571N89397K85610
13148I28075m49057k18828Q7387P1877K18066n5413p013L03440K73163q8042n47246
13137E16409n63104J35057M33325J62445r5239J13818k40L6444K47267K23810
$$ plain form
13209 697715 722952 915295 1274717 1148458 813567 747392 666996 522032 -87558 -233625
13199 -233625 -125467 -85144 -142603 -121143 -20155 395878 815144 574624 383928 448134
13189 448134 862319 932341 765583 656264 455961 126200 198309 411530 347725 559911
13179 559911 794981 845305 855069 738818 606959 529340 318413 132525 224815 472459
13169 472459 603497 756039 1106346 1217466 1085756 893530 713500 381169 64885 -422560
13159 -422560 -590929 -488953 -205244 7631 77398 -21694 11031 57639 53068 642465 928075
13148 928075 479018 260190 347577 419454 637520 582107 575094 878534 1151697 1063655 516409
13137 516409 -46695 88362 521687 684132 588893 702711 702471 738915 986182 1209992
13127A209992J98735k36820l28919j85393o0267j46496o6849J34297L90979J87903
13117A097162J59447j4087n92200m24234N0010K09416J17799M83432N27924K41743
13107A856412m4204o39789m31989o7582m39581l61243L80355O21392K13063j57806
13097I29028j14438j01772j60357p8520J42947J98595K3447p0005J77530J32282
13087A078737J48709M30196J89581j05455l48897k48057R9283J45678n2761k94162
13077A042852j23286K22099N20201M52365j25219k6635J09675j33518K7986K52782
13067B219302j94055j25279J43582J41788j69604k79367l3090j31712l1729K72680
13057A812516p859l96445l26636K47092L43061K40574L77985K4685O6623R7530
$$ plain form
13127 1209992 1408727 1171907 842988 657595 597328 450832 383983 518280 909259 1097162
13117 1097162 1256609 1242522 650322 226088 276098 485514 603313 1086745 1614669 1856412
13107 1856412 1812208 1172419 740430 672848 233267 -127976 252379 873771 1086834 929028
13097 929028 814590 712818 552461 473941 616888 815483 838930 768925 946455 1078737
13087 1078737 1227446 1657642 1847223 1741768 1392871 1144814 1244097 1389775 1337014 1042852
13077 1042852 919566 1141665 1661866 2114231 1989012 1962377 2072052 1938534 1966520 2219302
13067 2219302 2025247 1899968 2043550 2185338 2015734 1736367 1703277 1571565 1539836 1812516
13057 1812516 1804657 1408212 1081576 1328668 1671729 1912303 2290288 2314973 2381596 2479126
13047B479126j81262j64310j32322l74678j70343K8389K08174N52841L35672J63511
13037B744798r3468j69378k29318p6263q3714m8964K76670N07027K24948K5954
13027C078292K36628K99178M60281j9102m02857J63395L90232J46665j7173M4643
13017D380182L7130L42633O36034K80927L13075K58693k7915j68034O3336M71208
13007F587269N71979M29153K81675N74999N98578L15618L16741N87246O71449
12998A0934707Q38273J364282J774669J794556J803879K532556K668799K990472
12990B6702193L891913N310755O959086Q294105R940200J2734430J6214310K0908616
12982A10955608K7645556L6845054M8738518O2225246O7857012M7303481j171644
$$ plain form
13047 2479126 2297864 2133554 2001232 1626554 1456211 1484600 1692774 2245615 2581287 2744798
13037 2744798 2651330 2481952 2252634 2176371 2092657 2043693 2320363 2827390 3052338 3078292
13027 3078292 3314920 3614098 4074379 4055277 3652420 3815815 4206047 4352712 4335539 4380182
13017 4380182 4417312 4759945 5395979 5676906 5989981 6248674 6220759 6052725 6116061 6587269
13007 6587269 7159248 7588401 7870076 8445075 9043653 9359271 9676012 10263258 10934707
12998 10934707 11772980 13137262 14911931 16706487 18510366 21042922 23711721 26702193
12990 26702193 30594106 35904861 42863947 51158052 61098252 73832682 90046992 110955608
12982 110955608 138601164 175446218 224184736 286409982 354266994 401570475 400398831
12975D00398831m7073794o3906829n8037706m5955893l5247417k7463123k1379583
12968A01334486j6136860j2161537r742331p923117o685335n692981m696477m116641
12960C4179207l594049l244511k487944k032067j669881j070800j004820j320163
12952A7754972j377633q29134p83510j031333r06485r33205r45604m63632n65159
12943I919277m02883l3744n2457k18243m00111m67871k66125J14556K49818M11294
12933H853511O4762m4771K93596M58730M91112J41865j60527j53638M02446O10697
12923A0957783N26181O92456Q61598J634072K547143K122565P15503m43309p78371
12914A8835621r14417m68443J53008J06797K35393J090971J814422J769985J865030
$$ plain form
12975 400398831 353325037 289418208 231380502 185424609 150177192 122714069 101334486
12968 101334486 85197626 73036089 63293758 55370641 48685306 42992325 38295848 34179207
12960 34179207 30585158 27340647 24852703 22820636 21150755 20079955 19075135 17754972
12952 17754972 16377339 15548205 14764695 13733362 12826877 11893672 10948068 10484436 9919277
12943 9919277 9516394 9482650 9430193 9211950 8811839 8343968 8077843 8192399 8442217 8853511
12933 8853511 8918273 8873502 9167098 9625828 10116940 10258805 10098278 9944640 10347086 10957783
12923 10957783 11483964 12176420 13038018 14672090 17219233 19341798 20057301 19613992 18835621
12914 18835621 17921204 17452761 17605769 17712566 17947959 19038930 20853352 22623337 24488367
12905B4488367K450115L683287M655345N611989O777641Q347028J0482044J3042172
12897G9537988J6226529K0961036K8739502L9267150N2629425O6465111O9187676
12890C73014417M1894275j2455567n5278450o5959359n7732805m5087394l3821559
12883A44573558k5437476j9778204j5663872j2605447j0038549p780306o316891
12876D6952813n475024m675891l647112l134040l119894k429739j782611j544985
12868B1143517j575013j437874j067707j276655q75905n25157m89054p23302r00658
12859A2272192r23683n68963j24572j94208L6832j45682r18668n72272L1196j66467
12849H725705m04018m96493R3816L24341n43030l71565N8943J39620J63154O5229
$$ plain form
12905 24488367 26938482 30621769 35277114 40889103 47666744 56013772 66495816 79537988
12897 79537988 95764517 116725553 145465055 184732205 237361630 303826741 373014417
12890 373014417 414908692 402453125 347174675 281215316 223482511 178395117 144573558
12883 144573558 119136082 99357878 83694006 71088559 61050010 53269704 46952813
12876 46952813 41477789 36801898 33154786 30020746 26900852 24471113 22688502 21143517
12868 21143517 19568504 18130630 17062923 15786268 14910363 14385206 13896152 13172850 12272192
12859 12272192 11348509 10779546 10654974 10460766 10497598 10351916 9433248 8860976 8892172 8725705
12849 8725705 8321687 7825194 7919010 8243351 7700321 7328756 7387699 7527319 7690473 7755702
12839G755702M06186K74829j93166j72984l0782J98247O86168N31415L39652O12984
12829A0408251M89344L74134L27271N37649Q86153J189716J322590J378377J918953
12820A8832438K276622K758127L240964L654456N053903O466434P169853Q552927
12812E8005724J0736038J3390664J7650714K3253653L0987117M1286641N4226393
12805B49536944O5823107O2975963L0245435k1680078n7567381o3920026n4740048
12798B10673916m2450864l1691326k4000906j8529551j4183536j1761428j0258878
12791E7797427q133646o402125n258824l966553l339705k819157k270470k261234
12783B3345713k111436j922584j732985j491598j448401j106738j015413o92316
$$ plain form
12839 7755702 8161888 8436717 8243551 8070567 8039785 8238032 8924200 9455615 9795267 10408251
12829 10408251 10897595 11271729 11599000 12136649 13022802 14212518 15535108 16913485 18832438
12820 18832438 21109060 23867187 27108151 30762607 35816510 42282944 49452797 58005724
12812 58005724 68741762 82132426 99783140 123036793 154023910 195310551 249536944
12805 249536944 315360051 378336014 408581449 386901371 329333990 265413964 210673916
12798 210673916 168223052 136531726 112530820 94001269 79817733 68056305 57797427
12791 57797427 49663781 43261656 38002832 34036279 30696574 27877417 25606947 23345713
12783 23345713 21234277 19311693 17578708 16087110 14638709 13531971 12516558 11824242
12775A1824242n03628n58070n25888q31261p68369m00791o3198l54458r32657
12766F885922o91866j77020Q8044L45033L60760l09859n09575k52995j77810K5500
12756E586134k4359l56735p92425l80992j19291l92531K5612l4979k98384K32392
12746C444442L04633o9477l39475l11077j38617k50120k76416O4045J91741m57
12736B619222Q4314l2724j77093L308O295o6789J05092K70991l72728p02609J17879
12725A855158P39952N05364J03100o49572p89741j65425K23590J3499m735l05617
12715A525573m17055k35305N4872K86819M28338M4400K94303K00840j19777j74524
12705A888484j11663k5051j97800m18525j97147q3809l41025l54467l67530j69860
$$ plain form
12775 11824242 11320614 10762544 10236656 9405395 8637026 8236235 8173037 7818579 6885922
12766 6885922 6194056 6017036 6105080 6450113 6810873 6501014 5991439 5738444 5560634 5586134
12756 5586134 5561775 5205040 4412615 4031623 3912332 3519801 3545413 3510434 3212050 3444442
12746 3444442 3749075 3679598 3340123 3029046 2890429 2640309 2363893 2427938 2619679 2619222
12736 2619222 2703536 2670812 2493719 2497027 2503322 2436533 2541625 2812616 2439888 1737279 1855158
12725 1855158 2595110 3100474 3203574 2554002 1764261 1598836 1822426 1835925 1831190 1525573
12715 1525573 1108518 873213 928085 1214904 1643242 1687642 1981945 2182785 2063008 1888484
12705 1888484 1776821 1751770 1553970 1135445 938298 854489 513464 158997 -208533 -378393
12695c78393O8104k31851l80203j52999K06488N78120O00907R1596l19657k37986
12685a55874J76637K91293K17580J56829L41130O6556j56384J55517k41723k55213
12675E96348q6085Q1260J96197O06608N70199K0659q599m86775p63856k36097
12665D89859n7671j45019J15249K03741l6538j73930j4022K9933J34446Q7938
12655F33986l1151J07154K48002L69704K41630K2279k23881n69873n53974l89197
12645a45321R0415L06354K06753M76748L16036m14872j64984M03934L73077L35092
12635A783232j54888l2897j21067j46538j542j11490K08289L41955O0972j92450
12625A633576j52850j31548l42951j80059M06315K19986k26014j56610p5211j72694
$$ plain form
12695 -378393 -310289 -542140 -922343 -1075342 -868854 -290734 310173 401769 82112 -155874
12685 -155874 20763 312056 529636 686465 1027595 1094151 937767 1093284 851561 596348
12675 596348 510263 591523 787720 1394328 1964527 1985186 1976587 1489812 725956 489859
12665 489859 432188 287169 402418 606159 569621 395691 381669 411602 546048 633986
12655 633986 602835 709989 957991 1327695 1569325 1591604 1367723 797850 243876 -145321
12645 -145321 -54906 251448 458201 934949 1250985 836113 671129 1075063 1448140 1783232
12635 1783232 1628344 1595447 1474380 1327842 1326300 1214810 1423099 1765054 1826026 1633576
12625 1633576 1480726 1349178 1006227 826168 1232483 1452469 1226455 1069845 994634 821940
12615H21940l5214K13514R7141l71111l67546j13454M84454N63687R9817j57848
12605A235380j10988j00970j5101j04755k46716m07515j17980q401N0057L90353
12595E63364P4413O0094p5598k26027J42352M51826L76326L03096l60350p54605
12585E54891l01211J16523L32285p0514q04881p82608o0498M83972N4457k6715
12575e04299L52512J65458O9726n3455Q6905J79384K73773L24604j99218j80033
12565E15357J74401M17915j4042n85126l07320J86800J21227N4178k2825p5729
12555D64836l0571O6971O3590j43323K12365L36896l5547j11095k34337m50436
12545A39349j25385J19604k21049P6553j06360j6701K56259J96017J62225K74746
$$ plain form
12615 821940 786726 1000240 1097381 726270 358724 245270 729724 1293411 1393228 1235380
12605 1235380 1124392 1023422 1008321 903566 656850 249335 131355 122954 173011 563364
12595 563364 637777 697871 622273 396246 538598 990424 1366750 1669846 1309496 554891
12585 554891 253680 370203 702488 631974 -172907 -955515 -1016013 -532041 -477584 -504299
12575 -504299 -151787 13671 83397 29942 116847 296231 570004 894608 695390 515357
12565 515357 689758 1107673 1093631 508505 201185 387985 509212 563390 540565 464836
12555 464836 434265 501236 564826 421503 633868 970764 935217 824122 589785 139349
12545 139349 13964 133568 -87481 -10928 -117288 -133989 122270 318287 480512 755258
12535G55258L61387K87658j53928l51534k53092j22533J63518K58850q7824l3477
12525H24283P7137J70668j04227l09983L4370l88681k76211j30057k75446j69055
12515e47202K99430M26977k88675J03646m4999k07938r5627K97353J06613J55060
12505B04638J68245o7643o074M7486K91695L44786r1567k95459o1110k56589l75529
12494i7121j1357L04874J49619K80422o6351m62785o8509L16945J61033j77364
12484C29406j77635L97232L01561k88003n68474j99104K65839K84961M6213J79529
12474E71525P13523M10452o01393k92958R9798j0573p8746j74746k05141m70824
12464c9083m50872j44093L3312J38012M41420P0273l9885L41120L3748k44143
$$ plain form
12535 755258 1116645 1404303 1250375 898841 645749 523216 686734 945584 857760 824283
12525 824283 901420 1072088 967861 657878 692248 303567 27356 -102701 -378147 -547202
12515 -547202 -247772 179205 -109470 -5824 -50823 -258761 -354388 -57035 49578 204638
12505 204638 372883 305240 299166 346652 638347 983133 891566 596107 534997 278408 -97121
12494 -97121 -108478 196396 346015 626437 560086 97301 28792 345737 506770 329406
12484 329406 151771 549003 850564 562561 -5913 -205017 60822 345783 391996 571525
12474 571525 1285048 1695500 1094107 801149 900947 890374 811628 636882 431741 -39083
12464 -39083 -489955 -634048 -600736 -462724 -21304 48969 9084 350204 383952 139809
12454A39809m71851m25313k92294O3571J70053J65855J34958K57931P4137L21476
12444A38332Q7800k68605k12404j40540K41297M94643O36774L97554q966k39623
12434A126262j3681l1308P7047J41376l34992p03266l08609k2269R8418J78285
12424B07263q0202l21064P860N36948o412j51365J23690j42580j72781m7998j00492
12413a47133J8742L51239K30469j29397K0081K7850J74514P5069l19179j95786
12403A06469l3994p170l3035J34870j499k41996k48551J03572J66084J661l3459
12392h7048J82046L07829J79009q9289k29999j92626J25943L82072J7949J58237
12382G54123J30400k01650p17000p94079J36773L13687j37023K05265N48004K88728
$$ plain form
12454 139809 -332042 -757355 -1049649 -986078 -816025 -650170 -515212 -257281 -183144 138332
12444 138332 226132 -42473 -254877 -395417 -154120 340523 977297 1374851 1365885 1126262
12434 1126262 1112581 1081273 1158320 1299696 964704 261438 -47171 -69440 28978 207263
12424 207263 127061 -194003 -186143 350805 344393 193028 316718 174138 1357 -46641 -147133
12413 -147133 -128391 222848 453317 323920 344001 371851 546365 621434 302255 106469
12403 106469 72475 65305 32270 167140 165641 -76355 -324906 -221334 -55250 -53589 -87048
12392 -87048 94998 402827 581836 492547 262548 69922 195865 577937 595886 754123
12382 754123 884523 682873 -34127 -828206 -691433 -377746 -514769 -309504 238500 527228
12372E27228j95089M8003K58208p1354k53929j38914N9523l71662k23032k65270
12362f26288j17209Q8560o4508k50261p9254L01274M34910L75853j6742p9658
12352c3323K43889O29029K0389l22346m51207r6212K00464k9799K35325L5826
12342D32035l57536K54312K07699m20780m44656J76623K96379J67009K5480j20624
12332B15941Q4228J48293K39204N9476k65677M5396l62975l81963J57161L08736
12322B47820o6073j20340P2661R4681j67717k35471J2782J23532Q3765q3859l00049
12311c38268O3438K54858R236q6469M36827L99618l34299k21886k97040k50383
12301c64368J88396K67065O975M95958L74250k12300N1824k21320j00923j21894
$$ plain form
12372 527228 332139 380142 638350 566996 313067 174153 233676 -137986 -361018 -626288
12362 -626288 -743497 -654937 -719445 -969706 -1048960 -747686 -312776 63077 46335 -33323
12352 -33323 210566 839595 859984 537638 86431 -9781 190683 160884 396209 432035
12342 432035 74499 328811 536510 115730 -328926 -152303 144076 311085 336565 215941
12332 215941 300169 448462 687666 747142 481465 526861 163886 -218077 -60916 247820
12322 247820 181747 61407 134068 228749 61032 -174439 -161657 -38125 45640 -38219 -338268
12311 -338268 -274830 -19972 -10736 -97205 339622 739240 404941 183055 -113985 -364368
12301 -364368 -175972 91093 98068 594026 968276 755976 807800 586480 485557 363663
12291C63663m72393K2094Q705J13206J79912o6293J44031L46846K26273l4879
12281H31165m99107k65779M40581O3022k13180o2693o3269j00037k32921l7853
12271a40071K28943Q2167j44215j92091J89047L73320L73459K85704m20394m71685
12261A64184R7961R9113K75753K18244j86042n03388l05744k15311j54653J70426
12251c39457K31792Q8807P5780K01744j60417j74402j12665R9066j42971J82012
12241e0711K88831K93361Q7810k03611Q632O6338j79913J02619M2143o90787p20475
12230i55763P097L15971J46062K75843r5447j95300M1414R3668J17866K246Q0779
12219a65564r6297m6635K52715L76841K6738J54223m0071l50563j00568L3607
$$ plain form
12291 363663 -108730 -86636 -77931 35275 215187 148894 292925 639771 866044 831165
12281 831165 332058 66279 506860 569882 356702 294009 230740 130703 -102218 -140071
12271 -140071 88872 171039 26824 -165267 23780 397100 770559 1056263 635869 164184
12261 164184 262145 361258 637011 855255 669213 165825 -139919 -355230 -509883 -339457
12251 -339457 -107665 -18858 56922 258666 98249 -76153 -188818 -89752 -232723 -50711
12241 -50711 238120 531481 619291 415680 424312 490650 310737 413356 455499 -235288 -955763
12230 -955763 -948666 -632695 -486633 -210790 -306237 -501537 -460123 -366455 -248589 -246343 -165564
12219 -165564 -261861 -308496 -55781 321060 347798 502021 461950 111387 10819 44426
12209D4426O4790L85537M98174K23299j10541o152j77189p9797k15523k82532
12199C44492n8870L03945K24679J74396J10430k41541k70248l06606j43213j78959
12189d1495l5317K36342L4449k14234j80575L75993r5147k80048j59050k1428
12179c80510q7496k29492O9651M07374M26681N05348K90943l33454k62967o6493
12169C39585K9236J52612j16156l6122n9169N9485J91443l38433l04663J47792
12159F5610M26951m2460j20900j76444j33184O6768K48056k39493P1173J12921
12149B78998K52139M01759j50770m00006n49232k83612K4515L07010L60059M49720
12139F90580L09555o7849J61048j33872m97792m85045k10778M5161J10161P6873
$$ plain form
12209 44426 109216 494753 992927 1216226 1105685 1099533 922344 842547 627024 344492
12199 344492 285622 589567 814246 988642 1099072 857531 587283 280677 137464 -41495
12189 -41495 -76812 159530 193979 -20255 -200830 175163 80016 -200032 -359082 -380510
12179 -380510 -468006 -697498 -627847 -220473 206208 711556 1002499 669045 406078 339585
12169 339585 368821 521433 405277 369155 309986 369471 560914 222481 -82182 65610
12159 65610 492561 450101 329201 152757 19573 86341 334397 94904 166077 278998
12149 278998 531137 932896 782126 382120 -167112 -450724 -426209 -119199 240860 690580
12139 690580 1000135 932286 1093334 959462 461670 -23375 -234153 -188992 -78831 -1958
12129a958j7516P9117o6423m33556m9098L57892K78736L0765Q2989L11393K74757
12118H47098R7711l07442j70727K19109K99041O2956m33617k18017l15197j38341
12108e7426J44498L26973L13979k203j20805M76566O52866j28492n93755m78201
12098E34000m01067l28195n4758M027o7120R4818K14783J2508K5855j1427k30801
12087b07377n43169j93402K59424L24552N1080J6663N811k9J45635K83969K18603
12076C61760R5283n2978J53209J61810K37441L25247k77618q19740l41220K01925
12066D5119L43991j7443l14493J21029p5225j80756N8687L46306J09767K76072
12056G13054O7040m31515m78969k45274J77605K50155K61454l66538n60513j62246
$$ plain form
12129 -1958 -19474 59643 -6780 -440336 -489434 -131542 147194 177959 260948 572341 847098
12118 847098 944809 637367 466640 685749 984790 1047746 614129 396112 80915 -57426
12108 -57426 87072 414045 728024 725821 605016 1081582 1734448 1605956 1012201 534000
12098 534000 132933 -195262 -250020 -245993 -313113 -218295 -3512 8996 34851 23424 -207377
12087 -207377 -750546 -943948 -684524 -359972 -308892 -292229 -286418 -286447 -140812 143157 361760
12076 361760 457043 404065 557274 719084 956525 1281772 1004154 184414 -156806 45119
12066 45119 389110 371667 57174 178203 102978 -77778 -19091 327215 436982 713054
12056 713054 780094 348579 -130390 -375664 -198059 52096 313550 -52988 -613501 -775747
12046g75747J18858L46119N5595M873L5988K5337J47032K12483O5166K59073q0070
12035D14707n37278L1303M52206L36778J30208J38854J01350k9253j32382j89891
12025G16602J90905K55897K54809j18797m16892k2782m0966m39617m27562o1208
12015a09611J05009k31338l08306k41921Q5131J50735Q2937K27539l5964L02469
12005B6680N82286K03879k99331n18317k80537j33126K2620J12304J88142m3528
11995a38928j98608j08947p8533l5221M6931J76143J41495l17597n70729k94441
11985a378435J17646M18796L60644L2090p1059J99633M51890L22944K29257L16854
11975A000260J88942J3207k84929k66200j14278J0982j73914k28031m82671k91858
$$ plain form
12046 -775747 -656889 -310770 -255175 -250302 -214314 -188977 -41945 170538 235704 494777 414707
12035 414707 -122571 -91268 360938 697716 827924 966778 1068128 1038875 906493 716602
12025 716602 907507 1163404 1418213 1299416 882524 859742 818776 379159 -48403 -109611
12015 -109611 -4602 -235940 -544246 -786167 -701036 -550301 -467364 -239825 -275789 26680
12005 26680 608966 812845 513514 -4803 -285340 -418466 -395846 -283542 -95400 -138928
11995 -138928 -337536 -446483 -525016 -560237 -513306 -337163 -195668 -513265 -1083994 -1378435
11985 -1378435 -1260789 -841993 -481349 -449259 -520318 -320685 131205 454149 683406 1000260
11975 1000260 1189202 1202409 917480 651280 537002 547984 374070 146039 -336632 -628490
11965f28490K88441L60570Q8745J44187J6797J62344K49871L06901M26871O9846
11955A486083l03583m14343l76192m40622j43505J23704J49563Q712j3800k964
11945G3053Q0555M64498N48862J03792m97158l37821N56430K46817l33604O494
11935I11918J48891r4704l89666l30578p8854J70100J22441r0286O8173M9466
11925D86901j84946o6779J5877j00686k9680K02183K55213L8289k87935M4384
11915C72821J94072o5853j01821P6870K85445L6291j16170P3397N3937k90323
11905E18666j60657L2313O8176j15324l00950n9867N9767k4154j1281j55764j8425
11894a67500N985l1401k35437k7108L91406K08747K10512J93740J2636l65401
$$ plain form
11965 -628490 -340049 20521 109266 253453 270250 432594 682465 989366 1416237 1486083
11955 1486083 1182500 768157 391965 -48657 -192162 -68458 81105 89817 76017 73053
11945 73053 153608 618106 1166968 1270760 773602 435781 992211 1239028 905424 911918
11935 911918 1060809 966105 576439 245861 167007 337107 459548 369262 437435 486901
11925 486901 301955 235176 251053 150367 120687 322870 578083 616372 328437 372821
11915 372821 566893 501040 399219 476089 761534 797825 681655 755052 808989 518666
11905 518666 358009 390322 458498 343174 42224 -17643 42124 17970 6689 -149075 -167500
11894 -167500 -161515 -192916 -428353 -455461 -64055 144692 355204 548944 561580 196179
11884A96179m74384l26956k37060J45901K99304K16538J05504Q7743K35664k723
11874B45710m89932j13925M38112M17392L03302R3278k22453l35570l46873N2201
11864D1242L75266M15603K37453J40827j37169l60035k04180k00443m018J41017
11854D45563K39299k56713l92041j4205Q9505k31296m06025r8100N24419R5999
11844c595m72046j80998J86119k08957j14589N21465J91643l7906K44546K24576
11834C50258J87399J17606m23498q53360k81456M19176K43514R8212o1121J42048
11824f1222J80336j36943l43604j42092l2853M9151O0491K96799K66702J12488
11814B49253J28230j76619Q5512L0010l06527k09879q3747J80106O9395k11840
$$ plain form
11884 196179 -278205 -605161 -842221 -696320 -397016 -180478 -74974 12769 248433 245710
11874 245710 -244222 -358147 79965 497357 800659 893937 671484 335914 -10959 41242
11864 41242 416508 832111 1069564 1210391 1073222 713187 509007 308564 304546 445563
11854 445563 684862 428149 36108 21903 111408 -119888 -525913 -624013 -99594 -3595
11844 -3595 -475641 -656639 -470520 -679477 -794066 -272601 -80958 -118864 125682 350258
11834 350258 537657 655263 231765 -621595 -903051 -483875 -240361 -142149 -203270 -61222
11824 -61222 119114 -17829 -361433 -503525 -536378 -487227 -426736 -129937 136765 249253
11814 249253 377483 200864 286376 316386 9859 -200020 -283767 -103661 -34266 -246106
11804b46106p010J24893J9925P0678K46864L77718M69806n2744o34606n60238
11794a90820J47798N1044l80279k16020j2983N6404M27798K34175j55000L1740
11784f143P4030m9025M5763J01537N4680m3496J77353K9167k05853m8269l78920
11773b49176l37224K44879N20828N05846L62530j78136o34271l92117l69453k67662
11763g93956j61454J36354J21131m3919k9523J46035K77901J84134k69470o87237
11753a120004l86821L17416Q81462O33753n94069p851N48283J47918q200l74266
11743C7621j61235Q0326l45157k64555L61887N85730N9726j32860N977l26652
11733i9192k69193K67765M41149K81102R5280k74553k91864j58148l08824k43299
$$ plain form
11804 -246106 -253116 -128223 -108298 -37620 209244 586962 1056768 1004024 369418 -190820
11794 -190820 -43022 8022 -372257 -588277 -601260 -544856 -117058 117117 -37883 -6143
11784 -6143 67887 18862 64625 166162 220842 177346 354699 383866 178013 129744 -249176
11773 -249176 -586400 -341521 179307 685153 1047683 869547 235276 -156841 -526294 -793956
11763 -793956 -955410 -819056 -697925 -741844 -771367 -625332 -347431 -163297 -432767 -1120004
11753 -1120004 -1506825 -1189409 -307947 325806 -268263 -276114 272169 420087 411887 37621
11743 37621 -123614 -43288 -388445 -653000 -291113 294617 354343 221483 227460 -99192
11733 -99192 -368385 -100620 340529 621631 716911 442358 150494 -7654 -316478 -559777
11723e59777K0367L13047K36734l3906K42801K30524J36925J33K80670r3729n44879
11712B28910k50328J97123N9826j41911r342r5171j08659j0003l85366k77944
11702g92865L383R4180J88108M49309m8745J176l814k64699P1079J67033k00164
11691c36019l70277j23495J31728L82416K28109J32639M07057n415k05118k28296
11681A3329K39J47053l0581K38350M04563K60572K75j86784j9679P2036n2430
11670H46943J77349j91002m31092k35191N6243J0096l33802N6204J75660K22024
11660C53432K78507J47350m2447N429j49552j59781j92576r7289P7247L47376
11650E67696J52479k17803k08200o36768o80276O8135O72964R0288k45709m7748
$$ plain form
11723 -559777 -539410 -226363 10371 -23535 219266 449790 586715 586848 867518 773789 228910
11712 228910 -21418 175705 235531 93620 84278 -10893 -119552 -129555 -514921 -792865
11702 -792865 -789482 -695302 -507194 -57885 -106630 -105454 -109268 -373967 -302888 -135855 -336019
11691 -336019 -706296 -829791 -698063 -315647 -87538 45101 452158 446743 241625 13329
11681 13329 13568 160621 130040 368390 772953 1033525 1033800 847016 827337 899373 846943
11670 846943 1024292 833290 402198 167007 223250 233346 -100456 -44252 131408 353432
11660 353432 631939 779289 736842 742271 592719 432938 240362 143073 220320 567696
11650 567696 720175 502372 294172 -342596 -1022872 -954737 -281773 -191485 -437194 -484942
11640d84942L20088L13241L22757j4365m07038k79607k33311j52595K56454L31117
11630b8201K13852J66696J64372J1630k69814l50789j34203L95081M86337J44206
11620G99167j28984j60880m38258l77968o0393K15441L13928o0424k8581K14378
11610B87426J01281J9201M27622M56184k46598o14831k38175K68367Q4479o0901
11600D84055j04090l47182k14269j62114j3842K9920M76107N07092j90736k04782
11590B60159j07989j73892j37660P1269m7195J06406M75590J65352n7812j15166
11580D39062m08948k65006Q8680l132k03132n758O2210L1956Q6118K45917J91847
11569B59814k38719l75530n6024L66643J09443j15768q0633J97044j30574j88021
$$ plain form
11640 -484942 -164854 148387 471144 456779 49741 -229866 -463177 -615772 -359318 -28201
11630 -28201 185651 352347 516719 528349 258535 -92254 -226457 168624 654961 799167
11620 799167 670183 509303 71045 -306923 -367316 -151875 162053 101629 73048 287426
11610 287426 388707 407908 835530 1291714 1045116 430285 192110 460477 544956 484055
11600 484055 379965 32783 -181486 -343600 -357442 -327522 148585 655677 464941 260159
11590 260159 152170 -21722 -159382 -88113 -135308 -28902 446688 612040 554228 439062
11580 439062 30114 -234892 -146212 -149344 -352476 -358234 -296024 -264068 -177950 67967 259814
11569 259814 21095 -354435 -410459 -43816 65627 -50141 -130774 66270 -64304 -252325
11559b52325l4996k11666j97995J34388K69423L47816K36251K66501K46673J95496
11549I99566l52376m44306K35865l122m70154k00021J02062K61006J45838R4773
11539C69131J47171j65869J71683K59732J45643r3473j36061l49701k35599K39141
11529C51798K70206o1289k63478K3603L56683J97280j04127j44709k09264j29613
11519B87090j86389k99597M3570L05097j95102l56805J77612M88786M53812j11734
11509F06340J1695j52082o55703p64716j93092L85749L88438L66110K97637j80877
11499A09499j43734M10210L02982j35494j7017K80808J00095k00893J46623j4228
11489H38851n20204n44740k87221k98083l19086J89843L45780K99379K00024L38315
$$ plain form
11559 -252325 -287321 -498987 -696982 -562594 -293171 54645 290896 557397 804070 999566
11549 999566 647190 202884 438749 435627 -34527 -234548 -132486 128520 274358 369131
11539 369131 516302 350433 522116 781848 927491 834018 697957 348256 112657 351798
11529 351798 622004 560715 297237 320840 677523 874803 770676 625967 416703 287090
11519 287090 100701 -198896 -155326 149771 -45331 -402136 -224524 264262 718074 606340
11509 606340 618035 465953 -189750 -954466 -1147558 -761809 -373371 -7261 290376 109499
11499 109499 -34235 375975 678957 543463 526446 807254 907349 706456 853079 838851
11489 838851 318647 -226093 -513314 -811397 -1130483 -940640 -594860 -295481 -95457 242858
11479B42858o9783j48850N1969j07328L311J56548M72940N23138K58710j09975
11469A273538m73965o24481j73898L83696J76518l73313l00055j0411O7633p1551
11459a26289k63570J63992J02462j4073K64072K31316k47271o56377q44458J19387
11449a270809N22664O38402O99573J62337r9103M40011K82399j10584m04500m67524
11439C92866j92189L23595O53612Q3646j91868l50162j15178M43304p0020j83182
11429G94424k35417o25705m26814j40775J32573Q9625J71304L27327j13206j69004
11419a95668L284m8523M4886M976j70370j12875M30546k4847l03649K15652Q3004
11408g3584M00214M9147o49482j00474L7129K59796K38072m8400J57046K61k20230
$$ plain form
11479 242858 173075 24225 76194 -31134 -27823 128725 601665 1124803 1383513 1273538
11469 1273538 799573 175092 1194 384890 561408 188095 -111960 -122371 -54738 -126289
11459 -126289 -389859 -225867 -123405 -137478 126594 357910 110639 -545738 -1390196 -1270809
11449 -1270809 -748145 -109743 589830 752167 653064 1093075 1375474 1264890 860390 392866
11439 392866 200677 524272 1177884 1261530 1069662 719500 604322 1047626 977606 794424
11429 794424 559007 -66698 -493512 -634287 -501714 -412089 -240785 86542 -26664 -195668
11419 -195668 -192384 -240907 -196021 -191045 -361415 -474290 -43744 -68591 -372240 -156588 -73584
11408 -73584 326630 375777 -273705 -374179 -337050 -77254 160818 112418 269464 269725 49495
11397D9495o0999l441J35180j3597k40572l3104J56651K80481M19346L65038m1676
11386A012802k42651K51029j80713k06742R2558r3147k01406k56452j23246j02453
11376e0421k57994l33481n53430K9103M62468L55402L18714j22916k32607j4000
11366c99162p9777l12468Q1513M12673K98063L33459J74288k0270l43247o23515
11356d78443m15540j45656p47O61467O81997J22772j0325l35137m60590j44194
11346e24396j33399j58697Q5288M83010J14519k55471j21081L45137J96791k04011
11336a72310J01929K48807L23168K58576p2238k04691l9825N4336o8641Q0540
11326E09651l33967p81876j65827J37448O2155L50815L55304J92497j77716m47739
$$ plain form
11397 49495 -11504 -14945 120235 106638 -133934 -167038 -10387 270094 689440 1054478 1012802
11386 1012802 770151 1021180 840467 633725 726283 633136 431730 175278 52032 -50421
11376 -50421 -308415 -641896 -1195326 -1166223 -703755 -348353 -29639 -152555 -385162 -399162
11366 -399162 -478939 -791407 -709894 -297221 842 334301 508589 488319 145072 -478443
11356 -478443 -893983 -1039639 -1040386 -378919 303078 425850 415525 80388 -380202 -524396
11346 -524396 -657795 -816492 -731204 -248194 -133675 -389146 -510227 -165090 31701 -172310
11336 -172310 -70381 178426 501594 760170 687932 483241 443416 497752 429111 509651
11326 509651 175684 -606192 -772019 -634571 -572416 -221601 133703 326200 148484 -299255
11316b99255L5873K56892K79571L43079L28813J46389l47950l42760j21161N5779
11306C35270P5349l91827n13598j64328j59688K4033K08955J72645j03316l40932
11296h57437q5862L31619J97524K74156K64850M61755K49112m06791l34359M213
11286I8780N5693l16507k68204n2374j8400O4451J63575m0704o703M1886J80294
11275i8213j6695K56738O4256k74481m9191K92711J87156k4607j5769J39835M20169
11264H81909q3670m68544Q8539m1677o42562o12214J46421M39121M43588J39006
11254B89917j8298j61638p7964J88773L1585j37604J87349K74643N85955L20999
11244A483717l70430l61577k98322j307o9408j68690K06036k03904o44476m00084
$$ plain form
11316 -299255 -263382 -6490 273081 616160 944973 1091362 743412 400652 279491 335270
11306 335270 410619 18792 -494806 -659134 -818822 -794789 -585834 -413189 -516505 -857437
11296 -857437 -943299 -611680 -414156 -140000 124850 586605 835717 428926 94567 98780
11286 98780 154473 -162034 -430238 -482612 -501012 -436561 -272986 -313690 -320393 -278507 -98213
11275 -98213 -114908 141830 206086 -68395 -117586 175125 362281 337674 321905 461740 881909
11264 881909 798239 329695 418234 376557 -266005 -878219 -731798 -292677 150911 289917
11254 289917 271619 109981 32017 220790 252375 114771 302120 576763 1162718 1483717
11244 1483717 1113287 751710 453388 452081 382673 213983 420019 216115 -428361 -828445
11234h28445N7400J06513N0626K12344K42842J66892L94213N2544J8361j59735
11224C13555k77456r6951j11366q176k26918n47482L4401K88347K06469L96335
11214b9242L67313l445M1559K3954k90051j91579l3979o5010J74655L76869k02235
11203A68809m05784k99056P0379L10750P40634Q78657N67150n54987j067924o54342
11193b45714m0990M49017N62968J20810O9766p9731l0798O4528k92700l42781
11183B34375k52731J14368J74868m43067n09005o1712K41820K34924J63321K38834
11173A35995q2369k34038J77604r3026j36538n1491K39720m8964n7156K63592
11163A13329l4137j33959j10794k40023L349M04236J49893K1385R9181k42023
$$ plain form
11234 -828445 -771045 -664532 -613906 -401562 -158720 8172 402385 454929 473290 313555
11224 313555 36099 -60852 -172218 -180394 -407312 -954794 -920393 -632046 -425577 -29242
11214 -29242 338071 334626 376185 400139 110088 -81491 -115470 -180480 -5825 371044 168809
11203 168809 -236975 -536031 -465652 -154902 585732 1464389 2031539 1476552 408628 -245714
11193 -245714 -286704 162313 725281 846091 915857 836126 805328 869856 577156 234375
11183 234375 -18356 96012 270880 -172187 -681192 -742904 -501084 -266160 -102839 135995
11173 135995 53626 -180412 -2808 -95834 -232372 -283863 -44143 -93107 -150263 113329
11163 113329 79192 -54767 -165561 -405584 -402235 2001 151894 173279 272460 30437
11153C0437m38447J09420L09365K11142J79842r6697Q4613O669l96150k93659
11143b93465K10019J76803o6402k33213J1314P3039j43645k60711j51945r210
11133f87416j46474p8912K84715J24446Q6653K73771J67637n6082P9144J51914
11123A99396m6678J71912J64242n3165k16095k42056J45066K22192O1832j57389
11113B49257P4806J04167j98228N1839r9275O4633L57046Q1441J78098k8049l13757
11102E21978R2977K78820K19214J34201l39794k97459j68213n4656K64233k52273
11092C99028l44130Q4767O4925l89107k99990L74944M15606J17872l9561l25541
11082E8813O3529n40913m41042J47517J70679l05953m21704k60669r8075J41911
$$ plain form
11153 30437 -408010 -298590 10775 221917 401759 305062 389675 396344 194 -293465
11143 -293465 -83446 93357 26955 -206258 -194944 -121905 -265550 -526261 -678206 -687416
11133 -687416 -833890 -912802 -628087 -503641 -416988 -143217 24420 -31662 47482 199396
11123 199396 152718 324630 488872 435707 219612 -22444 122622 344814 406646 249257
11113 249257 324063 428230 230002 281841 182566 247199 604245 685686 863784 835735 521978
11102 521978 614955 893775 1112989 1247190 907396 609937 441724 387068 651301 399028
11092 399028 54898 139665 204590 -184517 -484507 -109563 306043 423915 384354 58813
11082 58813 122342 -418571 -859613 -712096 -541417 -847370 -1269074 -1529743 -1627818 -1485907
11072a485907K87950M07318P47732P31675N66295N6906p55224k81318J14316o35059
11062b45316n17965K50928L05357J79603J26746J05991k61561k21899j42196J71400
11052b48912Q9044J85120M87927K93219O9010j02087j10381q2891n46475n80363
11042e46789j05339K43039K22431N8184L6433K25806J70469m0428j89052l41440
11032b66686n9545K49984J60391L05377O3310k36862l43613j07586J05620J7655
11022a11955o1850j05081J43949p0448j83488K47256L06409J9134j63357k79286
11012b58717J05931K36858K66093L2001l8255J47679L89082L9612j35489k43652
11002E41143j52481j45640K58733L37780j18217l38441j36030J01937L42113L60477
$$ plain form
11072 -1485907 -1197957 -790639 -42907 688768 1255063 1311969 556745 275427 389743 -245316
11062 -245316 -763281 -512353 -206996 -27393 99353 205344 -56217 -278116 -420312 -248912
11052 -248912 -159868 25252 513179 806398 875408 773321 662940 580049 33574 -546789
11042 -546789 -652128 -409089 -186658 -128474 -92041 133765 304234 263806 74754 -266686
11032 -266686 -326231 -76247 84144 389521 452831 215969 -127644 -235230 -129610 -111955
11022 -111955 -173805 -278886 -134937 -205385 -388873 -141617 164792 183926 20569 -258717
11012 -258717 -152786 84072 350165 382166 343911 491590 880672 920284 784795 541143
11002 541143 388662 243022 501755 839535 721318 382877 246847 348784 690897 1051374
10992A051374N09600M56182K93052K56722k55058m14753n40679k63641J6514J0122
10982A119435K41896J03716q8990M69847J81682j07255r1410J46460L69009J6186
10972B360576k29750l03489L7277K09114m01961m98237j12301J44546m6782K6297
10962A185290O58191J02659j22075M38599O43726O18378Q6917L77389Q59994P04235
10952E553303P90427J509324K318615K723427L093192L373166M057752N504260
10944B8923466P228981J0055948J4638557K2701591L5587566N5669328P5077369
10937B49882806N3695275k7062146p1843933n5816444l3327255j7653918q563475
10930H9310910r20107O673627J6513549L1077789N2615331P0863094M3980914
$$ plain form
10992 1051374 1560974 2017156 2310208 2566930 2311872 1897119 1356440 1092799 1109313 1119435
10982 1119435 1361331 1465047 1376057 1845904 2027586 1920331 1828921 1975381 2344390 2360576
10972 2360576 2130826 1827337 1864614 2073728 1671767 1173530 1061229 1205775 1158993 1185290
10962 1185290 1843481 1946140 1824065 2262664 2906390 3524768 3611685 3989074 4849068 5553303
10952 5553303 6343730 7853054 10171669 12895096 15988288 19361454 23419206 28923466
10944 28923466 36152447 46208395 60846952 83548543 119136109 174805437 249882806
10937 249882806 303578081 276515935 204672002 148855558 115528303 97874385 89310910
10930 89310910 88390803 95064430 111577979 142655768 195271099 266134193 310115107
10923C10115107l8167785p6301736n8351351l6970956k3653877j6520128j1222041
10916D8927233q234238o360007n033527m038312l014377k656324k549084j707881
10908A5333483j623290j675582j166970j074214r36337n36218p23408p58161q01007
10899F038296m14068j39044j73068j95911m2166k68226j67686L730j40490k28310
10889D273057n9821j13245K43874O48478M05456k95522n19995m59925l80382n78596
10879C163379q90538m66968J63173K62923k8285P5868J06431N98236K23906m87073
10869B721052k93813l73508l02768j91535K2345N2319J7699j52169j93381M9809
10859A356050K41132j27462J01425L42364P6865m01318m55361m73304q8045J91398
$$ plain form
10923 310115107 271947322 195645586 137294235 100323279 76669402 60149274 48927233
10916 48927233 40692995 34332988 29299461 25261149 22246772 19590448 17041364 15333483
10908 15333483 13710193 12034611 10867641 9793427 8857090 8320872 7597464 6839303 6038296
10899 6038296 5624228 5485184 5312116 5116205 5074039 4805813 4638127 4641857 4501367 4273057
10889 4273057 4213236 4099991 4343865 4992343 5397799 5102277 4582282 4122357 3741975 3163379
10879 3163379 2272841 1805873 1969046 2231969 2203684 2279552 2385983 2984219 3208125 2721052
10869 2721052 2427239 2053731 1750963 1559428 1581773 1634092 1651791 1499622 1306241 1356050
10859 1356050 1597182 1469720 1571145 1913509 1990374 1589056 1133695 660391 572346 763744
10849G63744L03977k26880j54622M40657P8946P5869Q4719j89183j11166j18546
10839I47515P7070k19641r9580J55253j07903p0942k33305o03797k46809K14872
10829a87267M01863L18071j88546l56612J70436O11718O64076K74415j82902k29467
10819A295785j53021j60195j61256R4280K8856P8095N07368p4420n39167j86152
10809G30173j73362k47058p7938L20824J8212j09741J15703k42289k28502L0391
10799A36413K86713p9001l08773k7625K69057L84876J35236j13310o5764K56487
10789H74309K72690l38711n67053j80167J2800k43499l47267q3899J41643J91553
10779b67601K39632K74867J05881r1801J87843J02857o2659N4068O861K25104
$$ plain form
10849 763744 1067721 840841 686219 1126876 1205822 1281691 1366410 1177227 1066061 947515
10839 947515 1024585 804944 705364 860617 752714 681772 448467 -155330 -402139 -187267
10829 -187267 214596 532667 344121 -12491 157945 769663 1433739 1708154 1525252 1295785
10819 1295785 1142764 982569 821313 915593 944449 1022544 1529912 1455492 916325 730173
10809 730173 556811 309753 231815 552639 570851 461110 576813 334524 106022 136413
10799 136413 423126 344125 35352 7727 276784 661660 796896 683586 617822 874309
10789 874309 1146999 808288 241235 61068 73868 -169631 -516898 -600797 -459154 -267601
10779 -267601 -27969 246898 352779 260978 448821 551678 489019 543087 549948 775052
10769G75052k92052p38024j77425J33730J47803K54487J09417K8070M1662n72353
10759b89633k49447J70836M59536L17004j88053k31062J71422L2401j88541K4067
10749B8530O4546j48296k50843l5846K56371K76652Q5081L852k70654k30005m4799
10738b65411P0362n2436k91780p11356o06083M27715N00420O27810M90123M7196
10728B36560k1689p7191j51139K8671j09449l46585l8170J24613J67791n2562
10718b39150J31254K43852K57583K52186J47430n8547j78742r8407o0483k44076
10708A52900j7848J71634K61061Q3115q5783j24916Q4019K34303l3209l25655
10698C99621k41250J11662J62114j47674k43425j09828l551J47224K8708J03496
$$ plain form
10769 775052 483000 -255024 -432449 -298719 -150916 103571 212988 241058 282720 -289633
10759 -289633 -539080 -368244 91292 408296 220243 -10819 160603 193004 4463 28530
10749 28530 93076 -55220 -306063 -341909 -85538 191114 276195 280047 9393 -220612 -265411
10738 -265411 -195049 -247485 -539265 -1250621 -1856704 -1428989 -928569 -300759 189364 236560
10728 236560 214871 137680 -13459 15212 -94237 -440822 -478992 -354379 -186588 -239150
10718 -239150 -107896 135956 393539 645725 793155 734608 555866 457459 396976 152900
10708 152900 135052 306686 567747 650862 565079 440163 524182 758485 725276 399621
10698 399621 158371 270033 432147 284473 41048 -68780 -72331 74893 103601 207097
10688B07097N6240r5723P1733J49879N7040k84136p8574o8021J05054j13451J01325
10677A08463K61011k71481j00594J84850J15505l5641k15130M770P4328j50962
10667b4881j98489Q0710L91910m6466l11677M5418J35716j30808j25094j22464
10657c06125j11680k545L13919k2021K01819P80422K28433m23402j30856J85376
10647G13340k27433j43367j36831j53670L01930M13556L99278J3704n68445M7846
10637F59908L96327J99592k21605m90175j40664K22565o5673j94973j59670l69697
10627a64065m70922J48170L49356L50457K48109J95100k70453k26914J10984k6755
10617B43067k1862K12478R8715l69567J6800O84812L90333J25888p5388l53787
$$ plain form
10688 207097 263337 167614 239347 389226 446266 162130 83556 15535 120589 7138 108463
10677 108463 369474 97993 -2601 182249 297754 262113 46983 51753 126081 -24881
10667 -24881 -223370 -142660 249250 202784 -108893 -63475 72241 -58567 -183661 -306125
10657 -306125 -417805 -420350 -106431 -128452 73367 853789 1082222 658820 527964 713340
10647 713340 485907 342540 205709 52039 353969 767525 1166803 1180507 612062 659908
10637 659908 1056235 1255827 1034222 544047 403383 625948 560275 365302 205632 -164065
10627 -164065 -634987 -486817 -137461 212996 461105 656205 385752 158838 269822 243067
10617 243067 221205 433683 532398 162831 179631 864443 1254776 1380664 1305276 951489
10607I51489k32536m51933k05161J13606K34224J51012k8564l25504l23788r6508
10597b13663j62440l73276M6003J69866K19737J06171j21961k9446L34099J34188
10587A09278q9177j37863J74282M59937R1490l58447k64533L30846J61058J38743
10577F15614R8507K77276k3389k07925k00637m85856n68895N6791J97678j95299
10567d36135J05055k4149j14088K53815K23568K2325j84K46068O15000R1257R9736
10556A082268L20532j3668l27879m78354q27887o38710K46703L75746J57277K34793
10546A30821N2148Q4875k35406n80976l43722K0913O01j57977m0248M7108J43254
10535h78609l9223J50783M37175N53649l7887k72739j27828q2443q6976J95907
$$ plain form
10607 951489 718953 267020 61859 175465 409689 560701 532137 206633 -117155 -213663
10597 -213663 -376103 -749379 -703376 -533510 -313773 -207602 -329563 -359009 -24910 109278
10587 109278 20101 -117762 56520 516457 607947 249500 -15033 315813 476871 615614
10577 615614 714121 991397 968008 760083 559446 73590 -495305 -438514 -240836 -436135
10567 -436135 -331080 -355229 -469317 -215502 8066 30391 30207 276275 891275 982532 1082268
10556 1082268 1402800 1389132 1061253 582899 -244988 -883698 -636995 -261249 -103972 130821
10546 130821 182969 267844 32438 -548538 -892260 -871347 -870746 -1028723 -1068971 -1021863 -878609
10535 -878609 -917832 -767049 -329874 223775 185888 -86851 -214679 -297122 -384098 -188191
10525a88191N14658L26446k09451o58137n25749J26828R14480M24727p53441r60812
10515i88642n6962O27897O92749L64917p5347j3411Q2794O1729k68001l32526
10505I5197m5297k5746k82047j65006P5771K94689K07533K13028q0671j49855
10495A37596p3931n9700J52975J20104k52290J12184M59535O634m40641l87084
10485b24618K37122m0783j20179J38964Q9234k47282K23839K86966m87286m51309
10475e95332j95931K62622M68499M18179J82607O8891J44445J78613J80733l34086
10465G79240l27487k98665k70263l74303m14182o668K76346N1658O3827N41516
10455B1019K95981n6396J74042J37646j48512k10258k64383j04021M72239K71846
$$ plain form
10525 -188191 326467 652913 443462 -214675 -740424 -613596 300884 725611 -27830 -988642
10515 -988642 -1045604 -417707 275042 639959 564612 551201 633995 695724 427723 95197
10505 95197 49900 24154 -257893 -422899 -347128 -52439 155094 368122 287451 137596
10495 137596 63665 3965 156940 277044 24754 136938 596473 603107 162466 -224618
10485 -224618 12504 -28279 -148458 -9494 79740 -167542 56297 343263 -144023 -595332
10475 -595332 -791263 -528641 -60142 358037 540644 609535 753980 932593 1113326 779240
10465 779240 451753 153088 -117175 -491478 -905660 -912328 -635982 -584324 -520497 21019
10455 21019 317000 260604 434646 572292 423780 213522 -50861 -154882 317357 589203
10445E89203N612J04269J27628k51048l18376k19463J64596L40723J75507M675
10435G23326j26757l39370n9062L66605r515k94486l13026l65538m19253K4703
10425h12373R17260P99540l2602l19205k97027k59066r8573j70198k91082n5883
10415f19209L38867L53228K15012R1831J2877J66105K2131k51472n5434M48513
10405G22449K52815k12758n90557l71521K93508L28860J02048j83665l66461k97760
10395c23042R9560L80882M89009m6794l54649J43130K71428j39690m05278k2353
10385I2203j87558m28688l69020j47860J43545K98039M41900O28577M08818j26056
10375G53900o48409n6741M20180K04236J53652k51240l01686l15124j33060L17337
$$ plain form
10445 589203 594815 699084 826712 575664 257288 37825 202421 543144 718651 723326
10435 723326 596569 257199 198137 564742 555227 260741 -52285 -417823 -837076 -812373
10425 -812373 104887 904427 871825 552620 255593 -3473 -102046 -272244 -563326 -619209
10415 -619209 -280342 72886 287898 379729 392606 558711 580842 329370 273936 722449
10405 722449 975264 762506 171949 -199572 93936 422796 524844 341179 -25282 -323042
10395 -323042 -223482 157400 646409 599615 244966 388096 659524 519834 114556 92203
10385 92203 -95355 -524043 -893063 -1040923 -897378 -599339 -157439 471138 879956 753900
10375 753900 105491 48750 468930 673166 826818 575578 273892 -41232 -174292 143045
10365A43045K13246k3739m3194k3311l1742n0831M96169L86028j57197k59474
10355F49000k17289k27640k69146J17250J54062l903J4706M7796K1145j20286
10345A65695k89000l74403l9210p5838k24330m8870J64430K21632j87852q4771
10335g72517J50013k67794l54911p0573K65432J22789L7500J08725L1884J53759
10325e95693j0099k34514k85842k2250K34022K07293Q1805J9334q6027J70757
10315e21214m1727j97229J51878J85840k53996q5177K10134K31277K36941l032
10305h6305M1547L7329k35283k0429K2558J47585N52400L21266K40096k43537
10295G77227l21619m45330n23487J6166K26977l3396J08691j12851j77950m3062
$$ plain form
10365 143045 356291 332552 289358 266047 234305 183474 679643 1065671 908474 649000
10355 649000 431711 204071 -65075 52175 206237 202334 217040 264836 285981 165695
10345 165695 -123305 -497708 -536918 -612756 -837086 -885956 -721526 -499894 -687746 -772517
10335 -772517 -622504 -890298 -1245209 -1315782 -1050350 -927561 -890061 -781336 -749452 -595693
10325 -595693 -605792 -840306 -1126148 -1148398 -914376 -707083 -625278 -605944 -691971 -521214
10315 -521214 -562941 -760170 -608292 -422452 -676448 -761625 -551491 -320214 -83273 -86305
10305 -86305 -44758 -7429 -242712 -263141 -240583 -92998 459402 780668 1020764 777227
10295 777227 455608 10278 -513209 -497043 -270066 -303462 -194771 -307622 -485572 -528634
10285e28634Q1288J97893l8696K24808M19842L10153J71128k89871m70417m05703
10275c28209k64264K16192K47292k37350k72524M28314K96067k59960k13572j94449
10265e82463K34219O89032M18585l49669m27000M18368L40343k34724o1358q2252
10255C63081j68541j78322k23376k86253k66830K5984m8359J8855K68576q5914
10245e81099r1J66048J73210J39099N1417O156N3566J96223K63879Q8973l61285
10234A96096l65301j79641j74108j39862J13074l0926J77778N5071k63520r0850
10224g02189M74403L21036n4409o0052N1955J98587L15015J38256j78257k30604
10214B73741J35002j03577l21783j80168k87240K64454N84628l4405l18696l58888
$$ plain form
10285 -528634 -447346 -249453 -288149 -63341 356501 666654 837782 547911 77494 -328209
10275 -328209 -592473 -376281 -128989 -366339 -638863 -210549 85518 -174442 -388014 -582463
10265 -582463 -348244 340788 759373 409704 -17296 401072 741415 506691 445333 363081
10255 363081 194540 16218 -207158 -493411 -760241 -734257 -782616 -763761 -495185 -581099
10245 -581099 -581190 -415142 -241932 -102833 -51416 -45260 8306 204529 468408 557381 196096
10234 196096 -169205 -348846 -522954 -662816 -549742 -580668 -402890 -347819 -611339 -702189
10224 -702189 -227786 93250 38841 -21211 30744 229331 544346 682602 504345 273741
10214 273741 408743 305166 -16617 -196785 -484025 -219571 365057 330652 11956 -346932
10204c46932m03027J65979N0203j06454L45857N63054L07610N5182j82449j5080
10194D33943K53103k16672k46667m29745n29995m7049o7315J00254M76421K91023
10184A7301r098K20165O28450L57498j72108p2510j90793k16606j68544k23448
10174A70307q8877K09674J8898k35167k95673l8472m6907L5626j50791k31354
10164f52736M2659j58136M3102N27693P20098O3835l20142L78215J88602m14326
10154D18864r3814J30773L99068K94481l15424n11995k12348j47188M8521J57677
10144A68615M5760l25431l44557q9725K7784k31538J20425L9470O1374L25218
10134b02605K23870J01800P7567j4039j005j13479l31432j80020l7680j61719
$$ plain form
10204 -346932 -749959 -583980 -533777 -640231 -294374 268680 576290 631472 449023 433943
10194 433943 687046 470374 223707 -206038 -736033 -783082 -850397 -750143 -273722 17301
10184 17301 8203 228368 856818 1214316 1042208 969698 778905 562299 393755 170307
10174 170307 81430 291104 310002 74835 -220838 -259310 -306217 -270591 -421382 -652736
10164 -652736 -610077 -768213 -725111 -197418 522680 586515 266373 644588 833190 418864
10154 418864 325050 455823 854891 1149372 833948 321953 109605 -37583 10938 168615
10144 168615 214375 -111056 -455613 -545338 -517554 -749092 -628667 -589197 -527823 -202605
10134 -202605 21265 123065 200632 186593 185588 72109 -259323 -439343 -477023 -638742
10124f38742M4186K7116r0711j93834j60168K82722K38475k20378k05121p0659
10114i87114o9875J80375K6249O7192N08280L62035J7937k806k28238m9257j00022
10103b75244J3504M70263J86793P4562Q7067l1446K3393j39590j69855l580K0483
10092B56350Q1172K53712Q5124k73368k20728N0032j22838l11827k35976K8315
10082d10032N54710O87680J68712k57787n84912k98463K1200j09428J73476K77954
10072B23110q0790k37144j77968k9308n8287j90935m2114L24244M07879K26179
10062C64866r5782k38818m53789o30718l12981n6741L17759L83572R2853j7398
10052f47177j01242j8366k52936p8302M01184M67393l07770o63395K81260O38219
$$ plain form
10124 -638742 -594556 -567440 -658151 -851985 -1012153 -729431 -490956 -711334 -916455 -987114
10114 -987114 -1056989 -876614 -850365 -783173 -274893 87142 105079 102273 -125965 -175222 -275244
10103 -275244 -261740 208523 395316 469878 556945 525499 548892 409302 239447 235867 256350
10092 256350 337522 591234 676358 402990 182262 232294 109456 -202371 -438347 -410032
10082 -410032 144678 832358 1001070 743283 158371 -140092 -118892 -228320 -54844 223110
10072 223110 142320 -94824 -272792 -302100 -360387 -551322 -593436 -269192 138687 364866
10062 364866 269084 30266 -423523 -1054241 -1367222 -1423963 -1106204 -722632 -629779 -647177
10052 -647177 -748419 -766785 -1019721 -1098023 -696839 -229446 -537216 -1200611 -919351 -281132
10042b81132K64561j96303m74018j7325J08727J42427r5999l48501j06899M60090
10032e44372L56595K29244J60315O5497J50178L13577J04302j27814N0295k63393
$$ plain form
10042 -281132 -16571 -212874 -686892 -704217 -595490 -453063 -549062 -897563 -1004462 -544372
10032 -544372 -187777 41467 201782 267279 417457 731034 835336 707522 757817 494424
$$ [...]
##END NTUPLES=NMR SPECTRUM
##END=
