##TITLE=C13_55-2021
 CDCl3,  1100 sc

 9.7.2021
##JCAMPDX= 6.0         $$ Bruker NMR JCAMP-DX V2.0
##DATA TYPE= NMR SPECTRUM
##DATA CLASS= NTUPLES
##ORIGIN= UXNMR, Bruker Analytische Messtechnik GmbH
##OWNER= root
$$ XWIN-NMR		Version 3.5
$$ Fri Jul  9 12:01:14 2021 Russian Standard Time (UT+4h)  she@DPX200
##.OBSERVE FREQUENCY= 50.327896
##.OBSERVE NUCLEUS= ^13C
##.ACQUISITION MODE= SIMULTANEOUS
##.ACQUISITION SCHEME= undefined
##.AVERAGES= 1102
##.DIGITISER RES= 17
##SPECTROMETER/DATA SYSTEM= spect
##.PULSE SEQUENCE= zgpg30
##.SOLVENT NAME= CDCl3
##.SHIFT REFERENCE= (INTERNAL, CDCl3, 0, 222.697)
##AUDIT TRAIL= $$ (NUMBER, WHEN, WHO, WHERE, WHAT)
$$ ##TITLE= Audit trail, XWIN-NMR		Version 3.5
$$ ##JCAMPDX= 5.01
$$ ##ORIGIN= Bruker BioSpin GmbH
$$ ##OWNER= she
$$ F:/spectra/data/she/nmr/c13/1/pdata/1/auditp.txt
$$ ##AUDIT TRAIL=  $$ (NUMBER, WHEN, WHO, WHERE, WHAT)
(   1,<2021-07-09 11:59:19.51 +0400>,<she>,<DPX200>,
      <created by zg, POWCHK disabled, PULCHK disabled
       terminated by command 'halt'
       configuration hash MD5:
       00 E9 B6 7A A2 85 ED C7 34 08 36 98 17 FE 4E 26
       data hash MD5: 32K
       5A 2B 4B 30 BD CF 0E 50 A3 44 93 FE 8D 71 5B 53>)
(   2,<2021-07-09 11:59:47.35 +0400>,<she>,<DPX200>,
      <Start of raw data processing
       efp BC_mod = 2 LB = 1 FT_mod = 6 PKNL = 1 PHC0 = -337.5217 PHC1 = 30.56238 SI = 32K 
       data hash MD5: 32K
       29 5E 44 B8 33 EB 2B 77 28 87 63 9A 07 FE 7F 0D>)
(   3,<2021-07-09 11:59:50.65 +0400>,<she>,<DPX200>,
      <abs ABSG = 5 
       data hash MD5: 32K
       8B 18 99 FE 8A 3E A9 B7 80 B0 97 C0 4C 26 F0 E3>)
(   4,<2021-07-09 12:00:13.92 +0400>,<she>,<DPX200>,
      <pk PHC0 = -1.261733 PHC1 = -4.4 
       data hash MD5: 32K
       43 A0 68 EA 72 ED 55 BE 78 42 ED DB 89 98 A5 BA>)
(   5,<2021-07-09 12:00:17.64 +0400>,<she>,<DPX200>,
      <abs ABSG = 5 
       data hash MD5: 32K
       58 9A 14 D9 82 29 03 AC 48 C4 4F 2A E1 6E 0D 97>)
$$ ##END=
$$ 
$$ hash MD5
$$ 71 E5 FF 05 DA AE 3A E5 9A 98 D8 E9 F3 16 68 39
##$RELAX= 
##$RELAX= 
##$RELAX= 
##$RELAX= 
##$RELAX= 
##$RELAX= 
##$RELAX= 
##$RELAX= 
$$ Bruker specific parameters
$$ --------------------------
##$DU= <F:/spectra>
##$EXPNO= 1
##$NAME= <c13>
##$PROCNO= 1
##$TYPE= <nmr>
##$USER= <she>
##$AMP= (0..31)
100 100 100 100 100 100 100 100 100 100 100 100 100 100 100 100 100 100 
100 100 100 100 100 100 100 100 100 100 100 100 100 100 
##$AQSEQ= 0
##$AQ_mod= 1
##$AUNM= <au_zg>
##$AUTOPOS= <>
##$BF1= 50.322709
##$BF2= 200.13
##$BF3= 50.322709
##$BF4= 500.13
##$BF5= 500.13
##$BF6= 500.13
##$BF7= 500.13
##$BF8= 500.13
##$BYTORDA= 1
##$CFDGTYP= 0
##$CFRGTYP= 5
##$CHEMSTR= <none>
##$CNST= (0..31)
1 1 145 1 1 1 1 1 1 1 1 1 1 1 1 1 1 1 1 1 1 1 1 1 1 1 1 1 1 1 1 1 
##$CPDPRG= <waltz16>
##$CPDPRG1= <>
##$CPDPRG2= <waltz16>
##$CPDPRG3= <>
##$CPDPRG4= <mlev>
##$CPDPRG5= <mlev>
##$CPDPRG6= <mlev>
##$CPDPRG7= <mlev>
##$CPDPRG8= <mlev>
##$CPDPRGB= <>
##$CPDPRGT= <>
##$D= (0..31)
$$ [...]
##$SUBNAM4= <"">
##$SUBNAM5= <"">
##$SUBNAM6= <"">
##$SUBNAM7= <"">
##$SUBNAM8= <"">
##$SUBNAM9= <"">
##$SW= 239.972175391363
##$SWIBOX= (0..15)
0 1 3 0 0 0 0 0 0 0 0 0 0 0 0 0 
##$SW_h= 12077.2946859903
##$TD= 32768
##$TD0= 1
##$TE= 0
##$TE2= 300
##$TE3= 300
##$TEG= 300
##$TL= (0..7)
120 120 120 120 120 120 120 120 
##$TP= (0..7)
150 150 150 150 150 150 150 150 
##$TP07= 0
##$TPNAME0= <>
##$TPNAME1= <>
##$TPNAME2= <>
##$TPNAME3= <>
##$TPNAME4= <>
##$TPNAME5= <>
##$TPNAME6= <>
##$TPNAME7= <>
##$TPOAL= (0..7)
0.5 0.5 0.5 0.5 0.5 0.5 0.5 0.5 
##$TPOFFS= (0..7)
0 0 0 0 0 0 0 0 
##$TUNHIN= 0
##$TUNHOUT= 0
##$TUNXOUT= 0
##$USERA1= <user>
##$USERA2= <user>
##$USERA3= <user>
##$USERA4= <user>
##$USERA5= <user>
##$V9= 5
##$VALIST= <valist>
##$VCLIST= <CCCCCCCCCCCCCCC>
##$VD= 0
##$VDLIST= <DDDDDDDDDDDDDDD>
##$VPLIST= <PPPPPPPPPPPPPPP>
##$VTLIST= <TTTTTTTTTTTTTTT>
##$WBST= 1024
##$WBSW= 4
##$XGAIN= (0..3)
0 0 0 0 
##$XL= 0
##$YL= 0
##$YMAX_a= 6630331
##$YMIN_a= -1648836
##$ZGOPTNS= <>
##$ZL1= 120
##$ZL2= 120
##$ZL3= 120
##$ZL4= 120
##$ABSF1= 222.6899
##$ABSF2= -17.30692
##$ABSG= 5
##$ABSL= 3
##$ALPHA= 0
##$AQORDER= 0
##$ASSFAC= 0
##$ASSFACI= 0
##$ASSFACX= 0
##$ASSWID= 0
##$AUNMP= <proc_1d>
##$AZFE= 0.1
##$AZFW= 0.5
##$BCFW= 0
##$BC_mod= 2
##$BYTORDP= 0
##$COROFFS= 0
##$CY= -3
##$DATMOD= 1
##$DC= 0
##$DFILT= <>
##$DTYPP= 0
##$F1P= 0
##$F2P= 0
##$FCOR= 0.5
##$FTSIZE= 32768
##$FT_mod= 6
##$GAMMA= 0
##$GB= 0
##$INTBC= 1
##$INTSCL= 4.134877e-10
##$ISEN= 128
##$LB= 1
##$LEV0= 0
##$LPBIN= 0
##$MAXI= 10000
##$MC2= 0
##$MEAN= 0
##$ME_mod= 0
##$MI= 0.1934396
##$NCOEF= 0
##$NC_proc= -1
##$NLEV= 6
##$NOISF1= 120.0001
##$NOISF2= 80.00006
##$NSP= 0
##$NTH_PI= 0
##$NZP= 0
##$OFFSET= 222.6973
##$PC= 1.4
##$PHC0= -338.7834
##$PHC1= 26.16238
##$PH_mod= 1
##$PKNL= yes
##$PPARMOD= 0
##$PSCAL= 0
##$PSIGN= 0
##$REVERSE= no
##$SF= 50.3227279136918
##$SI= 32768
##$SIGF1= 140
##$SIGF2= 120
##$SINO= 11.81781
##$SIOLD= 32768
##$SREGLST= <13C.CDCl3>
##$SSB= 0
##$STSI= 32768
##$STSR= 0
##$SW_p= 12077.2946859903
##$SYMM= 0
##$S_DEV= 0
##$TDeff= 32768
##$TDoff= 0
##$TI= <>
##$TILT= no
##$TM1= 0
##$TM2= 0
##$TOPLEV= 0
##$USERP1= <user>
##$USERP2= <user>
##$USERP3= <user>
##$USERP4= <user>
##$USERP5= <user>
##$WDW= 1
##$XDIM= 32768
##$YMAX_p= 333844979
##$YMIN_p= -5309637
$$ End of Bruker specific parameters
$$ ---------------------------------
##NTUPLES= NMR SPECTRUM
##VAR_NAME=  FREQUENCY,     SPECTRUM/REAL,   SPECTRUM/IMAG
##SYMBOL=    X,             R,               I
##VAR_TYPE=  INDEPENDENT,   DEPENDENT,       DEPENDENT
##VAR_FORM=  AFFN,          ASDF,            ASDF
##VAR_DIM=   32768,         32768,           32768
##UNITS=     HZ,            ARBITRARY UNITS, ARBITRARY UNITS
##FACTOR=    0.368581032318806, 1,           1
##FIRST=     11206.7354408978, 0,            0
##LAST=      -870.559245092494, 0,           0
##MIN=       -870.559245092494, -5309637,    0
##MAX=       11206.7354408978, 333844979,    0
$$ Real data points
##PAGE= N=1
##DATA TABLE= (X++(R..R)), XYDATA
$$ [...]
22931G177996j601318k343757j794443K20469p8209n74411K14341J078455J173255
22922C472378M23976j26736p18297o60251j121732n80847M29027L17702L13016
22913A748236K92796J59500p27340m59966m65837n49451k15260J5127K97095m96130
22903d01230n72538K31485K11725N64671P32892m95000q88298l0146M34557L20607
22893A08725j18008L50276M44438K02264k92979j166064k34192L54916O21226
22884B70602Q09868P18840J3925j208569j486189l42627l72833n15190Q99165
22875a213008J263835L03361M56310M9495m52846l38878l20532Q50R94440J235685
22865A978712O81083k39240o32150r35231m61965K06806P45947K66083j67388
$$ y = [7177996, 5576678, 3232921, 1438478, 1658947, 1580738, 1006327, 1220668, 2299123, 3472378, 3896354, 3769618, 3051321, 2391070, 1269338, 688491, 1117518, 1435220, 1748236, 2041032, 2200532, 1473192, 1013226, 547389, -2062, -217322, -202195, 94900, -401230, -973768, -742283, -530558, 34113, 767005, 272005, -616293, -646439, -211882, 108725, -9283, 340993, 785431, 987695, 694716, -471348, -705540, -350624, 270602, 1080470, 1799310, 1813235, 604666, -881523, -1224150, -1596983, -2112173, -1213008, 50827, 354188, 810498, 859993, 407147, 68269, -252263, -251413, 743027, 1978712, 2659795, 2420555, 1788405, 853174, 391209, 598015, 1343962, 1610045, 1442657]
22856A442657K62775r6761p18234o78184J08049n0118L48489p1023r06288p07274
22846a065912j0099K9319M82175O2336M004K30007J1447L37719L30475j20733
22836B90738N57795K87929l84992k43639j86499m66185o13590l69423L68064J633505
22826H73703O28010J37008l52307l75582K49208L0081P38129O76504n06567q29931
22816A268256n57188p12608p45457R5573O02613l24616K32989j54195r37925m22353
22806a654911M29424L18576M44354N78314P61810O68648n30867j639957q28384
22797a452993J78979K36718M33627L32843n40215j71530k08419n61488k14232
22788a966710q7141J92067L45702j95319n33655j9706n36m0758J85535J02367
$$ y = [1442657, 1705432, 1608671, 890437, 212253, 320302, 270184, 618673, 547650, -358638, -1065912, -1076011, -1046692, -564517, -502181, -498177, -268170, -256723, 80996, 411471, 290738, 848533, 1136462, 751470, 507831, 321332, -144853, -758443, -1127866, -759802, 873703, 1501713, 1638721, 1286414, 910832, 1160040, 1190121, 1928250, 2604754, 2098187, 1268256, 711068, -1540, -746997, -651424, -48811, -373427, -140438, -294633, -1232558, -1654911, -1225487, -906911, -462557, 115757, 877567, 1546215, 1015348, -624609, -1452993, -1274014, -1037296, -603669, -270826, -811041, -982571, -1190990, -1752478, -1966710, -2053851, -1861784, -1516082, -1711401, -2245056, -2264762, -2265298, -2306056, -2120521, -2018154]
22778b018154O24597O44008N39686L18417J60627m42418p48086N27718N43532
22769A49927M46102P50496n37701q87001m0641L03004K42781j66538k4487l90108
22759a54166O6996N81529L90500o54357r57219m45122k53235j60056L30904P18173
22749e36053J004103M96337o71473r95521m59411R24673J552083M59157l68744
22740A405151k83083o54239j025320m25647O91087J395170O43420p75891j146999
22731a76351p4245O8004k03326n87239j27278P87076L63738n21200n96257n28194
22721a595272k74938o65551l31192Q36669J321327J440197P89448M07518q5613
22712A842593n29499p54582l74579k93808M15473k88185q51855j70583N45472
$$ y = [-2018154, -1393557, -749549, -209863, 108554, 269181, -173237, -921323, -393605, 149927, 596029, 1346525, 808824, -78177, -118818, 184186, 426967, 260429, 235942, -154166, -87170, 494359, 884859, 230502, -726717, -1171839, -1425074, -1585130, -1254226, -536053, 468050, 964387, 292914, -702607, -1162018, -237345, 1314738, 1773895, 1405151, 1122068, 467829, -557491, -983138, -292051, 1103119, 1746539, 970648, -176351, -250596, -182592, -385918, -973157, -1100435, -313359, 50379, -470821, -1067078, -1595272, -1870210, -2535761, -2866953, -2030284, -708957, 731240, 1520688, 1928206, 1842593, 1313094, 558512, 183933, -109875, 305598, 17413, -834442, -1005025, -459553]
22703d59553Q92773K88110l10656k48860L79029M01981P750j48521m71714J25776
22693D56115J40178l75364j4271k89853j22024L41598K44704P0220O54021P37338
22683A842662m27277r01202m60493j89226k37064J2914k91270m70418q0163P2237
22673a129300n96041m49355M93826P51197J000863N12222m88077l84789m44944
22664g34398m63827l04152J66969J54484m66853l68387j10564N60235K75560k86370
22654a577303m63832L30926J408787R50973M15317j32145n98393n97567j0529
22645b73766O4113L32484k84122n66750L70024Q72998M68220n21324j46550J35148
22635D50475j81978n65744l1247K66746J25015L57792P99072r8977p37826r26314
$$ y = [-459553, 433220, 721330, 410674, 161814, 540843, 942824, 950574, 802053, 330339, 456115, 596293, 220929, 206658, -83195, -205219, 136379, 381083, 451303, 1105324, 1842662, 1415385, 514183, 53690, -135536, -372600, -359686, -650956, -1121374, -1201537, -1129300, -1725341, -2174696, -1680870, -929673, 71190, 583412, 95335, -289454, -734398, -1198225, -1502377, -1335408, -1180924, -1647777, -2016164, -2126728, -1566493, -1290933, -1577303, -2041135, -1710209, -301422, 649551, 1064868, 932723, 334330, -263237, -273766, -209653, 122831, -161291, -728041, -358017, 514981, 983201, 461877, 315327, 450475, 268497, -297247, -328494, -61748, 63267, 421059, 1220131, 1121154, 383328, -542986]
22625e42986m16268n22877N94113Q64692m41885n89056M23833N26907N38094L75498
22615H10065L70484n2615n18095p37637n41735J45510O67491P09487N52188K34920
22605A640063J49087j71696m04570n60494q135P20205K48712j189747j633247
22596a209822k81538R5525l50586L7499K1741J47420L55714J10392n5649j42649
22586a271953l84173m22624m21305J29001L16147L26467P96718P84506L93853
22577B46637k01692j09397P13073N27680K65239L4328l37293r98412o30748M14888
22567g5697K74881J53625l80286p90421j145677k43996J103683J139537M10122
22558D45771m39030l93365J17036O63394L28965k86135l80960j19444k63969Q7040
$$ y = [-542986, -959254, -1482131, -888018, -23326, -465211, -1054267, -630434, -103527, 434567, 810065, 1180549, 1127934, 609839, -127798, -669533, -524023, 143468, 852955, 1405143, 1640063, 1789150, 1617454, 1212884, 652390, 644255, 1364460, 1613172, 423425, -1209822, -1491360, -1395835, -1746421, -1708922, -1687181, -1539761, -1184047, -1073655, -1129304, -1271953, -1656126, -2078750, -2500055, -2371054, -2054907, -1728440, -931722, -147216, 246637, 44945, -64452, 648621, 1176301, 1441540, 1475868, 1138575, 140163, -490585, -75697, 199184, 352809, -27477, -817898, -1963575, -2207571, -1103888, 35649, 445771, 6741, -386624, -269588, 393806, 722771, 436636, 55676, -63768, -327737, -240697]
22548b40697K29343M3335M15509M12485k37887n47942j68936j53714k99166J27032
22538d20638L28825J83756M31780L15904L78222n38676j015368p8896J95052L24854
22528A04815R64555K10190m26655o98557n21450m07615k08269R63029N82896j70499
22518C92440L79114N31997j50049p88786j38903O7630l92672r16211p18600n6878
22508a790918J52388o7891J20888k8976l67913M74360J230574j58942m45378K17820
22498f63988r2614n7773R8591o6283O2798N89231N85661J17614J09807Q5999n02158
22487B66885m99701r0691K47800j8112p21223r82087Q0149N06020M47925O13647
22477a49388M38927K37105J35693l14694J32571j19315k14620J81812N9695j40068
$$ y = [-240697, -11354, 31981, 447490, 859975, 622088, 74146, -94790, -248504, -547670, -420638, -91813, 91943, 523723, 839627, 1217849, 679173, -336195, -415091, -220039, 104815, 1069370, 1279560, 852905, 154348, -367102, -774717, -982986, -19957, 562939, 392440, 771554, 1303551, 1153502, 364716, 225813, 293443, -99229, -1015440, -1734040, -1790918, -1638530, -1706421, -1585533, -1614509, -1982422, -1508062, -277488, -436430, -881808, -663988, -756602, -814375, -715784, -782067, -719269, -130038, 455623, 573237, 683044, 769043, 266885, -232816, -323507, -75707, -93819, -815042, -1797129, -1716980, -1210960, -763035, -149388, 289539, 526644, 662337, 347643, 480214, 360899, 146279, 328091, 387786, 247718]
22467B47718o20495k02570l6888j8159m86167p418R02047J054827N03600o7593
22457A268902q20580l33048P7311p93961k90296N19900M2452j212046l80916N81189
22447a341093M90647q6535l8512R42594Q86165m84912l15130l46711l39481J17020
22437e15948p81248k67062K41561L1957M06273R51638J196356J98732m73439k82038
22427G06782l61360j5608N6697J73287k78595o56368k91694k05193l13693m85797
22417a671542m06481l1309Q60275J045067J006759K07922j056761n13846O92374
22408A32458J230705J083189K68805o11946q27190n20882k66965j80175Q1534
22399C89533j27358j053016O9428N78639o62821M9236O88849K13521l34648j41929
$$ y = [247718, -372777, -575347, -612235, -630394, -1116561, -1123979, -221932, 832895, 1336495, 1268902, 448322, 115274, 192585, -601376, -891672, -371772, -329320, -1541366, -1922282, -1341093, -850446, -936981, -975493, -32899, 853266, 368354, 53224, -293487, -632968, -515948, -1297196, -1564258, -1322697, -1290740, -884467, 67171, 1263527, 1462259, 988820, 706782, 345422, 329814, 386511, 559798, 281203, -375165, -666859, -872052, -1185745, -1671542, -2078023, -2109332, -1249057, -203990, 802769, 1010691, -46070, -559916, 132458, 1363163, 2446352, 2715157, 2103211, 1276021, 755139, 488174, 307999, 389533, 262175, -790841, -721413, -142774, -805595, -756359, -67510, 146011, -188637, -330566]
22389c30566K35237Q40891P72852M38715l10148l61005m56319J2944k3357p94889
22379B4355m36206O44226R10518l91090p34829o76249j95175J31982O3130L13916
22369c45422M54640J034038O57250K33737M91078P24556k67332l29012l80182
22360B273351L00865K10041m29592q65116o86263k25688j21887J38106J53217
22351G47034j35071J25718K6122l85980p71623p6448R550K40282L14543n69858
22341d75731j250454m17591K20727K35746L26613l16555o95539O23430J558765
22332a90589Q07909K87421k19684n93290j096076m82172O30430R04764O31715
22323F80428N4718j5246K42298p81812q14654N55375M36739m57458J66614L81114
$$ y = [-330566, -95329, 745562, 1518414, 1957129, 1646981, 1285976, 829657, 842601, 819244, 24355, -411851, 232375, 1142893, 751803, 16974, -659275, -854450, -722468, -659338, -345422, 109218, 1143256, 1800506, 2034243, 2525321, 3249877, 2982545, 2653533, 2273351, 2574216, 2784257, 2354665, 1489549, 803286, 577598, 455711, 593817, 747034, 611963, 737681, 763803, 377823, -393800, -470248, -460698, -220416, 94127, -475731, -1726185, -2143776, -1923049, -1687303, -1360690, -1677245, -2372784, -1749354, -190589, 617320, 904741, 685057, 91767, -1004309, -1486481, -856051, 48713, 680428, 735146, 719900, 962198, 180386, -634268, -78893, 357846, -99612, 67002, 448116]
22313D48116Q14805J17284j038079o14269j85663j27972J55643Q07122K72377
22304F49364k3345J3714j12079m50336n97659n96753J29048j54537r0591L35730
22294h97444M66501O00054k60631l21309P0095n493n9107M63667J031824Q11143
22284A899300L92450k6614p75676m83930K69135J11061j024008q28501J78917
22275b87866J36639k09304L55284M62270M69100q69913j139222M68731M08032
22266b06249m82184j39529J022743L01411p71181n26516J82946N07478j38096
22257b49177n6965J50929J11855Q52835O34770q7371L01521k4296p87710p20844
22247A25547j016020p0561N14893k7397N09592J321814J546903J87329n46805
$$ y = [448116, 1262921, 1380205, 342126, -272143, -457806, -585778, -430135, 376987, 649364, 626019, 639733, 527654, 77318, -520341, -1117094, -988046, -1142583, -1233174, -897444, -430943, 169111, -91520, -412829, -342734, -348227, -407334, 56333, 1088157, 1899300, 2291750, 2265136, 1489460, 1005530, 1274665, 1385726, 361718, -466783, -287866, -151227, -360531, -5247, 457023, 926123, 56210, -1083012, -614281, -206249, -688433, -827962, 194781, 496192, -274989, -801505, -618559, -111081, -249177, -306142, -155213, -43358, 809477, 1444247, 1356876, 1658397, 1634101, 846391, 125547, -890473, -961034, -446141, -473538, 36054, 1357868, 2904771, 3092100, 2545295]
22238B545295o05644p27317m89817J0221M33067r0723n78013p398p7869q15952
22228d04150j3816R61589M50149j51920l33744m58259o27107m71737L645P32888
22218c12462j82799k27100O65629P77806o26260p14762n85329J95889J136920
22209A27532K96572J4640K29939k49307j60097N29481P37710M11437p7679q83209
22199I77019p71903r1270K02741k6093K69086J73148j38006j1985M73875P49269
22189A805881k48239J02706o8360p44272K77786Q98541L4423o29814o25807p93596
22179I249k36187K83010N37843k13250L93484J202932J23041m88764r39238p36875
22169f4755k69079N27141j41919k16056N4480l55128k51692K31164M14305K41092
$$ y = [2545295, 1939651, 1212334, 722517, 732738, 1165805, 1075082, 497069, 489671, 411802, -404150, -417966, 543623, 993772, 841852, 508108, 49849, -577258, -1048995, -1045350, -312462, -495261, -722361, -56732, 721074, 94814, -619948, -1205277, -1009388, 127532, 424104, 438744, 668683, 419376, 259279, 788760, 1526470, 1937907, 1860228, 977019, 205116, 113846, 316587, 290494, 559580, 732728, 594722, 582737, 1056612, 1805881, 1557642, 1660348, 1591988, 847716, 1125502, 2024043, 2058466, 1428652, 802845, 9249, -226938, 56072, 593915, 380665, 774149, 1977081, 2100122, 1611358, 672120, -64755, -333834, 193307, 51388, -164668, -110188, -465316, -717008, -485844, -71539, 169553]
22159A69553K66278L95860k7736p29756m01199l7686N10278L70376m87143L36624
22149C65449J058755K98589l60253o27867l13155m2557J6043L83921O25804M32791
22139A837520n43675n44307k57925m33564R44511P3561p79018r35924j170022
22130a808843o01056J65699J18152l88813j33510l07902m07414K53585K05517
22121b904585O51679Q52836N94976k31776j32355J83726m48001n7798M70622J04188
22111i16488k84111K08223K89288M15950K60371J46299M92576N1434n73252o94123
22101f03833K7040L82341L39290L39127l77060L23996O16462o1615m76810n73412
22091f4474j076494l76651R21770J241049K97952o59858p99464J30451Q40498
$$ y = [169553, 435831, 831691, 803955, 74199, -327000, -364686, 145592, 515968, 28825, 365449, 1424204, 1722793, 1362540, 734673, 421518, 378961, 395004, 778925, 1404729, 1837520, 1293845, 749538, 491613, 58049, 1002560, 1076121, 297103, -638821, -1808843, -2409899, -2244200, -2126048, -2514861, -2648371, -2956273, -3363687, -3110102, -2904585, -2252906, -1400070, -805094, -1036870, -1169225, -985499, -1433500, -1491298, -1020676, -916488, -1200599, -992376, -703088, -287138, -26767, 119532, 612108, 663542, 90290, -603833, -576793, -194452, 144838, 483965, 106905, 430901, 1047363, 985748, 508938, -64474, -1140968, -1517619, -595849, 645200, 943152, 283294, -516170, -385719, 454779]
22082D54779N96590K6767M03739O47014k9389p59478n49722p4577k80957j094668
22072f59902j136633M06080N87920j44704l07409k24180M72217J019183N23569
22063E36141J010157K59678p23360k86679j27642n11558M9146l28007j183278
22054a305402l81651L92698Q67845O50458K82167P87618K73898J89292j28951
22045A627972o20281j039470j109988k6079M37387J65832q25429r24688m93432
22036b808176O37645R10549L78637j92366o92300p77505O28304J786117R55716
22027H26621K24640Q9858j83825m67310j013556K99258J404397K92704k90963
22018A181824N2963L9643p69417l49358L63436Q0550j18206k03231j56923j55000
$$ y = [454779, 1051369, 1078136, 1481875, 2128889, 2099500, 1340022, 790300, 715723, 434766, -659902, -1796535, -1390455, -802535, -947239, -1254648, -1478828, -1006611, 12572, 536141, 1546298, 1805976, 1082616, 795937, 668295, 156737, 205883, -122124, -1305402, -1687053, -1294355, -426510, 223948, 506115, 1293733, 1567631, 1756923, 1627972, 1007691, -31779, -1141767, -1167846, -730459, -564627, -1390056, -2314744, -2808176, -2170531, -1259982, -881345, -1073711, -1766011, -2543516, -1915212, -129095, 826621, 1051261, 1141119, 957294, 489984, -523572, -224314, 1180083, 1472787, 1181824, 1234787, 1274430, 505013, 155655, 519091, 599641, 481435, 278204, 121281, -33719]
22008c3719p63824q45016m0799m57209m86292J068049J265264Q20560J74983n37448
21998A64549q23018m55183J78088L35225j17235O1687j34418k23630j03302m47553
21988a564790k56969J76919P63207L61928o30468r21164l37104N291l57549m99513
21978c260212J29426N03269M39072J80031M58775P7988L1567K83249L86338N7945
21968g12552m95588j023281r70265l97297M55359J512762J267653P38309O13052
21959I88152k68517k79598n12373j34134l49727o47611P99904J594201P99142
21950A989439M89860M32087m46167j084946j113675n96531J44229Q28335N27506
21941A170137r64006j025530k87650m27150j3699O67094J064546P99207P04447
$$ y = [-33719, -797543, -1642559, -1683358, -2140567, -2626859, -1558810, -293546, 527014, 701997, 164549, -658469, -1113652, -935564, -600339, -717574, -655887, -790305, -1013935, -1117237, -1564790, -1821759, -1644840, -881633, -519705, -1150173, -2071337, -2408441, -2403150, -2760699, -3260212, -3130786, -2627517, -2188445, -2008414, -1549639, -1471651, -1440084, -1156835, -770497, -712552, -1208140, -2231421, -3201686, -3598983, -3143624, -1630862, -363209, 375100, 988152, 719635, 440037, -72336, -206470, -556197, -1203808, -403904, 1190297, 1989439, 2479299, 2911386, 2465219, 1380273, 266598, -329933, -185704, 642631, 1170137, 206131, -819399, -1107049, -1534199, -1547898, -880804, 183742, 982949, 1687396]
21932A687396P92121Q8402o90911p21843j08827n12912n94483M19609O72852M42217
21922A473621N1095q5195L61547J64216l06995l43536r565L52560o54513o38628
21912C64607q00174j061277J61723j2609m74783j06608Q95962O24154L74362p7635
21902a12278j351045n77512Q51470J035000M0334N8533O80728J86657j94920k68624
21892C48343k75761L65601K47656p83393l19498j86222o63545L13673J401024
21883D47878M51527o88714k97440k26742P69125P23065L08171q02919j111086
21874d27135l80514J00740j79222o04039o7412j28497m12026P58203J021286L98492
21864G9876k50639m15143K428j37068M22839j37908k30736j30648J30959K30965
$$ y = [1687396, 2479517, 2567919, 1877008, 1155165, 1046338, 533426, -61057, 358552, 1031404, 1473621, 1524716, 1439521, 1801068, 1965284, 1658289, 1314753, 1305188, 1657748, 1003235, 364607, -435567, -1496844, -1335121, -1347730, -1822513, -1929121, -1033159, -409005, -34643, -112278, -1463323, -2040835, -1189365, -154365, -114031, -55498, 625230, 811887, 616967, 348343, 72582, 438183, 685839, -97554, -417052, -603274, -1266819, -953146, 447878, 899405, 210691, -86749, -313491, 455634, 1178699, 1486870, 683951, -427135, -807649, -706909, -886131, -1490170, -1557582, -1686079, -2098105, -1339902, -318616, 79876, -170763, -585906, -583478, -720546, -297707, -435615, -666351, -796999, -666040, -435075]
21854d35075N1290k62245j87532O75055L31983j94017J81491j72879m94090L65218
21844a40801P27830J79448p04289k2408M90565o7688r3222J63471N85928J48624
21834A267458L21654L37795J21353m2863l29766n91940j282553q36625J07369
21825i28118M82934K09398J75075L54266l55890m17860L82968N61519M69320K3176
21815I56788q7257K87382K41313J41447j22797q45430p29899m50669m68504l02095
21805a379721K67069O44564L89740l30380p16524J9273Q28336N86062M263m57570
21795a44888j07713J63599L31215K91264J44553K50130n853K48445r4335j22755
21785I53662M60675j68236n38132l70038J34605N80910q90849r43375l48557M10925
$$ y = [-435075, -383785, -646030, -833562, -158507, 173476, -20541, 160950, -11929, -506019, -140801, 587029, 766477, 62188, 39780, 530345, 462657, 369435, 532906, 1118834, 1267458, 1589112, 1926907, 2048260, 2005397, 1675631, 1083691, -198862, -1035487, -928118, -445184, -235786, -60711, 293555, -62335, -480195, -97227, 464292, 933612, 956788, 869531, 1156913, 1398226, 1539673, 1416876, 571446, -158453, -609122, -1077626, -1379721, -1112652, -468088, -78348, -408728, -1125252, -1105979, -277643, 308419, 312682, -144888, -252601, -89002, 242213, 533477, 678030, 928160, 922307, 1170752, 1076417, 953662, 1414337, 1246101, 707969, 337931, 472536, 1053446, 162597, -780778, -1129335, -718410]
21775g18410O44554K48994k91012n06297j43920N49121J246433J083483j3664
21766B099282j147176q30524o84018m02574J27996L70347L20457j41477K72000
21757a5687K07751j60356N56480J73202k0565M79556M05197o31853m89218m16064
21747H8443l80298N9162M91841J81209k41445K43527P65607M05995J57425n84707
21737A186759p08645m00J97818J84849m29367o82127m39314N12358P09972l75629
21727A56274o89889l76513K69147K36137k63313o5292J95886l31000m82491Q77102
21717d73952J432672K02183q1513M71544L29104l76107j165761J42141O12773
21708A093084l08940m77784o2878k45974l74286M7140L43482l17612r0213O06655
$$ y = [-718410, -73856, 175138, -115874, -622171, -766091, -216970, 1029463, 2112946, 2099282, 952106, 121582, -562436, -965010, -837014, -466667, -146210, -287687, -15687, 192064, 31708, 588188, 761390, 740825, 1220381, 1625578, 993725, 504507, 88443, -291855, -232693, 259148, 440357, 198912, 442439, 1208046, 1614041, 1771466, 1186759, 478114, 477714, 675532, 860381, 431014, -251113, -690427, -178069, 531903, 156274, -533615, -910128, -640981, -404844, -668157, -733449, -537563, -868563, -1351054, -473952, 958720, 1160903, 1079390, 1550934, 1880038, 1503931, 338170, 480311, 1093084, 784144, 306360, 243482, -2492, -376778, -329638, 13844, -303768, -393981, 212674]
21698B12674L24764l61151j025993m94077R9248Q34804N35192l37074n47749p21087
21688a480449p3928O81263L20513j44026l79728K53222L59530K41071N43532K65404
21678E86404P1733q99736q88377M87678K59417K77679Q11736l15600m49576J66953
21668A08311J61322N12332j42897m15219q00200j406868l75205M74994J161586
21659g21844R83942M34179J55683p11421m39436N91038M99967N8263l55821q31650
21649c37100j31763P96628k11259l36072J53632k30548j67538P1077k87628l60189
21639a040760j30683O33621J058527K64882n80235l77799p3771Q27961J403518
21630A985261O46085K67827j10048m27258p56357L26478k29990n24709n4885m1512
$$ y = [212674, 537438, 176287, -849706, -1343783, -1244535, -409731, 125461, -211613, -759362, -1480449, -1554377, -873114, -552601, -696627, -1076355, -823133, -463603, -222532, 321000, 586404, 658137, -241599, -1129976, -642298, -382881, -105202, 706534, 390934, -58642, 108311, 269633, 781965, 639068, 223849, -576351, -1983219, -2358424, -1883430, -721844, 262098, 696277, 851960, 140539, -298897, 292141, 792108, 850371, 494550, -337100, -468863, 327765, 116506, -219566, -65934, -296482, -464020, -392943, -680571, -1040760, -1171443, -537822, 520705, 785587, 205352, -172447, -246218, 581743, 1985261, 2631346, 2899173, 2789125, 2361867, 1605510, 1931988, 1701998, 1177289, 1122404, 1080892]
21620A080892L40541q5247j062290m00738j86434q54429n92592k2864J38144M68289
21610a176728J041091N48192l1766m30145l46783m83822L9996n0591l54529n6327
21600a301412m03161l58191N433l12762L68654k73588j19658L65806R43612J304288
21590B19021R78083J39465l47804o63630o0425M8669k33763q1256J69634R8695
21580B66689r71017r36048R7851Q78236L76831L72211J339397Q41048m80123O5636
21570A850711M21459J28754M77785Q49671m46851j045499q65582n67965K05560
21561A008043L79100j20112l15060l06979m83247o80821j19389m32134m01189
21552a471788K83600O42693N87815M59957n17235n37777L38425M65943P20464
$$ y = [1080892, 1421433, 1336186, 273896, -126842, -313276, -1167705, -1760297, -1783161, -1645017, -1176728, -135637, 412555, 380789, -49356, -396139, -879961, -839965, -890556, -1245085, -1301412, -1704573, -2062764, -2057331, -2370093, -2001439, -2275027, -2394685, -2028879, -1085267, 219021, 1197104, 1336569, 988765, 325135, 264710, 313379, 79616, -1640, 167994, 266689, -704328, -1640376, -1542525, -664289, -287458, 84753, 1424150, 2265198, 1785075, 1850711, 2272170, 2400924, 2878709, 3728380, 3281529, 2236030, 1370448, 802483, 1008043, 1387143, 1267031, 951971, 644992, 161745, -519076, -638465, -1070599, -1471788, -1188188, -545495, 42320, 502277, -14958, -552735, -214310, 251633, 972097]
21543I72097Q2345k03420m54247k48782K00578K08313k41244l84326l52579o5312
21533d86577K89958P62244N15195k21885l89760o11588p22082J04244K24297j09225
21523f45179N17104K28566J74087k28034l92249n7537o78751j284351L87866R31618
21513a046860L86756L99109O61342m3816j222401j128398K47600M01284r67481
21504b312865j180662M19747J320876M96228R571J68127K42987J53847j14969
21495g97113o74114j33396J64846K5090m24533K10729Q57660N87594M54388J33407
21485D04558o42983l09976J27583l34471j49830n4197q7758k84761q2131R33054
21475d80912P33236m6725m5232M68757J110992L99996p06987n72504l86178l38951
$$ y = [972097, 1054442, 851022, 396775, 147993, 348571, 556884, 315640, -68686, -421265, -486577, -196619, 565625, 1080820, 858935, 469175, -142413, -864495, -760251, -535954, -645179, -128075, 100491, 274578, 46544, -345705, -403242, -1081993, -2366344, -1978478, -1046860, -660104, -260995, 400347, 356531, -865870, -1994268, -1746668, -1345384, -2312865, -3493527, -3073780, -1752904, -1256676, -1247105, -1078978, -835991, -682144, -797113, -1471227, -1604623, -1439777, -1414687, -1839220, -1628491, -770831, -183237, 271151, 404558, -238425, -548401, -420818, -755289, -905119, -959316, -1047074, -1331835, -1413966, -480912, 252324, 205599, 160367, 629124, 1740116, 2140112, 1433125, 860621, 474443, 135492]
21465A35492M86293L78121j20281r69500q68401K55526k47002n99859m4738K93975
21455a300374M15669L24599M46582N50450N16855N93119j049l4171m07449j196638
21445i2407m80848j98055J41653L44494P5519L72722L36465l40025n24325K74370
21435i0437N71083L66982K85542o12241k87586J85736j66611n00234q38043P5717
21425a010092Q79955M84077k78751q34308J3899R73905K36911J77615j26393o32595
21415a15777o90280l32609N89365P88548K49308j00546p75364p61248k18880O70991
21405f96492R13719o33972p86860J68244J258064P64994r17909o73943J04182
21396d99973l65195r25369q80357Q6198M43029Q5035J026278Q49619J58301Q40036
$$ y = [135492, 621785, 999906, 879625, -89875, -958276, -702750, -949752, -1549611, -1594349, -1300374, -884705, -560106, -113524, 436926, 953781, 1546900, 1545851, 1511680, 1104231, -92407, -573255, -771310, -629657, -285163, -209644, 163078, 499543, 159518, -364807, -90437, 480646, 847628, 1133170, 520929, 233343, 419079, 252468, -247766, -1085809, -1010092, -130137, 353940, 75189, -759119, -745220, 228685, 465596, 643211, 516818, -115777, -806057, -1138666, -549301, 239247, 488555, 388009, -387355, -1148603, -1367483, -696492, 217227, -416745, -1203605, -1035361, 222703, 987697, 69788, -604155, -499973, -865168, -1790537, -2670894, -2584696, -2141667, -2056632, -1030354, -180735, -22434, 817602]
21386H17602N02055N46730l8078j120299p78480j39525j72973N53579M07992M8586
21376F27189K35181M23700j97598j114807p02591K7633M42831M00522M8146K47195
21366D37401R7141m67207k56367k24413L44766P03548m87883o51938N11455O31614
21356F38117J86919R4689q47389j489733r27550K18980R24015L61645P03898R42216
21346H05807J21835n44906k47486K13808M68161l18440j128613j429668j8260
21337b077762J254508J176485M64358n44585l64082j68049k04204j74473K19420
21328d18384O72527N31042n72974m82745J67126J86979q8336q70049j12714L00238
21318f87290K19854j57184J5615j41848l05939o29166j15534q9002Q3721j58887
$$ y = [817602, 1319657, 1866387, 1828309, 708010, -70470, -209995, -382968, 170611, 578603, 627189, 862370, 1286070, 1088472, -26335, -728926, -701293, -258462, 142060, 190206, 437401, 534542, 67335, -189032, -413445, -68679, 634869, 146986, -504952, 6503, 638117, 825036, 919725, 72336, -1417397, -2344947, -2125967, -1201952, -840307, -136409, 805807, 927642, 382736, 135250, 349058, 817219, 498779, -629834, -2059502, -2077762, -823254, 353231, 817589, 273004, -91078, -259127, -463331, -637804, -418384, 254143, 785185, 212211, -270534, -103408, 83571, -4765, -874814, -987528, -687290, -467436, -624620, -609005, -750853, -1056792, -1685958, -1801492, -1890494, -1806773, -1965660]
21308a965660O6033R29407L72088j49042j09636Q0814K81872K44454J78386O38085
21298E66801N28767N01160k12668n83348m73889l5132k41641k00332J53810j85230
21288a81702R7280p7247n2528n7443j82244K37103N87690J002295k94043q91787
21278A87374p0784j97949m7815l44839n09587M36951O58340J98701l97796n77076
21268f64480J82493K684o78007q4028m28136l11280N48477O08497k24958l13730
21258a362468M61552R41891R78520R87807N67317m78664q73386n23981n49810
21249A48778l10618l90456l06093l10820k38652L87733K51413k50739p5450Q27625
21239b67279J224372N53133p79522q31709l22723q61489o54386R065N09434L50742
$$ y = [-1965660, -1899627, -970220, -598132, -747174, -856810, -775996, -494124, -249670, -71284, 566801, 1095568, 1596728, 1384060, 800712, 326823, 291691, 50050, -150282, 3528, -181702, -84422, -161669, -214197, -271640, -453884, -216781, 370909, 1373204, 1079161, 187374, 116590, -81359, -129174, -474013, -983600, -546649, 111691, 310392, -87404, -664480, -481987, -479303, -1157310, -1241338, -1669474, -1980754, -1432277, -823780, -1048738, -1362468, -900916, 40975, 1019495, 2007302, 2574619, 2095955, 1222569, 698588, 148778, -161840, -552296, -858389, -1169209, -1407861, -1020128, -768715, -1019454, -1094904, -267279, 957093, 1510226, 730704, -101005, -423728, -1285217, -1939603, -1930538, -1421104, -1070362]
21229a070362j65221k15945k13299m09679J37493J21156j38734j83288o21062
21220b758941L65230L11031k84932M36810J263024Q80020k29493m75609J1937
21211d80923O7274r5269j73603J09546o12396j90390P0392Q85755J233081K27617
21201A041084j54266k64002j372330o77621P105m00432o6754P26863J035990J119656
21191I95293J91756p346o90050n57470L10640N04935n62935n83134P80024j05576
21181B76137r14446q37381l45162l61858l5010Q27744J271368J86693k46980k14175
21171c93070n35892l79409m12754J79701J119393J115727J05742r48163J02859
21162d5866L55905l93190j39277K43259k75342l13037P39474N92789m11220m5207
$$ y = [-1070362, -1235583, -1451528, -1664827, -2074506, -1937013, -1815857, -1954591, -2137879, -2758941, -2393711, -2082680, -2367612, -1930802, -667778, 212242, -17251, -492860, -480923, -413649, -508918, -682521, -572975, -1185371, -1375761, -1305369, -419614, 813467, 1041084, 886818, 622816, -749514, -1427135, -1420030, -1820462, -1887216, -1160353, -124363, 995293, 1187049, 1179703, 489653, -67817, 242823, 747758, 184823, -398311, 381713, 276137, -638309, -1475690, -1820852, -2182710, -2217720, -1389976, -118608, 68085, -178895, -393070, -928962, -1308371, -1721125, -1541424, -422031, 693696, 799438, -148725, -45866, 310039, -83151, -222428, 20831, -254511, -567548, 171926, 764715, 353495, 308288]
21152C08288N77527J95062j08950l00629r4046O74477L39946q58925q09643J00482
21142B3589n44281j84111L108p4789n25407q71157n81156M12674K93965m10344
21132b457909Q8811M57813J03599J36165J34962J20810P5139L052M89752N75088
21122b72718j66828l72192n9517J124002J120007M34634j87957k04379N42204
21113A957256O17589j67086Q3963M74766o2527J38112J79681l85483p81511p06584
21103A348176q85618p75067q26487O6887K54550K51703k85250l44875M25701L91773
21093c78507N99209P1848k67499K96909L28969l07758q00288n24023K0478O41814
21083c18848P95915L92735n4551k41877m09946k03113m82065j311334j122499
$$ y = [308288, 885815, 1080877, 971927, 671298, 577252, 1251729, 1591675, 732750, -76893, 23589, -520692, -704803, -701695, -776484, -1301891, -2173048, -2754204, -2341530, -2047565, -2457909, -2369098, -1911285, -1807686, -1671521, -1536559, -1415749, -1340610, -1337558, -847806, -272718, -439546, -811738, -871255, 252747, 1372754, 1807388, 1619431, 1415052, 1957256, 2574845, 2407759, 2491722, 2966488, 2903961, 3042073, 3221754, 2836271, 2054760, 1348176, 462558, -312509, -1138996, -1072109, -817559, -565856, -851106, -1195981, -770280, -378507, 220702, 292550, 25051, 321960, 650929, 343171, -457117, -981140, -960662, -318848, 477067, 869802, 815251, 573374, 163428, -39685, -521750, -1833084, -2955583]
21074b955583J31602P50084n29140j42785Q33188K88371N02505R12997P13547
21065E04786M45594N795j16060k86081q61106k40038R41814J020858L30617k77161
21055A469018j32636k00914j250270j168053m27091J48418M45059N93819Q28883
21046C06233m3416M47977Q79992k32631m5740K37108m67350m54417l3136L08148
21036I02768P16888j7993r78549j032375P5815M37148O2556J58875K68700K02261
21026G96094j12223j62811R879k05601k79840M65715k54558m74596K39225K70533
21016B91817l84970r0240L38067Q58860K73298l46213j49767j34217l54704p83280
21006d81349k75820l33057L83520J30125k73474m50603K84352J77383J15899R6482
$$ y = [-2955583, -2823981, -2073897, -2603037, -2745822, -1912634, -1624263, -1121758, -208761, 504786, 950380, 956175, 840115, 554034, -307072, -547110, 394704, 1415562, 1746179, 1469018, 1336382, 1135468, -114802, -1282855, -1709946, -1561528, -1116469, -522650, 306233, 262817, 710794, 1590786, 1358155, 1312415, 1549523, 1082173, 627756, 594620, 902768, 1619656, 1601663, 623114, -409261, -333446, 103702, 166258, 325133, 593833, 796094, 683871, 521060, 530939, 325338, 45498, 511213, 256655, -217941, 21284, 291817, -93153, -183393, 154674, 1013534, 1286832, 940619, 790852, 656635, 301931, -481349, -757169, -1090226, -706706, -576581, -850055, -1300658, -1016306, -838923, -723024, -626542]
20996f26542N76126Q04516n61157r3892P37056q1653j165000q41148n14506K8544
20986a737656J002850M91427J47411N63366K94074K90441k40874q21330j54554
20977a64845j09103P8556j96779m8297L59411j81288K90656J08198n6767j00165
20967b0423j73877j65501n40959p27838M7497L91993n21035K99146L89041J19769
20957i02187N6775j20217J86409L62869R49558J040130P39789p12668j158281
20948D42177j82025k18476k63022m88464J84176O95404O04723K55911m28898m83472
20938A18034k97087n07040o38295K88463J60451J83106J68869L10883j85305q9297
20928d87218K90296M48415Q46293K72247j75923k54509m35171j18778k86177o18551
$$ y = [-626542, -50416, 754100, 192943, 99051, 836107, 754454, -410546, -1251694, -1766200, -1737656, -734806, -243379, -95968, 467398, 761472, 1051913, 811039, -10291, -164845, -273948, -195392, -392171, -440468, -81057, -262345, 28311, 136509, 79742, -20423, -194300, -359801, -900760, -1628598, -1581101, -1189108, -1710143, -1410997, -1021956, -902187, -845412, -965629, -779220, -416351, 533207, 1573337, 2313126, 1600458, 442177, 260152, 41676, -221346, -709810, -525634, 169770, 774493, 1030404, 601506, 118034, -179053, -686093, -1324388, -1035925, -875474, -692368, -523499, -212616, -397921, -487218, -196922, 251493, 1097786, 1370033, 1194110, 939601, 504430, 385652, 99475, -519076]
20918e19076r8267o9703k6366N2430o7517k20052l08965M03254M25245K98447
20908a30570j38305R3440n4596R70857J104075J51760o35106l72506N52143j77600
20898A363592m69877L36872P43201N92968L1610j140565j366728j95461R83638
20889H79250M51022o75311n78753J49437k59907q18145K91913L0999k54172R62492
20879A78825J150601K34977M502N90734J13111n79329n68940o58872p11934o22135
20869h68460n54241j36398P31634J129902K27320l19465M11121L94658N02542
20860A518613L29002p21453n05818q73242p04218k67761J76281O25957K98232
20851a24407k27050p5159O673M7897k73283k10021l21728L4309M48843j27166
$$ y = [-519076, -617343, -687046, -713412, -660982, -728499, -948551, -1257516, -854262, -429017, -130570, -268875, -175435, -230031, 740826, 1844901, 1996661, 1361555, 989049, 1541192, 1363592, 893715, 1230587, 1973788, 2566756, 2598366, 1457801, 91073, -104388, 879250, 1330272, 654961, 76208, 225645, -34262, -852407, -560494, -529495, -783667, 178825, 1329426, 1564403, 1568905, 2159639, 2272750, 1693421, 1124481, 465609, -246325, -868460, -1422701, -1559099, -827465, 302437, 529757, 210292, 621413, 1016071, 1518613, 1847615, 1126162, 620344, -252898, -957116, -1224877, -1048596, -422639, -124407, -351457, -426616, -419943, -372046, -645329, -855350, -1177078, -1142769, -693926, -821092]
20841h21092n79127L99821J131459j9803O0034J93176L0292j27015q6197L2912
20831B14460n15959r59085m55380L21997J023964P06693L3978K36248j28879j3554
20821D64483p64159j031743l43920M43780M42787L01935L82888J45911n0884Q9865
20811H0943j73762m53051L11816J9686J76120K69334M86860O33907K49427m56314
20801A144966j041691m85782P13503P58967K69214o7837o57668m51782L02161
20792D84051r7978k57002K68370J49269k38459o61486q4013M17528P80406M26918
20782A187604j42781k08850J37680j4107M03649N45148j40222j195993k29348
20773C42780M63619k17990J51566M79367L8678l15706m12284m41032K32688M14635
$$ y = [-821092, -1400219, -1000398, 131061, 111258, 171292, 364468, 394760, 267745, 181548, 214460, -301499, -1260584, -1715964, -1393967, -370003, 336690, 370668, 606916, 478037, 464483, -299676, -1331419, -1675339, -1231559, -788772, -486837, -103949, 41962, -8922, 80943, -92819, -545870, -234054, -214368, -38248, 231086, 717946, 1351853, 1601280, 1144966, 103275, -382507, 330996, 1089963, 1359177, 1291340, 633672, 181890, 484051, 386073, 129071, 397441, 546710, 308251, -353235, -437248, -19720, 760686, 1187604, 1044823, 835973, 973653, 959546, 1363195, 1908343, 1768121, 572128, 342780, 806399, 588409, 739975, 1219342, 1258020, 942314, 530030, 88998, 321686, 736321]
20763G36321K60447k33379l52707L3725j18846k41233j57759J91113K7826m67878
20753c22370q43105l30590N46628P49275j1780M96548J056327j50775p21323j91165
20743B77670O9659q9214n73918J4424L30592L564j22355P4227L1592o86023q97432
20732a567214l78473M28055P79227R30894N23441K08050p59623n76640O77588
20723B65305K52477r1695k05837K0644L33259k26209n30769N9368L5057m85886
20713e74286M37871M73360N99736m40299q06573L40383k67379n29743N36228J014785
20703G84083L59150k29161J469n28137p34209k85618L04877L36563Q38441K68790
20693A116248j121197J22952L61944L13447j046382r93046k840K26955N0819m24597
$$ y = [736321, 996768, 763389, 410682, 444407, 325561, 84328, -73431, 117682, 145508, -322370, -1165475, -1496065, -949437, -200162, -211942, 284606, 1340933, 1190158, 468835, 277670, 347329, 258115, -315803, -301379, 29213, 32777, -89578, -15351, 16241, -669782, -1567214, -1945687, -1517632, -738405, 192489, 715930, 923980, 164357, -412283, 265305, 517782, 426087, 220250, 240894, 574153, 347944, -182825, -123457, -88400, -574286, -136415, 336945, 936681, 496382, -310191, 30192, -237187, -766930, -230702, 784083, 1143233, 914072, 915541, 387404, -346805, -632423, -327546, 9017, 847458, 1116248, -4949, 118003, 479947, 793394, -252988, -1246034, -1248874, -1021919, -971100, -1395697]
20683a395697k87249J66796m00957q23109J87929P26574J023179N49744k97839
20674e50629R4851L51489M81612L11667M30481J344448K10441r28070r15398o86637
20664A44255L64948Q94715P01364M66398m58818j362556n11397L76340N01387
20655A116636l44728r08701k20143M57894L01491l84837j184994m89702P0543
20646a586541J19618M38694Q28395K06613k32869k22124j51233O09216J015381
20637A025150M21573k84410p28301m48776k51622O48637Q59636l02141n82502
20628C57244o45983m08914K6837M08980M8820K99477N64187J75009M14626K31161
20618A471444q63745j230552k87828K52376N69872K25109l34209R9584L72342
$$ y = [-1395697, -1682946, -1516150, -1917107, -2740216, -2552287, -1825713, -802534, -252790, -550629, -455778, -104289, 377323, 688990, 1119471, 2463919, 2674360, 1746290, 830892, 144255, 509203, 1403918, 2105282, 2571680, 2112862, 750306, 238909, 615249, 1116636, 771908, -136793, -356936, 100958, 402449, 17612, -1167382, -1657084, -1586541, -1466923, -1028229, -199834, 6779, -226090, -448214, -599447, 9769, 1025150, 1446723, 1162313, 434012, -14764, -266386, 382251, 1241887, 939746, 357244, -288739, -697653, -670816, -261836, -213016, 86461, 650648, 825657, 1240283, 1471444, 607699, -622853, -910681, -658305, -88433, 136676, -197533, -97949, 274393]
20609B74393N84198R32023M94826q41362n77644O7960L00589N25451k1843q34007
20599I04584m65140o07054p53266n49402j34485R04854P53909O55124N83035k99723
20589I92436o6818J95397O9673n68466j26798j58554j76544J14792p22878q35469
20579a283229l96873K85381R18966k3239n70643o85638j33076P94064J209990
20570A15703J629297N96088m53570n3275Q5662k84027l94110n88242q37129l7776
20560b21379j79839M56474J03065j76741P30686M73267K68755J34794j200294
20551C88788p19699K07384O96057J69519q2787K1651n44429m98592k69584k5602
20541f57294K45804L84799P3247r16994j782440n87630Q15872N84031K49291R07386
$$ y = [274393, 858591, 1790614, 2285440, 1444078, 866434, 934394, 1234983, 1760434, 1738591, 904584, 439444, -167610, -920876, -1470278, -1604763, -699909, 54000, 709124, 1292159, 992436, 925618, 1121015, 1190688, 622222, 495424, 336870, 160326, 275118, -447760, -1283229, -1680102, -1394721, -475755, -498994, -1069637, -1755275, -1888351, -1094287, 115703, 1745000, 2341088, 1887518, 1834243, 1919905, 1635878, 1241768, 653526, -183603, -221379, -401218, 55256, 158321, -18420, 712266, 1185533, 1454288, 1589082, 388788, -330911, -123527, 572530, 742049, 659262, 680913, 136484, -362108, -631692, -657294, -411490, -26691, 46556, -870438, -2652878, -3240508, -2424636, -1840605, -1591314, -683928]
20531f83928R86876j81238r51837l91411K61913K2243J88901O15978J174662P13608
20521A755767J68541l13373m39852J60476k90253q85917j26292P42457O79008
20512A450562L56521m09521p90297j353801j320832L82724Q19132M92609L41377
20503c1526M56098L32437n73389r06258o20769K53p1922n72483J2814R42727J399020
20492C67002L23051l15577n20892o07518p9166J93113P6037M74261K52223J17790
20482B80324l30864p76513O92390M84175m90784M27132R79955K43843L4818l03523
20472A240953o55096q33610n96568l40459j01005K46471L49418R60886M61764
20463G32754m74751n33430q95702o00096L61L49264K3755K09578N29284J038078
$$ y = [-683928, 302948, 121710, -830127, -1221538, -959625, -937382, -748481, -132503, 1042159, 1755767, 1924308, 1610935, 1171083, 1331559, 1041306, 155389, 29097, 771554, 1450562, 1807083, 1397562, 607265, -746536, -2067368, -1684644, -865512, -372903, -31526, 424572, 757009, 183620, -722638, -1343407, -1343154, -1415076, -1987559, -1974745, -1032018, 367002, 690053, 374476, -146416, -753934, -833100, -639987, -563950, -89689, 162534, 280324, -50540, -827053, -134663, 349512, -141272, 285860, 1265815, 1509658, 1544476, 1240953, 585857, -247753, -844321, -1184780, -1285785, -1039314, -689896, 270990, 732754, 258003, -275427, -1171129, -1771225, -1770864, -1421600, -1397845, -1188267, -658983, 379095]
20453C79095K04400j07576N2704R2484l21576l51439M16245M31732M25652j36960
20443A084761p13498m60114m04603K69510p6239j05426j59295R0585l7783j23820
20433f35922J51845k99980l27952k14341m19220J47007J311822J210790L89835
20424A313884j8922k61996j015383j069934j82540P30966L34442k40323Q2797
20415c27009j7388m4705K40295o22230k18052M57217O89068K66744L20040j08581
20405F35399q47086J96446Q74468j01092n16423o3692q53604l68053L42057N93695
20395a07885O55760k38864m73806J91588L13650L01949l16833o63214j17034K59641
20385a95048J004262R81629J90085p16501r78632j074044m73461k79382l47622
$$ y = [379095, 583495, 475919, 528623, 621107, 299531, -51908, 364337, 796069, 1221721, 1084761, 371263, -88851, -493454, -223944, -300183, -405609, -564904, -474319, -512102, -635922, -484077, -784057, -1112009, -1326350, -1745570, -1598563, -286741, 924049, 1313884, 1294962, 1032966, 17583, -1052351, -1234891, -503925, -169483, -409806, -327009, -344397, -389102, -148807, -771037, -989089, -531872, 157196, 423940, 743980, 635399, -211687, -15241, 859227, 758135, 241712, 178020, -675584, -1043637, -701580, -107885, 547875, 309011, -164795, 26793, 340443, 642392, 325559, -337655, -454689, -195048, 809214, 1790843, 1980928, 1264427, 285795, -788249, -1261710, -1541092, -1888714]
20376a888714M17249o63979q84719J76903O35173J386514J042862P5315p46508
20367d49904j69314O9270k41500q17830l56511P29830O90297P6730k70555l59978
20357a099465o05385J91111R81753P38398M33830k14183l35810j19311K87308
20348B58246N01896l24358j52678k00336K90090N02560N88024M70136l83623j03105
20338A446852j86724m18767n63114k73703O14343j05660j046607n44850O11045
20329d67185Q92132q4952j38762M58257M40187P4799j71410m85896J03944J05132
20319G26246O57648N27483o51488m85085P9476M03143j3460j794k66341l65597
20309F10231o54329l69342p06547j2335M9975L81047J13492r9036N10875K82342
$$ y = [-1888714, -1471465, -2135444, -3020163, -2843260, -2208087, -821573, 221289, 296604, -449904, -619218, -549948, -791448, -1609278, -1965789, -1235959, -545662, -468932, -739487, -1099465, -1704850, -1513739, -531986, 206412, 640242, 426059, 90249, -29062, 258246, 760142, 435784, 283106, 82770, 372860, 875420, 1463444, 1933580, 1549957, 1446852, 1260128, 841361, 278247, 4544, 618887, 513227, -533380, -1078230, -467185, 424947, 339995, 201233, 659490, 1099677, 1174476, 1003066, 517170, 621114, 726246, 1383894, 1911377, 1259889, 774804, 854280, 1257423, 1243963, 1242169, 975828, 610231, -44098, -413440, -1119987, -1132322, -1082347, -701300, -587808, -686844, -175969, 106373]
20299A06373k85703k43041j20495L34784N261m54727p01545n77898M19480R28422
20289e89089O05634L55365P16998K56549n2346K89065j69991K50113K10989o56991
20279A216296k18679j6326l2418N16269Q57862o68259o69415k61645l34561j42651
20269B46473m54004k58777K9157N99050Q64780J75315m11029n66079O80760N79340
20259A484986M7908m54830j007587o87267q57954j61636n5974J48295l9781N3605
20249a530235K35028K25855O8297K22273O73027k0750j87844N57384Q75373J06279
20239A224687p79048l85800K80335N66525K12658m70789k73308m65466m37057
20230e27263K92321M57070J247922L73573r76979j476389p89319j84714J26727
$$ y = [106373, -179330, -422371, -542866, -208082, -202821, -657548, -1359093, -1936991, -1517511, -589089, 16545, 371910, 1088908, 1345457, 1293111, 1582176, 1412185, 1662298, 1873287, 1216296, 997617, 981291, 948873, 1465142, 2323004, 1654745, 985330, 723685, 389124, 246473, -207531, -466308, -437151, 161899, 1026679, 1201994, 790965, 224886, 905646, 1484986, 1532894, 1078064, 70477, -616790, -1474744, -1636380, -1692354, -1544059, -1583840, -1530235, -1295207, -1069352, -1001055, -778782, -105755, -126505, -314349, 243035, 1118408, 1224687, 445639, 59839, 340174, 906699, 1119357, 648568, 375260, -90206, -527263, -234942, 222128, 1470050, 1843623, 866644, -609745, -1399064, -1583778, -1457051]
20221a457051O90864N98397K31786k35513N4522Q95324N11507J75669m55560j02749
20211I07196n4801m50259Q1417Q7844l51751O3053l13001p30199L6075O39648
20201h4778Q9168o28569l58405J84968O92835N98253L95518p56847j94302Q87031
20191H24872k69801r99422q47973K40788P63516M18236N67227K31777j91631o34489
20181A03100m38855n98556l78400M48471M90467R00340O70413n36333q34617j25076
20171b99046k9368n34842L68234Q99333m87357n49432k42487l25798K67481Q03723
20161a29559O12248Q97727P24917J10607K87844K18085k6509J7916l95182K9000
20151B347094J336166N02799q53110n77441k35780m57953r7266n12362l82759
$$ y = [-1457051, -766187, -167790, 63996, -171517, -116995, 778329, 1289836, 1465505, 1009945, 907196, 852395, 402136, 483553, 571397, 219646, 282699, -30302, -760501, -724426, -84778, 4390, -624179, -982584, -797616, -104781, 493472, 888990, 132143, -62159, 824872, 555071, -444351, -1292324, -1051536, -288020, 130216, 697443, 929220, 737589, 103100, -335755, -934311, -1312711, -864240, -373773, 526567, 1196980, 660647, -173970, -299046, -328414, -863256, -495022, 404311, -83046, -632478, -874965, -1200763, -933282, -129559, 482689, 1380416, 2105333, 2215940, 2503784, 2721869, 2695360, 2713276, 2318094, 2347094, 3683260, 4186059, 3332949, 2755508, 2519728, 2061775, 1964509, 1452147, 1069388]
20142A069388j75559K76679O19969M19498n59379n80994N92836K34262O0109k56748
20132A700061k61106K34019n0453p15889q22438m94783j04357M16788J76901K15661
20122B94404M79781R9386K09425L26268K38354N8378j99180K59703j29837q7369
20112A549313k2476n28350o155Q52323O43480k23921m74961K94973O3630M0288
20102B188144P5709M21685L61645J22898j02647L66371O04619N46213J55480o7074
20092D673043M56639J242002J018105J344165J168781J842747K430893K640480
20084A6816855K919596M829883N839243N868714O448314R511909J3842071K1320451
20076H7397036L2427248N1432375P2198912O9408556K0980852j2010040n0891965
$$ y = [1069388, 893829, 1170508, 1790477, 2209975, 1650596, 1069602, 1662438, 1896700, 1956809, 1700061, 1438955, 1672974, 1622521, 906632, 84194, -410589, -514946, -98158, 78743, 294404, 774185, 873571, 1082996, 1409264, 1647618, 1705996, 1506816, 1766519, 1636682, 1549313, 1526837, 998487, 992332, 1844655, 2488135, 2264214, 1789253, 2084226, 2147856, 2188144, 2263853, 2685538, 3047183, 3170081, 3067434, 3433805, 4038424, 4584637, 4740117, 4673043, 5129682, 6371684, 7389789, 8733954, 9902735, 11745482, 14176375, 16816855, 19736451, 24566334, 30405577, 36274291, 42722605, 52234514, 66076585, 87397036, 119824284, 171256659, 243455571, 312864127, 333844979, 321834939, 270942974]
20069B70942974q0194920n9912005l8085084k3382133j4967632j0125858q502332
20062C5773010o358114n507970l790344l396954k111488j810469j805445k380073
20054H612153j562087j158242j653311j649933K03011J42194R90943J45606j157067
20045B913267l24729L12377K1621K21003p2073l47786L4230k24287k94708l16137
20035A922778j210083m65313M56973J81018l06985k9301K60533N80209K16583
20026A606412M74598J001750J001670J098676N82224P36685Q73019J573643L162433
20017A2111110M190528M313146J250842l629082n240668l977678k752228j335949
20009D930021q80305o67090L53535Q24037Q6859m06609m01929L04509O59389M62856
$$ y = [270942974, 190748054, 130836049, 92750965, 69368832, 54401200, 44275342, 35773010, 29414896, 23906926, 20116582, 16719628, 14608140, 12797671, 10992226, 8612153, 7050066, 5891824, 4238513, 2588580, 2791591, 2933785, 3924728, 4070334, 2913267, 2588538, 2900915, 2922536, 3143539, 3071466, 2723680, 2757910, 2533623, 2238915, 1922778, 712695, 247382, 704355, 885373, 578388, 549087, 809620, 1389829, 1606412, 2081010, 3082760, 4084430, 5183106, 5765330, 6502015, 7375034, 8948677, 12111110, 16301638, 20614784, 21865626, 18236544, 12995876, 9018198, 6265970, 4930021, 4049716, 3382626, 3736161, 4560198, 4647057, 4240448, 3838519, 4143028, 4802417, 5265273]
19999E265273m03022j075822n14743m08857J16945O16772L01810n06081j495583
19990A896692j228758j59269N38076K77494P12774Q49451O48344m8033q59925
19981B626846r60700j020155k32516K94823l75195N0275K09245L58255j43760
19972H07118l44021l14959K66423L09642m32407n45731n40424j157510l6341L297
19962a984913L5878J043419Q91406N17387N6243O5429K51483o1102O1461j07066
19952G69625O21280K1838o33688k78632L48456O18668L20491n31092p10289q24428
19942b77771q14073k66733M59326P23567K76682K68677k71994n36774m32435k64004
19932a135532m1466K86660j10654j69557O37202m0159k88363m07536l34202k69298
$$ y = [5265273, 4862251, 3786429, 3271686, 2862829, 2979774, 3596546, 3898356, 3392275, 1896692, 667934, 508665, 1046741, 1324235, 2037009, 2886460, 3534804, 3486771, 2626846, 1666146, 645991, 413475, 708298, 333103, 383378, 592623, 950878, 807118, 463097, 148138, 414561, 724203, 291796, -253935, -794359, -1951869, -1988210, -1984913, -1949035, -905616, -14210, 503177, 559420, 624849, 876332, 815230, 876691, 769625, 1390905, 1412743, 779055, 500423, 848879, 1467547, 1788038, 1256946, 546657, -277771, -1091844, -1358577, -899251, -175684, 100998, 369675, 97681, -439093, -871528, -1135532, -1176998, -890338, -1000992, -1170549, -533347, -573506, -861869, -1269405, -1603607, -1872905]
19922a872905K055M23769k6076j58910J41535J49826R42421K42053l57934R6748
19912d17418N52709K75525J23755m42718o56683p85318o85695K31017L16376K24248
19902a264202M56163R60548M24046m02299K4571l01417j102141m80311O50148
19893a034894N08915m68437o42057L28259J260299Q74998L37344q27796j440453
19884a103822n78090J73983R43245O10999K70461J57752p71896k82780L0169O4552
19874d85427J11529j29228M92119Q08798m18507q49111k87370P02827O28530m29401
19864A44759j37260P12557J86023j89896J24921L98604j04511q98583j582562
19855a345948m91596p2279J42904L66461k68602k14768Q84050N42028o1730r3599
$$ y = [-1872905, -1870850, -1447081, -1473157, -1632067, -1490532, -1340706, -398285, -156232, -514166, -417418, 135291, 410816, 534571, 91853, -564830, -1350148, -2035843, -1804826, -1488450, -1264202, -808039, 152509, 576555, 174256, 198827, -102590, -1204731, -1685042, -1034894, -525979, -994416, -1636473, -1308214, -47915, 827083, 1164427, 336631, -1103822, -1681912, -1507929, -564684, 46315, 316776, 474528, -297368, -580148, -549979, -485427, -373898, -503126, -11007, 797791, 379284, -469827, -757197, -54370, 574160, 144759, 7499, 720056, 906079, 716183, 841104, 1239708, 1135197, 236614, -1345948, -1837544, -1909823, -1766919, -1400458, -1669060, -1883828, -999778, -457750, -519480, -613079]
19845f13079J00253J80221q6255q04513n01632k6740L68043K62766R2416K99212
19835g29308l63463o47038q7535L84037K84629J71204O44778L51426K97807r3474
19825B13063j40872j73328k73582o49669k64888P57715J03136N06916j58008l44841
19815d24358N00736J93060J18075k54276n44389L55560J171243j7657o89894n32616
19805a24516K2073K7734j074401n94233J30396j06243K63053L89443M19140J06221
19795e41333k58386j52613L36201j37836J82603Q90206L58894K53824M17567l91782
19785I57345r50989n00414N41347N19995n30457q94868m57830l74857n89687j78257
19775b458672J072537J468652R15737j45015l70472J87646L4095R3099L28871
$$ y = [-613079, -512826, -332605, -418860, -1223373, -1725005, -1751745, -1383702, -1120936, -1028520, -729308, -1092771, -1739809, -1827344, -1443307, -1158678, -987474, -342696, 8730, 306537, 213063, 72191, -101137, -374719, -1024388, -1289276, -531561, -428425, 78491, -79517, -424358, 76378, 269438, 387513, 133237, -411152, -55592, 1115651, 1097994, 408100, -124516, -102443, -74709, -1149110, -1743343, -1612947, -1719190, -1456137, -1066694, -647554, -541333, -799719, -952332, -616131, -753967, -571364, 318842, 677736, 931560, 1349127, 957345, 6356, -494058, 47289, 567284, 36827, -858041, -1315871, -1690728, -2280415, -2458672, -1386135, 82517, 998254, 853239, 482767, 670413, 704508, 797607, 1126478]
19766A126478r6970J70442M88498Q0901l13217j070262p68911j52250J13371j68911
19756e90831l48697l67626p9039J54715R9199o06248l50516O41560J248843P95506
19746E96866J17209k9173J37540l22049q03604j002476N2422P45098L49536p2521
19736b31152n46626j14148L04075P83247N17871l03989j57791j1708o7402J31424
19726C03801j23175k24576o96393q18352R13064P07665J76161L03208P91395P39473
19716B072271k07986o42257j143264m91789J26988L49854Q8094N8119j75831m2150
19706g951n30743r8483J55141r9412M11665N53378K49606L17571L95361J08135
19696A454268k53345K9705l77222k91914R9331M94911p7813m59040p70214n43073
$$ y = [1126478, 1029508, 1199950, 1688448, 1769349, 1456132, 385870, -383041, -535291, -421920, -590831, -939528, -1307154, -1386193, -1231478, -1132279, -1738527, -2089043, -1447483, -198640, 596866, 714075, 684902, 822442, 500393, -303211, -1305687, -1253265, -508167, -158631, -231152, -777778, -891926, -587851, 195396, 713267, 409278, 251487, 239779, 172377, 303801, 180626, -43950, -740343, -1558695, -645631, 62034, 238195, 541403, 1332798, 2072271, 1864285, 1222028, 78764, -413025, -286037, 63817, 151911, 210030, 34199, -7951, -538694, -637177, -482036, -581448, -169783, 383595, 633201, 950772, 1346133, 1454268, 1200923, 1230628, 853406, 561492, 660823, 1155734, 1077921, 618881, -151333, -694406]
19686f94406k37561j49110O99871J005509N72562L8423O6867J23306k85083m99912
19676F40466J14085R8548k17600K9230k35044l27395l67564j1778L76105O41061
19666G40114O63564O59041O5905l57937n54514j138650n84033p16583j261719
19657b484812R0598Q75584J46313L90706J033391P56402n09110p96612l28028
19648h25568J67536L39779L39147j6987R9018J67833l22183k47822M68601N72250
19638G41604L1980j109900r48924L64048R63130P99823J54676M32671K1094o8082
19628A382120j44369n17281K67497P07608l92606m59668k2908l99062L03316m5331
19618F79316r73226K18621J330207J86145p95292j027888l1426K9004n66678l98065
$$ y = [-694406, -931967, -1081077, -381206, 624303, 1196865, 1235288, 1302155, 1425461, 1140378, 640466, 754551, 853099, 635499, 664729, 429685, 102290, -265274, -277052, 99053, 740114, 1403678, 2062719, 2128624, 1770687, 1216173, 77523, -506510, -1223093, -2484812, -2394214, -1518630, -1372317, -981611, 51780, 808182, 299072, -497540, -825568, -658032, -318253, 20894, 3907, 102925, 270758, -51425, -299247, 169354, 741604, 773584, -336316, -1285240, -921192, 41938, 841761, 996437, 1429108, 1450202, 1382120, 1237751, 720470, 987967, 1695575, 1302969, 843301, 820393, 421331, 724647, 679316, -293910, -75289, 1254918, 1441063, 645771, -382117, -413543, -384539, -951217, -1349282]
19608a349282K11758L48967J31893j31559p4114R09970J313582P12213J36603
19599B210031J656K52492l76153n78453l05399m77133j30699M00251J27421n07820
19589F16194l12348N8588K37021P36944l4248q41810Q27279J058983K78005o64554
19579A960054r02740m66225Q2864l5295l54691j58296k20563P04380J24190r74034
19569b40356j294229o68888L68869L8611j42407l8467K35554R07599K26169M41832
19559a65713J075659l91805j905292j476227J13741P47006N39007Q60125J051648
19550D48149K95630o05482N8899L58822L46593L62787O10439O92899O94761q07096
19540B456401j143743j10714O00605k0630J7087P48150k53078j495264j179508
$$ y = [-1349282, -1137524, -788557, -656664, -788223, -862337, 47633, 1361215, 2073428, 2210031, 2211687, 2464179, 2088026, 1509573, 1204174, 727041, 596342, 996593, 1124014, 616194, 303846, 362434, 599455, 1336399, 1302151, 460341, 1287620, 2346603, 2624608, 1960054, 1057314, 591089, 673953, 638658, 283967, 125671, -94892, 609488, 733678, -240356, -1534585, -2203473, -1834604, -1795993, -1938400, -1976867, -1741313, -833714, -607545, -165713, 909946, 518141, -1387151, -2863378, -2749637, -2002631, -1463624, -603499, 448149, 743779, 138297, 197196, 556018, 902611, 1265398, 1875837, 2568736, 3263497, 2456401, 1312658, 1201944, 1802549, 1781919, 1799006, 2547156, 2294078, 798814, -380694]
19531c80694r59662m71475j50518N08071M27273N05130N83590N96924P83850J70920
19521A613409k41670l08785o25866k97238J56564N88606K73995m06002j281154
19512e28141j105162j8436J192758J238614J25619P01159O56693J02643m4710
19503B321037J83623J95605l36508l64106j47730j19255l22093k9085M11255J39062
19493A931805O55420R61006J60331r16327j191998k59325K04151r3621k1893k52734
19483A176815n04237k85498j22604M5307L28220L34752j20564j19107J80962j691
19473I12355K8579R1407L06564L62673K43707m02865m42926Q48522L11779q36452
19463A423343l05726N74062Q14930j55474o95542j74840J82140k3736L78959J80127
$$ y = [-380694, -1340356, -1811831, -1962349, -1454278, -1027005, -521875, 61715, 658639, 1442489, 1613409, 1371739, 1062954, 437088, 139850, 296414, 885020, 1159015, 753013, -528141, -1633303, -1651739, -458981, 779633, 905252, 1606411, 2263104, 2365747, 2321037, 2504660, 2700265, 2363757, 1999651, 1851921, 1732666, 1410573, 1381488, 1792743, 1931805, 2587225, 3548231, 3708562, 2792235, 1600237, 1340912, 1545063, 1451442, 1429549, 1176815, 672578, 387080, 264476, 309783, 638003, 972755, 852191, 733084, 914046, 912355, 940934, 1032341, 1338905, 1701578, 1945285, 1542420, 1099494, 1948016, 2259795, 1423343, 1117617, 1691679, 2506609, 2351135, 1655593, 1480753, 1662893, 1639157, 2018116, 2198243]
19453B198243n76607n55977J102752K270340N19377p06851n90890q8811L94020
19444C965596J243458J886503K158260K009460J822492J559626J362248K509127
19436A8516770L666180M182064N481157R804689J5454895K2651589L1506782L1740472
19428A43004598R852254m670227J759055j0911922l3534384l0377170j9431533
19421E5690671j3435741r957459p706092n177018l900111k440396j381736j646667
19413A0045451j456676j162039j093083r48224n49496j32681J7398j46684o33185
19404C940781j194299j379756j019441n76282J54252l4390J6767O30160J83905
19395G21697j29027O46411M17016J03110J43497k77701m48617o61490k4446O26814
$$ y = [2198243, 1621636, 1065659, 2168411, 4438751, 4958128, 4251277, 3660387, 3571576, 3965596, 5209054, 7095557, 9253817, 11263277, 13085769, 14645395, 16007643, 18516770, 22182950, 26365014, 31846171, 41650860, 57105755, 79757344, 111264126, 143004598, 152856852, 148186625, 149945680, 139033758, 105499374, 75122204, 55690671, 42254930, 32297471, 24591379, 19414361, 15514250, 13073854, 11692118, 10045451, 8588775, 7426736, 6333653, 5385429, 4835933, 4703252, 4720650, 4573966, 3940781, 2746482, 1366726, 347285, -228997, -74745, -109135, -92368, 537792, 721697, 592670, 1239081, 1656097, 1759207, 1902704, 1625003, 1176386, 514896, 490450, 1117264]
19385A117264L44141m60451q93475j077401j49272Q65995P37178K58866j82004
19376E60841K12646M10663L71465j95885j329463n80742P53301K59221r7260j82357
19366A82430j82969l99039j41162L64905J52007l27285j81837k23794K97838M97754
19356C8848O67323M37314p67608p66442J89586P13129l2460o87080m64141K77196
19346c94335M75181J16669j94837L3880J41779J66376N58536N35434J93121k81514
19336A350290l46146p71473j373432j310328n14685M05911Q79407J004396J558250
19327H82190P94994n52692m31564j62736J75097K90527K90009O624r24360l58191
19317I898k55978q27625m61099L58002N85483O75364n13623q83275J21409M19730
$$ y = [1117264, 1461405, 1000954, 107479, -969922, -1119194, -253199, 483979, 742845, 560841, 773487, 1184150, 1555615, 1359730, 30267, -550475, 202826, 462047, 364787, 182430, -539, -399578, -540740, -175835, -23828, -351113, -532950, -756744, -458906, 38848, 706171, 1143485, 375877, -390565, -200979, 512150, 479690, -207390, -671531, -394335, 80846, 197515, 2678, 36558, 178337, 344713, 903249, 1438683, 1631804, 1350290, 1004144, 232671, -1140761, -2451089, -2965774, -2559863, -1680456, -676060, 882190, 1677184, 1124492, 692928, 530192, 705289, 995816, 1285825, 1292449, 368089, 9898, -246080, -1073705, -1534804, -1176802, -591319, 84045, -429578, -1312853, -1191444, -771714]
19307g71714N74217L48677N22734K7105k04926p12535j44394J53057m42074P8549
19297e71304J93665K10141Q43245P52542m68997j611060k86533N65193l2960j9160
19287d25228M80206J02367o45317J4849O09192j47744l06853R31910J47245n31189
19277B29438n97394p1799J247776M62089j141704p67407P56970J061374K33377
19268A412720m95507k97438j49068P8557k90605o79126n85426J78866Q76162Q31661
19258H80796J21360j268721j434841p80836J57707P54306Q47644P81778J287743
19249A346936K32667r80919K00189Q57617n72218j047878n3856J32494l42654
19240b27622p76632m01510K81810m23270P9178O66252P54187L63472K74931j55192
$$ y = [-771714, -197497, 151180, 673914, 701019, 496093, -216442, -360836, -207779, -649853, -571304, -377639, -167498, 675747, 1428289, 959292, -651768, -938301, -373108, -406068, -425228, 54978, 157345, -487972, -473123, 136069, -11675, -318528, 613382, 760627, 229438, -367956, -439755, 808021, 1270110, 128406, -639001, 117969, 1179343, 1412720, 917213, 619775, 470707, 549264, 258659, -420467, -1005893, -827027, 49135, 880796, 1002156, -266565, -1701406, -2482242, -2324535, -1570229, -722585, 59193, 1346936, 1579603, 598684, 798873, 1656490, 1084272, 36394, -17462, 115032, -227622, -1004254, -1405764, -1123954, -1547224, -1468046, -801794, -47607, 315865, 590796, 435604]
19230D35604l41140n80293J75099R45452R2094J07822M86963O47982J03873l89488
19220A683968r23660j195084j321245r2568K2115j73557o5728j58364J69977J287295
19210g66851J226726O20199J61656M8689p38056n74804L6600J03782m48854k97658
19200f28571J91476N16558N19426O37L27125O48376k34880l77917n52308n54820
19190a44898l18781j21144M37876K70307M30646r2058l96743K14619M62197j50783
19180E91238m01308k63230l68316K18954L64183Q0357R0137J97467q6939k274
19170D20269M01057M12063j59897r15301p14667n20265p80856o75253J95220O42086
19160a695544P69681P18327P42828L88318K66458o88669q25197j33044L84125
$$ y = [435604, 94464, -485829, -310730, 634722, 726816, 834638, 1321601, 1969583, 2073456, 1683968, 760308, -434776, -1756021, -1848589, -1826474, -2000031, -2065759, -2224123, -2054146, -766851, 459875, 1080074, 1241730, 1290419, 552363, -22441, 14159, 117941, -330913, -628571, -437095, 79463, 598889, 599526, 926651, 1575027, 1340147, 962230, 409922, -144898, -463679, -584823, -146947, 123360, 554006, 461948, 65205, 279824, 742021, 591238, 189930, -73300, -441616, -222662, 141521, 221878, 312015, 509482, 422543, 420269, 821326, 1233389, 1073492, 158191, -556476, -1076741, -1857597, -2532850, -2337630, -1695544, -925863, -207536, 535292, 923610, 1190068, 501399, -323798, -456842, -72717]
19151g2717R25633N14651O88810j62408j151784n87437l65160J34952K89838l16469
19141a02091m35794L8706m65139o07276o0550j68999M4529R18766O14060K45857
19131B2069m97621j232793n14806K25237N72893P23219J36211K78927K08614n66079
19121f44129j83N28940K77869l3218r1927q5733m02531L88796Q1458J06792K97421
19110D23555N93937O19457j00971l50467J73211l09055r13766j84118N16836J047338
19100A515957N24909M07944P3209m35755l15016n87389m28939o19586r53597J66495
19090f51768J255465K63512m91251o3980j09981M21913o5532m42404J26694K3196
19080B65864J66688j71231k60083L5652M02528K31181l71590o18957k96852J20044
$$ y = [-72717, 852916, 1367567, 2056377, 1893969, 742185, 154748, -210412, -75460, 214378, -102091, -537885, -499179, -964318, -1571594, -1632144, -1801143, -1756614, -837848, -223788, 22069, -475552, -1708345, -2223151, -1997914, -1425021, -701802, -565591, -286664, -78050, -644129, -644312, -115372, 162497, 129279, 37352, -48381, -450912, -62116, 19342, 126134, 423555, 1017492, 1636949, 1535978, 1185511, 1358722, 1049667, 135901, -48217, 468619, 1515957, 2040866, 2448810, 2522019, 2086264, 1771248, 1183859, 754920, 135334, -818263, -651768, 603697, 867209, 375958, 311978, 201997, 623910, 558378, 115974, 242668, 265864, 432552, 261321, 1238, 36890, 439418, 670599, 299009, -319948, -616800, -496756]
19070d96756K9983Q5777j72577J43778Q97845J248509K26299m59947r47240o31853
19060g6182K26729k88012m54201l57052j56067k20420l69495j16064K08684K49080
19050a353000J64039P30123J064116K65712p67150j152159j07506R54824Q24239
19041F23238R3624J75983j29911m22138m96066p37916j94741O86081P16572K65746
19031E80472K04317j82495r562j6531N4261k06156j04779R7575N26356K89048
19021A232506m2192l99978m94355j61045k36331k19963n632L96196L0735k42449
19011a42508q48701o85805N23836J002578R07691r4868l863L81868n61K34499
19001A274166N65797r9107o21373j20841J69100l53566p70056l71444N60828L32509
$$ y = [-496756, -466773, -380996, -553573, -409795, 488050, 1736559, 1962858, 1502911, 555671, -76182, 150547, -137465, -591666, -948718, -1104785, -1325205, -1694700, -1810764, -1602080, -1353000, -1188961, -458838, 605278, 870990, 103840, -1048319, -1155825, -201001, 623238, 716862, 892845, 762934, 340796, -155270, -893186, -1087927, -401846, 314726, 580472, 784789, 602294, 592732, 576201, 630462, 424306, 319527, 417102, 943458, 1232506, 1190314, 790336, 295981, 134936, -101395, -321358, -326990, 69206, 99941, -142508, -991209, -1677014, -1153178, -150600, 757091, 662223, 658360, 1040228, 1039667, 1274166, 1839963, 1740856, 1119483, 998642, 1167742, 814176, 44120, -327324, 233504, 566013]
18991E66013l78290n497M71106Q52474k61024r30293m90048j94346o1238O72753
18981B41610m5190m33335K59329Q28648J199669M7037m87590m83616m67924K3255
18971F81893j62409l82824m25350k68475J18678m53762n72340L0270M4115N95347
18961g94857L40721L32630J63212m57073k31648O36j76544K08018L21878j77283
18951d70310L15971M29221R8036k10715l58318m49015L94588P11804M03511k53581
18941F11192l80714K07781K49112K51039K74215J32123K26733L04843k81778o76689
18931I17857j96143l98279j025245l03571q1213m4751L93573L4507K81981P01474
18921B80190K31403q19939j010076o31529k77909l744L94106K63518M35496O41610
$$ y = [566013, 187723, 182226, 653332, 1505806, 1244782, 314489, -175559, -369905, -431143, 241610, 196420, -236915, 22414, 851062, 2050731, 2097768, 1610178, 1126562, 658638, 681893, 519484, 136660, -288690, -557165, -438487, -892249, -1464589, -1434319, -1390204, -794857, -454136, -121506, 41706, -415367, -647015, -646379, -822923, -614905, -293027, -470310, -154339, 274882, 372918, 162203, -196115, -645130, -250542, 461262, 864773, 611192, 230478, 438259, 687371, 938410, 1212625, 1344748, 1571481, 1876324, 1594546, 917857, 721714, 323435, -701810, -1005381, -1086594, -1131345, -737772, -703265, -421284, 280190, 511593, -308346, -1318422, -1949951, -2227860, -2231604, -1837498, -1573980, -1138484, -496874]
18911d96874l04661r46413m0613Q57036J51129l35871j8857R1096R35920Q34629
18901G26521n62112r3436k48631j47468L03938l35979o42859M18452J418798R19237
18891A756461N16891k47667j110161q92629m38765P8554J70068J88029N00769
18882E21550N94554o7937j56878K86834m04941k5196m80301k13119J235792J338333
18872B628691L08786p74422k05744N80857k97272j019052j133171p69836p53R16277
18862B34361J34228n10193R44088O96890l01139n11289j190351l41841Q95100
18853D9854J045873L89315l42134k14428k71101n13378o04614R5329N20060n17048
18843c62272n31633Q819j02870J18172k42423J36873M78348P12535N89449R26677
$$ y = [-496874, -801535, -1747948, -1788561, -931525, -780396, -1116267, -1135124, -1044028, -108108, 726521, 164409, 70973, -177658, -325126, -21188, -357167, -1000026, -581574, 837224, 1756461, 2273352, 2025685, 915524, 22895, -415870, -337316, -167248, 20781, 521550, 1116104, 1048167, 891289, 1178123, 773182, 747986, 267685, 54566, 1290358, 2628691, 2937477, 2163055, 1957311, 2538168, 2240896, 1221844, 88673, -681163, -681916, 234361, 368589, -141604, 802484, 1499374, 1198235, 686946, -503405, -845246, 49854, 1095727, 1485042, 1142908, 928480, 657379, 144001, -460613, -365284, 154776, -362272, -893905, -885086, -987956, -869784, -1112207, -975334, -496986, 215549, 804998, 1731675]
18833A731675Q90986J69012K44673k77447q40982o54646L79301j05487j411627
18824A25458q97493R8247J432323J145515J41370J32484O1598M8323o05473m49703
18814A232649N53999L89135M19821M95904N51452q1619m9977J30053j374302j085082
18804A182033q60653j208410r84362n04026l95148L67283J319041J943301J283833
18795B142892k77364n89823l49205k30230O84917M24004R2110O03476L99837k21781
18785B678833r81929K72087N80429r4625m10746L78419K13663l92595l19456o53546
18775A270534o53176Q732J008108J005203P24288O57885K54047M90885J060652
18766E827158J133087J036157R72669J457351K254808L022868L376246L138055
$$ y = [1731675, 2622661, 2791673, 3036346, 2758899, 1917917, 1263271, 1642572, 1537085, 125458, -772035, -673788, 758535, 1904050, 2045420, 2177904, 2239502, 2287825, 1682352, 1232649, 1786648, 2175783, 2595604, 3091508, 3642960, 3561341, 3511364, 3641417, 2267115, 1182033, 321380, -887030, -1871392, -2375418, -2770566, -2403283, -1084242, 859059, 2142892, 1865528, 1275705, 926500, 696270, 1381187, 1805191, 1897301, 2500777, 2900614, 2678833, 1696904, 1968991, 2549420, 2454795, 2044049, 2422468, 2636131, 2243536, 1924080, 1270534, 617358, 626090, 1634198, 2639401, 3363689, 4021574, 4275621, 4766506, 5827158, 6960245, 7996402, 8969071, 10426422, 12681230, 15704098, 19080344, 22218399]
18758B2218399M975555P744558J0161237J4581640K3546210L7268035N1909957
18751A72405591L9460510k1689349n4626694l7791225k1988487j2629448o647064
18744E6493834l85444M240377R996356J5676809K8407040M4777971M5370222o074741
18736A98502424n3893958m6009862k9616190j8880099j2311569q235787n774917
18729B3780042m852546l263292k187523j586659j198211j581009n36217k62049
18721H312536j289424j480760o93091o93551j238008j067282j046925p08576L00848
18712C95767k09980O8003O90538P75685K39943M1323L9950m83646l595P84660
18702B338648L60747m97163j212894n77740p5349m43216n76442m38173o59316
$$ y = [22218399, 27193954, 34938512, 45099749, 59681389, 83227599, 120495634, 172405591, 211866101, 190176752, 135550058, 97758833, 75770346, 63140898, 56493834, 56108390, 60348767, 70345123, 86021932, 114428972, 159206943, 204577165, 198502424, 144608466, 98598604, 68982414, 50102315, 37790746, 29554959, 23780042, 18927496, 15664204, 13476681, 11890022, 10691811, 9110802, 8574585, 8312536, 7023112, 5542352, 4849261, 4155710, 2917702, 1850420, 803495, 94919, 395767, 185787, 253790, 944328, 1720013, 1959956, 2001279, 2041229, 1557583, 1553988, 2338648, 2699395, 2202232, 989338, 411598, 336249, -106967, -683409, -1121582, -1780898]
18693a780898j58540N60899J238301P24368l70202r43739L1785J494979J014941
18684A811894j88166l2760J43341n96180j106426o35468o5497r9082l76807k7216
18674a172367Q69114L89645q7116K81043J219253Q92197M29694j46980p44410
18665A930073k90437O96740R43718K90221P58980P05939k94362L11991O32131
18656E684994J614979K547712K157610K30535k575041k882860k143519j140713
18648C493697o30734o55986m95700o17285l00308l98663K67141R97392K80393
18639A939947p24559j544165o63473p9292k0567r2107j44709P98536L30241L9512
18629a60636M12149L34374j18337m98000j83071P52968N52864m41077N220J252030
$$ y = [-1780898, -1939438, -1378539, -140238, 584130, 213928, -729811, -698026, 796953, 1811894, 1623728, 1590968, 1734309, 1138129, 31703, -603765, -669262, -768344, -1145151, -1172367, -303253, 86392, -724, 280319, 1499572, 2391769, 2821463, 2674483, 1930073, 1639636, 2336376, 3280094, 3570315, 4329295, 5035234, 4740872, 5052863, 5684994, 7299973, 9847685, 12005295, 12235830, 9660789, 6777929, 4634410, 3493697, 2862963, 2206977, 1711277, 1093992, 793684, 395021, 662162, 1659554, 1939947, 1215388, -328777, -992250, -1071542, -1092109, -1184216, -1328925, -530389, -200148, -160636, 251513, 585887, 467550, -30450, -213521, 539447, 1092311, 651234, 656454, 1908484]
18619A908484J168869J64513j329095o37219N68444R36742k64701m72439o10368
18610A433230p83114n03544n90262k37132J168186P98204o7718l38092l91292
18601D88466O1003J63132m41580R4972L30346k40890j33297O507K23640j64861
18591C87438L58790L68604K17835K08513n90962l22134O25515Q7837m3422J68124
18581A466138L76671j62869L78216K06203j54373K65660k60964q61052n51824
18572G01806j35127j66616L66322R80515M12575j69303r86392j794447o01717
18563a392384L65207M52017M72880m60029j69885Q07554L73530j81311j38959
18554A28620j64368K04204N0946K05318k32328m45633L35220M12825M21911k09337
$$ y = [1908484, 3077353, 3241866, 1912771, 1275552, 1843996, 2780738, 2516037, 2043598, 1433230, 650116, 146572, -443690, -680822, 487364, 1285568, 1217850, 879758, 488466, 549469, 712601, 271021, 365993, 696339, 455449, 322152, 328659, 552299, 387438, 746228, 1114832, 1332667, 1541180, 950218, 628084, 1253599, 1341436, 1298014, 1466138, 1842809, 1679940, 2058156, 2264359, 2109986, 2375646, 2114682, 1253630, 701806, 566679, 400063, 766385, 1746900, 2159475, 1990172, 1003780, -790667, -1392384, -1027177, -575160, -102280, -562309, -732194, 75360, 448890, 267579, 128620, -35748, 168456, 219402, 424720, 192392, -253241, 81979, 494804, 916715, 707378]
18544G07378l99609r92133n83118J071291Q41491j1361O5138J37814L90109n2176
18534A174824p44736l70445k92651l46399J6890P31105N24211n67875n88102K74426
18524a88752K56072L5216m34826l87393L83350K38742j1658l42582l66170L7288
18514g80713n93395n98855q96127l766L02839j21467O05572M15832j9620N41954
18504a147746K03804l69622j48200J24337N62490k41795p36077k02854O77819
18495a277844J35287K77227O08226N9792N6490N28860j27944K89413P8483j33375
18485D94615p19207l20095N79225L34317l76094q4944O73361j82982p3923J91995
18475E16268p8468K89928k74862o86018m97554M33726J206625L21975K9535q20341
$$ y = [707378, 307769, -684364, -1267482, -196191, 645300, 633939, 699077, 836891, 1227000, 1174824, 430088, 59643, -233008, -579407, -562517, 168588, 692799, 124924, -463178, -188752, 67320, 102536, -332290, -719683, -336333, -97591, -109249, -451831, -818001, -780713, -1374108, -1972963, -2869090, -2872856, -2570017, -2691484, -2085912, -1670080, -1689700, -1147746, -943942, -1313564, -1461764, -1337427, -774937, -1016732, -1752809, -1955663, -1277844, -1142557, -865330, -257104, -197312, -140822, 388038, 260094, 549507, 627990, 494615, -224592, -544687, 34538, 368855, -7239, -92183, 581178, 398196, 324273, 516268, 437800, 727728, 452866, -233152, -730706, -296980, 909645, 1231620, 1261155, 440814]
18465D40814p20287l14690o45591l20571R73354J257355Q33126M95000j71186
18456A827324R9732m08167r50427j061866n34703M03192J63093L7557N39895J59152
18446B74782m50919K49013N76456l05798p13973n08779r6938K00788N93758K66299
18436H4689j17514m0269L77064P27213O40601J77727m20487p01544m75614l22769
18426g0903l40727k10069Q21602J361872J56154k15742n74188p58377p27895k77879
18416h36152L33167K94521Q5686m89843l02625M04917L69099M949n64134K9367
18406f71048J68064L2776L22030O42958M28337Q39418M44689p74830j245812l82616
18396a96034p1708O0692K17247j02139n31237p19937o40984N36700Q42077L05643
$$ y = [440814, -279473, -594163, -1239754, -1560325, -586971, 670384, 1503510, 1998510, 1827324, 1927056, 1518889, 568462, -493404, -1028107, -624915, -461822, -424265, 115630, 274782, -176137, 72876, 649332, 343534, -370439, -879218, -976156, -775368, -181610, 84689, -32825, -73094, 303970, 1031183, 1671784, 1849511, 1429024, 727480, 251866, -70903, -411630, -621699, 199903, 1561775, 1717929, 1502187, 927999, 169622, -558273, -836152, -502985, -208464, -122778, -612621, -915246, -510329, -141230, -136281, -700415, -671048, -502984, -470208, -148178, 494780, 923117, 1762535, 2207224, 1432394, 186582, -196034, -267742, -207050, 10197, -91942, -623179, -1343116, -1984100, -1447400, -605323, -299680]
18386b99680L18483n8570K12894O27892M12650J86908J37837j014335r08353J55893
18376b28381j09433P7233J77141m25871J36129M79455j31659k22785L48258O47336
18366G47423L03125r37587o54567K70779M36703J65255j62305o7147l1600l45940
18356b75861m9556N65560Q2248j63699M70378L34277M86841L84870r39625o85089
18346B10344J82163O93434K94819J93970M0031M6291K97908j28872j156808p72056
18336i8776l31302O326N63685N81616k83989L84858R33198l81382m4349M58573
18326A788458J685m89178M4800O10543K8633k98851j74336o11916k35909J82770
18316H46699L72161N1001l71143m27268j39035j2447k97650P38996N96760n16606
$$ y = [-299680, 18803, -39767, 173127, 801019, 1213669, 1400577, 1538414, 524079, -384274, -228381, -337814, -260581, -83440, -509311, -373182, 106273, -25386, -248171, 100087, 747423, 1050548, 112961, -541606, -270827, 165876, 331131, 168826, 101679, 70079, -275861, -325417, 240143, 322391, 158692, 629070, 963347, 1450188, 1835058, 895433, 210344, 392507, 1085941, 1380760, 1574730, 1614761, 1661052, 1958960, 1830088, 673280, -98776, -430078, -423752, 139933, 721549, 437560, 822418, 1755616, 1374234, 1329885, 1788458, 1790143, 1300965, 1345765, 1956308, 1984941, 1686090, 1511754, 899838, 663929, 846699, 1218860, 1269861, 898718, 471450, 332415, 319968, 22318, 761314, 1358074, 841468]
18306H41468o89323n42013O58020L85305M6042O08772N51191n33616o74475J75437
18296H26808j35460r02224m17462k08465j76407M94948Q51604J311633J22339
18287A767314m75083k59791j05714J04994j17796J52063L8738m19974m39916j16983
18277A27852j93396m02459n96469o00331K35542O29400J301870Q39768o16066
18268G25711j123108p21604o90911M7625Q22139J2765l31666o22321l16952k22480
18258b420802k03853M65442O10234N76466O52741K92089L5431L96874K12724l82613
18248B34733l8223m06667L87629P01523O31839N04039m49500p4664j6518j521840
18238d7649j222228L3547L71181L39879J49938k2383O72683L22266j335425o32599
$$ y = [841468, 152145, -389868, 268152, 653457, 699499, 1308271, 1859462, 1325846, 651371, 826808, 691348, -210876, -628338, -836803, -1013210, -518262, 333342, 1644975, 1767314, 1292231, 1032440, 926726, 1031720, 913924, 1065987, 1104725, 684751, 244835, 127852, -65544, -468003, -1064472, -1664803, -1429261, -799861, 502009, 1341777, 725711, -397397, -1119001, -1809912, -1762287, -940148, -927383, -1259049, -1881370, -2198322, -2420802, -2624655, -2159213, -1548979, -972513, -319772, -27683, 7748, 404622, 617346, 234733, 196510, -210157, 177472, 878995, 1510834, 2014873, 1565373, 1490709, 1474191, -47649, -1269877, -1236330, -865149, -525270, -375332, -397715, 274968, 597234, -738191, -1370790]
18228a370790R76140P11624L1413m67452m47282J15591m15654j85355M39595N15352
18218i6818J92064n7939L10040K36927m89708M23754Q59528j39587J24309M28454
18208A791024m22377m76393l64829n38710j85712N53285L80317k06900k61819
18199B67886K8641L82539O2251l16512j23002J43867k7974q43760r47033m06144
18189a779241m8461m54142m64604K56903M84362N37452k66338j077214j47118
18180b958401j19327N68070J029951J53192k05086L08185M95435j42167K46037
18171f24111M1200j41759J45670l57066j06934J6638J188777O85751n697N38453
18161A380922L39638L09785r8462m76134o43261q50185l10910M44148o44356J64278
$$ y = [-1370790, -394650, 316974, 348387, -119065, -566347, -450756, -866410, -1051765, -612170, -96818, 95246, 37307, 347347, 584274, 94566, 518320, 1377848, 1238261, 1362570, 1791024, 1368647, 892254, 527425, -11285, -196997, 356288, 736605, 529705, 267886, 296527, 679066, 741317, 424805, 301803, 445670, 417696, -426064, -1373097, -1779241, -1827702, -2281844, -2746448, -2489545, -2005183, -1467731, -1734069, -2811283, -2958401, -3077728, -2509658, -1479707, -1326515, -1531601, -1223416, -727981, -870148, -624111, -582911, -724670, -579000, -936066, -1043000, -1026362, 162415, 848166, 842469, 1380922, 1720560, 2030345, 1931883, 1455749, 812488, -37697, -348607, 95541, -548815, -384537]
18151c84537R76093Q86653K61537l0476K72521M53974Q56873N86630k83556n72147
18141C023565n60453j19605n4433j06817M19275P06395K61032N00833P05287J543430
18131F318509L016653N297952O672598L860628m038071o838494m555903k883788
18123F850084j788723j043725j004996n35063m82828o06470m29457k91981p39789
18114g2948p36242l49210J12012M91862N77428L61569N03931N39032L50155k86212
18104A491377n81265M0509K35103o24233j025059n41684n26522m35176l04116
18095b271066J063773J030531O14966L70143J44318r50531j083837l78123L10325
18086a149501K93515n67345q91831M77960N05428j66328o6147j32357L11997M51254
$$ y = [-384537, 591556, 1478209, 1739746, 1709270, 1981791, 2435765, 3292638, 3879268, 3595712, 3023565, 2463112, 2343507, 2289074, 2182257, 2601532, 3307927, 3568959, 4069792, 4775079, 6318509, 9335162, 14633114, 21305712, 25166340, 21128269, 14289775, 9733872, 6850084, 5061361, 4017636, 3012640, 2477577, 1994749, 1388279, 958822, 666841, -72948, -809190, -1158400, -1046388, -554526, 22902, 384471, 888402, 1427434, 1777589, 1491377, 910112, 950621, 1185724, 561491, -463568, -1005252, -1531774, -1966950, -2271066, -1207293, -176762, 438204, 808347, 952665, 2134, -1081703, -1459826, -1149501, -855986, -1423331, -2315162, -1837202, -1331774, -1498102, -1564249, -1696606, -1384609, -933355]
18076i33355K08283K38912M59564M40025j60035l08317m04279l44290m615L24993
18066d83114J72277L09228k70291k86903k03011q20336k63483o6966L44034J076256
18056d92309J280808J22690l74220Q67485k74175l48556r8756p18886j63845n20953
18046g20717p15538K35040Q84381j7796q78057m6569Q94179J479034L90195m6931
18036A457221j13691r05839j264292o47395N79068J131938R2908p23948n07672
18027i01702O4027M44012N02300m04643l01682N73551N29872p3518p26251p3602
18017c67636O33464m47662j94155J67172j037556r8811L52762j23854n19618k59978
18007a895872J187337Q05528J81573j74888m36639n82530k49213L12869L11385
$$ y = [-933355, -725072, -486160, -26596, 413429, 253394, -54923, -459202, -803492, -808107, -483114, -310837, -1609, -271900, -558803, -761814, -1582150, -1845633, -1912599, -1568565, -492309, 788499, 911189, 536969, 1404454, 1130279, 781723, 682967, -35919, -199764, -720717, -1436255, -1201215, -316834, -334630, -1212687, -1259256, -365077, 1113957, 1504152, 1457221, 1343530, 437691, -826601, -1473996, -894928, 237010, 329918, -394030, -901702, -837675, -393663, 108637, -296006, -597688, -24137, 505735, 432217, -294034, -367636, 265828, -181834, -375989, -208817, -1246373, -1345184, -992422, -1116276, -1635894, -1895872, -708535, 96993, 278566, 103678, -332961, -915491, -1164704, -851835, -540450]
17998e40450J14959n11030L12703P85322j82252j23900Q2950n3816K46155L14501
17988D45142k4961N89287l1842j019273r08893n46834L39516K59320L85098M58910
17978e4530O96418l77778l49408K98655M6141K97671Q1354j48965l32731p37087
17968e80260n77066j77209j26950k58815J06370P15805J050408K91179j07562
17959C35900L0020O28582P02536p10508q88022o88992n70572j70392K82615m8324
17949a097157l87551m35695r2834J215876J084786K02216k2544M475p5207J68672
17939E65037P9203n45398k36193J076606Q04652l17062o18233N53980K90534k5606
17929A627520O5693o54575m72641m99450o85986o4310N14041O23411j69171n31704
$$ y = [-540450, -425491, -936521, -623818, 161504, -20748, -144648, -61698, -115514, 130641, 445142, 420181, 1009468, 977626, -41647, -950540, -1497374, -1157858, -898538, -513440, -54530, 641888, 264110, -85298, 213357, 259498, 557169, 638523, 489558, 156827, -580260, -1157326, -1334535, -1461485, -1720300, -1613930, -898125, 152283, 443462, 335900, 365920, 994502, 1697038, 986530, 98508, -590484, -1161056, -1331448, -1048833, -1097157, -1484708, -1920403, -2013237, -797361, 287425, 489641, 467097, 471572, 396365, 565037, 644240, 98842, -137351, 939255, 1743907, 1426845, 808612, 1362592, 1653126, 1627520, 1693213, 1038638, 565997, 66547, -619439, -683749, -169708, 453703, 284532, -247172]
17919b47172o1159J27515Q8111J09584M14614L33527M80057M10893L66436k64581
17909A757825l34745m35641o28046m69103l56709J29934J146750K22138j099751
17900f7348p57942j2777J70997L20966N05997K62045J71388K60958Q3339q40226
17890I7397m70434O51802M73302L16887L83943M09710O364k32089l17270l48627
17880I70985j62557k8879R9519l15398k78623J78186M41047o1077n78226j07415
17870A57562O97567P18692n3386m23696j70362J49969K6161j30424q41648l48615
17860b18180K93857m93246j018141n62978K51565K85582M37675n19795j305711
17851b849372k11459N18388N6637k22750P8981J026225R66286L40249k54844L55199
$$ y = [-247172, -308331, -180816, -92705, 16879, 431493, 765020, 1245077, 1655970, 2022406, 1757825, 1423080, 987439, 359393, -109710, -466419, -336485, 810265, 1032403, -67348, -825290, -838067, -667070, -346104, 159893, 421938, 593326, 854284, 937623, 97397, -373037, 278765, 752067, 1068954, 1452897, 1862607, 1868971, 1636882, 1319612, 970985, 808428, 779549, 879068, 563670, 285047, 463233, 904280, 843203, 264977, 157562, 855129, 1573821, 1520435, 1096739, 926377, 1076346, 1102507, 972083, 130435, -218180, 75677, -417569, -1435710, -1998688, -1747123, -1461541, -1023866, -1543661, -2849372, -3060831, -2542443, -2485806, -2708556, -2629575, -1603350, -637064, -296815, -551659, -196460]
17841a96460O97364K88433o73969m21089M73436P68859j63118n87726k71669k94567
17831c80506Q1636J78177R1260k88471p43511N56547M27602k42366n80746j048484
17821a948862L94547Q47482N76329K84665O94022L90081l15550J02544M36906
17812A462164J04998j18282l08095K3340N02463K04930K84279K66843l10117n22803
17802A589720m61553p17975l36387J49494l53889m47926L93657L02587K51135
17793C68863N79751Q39175M40414j98020j262854j581920l50690l24578J67371
17784a322488M15183l27507p9767M16854O93843L50482q6907r87620J5174P12782
17774a99971l28021l66676J45168m06144p50316Q6660o61549j020136m35790K93820
$$ y = [-196460, 500904, 789337, 115368, -305721, 167715, 936574, 773456, 185730, -85939, -380506, -298870, -120693, -29433, -317904, -1061415, -504868, -77266, -319632, -900378, -1948862, -1554315, -706833, -130504, 154161, 848183, 1238264, 922714, 1025258, 1462164, 1567162, 1448880, 1140785, 1164125, 1666588, 1871518, 2155797, 2422640, 2112523, 1589720, 1128167, 410192, 73805, 223299, -130590, -578516, -184859, 117728, 368863, 948614, 1787789, 2228203, 2030183, 767329, -814591, -1165281, -1489859, -1322488, -907305, -1234812, -1314579, -897725, -203882, 146600, 59693, -927927, -912753, -199971, -527992, -894668, -749500, -1155644, -1905960, -1819300, -2480849, -3500985, -3936775, -3642955]
17764c642955P51734P19011J043926P19278N95761J7948l52439j72958k99702
17755f20396M11182O28061l08871j83260J56013N16875N20401O42514M80914J17647
17745B361080J0878j132388j691346j110116m68602N9722O86075L89600j48596
17736a043693Q6090m42815K52072N64764j95043k71180K97064K00030K37746M76181
17726A61216Q2666J93537n32499j06497L09916j35907J55326j53660n84366M04566
17716b05702O77460J240967M75712m66137m50052l19242j109898q97043J78538
17707h75397N18159N94948P01157O58275j80596l65903Q5026J27160q2303K28359
17697A408885J00472l16630j58995L14031P42652L83116m19011m43390j40456
$$ y = [-3642955, -2891221, -2172210, -1128284, -409006, 186755, 204703, -147736, -320694, -620396, -209214, 418847, 109976, -73284, 82729, 599604, 1120005, 1762519, 2243433, 2361080, 2371958, 1239570, -451776, -1561892, -2030494, -1970772, -1284697, -895097, -1043693, -957603, -1400418, -1148346, -583582, -778625, -1049805, -752741, -552711, -314965, 161216, 243882, 437419, -95080, -201577, 108339, -27568, 127758, -25902, -610268, -205702, 471758, 1712725, 2188437, 1722300, 1272248, 953006, -156892, -1053935, -875397, -357238, 237710, 938867, 1597142, 1416546, 1050643, 1135669, 1262829, 1180526, 1408885, 1509357, 1192727, 1033732, 1347763, 2090415, 2473531, 2054520, 1611130, 1470674]
17688A470674l39734J28622j59919l78532K06683k35564k16742J27752m54866
17679A48374r1953L8527k36989L32408J497675J396085k09489j039928j237468
17670E97242q47225L50415P00550L58455j23514j79327m38962k9370N69680L37639
17660A295583j42922p91384m62978R0101L36036j82576k70780K789k48755L52561
17650b2325j97651n74285q00347m30988L94997N71448K87432K15871L95215J94553
17640C3920L4264r2292J95225L33825n12525o32897q46427m78158L18154N76526
17630a070385n961j77451M02267L36517M41501M14241J10901k53807o40162p69798
17620a212137m11225J43896L1648k6749P84070Q25324P3010L51558O57114R5190
$$ y = [1470674, 1130940, 1259562, 1099643, 721111, 927794, 692230, 475488, 603240, 148374, 56421, 94948, -142041, 190367, 1688042, 3084127, 2874638, 1834710, 597242, -249983, 100432, 800982, 1159437, 1035923, 856596, 417634, 388264, 957944, 1295583, 1152661, 361277, -101701, -11600, 324436, 141860, -128920, -126131, -374886, -22325, -219976, -794261, -1594608, -2025596, -1630599, -1059151, -771719, -555848, -160633, 33920, 68184, -24108, 171117, 504942, -7583, -640480, -1486907, -1965065, -1646911, -1070385, -1076346, -1253797, -851530, -515013, -73512, 340729, 451630, 197823, -442339, -1212137, -1623362, -1479466, -1447818, -1474567, -690497, 134827, 207837, 559395, 1216509, 1311699]
17610A311699r62643j179525o36234M83119Q37763m6204Q6173l7261O40784J005176
17600A502847R7538L77525K50110j098780j433063j62254Q66304P59640L01196
17591A461063m09922m33158J3176J87151l30625j14001n82968q41230J32477m0544
17581i58581N21799J079221N85783q02995p30274K65834J90109j6103k77122L45331
17571B03002J300547P66399o58307j173532p76856K66098K30645j74198M63921
17562D47719P62316j70749o32798p33814j207970j029402n74127j5283N66905
17553b587203O27956L9111K71264N83470J175467J305145L17615n76307o27918
17544E28600k08830K77209K72361k71855k49567k4259l38416j69140K77493N337
$$ y = [1311699, 349056, -830469, -1466703, -983584, -145821, -192025, -105852, -143113, 497671, 1502847, 1600385, 1977910, 2228020, 1129240, -303823, -466077, 400227, 1159867, 1461063, 1051141, 617983, 631159, 818310, 487685, 373684, -209284, -1050514, -918037, -958581, -436782, 642439, 1228222, 425227, -305047, -39213, 150896, 134793, -142329, 203002, 1503549, 2269948, 1611641, 438109, -338747, -72649, 157996, -16202, 447719, 1210035, 1039286, 406488, -327326, -1535296, -2564698, -3138825, -3154108, -2587203, -1959247, -1920136, -1648872, -1065402, 110065, 1415210, 1732825, 1156518, 528600, 319770, 596979, 869340, 597485, 347918, 323659, -14757, -183897, 93596, 98933]
17534I8933L66880K75796J79604L30755J78159n35121m62804j34468j060524n45024
17524a307814R45915O97723O45984m08903j022301L54028M83745J82497j42884
17515D27990p53941q09763J47251P75773N57767K64680n67793p89014m1405L53848
17505d34607J58640O49463L13952l95071p96772m94951J65290l68752k19115N50034
17495h71889P66648N06386k43555r39286J49168M31383k07827l85766l09857k1510
17485a126105M08489J144598L72881m55731J69793J54928l61547l65218r2291
17476a50203K76241J92860N0760n9652n55522M8535M37601J96851M7847k36116
17466B49202j07863l71596k29705p41451n91541M23722N82788L04060P29708j20938
$$ y = [98933, 465813, 741609, 921213, 1251968, 1430127, 895006, 432202, 297734, -762790, -1307814, -361899, 335824, 981808, 572905, -449396, -95368, 388377, 570874, 427990, -325951, -1135714, -988463, -212690, 345077, 609757, 41964, -747050, -788455, -434607, -275967, 373496, 687448, 292377, -504395, -999346, -834056, -1202808, -1421923, -871889, -105241, 401145, 157590, -781696, -632528, -201145, -408972, -794738, -1104595, -1126105, -717616, 426982, 799863, 344132, 513925, 668853, 307306, -57912, -150203, 126038, 318898, 369658, 310006, -245516, -196981, 240620, 437471, 485318, 249202, 141339, -230257, -459962, -1201413, -1792954, -1369232, -786444, -482384, 247324, 126386]
17456A26386r9336P33416J170138N97816n22313n41324R7049l67312j476195n46621
17446h28296K09806J36234O0120N00126k321Q3914j50963l40610K0040o9550M98430
17435A16930N26037k63550n19105L744l90013K16518Q66895K13972j81196r6003
17425D94229J44622L53377N67112M39944O0769m78532q03429j184513p30701J51382
17415i85740N82497J067042O93404k28013o60338M72298N32213n48091o98313
17406B26959L62897L16923J38520L7672P48296J14293p40527j174652k73454K03681
17396c9392k67709M6832O88678P74417N15878Q388j66466p25149o57622p34831
17386e56976j50089R07147J014096k4052m14298o2766k59323l51793k04785Q5650
$$ y = [126386, 27050, 760466, 1930604, 2528420, 2006107, 1464783, 1561832, 1194520, -281675, -828296, -618490, -482256, -422136, 77990, 75669, 159583, 8620, -331990, -311950, -381500, 116930, 642967, 379417, -139688, -135944, -525957, -309439, 557456, 771428, 590232, 494229, 638851, 992228, 1559340, 1999284, 2060053, 1581521, 778092, -406421, -1137122, -985740, -403243, 663799, 1357203, 1129190, 468852, 941150, 1473363, 925272, 226959, 589856, 906779, 1045299, 1082971, 1831267, 1945560, 1205033, 30381, -243073, -39392, -307101, -260269, 428409, 1202826, 1718704, 1727092, 1560626, 835477, 177855, -556976, -707065, 200082, 1214178, 1190126, 775828, 713062, 453739, 101946, -102839, -17189]
17376a7189p31053m9985P9189l4529m27592m91220n2043Q81389Q52599M70641
17366D80207m18171j27958L82737o80893l16727K56002J105404M79261n55885
17357F03977Q92M38648N42998K32388q8666o59609q08523j051332j087741m66807
17347b343775J08512K61002P7552L01718N02722P91591k06043p70647k74717r1287
17337a643372P6292L15822L72908K79056N33750L75023L15791k60717m24915q3183
17327a43545N34869O63920j4103j62834j56001m22013k67787K84812P17986P47046
17317A782350K76780n88394n97477k77879l13061K32275J016336M14680l18620
17308A626990p43576j369285n04278N78251L64648J11218J12124L55796K27034
$$ y = [-17189, -748242, -798227, -719038, -753567, -1181159, -1672379, -1724422, -843033, 9566, 480207, 62036, -65922, 316815, -364078, -680805, -424803, 680601, 1159862, 603977, 604869, 1043517, 1586515, 1818903, 1730237, 1070628, 262105, -789227, -1876968, -2343775, -2235263, -1974261, -1896709, -1594991, -1092269, -300678, -506721, -1277368, -1552085, -1643372, -1567080, -1251258, -878350, -599294, -65544, 309479, 625270, 364553, -60362, -143545, 391324, 1055244, 1041141, 878307, 722306, 300293, 32506, 317318, 1035304, 1782350, 2059130, 1470736, 873259, 595380, 282319, 514594, 1530930, 1945610, 1626990, 883414, -485871, -990149, -411898, -47250, 63968, 176092, 531888, 758922]
17299G58922K93294M15659k47993p2953O51657N38658k3436M9460p78697j152501
17289D32070l97157k35435M01533O76042q4593l51891M57860N22771P54633Q42162
17279C017995m50222r11048j92941k9573j17767l00078N0476R02296P71350k10411
17269B530077Q488j05373k19380k48590j191311m38666P12483J68343q02214p02551
17259b88694L47657Q7586L14409j40878Q559Q94198l5470j058025j050826r65831
17249a887315k01381N80704N52789N59376N79060l78655o53091n17886J47637
17240a218762L55519J80573k750m64214l01486K7669R7613O11946L58070n98607
17230i54429m74542N55386L80680k07359j85079K26896O87358o70058n22279K70758
$$ y = [758922, 1052216, 1467875, 1219882, 1146929, 1798586, 2337244, 2313808, 2363268, 1584571, 432070, 34913, -200522, 201011, 877053, 792460, 440569, 898429, 1421200, 2175833, 3017995, 2567773, 1656725, 1463784, 1434211, 1316444, 1016366, 1066842, 1969138, 2740488, 2530077, 2538565, 2433192, 2213812, 1965222, 773911, 335245, 1047728, 1216071, 413857, -288694, 58963, 146549, 460958, 320080, 328639, 1222837, 1187367, 129342, -921484, -1887315, -2088696, -1507992, -955203, -395827, 183233, -195422, -848513, -1366399, -1218762, -863243, -682670, -685420, -1149634, -1451120, -1423451, -1325838, -713892, -355822, -954429, -1428971, -873585, -492905, -700264, -885343, -658447, 28911, -641147, -1163426, -892668]
17220h92668M54846L47241n82464o86877l73513m28298J95108P35244J422N1796
$$ y = [-892668, -437822, -90581, -673045, -1359922, -1733435, -2161733, -1966625, -1231381, -1229959, -1178163]
$$ [...]
##END NTUPLES=NMR SPECTRUM
##END=
