##TITLE=C13_54-2021
 CDCl3,  2400 sc

 8.7.2021
##JCAMPDX= 6.0         $$ Bruker NMR JCAMP-DX V2.0
##DATA TYPE= NMR SPECTRUM
##DATA CLASS= NTUPLES
##ORIGIN= UXNMR, Bruker Analytische Messtechnik GmbH
##OWNER= root
$$ XWIN-NMR		Version 3.5
$$ Thu Jul  8 11:27:01 2021 Russian Standard Time (UT+4h)  she@DPX200
##.OBSERVE FREQUENCY= 50.327896
##.OBSERVE NUCLEUS= ^13C
##.ACQUISITION MODE= SIMULTANEOUS
##.ACQUISITION SCHEME= undefined
##.AVERAGES= 2400
##.DIGITISER RES= 17
##SPECTROMETER/DATA SYSTEM= spect
##.PULSE SEQUENCE= zgpg30
##.SOLVENT NAME= CDCl3
##.SHIFT REFERENCE= (INTERNAL, CDCl3, 0, 222.69)
##AUDIT TRAIL= $$ (NUMBER, WHEN, WHO, WHERE, WHAT)
$$ ##TITLE= Audit trail, XWIN-NMR		Version 3.5
$$ ##JCAMPDX= 5.01
$$ ##ORIGIN= Bruker BioSpin GmbH
$$ ##OWNER= she
$$ F:/spectra/data/she/nmr/c13/1/pdata/1/auditp.txt
$$ ##AUDIT TRAIL=  $$ (NUMBER, WHEN, WHO, WHERE, WHAT)
(   1,<2021-07-08 11:25:44.03 +0400>,<she>,<DPX200>,
      <created by zg, POWCHK disabled, PULCHK disabled
       terminated by command 'halt'
       configuration hash MD5:
       00 E9 B6 7A A2 85 ED C7 34 08 36 98 17 FE 4E 26
       data hash MD5: 32K
       1E 9F 7F 96 80 4B 1E EA D5 9A A1 E6 BA 57 ED 06>)
(   2,<2021-07-08 11:25:45.84 +0400>,<she>,<DPX200>,
      <Start of raw data processing
       efp BC_mod = 2 LB = 1 FT_mod = 6 PKNL = 1 PHC0 = -338.6595 PHC1 = 27.16238 SI = 32K 
       data hash MD5: 32K
       24 40 B1 C1 93 F4 21 3C 6F B1 AA 74 E6 AE 4C 99>)
(   3,<2021-07-08 11:25:49.09 +0400>,<she>,<DPX200>,
      <abs ABSG = 5 
       data hash MD5: 32K
       3B A9 89 69 8D F2 80 EE 5A 07 31 1D 16 73 5A 53>)
(   4,<2021-07-08 11:26:15.35 +0400>,<she>,<DPX200>,
      <pk PHC0 = -6.196332 PHC1 = 8.999999 
       data hash MD5: 32K
       0C E7 E2 AA F7 E5 27 E3 52 EF 9C 99 AC AE 35 A0>)
(   5,<2021-07-08 11:26:19.45 +0400>,<she>,<DPX200>,
      <abs ABSG = 5 
       data hash MD5: 32K
       99 D0 3C 8B 44 98 BA 9A C6 9F 31 BC 74 9C CF 2A>)
$$ ##END=
$$ 
$$ hash MD5
$$ AC 1C 5F 75 79 44 E6 B0 6A 9A EA B3 C3 84 64 36
##$RELAX= 
##$RELAX= 
##$RELAX= 
##$RELAX= 
##$RELAX= 
##$RELAX= 
##$RELAX= 
##$RELAX= 
$$ Bruker specific parameters
$$ --------------------------
##$DU= <F:/spectra>
##$EXPNO= 1
##$NAME= <c13>
##$PROCNO= 1
##$TYPE= <nmr>
##$USER= <she>
##$AMP= (0..31)
100 100 100 100 100 100 100 100 100 100 100 100 100 100 100 100 100 100 
100 100 100 100 100 100 100 100 100 100 100 100 100 100 
##$AQSEQ= 0
##$AQ_mod= 1
##$AUNM= <au_zg>
##$AUTOPOS= <>
##$BF1= 50.322709
##$BF2= 200.13
##$BF3= 50.322709
##$BF4= 500.13
##$BF5= 500.13
##$BF6= 500.13
##$BF7= 500.13
##$BF8= 500.13
##$BYTORDA= 1
##$CFDGTYP= 0
##$CFRGTYP= 5
##$CHEMSTR= <none>
##$CNST= (0..31)
1 1 145 1 1 1 1 1 1 1 1 1 1 1 1 1 1 1 1 1 1 1 1 1 1 1 1 1 1 1 1 1 
##$CPDPRG= <waltz16>
##$CPDPRG1= <>
##$CPDPRG2= <waltz16>
##$CPDPRG3= <>
##$CPDPRG4= <mlev>
##$CPDPRG5= <mlev>
##$CPDPRG6= <mlev>
##$CPDPRG7= <mlev>
##$CPDPRG8= <mlev>
##$CPDPRGB= <>
##$CPDPRGT= <>
##$D= (0..31)
$$ [...]
##$SUBNAM4= <"">
##$SUBNAM5= <"">
##$SUBNAM6= <"">
##$SUBNAM7= <"">
##$SUBNAM8= <"">
##$SUBNAM9= <"">
##$SW= 239.972175391363
##$SWIBOX= (0..15)
0 1 3 0 0 0 0 0 0 0 0 0 0 0 0 0 
##$SW_h= 12077.2946859903
##$TD= 32768
##$TD0= 1
##$TE= 0
##$TE2= 300
##$TE3= 300
##$TEG= 300
##$TL= (0..7)
120 120 120 120 120 120 120 120 
##$TP= (0..7)
150 150 150 150 150 150 150 150 
##$TP07= 0
##$TPNAME0= <>
##$TPNAME1= <>
##$TPNAME2= <>
##$TPNAME3= <>
##$TPNAME4= <>
##$TPNAME5= <>
##$TPNAME6= <>
##$TPNAME7= <>
##$TPOAL= (0..7)
0.5 0.5 0.5 0.5 0.5 0.5 0.5 0.5 
##$TPOFFS= (0..7)
0 0 0 0 0 0 0 0 
##$TUNHIN= 0
##$TUNHOUT= 0
##$TUNXOUT= 0
##$USERA1= <user>
##$USERA2= <user>
##$USERA3= <user>
##$USERA4= <user>
##$USERA5= <user>
##$V9= 5
##$VALIST= <valist>
##$VCLIST= <CCCCCCCCCCCCCCC>
##$VD= 0
##$VDLIST= <DDDDDDDDDDDDDDD>
##$VPLIST= <PPPPPPPPPPPPPPP>
##$VTLIST= <TTTTTTTTTTTTTTT>
##$WBST= 1024
##$WBSW= 4
##$XGAIN= (0..3)
0 0 0 0 
##$XL= 0
##$YL= 0
##$YMAX_a= 13430385
##$YMIN_a= -3543022
##$ZGOPTNS= <>
##$ZL1= 120
##$ZL2= 120
##$ZL3= 120
##$ZL4= 120
##$ABSF1= 222.7046
##$ABSF2= -17.29222
##$ABSG= 5
##$ABSL= 3
##$ALPHA= 0
##$AQORDER= 0
##$ASSFAC= 0
##$ASSFACI= 0
##$ASSFACX= 0
##$ASSWID= 0
##$AUNMP= <proc_1d>
##$AZFE= 0.1
##$AZFW= 0.5
##$BCFW= 0
##$BC_mod= 2
##$BYTORDP= 0
##$COROFFS= 0
##$CY= -3
##$DATMOD= 1
##$DC= 0
##$DFILT= <>
##$DTYPP= 0
##$F1P= 0
##$F2P= 0
##$FCOR= 0.5
##$FTSIZE= 32768
##$FT_mod= 6
##$GAMMA= 0
##$GB= 0
##$INTBC= 1
##$INTSCL= 4.134877e-10
##$ISEN= 128
##$LB= 1
##$LEV0= 0
##$LPBIN= 0
##$MAXI= 10000
##$MC2= 0
##$MEAN= 0
##$ME_mod= 0
##$MI= 0.1934396
##$NCOEF= 0
##$NC_proc= -1
##$NLEV= 6
##$NOISF1= 120.0001
##$NOISF2= 80.00006
##$NSP= 0
##$NTH_PI= 0
##$NZP= 0
##$OFFSET= 222.6899
##$PC= 1.4
##$PHC0= -344.8558
##$PHC1= 36.16238
##$PH_mod= 1
##$PKNL= yes
##$PPARMOD= 0
##$PSCAL= 0
##$PSIGN= 0
##$REVERSE= no
##$SF= 50.3227282834384
##$SI= 32768
##$SIGF1= 140
##$SIGF2= 120
##$SINO= 11.81781
##$SIOLD= 32768
##$SREGLST= <13C.CDCl3>
##$SSB= 0
##$STSI= 32768
##$STSR= 0
##$SW_p= 12077.2946859903
##$SYMM= 0
##$S_DEV= 0
##$TDeff= 32768
##$TDoff= 0
##$TI= <>
##$TILT= no
##$TM1= 0
##$TM2= 0
##$TOPLEV= 0
##$USERP1= <user>
##$USERP2= <user>
##$USERP3= <user>
##$USERP4= <user>
##$USERP5= <user>
##$WDW= 1
##$XDIM= 32768
##$YMAX_p= 426694974
##$YMIN_p= -6208013
$$ End of Bruker specific parameters
$$ ---------------------------------
##NTUPLES= NMR SPECTRUM
##VAR_NAME=  FREQUENCY,     SPECTRUM/REAL,   SPECTRUM/IMAG
##SYMBOL=    X,             R,               I
##VAR_TYPE=  INDEPENDENT,   DEPENDENT,       DEPENDENT
##VAR_FORM=  AFFN,          ASDF,            ASDF
##VAR_DIM=   32768,         32768,           32768
##UNITS=     HZ,            ARBITRARY UNITS, ARBITRARY UNITS
##FACTOR=    0.368581032318806, 1,           1
##FIRST=     11206.3631092498, 0,            0
##LAST=      -870.931576740451, 0,           0
##MIN=       -870.931576740451, -6208013,    0
##MAX=       11206.3631092498, 426694974,    0
$$ Real data points
##PAGE= N=1
##DATA TABLE= (X++(R..R)), XYDATA
$$ [...]
17917 19135024 14933454 12491416 11323013 9152561 7234138 6039528 5679264 5589211
17909 5589211 5054587 4706916 4214848 3423578 2199729 2091723 2538174 1825699 738485
17900 738485 426580 222872 198176 603840 1479277 1962436 1838584 1008623 1163768 1882298
17890 1882298 1900913 975643 95906 -549013 -1211730 -2169749 -3243465 -3383112 -3091553
17881 -3091553 -2416591 -1024675 253547 1155838 798778 -165884 -116636 292417 -41664
17872 -41664 -264190 34333 663005 1379671 2215465 2520447 1882697 784012 136615 534533
17862 534533 1461007 883391 -612684 -1525515 -668051 310957 -257504 -742737 -598935
17853 -598935 -80464 527039 908690 392302 -686417 -928100 254341 858885 1508567
17844 1508567 2155269 1719943 2214241 2389117 2248226 3059080 3284659 2429493 1955458
17835 1955458 1152590 783513 1448277 1615073 1747793 1408062 2162171 2366034 1787441
17826 1787441 1716335 1775385 1882296 1150549 -225450 -512543 -1518995 -2016777 -1246396
17817 -1246396 -489906 595128 784872 157156 -235020 -564730 -565571 -133286 534096 1313094
17807 1313094 1270336 755822 1054913 1210459 1718927 2111882 3038540 3033527 2411756 2386718
17797 2386718 1552689 580962 -635418 -534285 -551553 -1208029 -723698 -930231 -2712476
17788 -2712476 -3089863 -2219786 -1966943 -1863200 -2101635 -2097577 -1464374 -341819 63209 -95252
17778 -95252 -181334 -294219 1139687 3093075 2736690 1165189 1277901 2354420 2755902
17769 2755902 2808640 1373991 223921 932669 1931662 2145777 2158311 1158590 581053
17760 581053 -568130 -1330564 -1342533 -800365 62024 -425538 -1904428 -1190488 -308099
17751 -308099 -660983 -927183 -857945 -988607 -1337788 -1466727 -970926 -829818 -438303 -723952
17741 -723952 -1750137 -1937343 -1774555 -391014 1203523 1348341 557992 107208 473541
17732 473541 1095680 1758236 1380783 158641 -507665 -1321944 -2707338 -3214781 -3369085
17723 -3369085 -3124002 -2547483 -2578550 -2874312 -2874070 -2332551 -2231207 -1639023 -523485 9278
17713 9278 -211595 -482640 -1653321 -2343680 -2870729 -3917919 -4521324 -5601240 -6186084
17704 -6186084 -4873929 -2530060 -1125633 424845 1341912 398984 -22097 -676010 -3259051
17695 -3259051 -4974754 -5597156 -5783128 -5665475 -5161963 -4671307 -5135904 -4949908 -3519893
17686 -3519893 -2361283 -962162 1290590 2656861 2165157 1287166 799415 990882 1212189
17677 1212189 1691043 1985292 1126343 -1142892 -2310206 -1123148 -354416 -446049 590753
17668 590753 560596 -437324 -259940 -788314 -1921341 -1838197 -905883 -1090542 -1788513 -2752048
17658 -2752048 -2741959 -2673636 -2855357 -2533640 -2542926 -3041202 -3285537 -2886326 -2284160 -1428036
17648 -1428036 -1223325 -728220 -513693 -948894 163118 1324946 397916 -761857 -204901
17639 -204901 517880 132739 -244218 558500 724531 704383 512365 405018 -137980 -881386
17629 -881386 -1168066 -162309 1055025 2136882 1843633 222154 -898222 -948942 -126455
17620 -126455 869604 1337060 1655790 1458685 1197144 1356159 1954520 2964728 3735573
17611 3735573 3146617 1758776 201281 -163475 896809 2027722 2429544 2735100 2959363
17602 2959363 2337060 1138237 1010236 2155940 2357539 2112264 1377780 805619 1209774
17593 1209774 351801 -340386 281292 -330332 -744299 -1086115 -1306240 14900 210894
17584 210894 -461887 -654722 -1017368 -1786061 -2314500 -2472519 -2197593 -1601925 -460167
17575 -460167 369448 62703 -837759 -1529197 -992524 -177039 -89508 -70031 -762784 -982917
17565 -982917 -1423749 -1578288 -2107028 -2148043 -1027130 -770775 -940594 -563088 -162508 387709
17555 387709 1196995 750158 1490259 3646197 3882047 2507916 730763 -1808326 -2562376
17546 -2562376 -1513820 -264376 77918 -1053551 -1233796 154559 795352 1280379 1488545
17537 1488545 1186775 598668 284567 268320 -95206 -517015 -1029517 -630965 -891192 -1915279
17527 -1915279 -2222238 -1516615 -1326096 -211054 620869 629020 -30342 -85525 -446340 -1712791
17517 -1712791 -2048732 -1062230 645390 1540359 2046350 2810600 3608703 2970905 2096206
17508 2096206 1312138 201076 -317823 114839 211905 -629645 -35245 1120940 1878107
17499 1878107 3367083 5051126 5457258 4243806 2897554 1928242 846170 1243407 1474531
17490 1474531 1344514 1258778 469213 -234005 -871638 618104 2366487 3330994 4043294
17481 4043294 3831775 3151382 1931577 949524 1392496 1494743 747548 47764 166137
17472 166137 69452 230334 419432 769748 1531450 1687771 1280524 670622 -607867 -1301202
17462 -1301202 -962485 -590429 -306517 -1128872 -1182835 247246 646060 465702 1194261
17453 1194261 868641 -394750 -1070081 -1089836 -153206 830946 1172290 223386 -914842
17444 -914842 -651261 338536 345941 1152873 752419 284557 1226473 2995181 3855277 4030178
17434 4030178 5710229 6374275 6434556 7911060 8865853 7866188 5595507 3920656 2600922
17425 2600922 1509957 2217719 3965226 5715663 8507159 11987556 15734735 20942168
17417 20942168 25685509 30848265 38569265 47095357 50760858 47155368 37275722 27410024
17409 27410024 20672940 14818097 10756253 8515673 7018020 4913298 3016424 2371370
17401 2371370 1718720 910312 30973 -620151 -557895 619433 1437340 1879556 664770
17392 664770 -1652711 -2155382 -1382059 -375849 -612896 -1119846 -1591809 -2325495 -2429084
17383 -2429084 -1937454 -1525687 -739311 -536050 -578140 -134338 262211 471436 -326928 -1266236
17373 -1266236 -1740279 -864412 267972 576064 1028523 693315 111271 -42707 925848
17364 925848 769760 1153936 1209845 787276 423914 -86901 119201 -284959 -760041 -448682
17354 -448682 -625087 -1738892 -2649676 -2374714 -2065986 -1869926 -1480254 -854428 -731628
17345 -731628 -1465459 -1828401 -1763676 -1066325 -446171 -269505 566827 1297009 1763303 1077256
17335 1077256 45226 642485 2073216 2486523 1541336 559998 -366627 -663721 -260842
17326 -260842 727558 1490824 1962360 2002253 614830 -1439765 -2775151 -2595945 -2052597
17317 -2052597 -1949225 -2334128 -3305047 -4196200 -4337441 -4066328 -2818199 -30089 1514039
17308 1514039 1986786 1077541 -30211 -419613 -458428 391379 571087 -91413 -386634
17299 -386634 162271 236956 448410 698060 719986 589311 -580867 -1418523 -1612658 -1375253
17289 -1375253 -1297592 -1014415 -178943 -90559 280888 926519 1239496 548326 -81399 805061
17279 805061 1515429 906019 725690 620484 472087 1176246 1228514 575519 237143 278184
17269 278184 50503 -403459 -967023 -1281969 -2771102 -3141059 -2102806 -1184533 -628350
17260 -628350 6258 -296800 -1288092 -1960266 -1259390 -248053 377298 992157 1207428
17251 1207428 86377 -1108748 -896632 -433146 -891536 -1611839 -1089699 -335977 114287
17242 114287 997064 1076181 -292162 -795400 -295525 927882 1683784 1153887 726577
17233 726577 254760 983064 1827346 1178992 366892 339664 1156065 2592203 3545557 3115994
17223 3115994 3047804 2739514 1561741 625047 -112911 -55214 555362 533593 -69473 -323319
17213 -323319 -1140602 -1810473 -1754134 -2007765 -3277483 -4537555 -4131573 -1857252 -707268
17204 -707268 -1248267 -1454382 -1442008 -1462092 -1107391 -381740 -90349 -802469 -1096347 -863904
17194 -863904 -276569 260075 231001 982161 1853019 2435988 3151559 2055696 650667
17185 650667 -286030 -1297117 -1094450 -450664 55225 486635 728027 1310167 1112813
17176 1112813 339908 340894 942572 1153475 -896830 -1380096 -359638 -591359 -934898 -1359060
17166 -1359060 -1442409 -1070505 167860 1458164 2429174 3211779 3004564 3202929 3688620
17157 3688620 3761437 2508348 238393 -378335 -55839 -832904 -1192372 -1276267 -1767904
17148 -1767904 -2392253 -1930871 -556353 882699 1977045 2069540 867549 -410973 -681127
17139 -681127 -81943 -419619 -1119437 -1865455 -2092763 -1512632 -995900 -850378 -413022 -528061
17129 -528061 -104628 212525 72471 -433278 -127677 343852 377984 1423157 1951785 1586132
17119 1586132 2122283 3289432 3444554 3684266 3209306 3042950 3402697 2904190 893196
17110 893196 -131938 514682 548714 -307340 -794241 -621969 -422010 -888495 -1931415
17101 -1931415 -1908096 -363778 1553952 2023294 847986 -449546 -981770 -1370489 -1675492
17092 -1675492 -2251796 -1314327 -890022 -1879028 -1768428 -632410 497716 1209695 1390395
17083 1390395 1947857 1771121 1878985 2248178 2431397 2584245 2054330 2388816 3193913
17074 3193913 3330817 1766661 622369 701639 141785 -938593 -11398 407337 -290532
17065 -290532 325268 454702 9397 -586177 -1148092 -694860 664063 1853888 1812163
17056 1812163 1148067 113011 -418098 -972204 -2219298 -1922098 -716062 -78666 -142681
17047 -142681 -116497 -25916 479601 592644 -182741 -511295 -349366 41891 630281 1723188
17037 1723188 2089178 1312442 -335665 -1292938 -1831858 -2736141 -2914087 -1504156 32007
17028 32007 -210522 -839745 -1057760 -721510 150036 518374 10232 -979672 -1815135 -1924994
17018 -1924994 -786466 -782172 -1555494 -1306724 -617818 -88352 310728 41660 389044 -1974
17008 -1974 -88960 464640 1087772 1309065 600112 -463026 -372832 169738 1923699 3294271
16998 3294271 1705015 -548613 -1476853 -749744 269814 77190 -635093 -591388 -905220
16989 -905220 -2071727 -2868682 -1551423 -71987 482502 118839 110963 414744 -94408
16980 -94408 -344856 -279191 51150 561881 -399957 -1562253 -1875175 -1666163 -1517236 -1132601
16970 -1132601 -346052 231111 830325 1301077 1390510 1471073 2119236 2265158 2000914 689543
16960 689543 -111775 560445 1922152 1649913 288730 896408 1665819 1554942 1704416
16951 1704416 1941787 2077084 2408479 3139732 2658034 2104906 3150186 3770536 3917509
16942 3917509 4597533 4978406 4156278 2815481 3451828 6022679 8011807 8486177 8099490
16933 8099490 9459254 11746701 15373617 20808317 26169148 32597133 39809841 45683905
16925 45683905 45924246 39577594 31181930 23839802 18231156 14784730 12458139 10775575
16917 10775575 9397736 7713504 5971130 3659557 1621613 -350315 -1574118 -970307
16909 -970307 339227 1712171 2117906 1073762 853630 1367407 1288786 546830 201049
16900 201049 616504 1379063 2183585 927468 -817165 -1683189 -1769793 -1100260 -381637
16891 -381637 -408905 -933205 -564351 -448975 -414147 715525 1305001 53576 -41823 1073935
16881 1073935 1317775 620740 863751 931231 317574 -753773 -1547021 -1904928 -1490014
16872 -1490014 425679 1497303 925349 678143 1232463 2135034 839967 -1322924 -1892579
16863 -1892579 -2295527 -2595483 -1827766 -1815603 -2499952 -1760452 -69574 697969 1317874
16854 1317874 1766359 1159395 1397106 1379463 719192 -225311 705796 1029189 -38910
16845 -38910 -1449104 -2165391 -1528347 -1090684 -923390 37649 885398 1929635 2233179
16836 2233179 2850837 3066324 1613472 -282077 -799253 -833374 -426517 979441 1264880
16827 1264880 535786 20406 1139254 1501084 1097726 -406332 -784349 -602030 195561
16818 195561 814965 1058563 1021815 1402809 1385065 410200 -377395 -1389294 -1562147 -292463
16808 -292463 477716 548565 470103 572439 696616 75537 -203781 474545 1840692 2388071
16798 2388071 1076862 321454 531164 634712 829211 231386 456797 1264677 1398536
16789 1398536 1718792 1931659 2020422 1567773 1654830 2228988 2852264 2125807 450474 -60093
16779 -60093 469496 592359 -38519 -306072 288331 1328270 1018427 719645 1028158 754073
16769 754073 620501 733571 295766 -627344 -724685 -1227493 -1757655 -698230 -288335 -305213
16759 -305213 -730718 -1781573 -2883619 -2792553 -731145 484368 533249 1212828 1102681
16750 1102681 718273 727631 1565601 2120752 1666274 514755 -1041923 -1717913 -2236026
16741 -2236026 -3170878 -1958698 297337 893879 510234 214971 -128457 -119662 50983
16732 50983 -321016 -149518 -200696 -715467 -2280032 -3629718 -4058116 -3533549 -2294682
16723 -2294682 -1008440 -290467 -235124 103372 -184812 -1333897 -1886046 -1298123 -821524
16714 -821524 -123423 179857 -501341 -1299054 -1780466 -1929912 -1256714 -1722135 -3587591
16705 -3587591 -4645569 -3946511 -2226697 203606 1545627 580394 236403 1076085 1340448
16696 1340448 862736 371381 -167892 -727311 -759159 -544015 -1080383 -1684180 -2402523 -2032526
16686 -2032526 -885856 -346595 -1021473 -1725199 -1657135 -1476786 -1077771 -873320 -959298 -1478832
16676 -1478832 -1775317 -1762420 -782099 49084 -205677 -677471 -64135 224522 316748 770085
16666 770085 1447142 1222110 -893361 -2243282 -2975785 -3030892 -1569913 -1750031 -2990873
16657 -2990873 -2948705 -2266437 -1519767 -46974 1440369 2694937 1695691 25241 -878070
16648 -878070 -1837475 -1709366 -209325 1349484 831833 -721438 -2252746 -1733853 -643170
16639 -643170 348363 1836305 1952044 1518260 624307 -290401 -391325 -686208 -1044039
16630 -1044039 -1679472 -1418742 -584685 -598690 -1226179 -1516970 -1598800 -973610 -1087411 -1353426
16620 -1353426 -837905 -604807 -656428 -20944 481047 -206686 86139 1051042 2720009
16611 2720009 3035236 1547122 1111585 1601639 1280442 -612221 -2606172 -3806380 -3470407
16602 -3470407 -1788551 -1483900 -2347721 -2712592 -2554214 -1801846 -1035159 -820603 -737067
16593 -737067 -784698 -689742 -1044448 -1229661 30675 541853 450253 366087 545270 1066318
16583 1066318 980740 1245066 2192455 2536491 1762503 992458 1167879 2104359 2797405 1563672
16573 1563672 -287175 135195 2036415 3269695 3162186 2929862 2405435 2114693 2196458
16564 2196458 2761201 2627930 2133344 1343039 413844 383542 1190818 1807353 1694020 1645533
16554 1645533 719368 -439775 -1535320 -1594696 -1703994 -1570042 -2265944 -3181870 -3223967
16545 -3223967 -3196100 -2146157 -1979318 -1956647 -2040421 -2081041 -1561203 -1141607 -1678669 -1916459
16535 -1916459 -2438843 -3042233 -3086684 -3315934 -3597512 -3101187 -1954138 -739113 940904
16526 940904 2447092 3024723 3545756 3053967 2072549 1560220 1492612 889954 1068239 1073308
16516 1073308 556652 328977 -1919075 -3579202 -3104516 -1620532 -1909440 -3443766 -2801611
16507 -2801611 -2214532 -1685223 -254450 932253 1022759 425592 706379 594505 -1231036
16498 -1231036 -2881627 -3112409 -2647608 -1815719 -1642119 -2727633 -3044369 -1818139 -1542199
16489 -1542199 -1838868 -2185371 -1946351 -1281850 -770190 258329 1848781 1961170 1072047
16480 1072047 222489 755746 215245 -1517231 -2941000 -3233737 -2586993 -2688659 -2545657
16471 -2545657 -1430178 -1231754 -1550934 -1516952 -1575558 -2025076 -1836181 -1669778 -437122
16462 -437122 1537753 2095829 1294228 1218160 1117452 318326 34493 59303 317317 -193181
16452 -193181 -1500315 -1637921 -1140622 -199291 259722 -202106 -643778 -1162647 -857824
16443 -857824 -174676 -330554 -1095478 -1991563 -2498159 -2513646 -2124830 -1746109 -2013807 -1548051
16433 -1548051 -1137150 -261443 226443 215814 -318420 -62851 -192760 -1502790 -1868187
16424 -1868187 -1519726 -1877216 -2195249 -1655946 -749234 -213060 32125 -306789 -80030
16415 -80030 546369 1687105 1996418 1553038 762966 -251898 -410767 -971628 -1691548
16406 -1691548 -1079068 416466 1629124 1823343 1746291 1299460 966884 926516 168763
16397 168763 185425 495040 641194 1044556 1114367 822870 673072 517577 342723 827455
16387 827455 154781 -701164 -180144 -745989 -1537120 -186253 1099494 1043767 364799
16378 364799 -715578 -1979120 -2732178 -2537133 -2434709 -2860260 -2665919 -1566268 -307351
16369 -307351 331644 197169 638344 876650 687747 462843 1090304 1184896 732496 1215402
16359 1215402 1021411 228819 -507786 -1337395 -530188 624667 1923325 2140072 2116038
16350 2116038 2026314 1080386 294237 575349 252119 -850748 -1116333 -175454 428676
16341 428676 349975 173433 403411 748256 741664 170020 -228490 -708930 -1266130 -1105042
16331 -1105042 -1074414 -1793688 -1811492 -1858645 -1357188 -570779 -901655 -1443013 -1681448 -1742111
16321 -1742111 -1221356 -1124257 -2098782 -2193568 -1170649 -1288430 -1828742 -2373313 -3070988 -2879224
16311 -2879224 -2922654 -2851772 -2318723 -2054440 -2498835 -2592828 -2073595 -1008260 -947470 -1626894
16301 -1626894 -1601028 -917367 -1033682 -1435445 -1967991 -873442 645119 1227799 588687
16292 588687 -63821 -539812 -1445976 -866683 38261 482471 52193 -594316 -759713 -913753
16282 -913753 -738167 -619908 372531 1435536 919918 82535 -238766 -93481 108418
16273 108418 -406943 -621770 -807721 -2125614 -3803625 -4258977 -3692719 -3095892 -1725779
16264 -1725779 -599494 -664561 -1442781 -1847824 -2454248 -2321115 -1278912 -890409 -1074051
16255 -1074051 -1800239 -1230813 -540167 256815 -76068 -683790 -992504 -1601004 -1066534
16246 -1066534 351465 227973 87781 1073169 2057570 2283584 2017230 1557321 1553369 1642651
16236 1642651 834643 -63482 -4906 727562 1456219 1316586 31720 -634418 -487163
16227 -487163 -809903 -571968 364775 858206 808193 223230 -115026 347593 81924 173354
16217 173354 1035471 1282347 -479839 -2431273 -3368696 -3464078 -2207669 -2344880 -1960693
16208 -1960693 -1256221 -1097350 -1021701 -152568 762991 1128864 854419 260784 672119 608370
16198 608370 -387558 -517105 -1456096 -2272546 -1935652 -1852801 -938999 -1368802 -2213717 -2319969
16188 -2319969 -2718160 -2283925 -1570851 -1042137 -907213 -424374 316040 379197 -365947 -1900528
16178 -1900528 -2550951 -2301159 -1890242 -1327912 -1350246 -1290979 -1240058 -1742194 -1706749 -1837610
16168 -1837610 -2172163 -2434390 -3281742 -3498048 -2465168 -1157900 -679647 -790952 -574459
16159 -574459 823273 1691068 656920 650519 1779993 794536 -1092532 -2040686 -2033234 -835306
16149 -835306 -100947 -363359 -402279 -499948 351324 674847 850270 1193987 930183 797670
16139 797670 775720 2005527 3471799 4012017 3406492 1974123 1573530 2562311 2944113
16130 2944113 2078303 1376964 -248245 -1358315 -1429285 -1065129 -1372967 -2550571 -2658620
16121 -2658620 -2052159 -2050162 -1250808 -537070 74530 923792 1378936 1390514 867166 -193667
16111 -193667 -1046933 -1946506 -3091126 -3265261 -2533799 -1034912 186797 1110967 1634712
16102 1634712 1480867 96840 -389681 -569187 -527868 84127 1608948 2044475 432315
16093 432315 -355843 668488 -186349 -1869182 -2431083 -1345043 403615 760376 533692
16084 533692 454655 1346562 1859002 2113878 1756677 1313676 684734 -364867 -857829 -957413
16074 -957413 -1340425 -900601 -319912 46682 1921328 2899750 1893738 626003 -657265
16065 -657265 -1754113 -1982677 -1823259 -2484168 -2856608 -715408 1053156 1236242 758506
16056 758506 430935 304082 -619867 -585172 596274 1083861 1572788 1383516 1460476 2027202
16046 2027202 1782999 1337298 652376 866575 2005213 2785967 2573580 2925516 2484544
16037 2484544 1439873 875944 446888 374005 -70548 1272 -718490 -1648056 -1523012 -2523871
16027 -2523871 -2419898 -828670 239467 553371 -111367 -787798 -569121 818537 1618760
16018 1618760 1600107 581951 -1253548 -2499783 -1706302 -15591 693414 1287391 -300475
16009 -300475 -1881322 -828036 1203903 2287861 2195718 1660485 1523566 1878753 2294661
16000 2294661 1546865 -43783 -865227 -621558 -1027437 -836455 54452 155286 -165822
15991 -165822 107865 72984 -723854 -1226933 -520124 635791 1305869 1971395 2889819 1903660
15981 1903660 749756 102285 -691763 -352837 -182248 -726087 -915665 -1740367 -2870736
15972 -2870736 -1770890 722892 1278057 71935 -205795 662150 1919804 3074002 3586169
15963 3586169 3911274 3147531 1369191 949185 978431 920992 865736 119311 -365005 -269504
15953 -269504 -327204 -934783 -1600150 -629605 398591 1438686 1157264 42087 625673
15944 625673 1807927 801840 -529982 -1401158 -1620619 -1642676 -2390123 -2868896 -2982682
15935 -2982682 -3209334 -2763293 -1298673 121415 -14852 -801218 -1376432 -1007487 481730
15926 481730 1710905 1408023 509531 433038 964285 565077 450855 -771710 -2601407
15917 -2601407 -3964708 -4324773 -3079417 -2119231 -1376000 -819273 -1302628 -2096619 -3095973
15908 -3095973 -3690266 -2979138 -2062368 -1322931 -719604 -1470130 -2673128 -2215875 -1779253
15899 -1779253 -2131254 -2091592 -1164517 -888264 -38303 899881 2487273 2805213 1756808
15890 1756808 199907 -2112289 -3058510 -2043709 -978205 -688856 -824552 -325830 -294934
15881 -294934 -162639 103657 891989 1141489 459381 272674 1157235 2407936 1140641
15872 1140641 -108075 -689052 21751 1013306 992087 -134141 -9479 692915 693971 550716
15862 550716 1044655 1349690 1038384 1532516 1648962 2540020 2489361 1313675 308786
15853 308786 116374 141062 -299674 -419763 -853949 -1975089 -2894028 -1875370 -766750
15844 -766750 -1998962 -2759840 -2103269 -361715 1584205 1415352 698760 -116695 51432
15835 51432 899766 1195199 852097 424793 240347 1587402 2671615 1752603 1068908
15826 1068908 -149302 -841662 -629416 -349646 54194 313914 -232850 -779587 -943208
15817 -943208 -550641 289203 667320 1067546 1662876 2590816 2639973 1927142 1323108 1300761
15807 1300761 946683 925714 916385 691751 932668 778923 285259 805772 447036 241593
15797 241593 -56955 -1137076 -1634837 -2031206 -2618131 -2685240 -2239046 -1520734 119385
15788 119385 520969 -832001 -1450168 -923198 -782664 -951446 -930420 -861717 -1721221 -2020905
15778 -2020905 -1523119 -669343 -606077 -80270 1180040 1312731 -232681 -567122 201744
15769 201744 105650 944663 1325475 142809 -347340 -204868 -751049 93903 2241934
15760 2241934 2573001 2180604 3038965 2856731 1989345 2110602 2140134 1536365 1045038 880900
15750 880900 903962 398396 -381295 -283627 236342 -271533 -854886 -157726 -104653 -1191524
15740 -1191524 -1158410 -770177 -442648 -209326 326315 463204 -450572 -43035 358184 941086
15730 941086 2176650 3170518 3485949 2673101 1854007 1399314 422105 194326 230322 -599979
15720 -599979 114801 1484851 1295810 816285 233219 174266 783949 1487103 2200887 2364499
15710 2364499 1798200 1307286 1510122 1857443 1430842 503083 782655 2011505 2878164
15701 2878164 3456264 2697305 1673454 192311 -1625942 -1817184 -1143202 19256 1084826
15692 1084826 1406324 1209093 1093473 489820 -415965 -1557640 -2020645 -1407485 -173240
15683 -173240 1045234 825705 186776 -410425 -485607 -505055 -1158782 -1675823 -1844620 -1603762
15673 -1603762 -625592 -345661 -1020094 -1591375 -1556955 -2061028 -2209841 -2064065 -1771914 -1124656
15663 -1124656 188039 1254241 1212319 791502 -613077 -2489354 -2416455 -867114 -387497
15654 -387497 -1038991 -944148 -572802 -387654 -205827 -1303458 -2101485 -1789064 -561897
15645 -561897 -592721 -1303359 -1941531 -2566766 -1927164 -286922 946004 1557791 1794764
15636 1794764 1010539 -578259 -1342578 -246596 671466 1144342 633745 -512792 -1939629
15627 -1939629 -3025745 -3080310 -3006181 -2916180 -2056215 -1308229 -59982 962370 2131472
15618 2131472 3125206 3085557 1530222 -351540 -848171 -79952 696812 -38740 -530713
15609 -530713 -128469 1315379 1395553 -161348 -1362037 -1276568 -967888 -730239 -143940
15600 -143940 235686 -960947 -2255485 -2253105 -1116228 -308977 -1272725 -1751209 -2199836
15591 -2199836 -2864225 -2675660 -1138639 221417 508818 -293978 -329409 130800 -187970
15582 -187970 -326321 -581157 891242 2766940 3074057 2083221 2077552 1824896 1444895 1975855
15572 1975855 2250805 1490471 893076 1121637 1323136 980078 1171122 863109 -31196
15563 -31196 -1514118 -2914946 -1659560 1099938 2827736 2395542 96862 -731006 61578
15554 61578 1024958 1242358 -281968 -1035941 -925022 -782631 -1009120 -1185813 -1012645 -1159181
15544 -1159181 -1277054 -1523332 -1221443 -816687 -397802 65939 143454 492366 1239725 2097035
15534 2097035 1447724 -40532 -356400 -632969 -1011564 -489171 189674 135552 -489384
15525 -489384 -225794 313411 -19558 104478 576126 1073850 659926 34560 161984 114160
15515 114160 759472 736665 753146 -313026 -2187249 -1663402 -113682 737601 752661 1257335
15505 1257335 1635127 2161327 1707558 1426788 1157863 912269 789772 792687 1956122 1871566
15495 1871566 1092063 832672 600212 216381 671211 759101 612314 525239 -402018 -743819
15485 -743819 -252561 -33096 281439 639184 764679 1183536 1218600 -282402 -2235337
15476 -2235337 -3038675 -2448385 -2334267 -2855611 -1996128 -1163706 -883393 -729444 -1004163
15467 -1004163 -390786 190629 -535071 -823623 -882184 -103813 663872 1476072 1367026 917079
15457 917079 1257205 1093890 797719 884090 282813 -7804 297676 751110 1638025 2093121
15447 2093121 2373989 1465290 -220314 -764605 149551 609343 992079 1062185 1232660
15438 1232660 817815 296059 537771 709238 687339 1048647 1040106 773746 1151 -209973
15428 -209973 624320 1827117 1803266 999457 -246384 -691853 -607147 -251852 1031516
15419 1031516 1539498 971386 833102 1723828 2148621 2090871 911251 -708881 -1003206
15410 -1003206 -634574 -965593 -1587040 -667670 792064 1577283 846668 -556136 -1123749
15401 -1123749 -1255406 -1117166 -606222 774845 744801 -452920 -669492 246783 560881
15392 560881 -529346 -1399582 -1966822 -1637273 -1153197 -380194 397853 581547 848065
15383 848065 983311 418347 -313871 -1153688 -2329256 -3176090 -2468281 -1577177 -137973
15374 -137973 944737 1825 -520246 48462 806680 1160160 1325820 471916 -607113
15365 -607113 -1493228 -968488 -116923 580271 -460077 -1032296 -97461 1293203 1677096
15356 1677096 1051849 965382 329330 -68609 -740221 -1733830 -1101522 -654482 -1461986 -1438994
15346 -1438994 -276438 1027142 952710 -138365 -467179 -383941 -699824 -1678173 -2658620
15337 -2658620 -1627197 -643549 -775656 -1254854 -1347640 -1260223 -923767 143908 911055
15328 911055 961923 670054 1359636 2205934 2311741 1479040 519861 -1115475 -3007258
15319 -3007258 -3475704 -3281300 -3208089 -2756073 -1962537 -1407575 -1139147 -2663212 -4581502
15310 -4581502 -4968058 -4139699 -2761458 -1908289 -1523491 -1302356 -29076 1003239 1953340
15301 1953340 2003089 1365965 1168056 1207239 1189951 1699217 1683904 1800835 2338913 2050627
15291 2050627 968123 -232173 -226565 -770760 -1610351 -1689185 -1282360 -1178796 -229236 -505232
15281 -505232 -506286 -104201 696389 1947705 1420181 694408 1084608 1393073 471050 630949
15271 630949 1921580 2059508 1656236 1488896 1959640 2181292 2097931 1492957 814798 131286
15261 131286 -269484 -453346 -148124 321397 740023 -597595 -1752560 -1302086 -1251890
15252 -1251890 -1652128 -2571913 -2000897 -664050 90097 -414567 -1952732 -2403810 -1478922
15243 -1478922 -495424 -208221 735808 1455911 2129761 2585834 2262926 2190183 2608325 2618504
15233 2618504 2567458 3603941 4691878 5033669 4038803 3321993 2829623 2946738 2825446
15224 2825446 1728861 569745 313932 697887 -66995 -1194068 -2265501 -2115261 -765488
15215 -765488 -894227 -1068091 -484477 -68562 -476069 -150054 1354469 1396549 467773 381139
15205 381139 1093475 794387 -637499 -1425963 -188432 635189 195799 -64359 226744
15196 226744 267215 283865 950982 1683117 951912 321184 81993 -744995 -1051927 -689670
15186 -689670 -940221 -2374720 -3559997 -4169589 -4146704 -3531488 -2043380 -765056 -422233
15177 -422233 -955759 -843644 -462078 -531744 -1115306 -1584533 -1187745 -1643925 -2588627 -2055265
15167 -2055265 -1052239 -926120 -503468 264624 888205 1079818 937020 176078 -93749
15158 -93749 -149470 -180653 -351070 -977546 -1486349 -877557 201024 -761007 -1759623 -1831989
15148 -1831989 -1142565 -1400692 -2472198 -2925583 -3170551 -2773289 -2380914 -2647151 -3090285
15139 -3090285 -3651660 -3726744 -2582616 -1729736 -1727042 -1877766 -2425902 -2403852 -2383167 -2751510
15129 -2751510 -3085883 -2530442 -1303879 -671643 -221815 10749 -717293 -1334086 -2497888
15120 -2497888 -3302554 -2418968 -1347057 -1183034 -1277009 -595803 642306 1944777 1336184
15111 1336184 -949602 -1008371 16263 439949 1214482 1811940 1400735 636508 128576
15102 128576 629848 1360583 2035551 2341809 1534514 1051276 145145 -628062 -757383 -646538
15092 -646538 -1046934 -1096948 -1164102 -1072328 -1566582 -2170826 -2546383 -2335733 -1763639 -555251
15082 -555251 1070054 1720449 57229 -2435147 -2674867 -2731281 -1757313 -832926 446849
15073 446849 796282 331431 461439 640324 1462296 2014777 778484 -259363 -732824
15064 -732824 -703162 -372930 210068 -20559 -637661 -482218 900860 1982805 1031441
15055 1031441 -14276 239346 421835 66403 932194 789538 11063 -39600 -770656
15046 -770656 -1048766 -197395 487428 703643 157258 -1055707 -1754219 -841158 111318
15037 111318 59118 180262 637162 628481 529220 140626 -563332 -1363375 58605 1515785
15027 1515785 1379352 571081 -686561 -691251 -457341 910079 1701661 772490 1252806
15018 1252806 2730983 3425508 2941572 1880220 2028875 2678570 2315382 1442330 1012999
15009 1012999 632143 -349573 -699688 549262 732068 504389 474068 233848 569215
15000 569215 674885 690593 507285 287587 236331 -679243 -995769 -1079598 -1740711 -2616196
14990 -2616196 -2684053 -684458 894875 1343701 1492686 963502 419517 1190106 2031078
14981 2031078 1482896 1823035 2046814 775557 -657550 -736617 372829 1085074 520431
14972 520431 -461272 -873374 -439307 -325497 116864 488020 562505 -301195 -884431 305580
14962 305580 826192 864961 567005 -462741 -912550 -1414792 -2481193 -2890695 -1960882
14953 -1960882 -93410 470448 235606 461606 340583 -783996 -1589947 -2067675 -941651
14944 -941651 724351 1664667 1025685 -878201 -1706969 -1087668 -920568 -1129744 -116081
14935 -116081 1372051 2244803 3457509 3891604 3382793 2421924 1920041 1779131 1563207
14926 1563207 896064 -398897 -1681020 -983963 857269 1311579 189443 -519172 -1513660
14917 -1513660 -803380 323073 -116076 -1502676 -1477285 -360534 997413 1946963 1873780
14908 1873780 1351564 39648 -2063990 -3702380 -3485278 -1673580 -675242 -932489 214432
14899 214432 1101982 811682 615743 1134970 1134598 1145467 1393932 694226 377981 259397
14889 259397 -318431 -851029 -1080719 -1388105 -800347 -282878 -45317 -663255 -1054723 -942359
14879 -942359 -983484 -83395 578195 381853 617610 758298 -165558 54315 626800 1705074
14869 1705074 2367171 654376 -1810090 -2131228 -1193081 -9663 599178 165467 -1444126
14860 -1444126 -2617450 -1821665 -764944 -746200 -893101 133966 1125746 261041 -1164036
14851 -1164036 -1681969 -3058812 -3217144 -2170627 -1739155 -1195284 -531745 380697 1482105
14842 1482105 2054111 1950474 2117221 1976661 836362 -543933 -1563739 -2213269 -2650408
14833 -2650408 -2685403 -1975436 -1246728 -1015932 -2038940 -2683644 -3401156 -3768231 -3493435
14824 -3493435 -2849504 -2833594 -2393997 -1025687 -149788 -649270 -1014659 -898726 -888199 -169758
14814 -169758 25821 6964 342033 -242040 -1882551 -3727907 -3749556 -3171519 -2246465 -636665
14804 -636665 -79700 -372850 -428198 319168 262498 -207552 -38526 72450 -535926 -1593628
14794 -1593628 -2644674 -3430493 -4514364 -4771187 -3497928 -1999017 -1677522 -773176 466235
14785 466235 892456 381222 -831153 -1388295 -1211426 -1152995 -395587 1011915 990902 -28422
14775 -28422 -646963 -771718 -325127 309154 -316198 -473963 1207368 2659853 2007767
14766 2007767 459128 -536977 -406825 -649095 -991315 -510513 -892018 -1472935 -717291
14757 -717291 -22680 -178666 -888441 -1766940 -1694374 -1764674 -2148427 -1592063 -1159630 -1666119
14747 -1666119 -2037720 -1970833 -1636262 -2103285 -2210848 -1766230 -1276414 -568912 -91536 334559
14737 334559 684840 361333 -607236 -1633241 -1428381 677883 1984500 1412450 88228
14728 88228 -1625710 -1814849 249439 1257079 1182329 273126 94060 604057 1467613
14719 1467613 2381778 2736741 2827598 2031658 443791 -665960 -1121558 95578 1170706
14710 1170706 1383955 1156519 513828 493950 1037036 666779 -242158 -1098295 -2211082
14701 -2211082 -2551818 -3139817 -3308315 -3824463 -2338015 362069 755549 331229 224989
14692 224989 -265019 -579699 27921 380595 356499 895343 1209897 1076057 875517 844232
14682 844232 499409 649209 669759 89502 -341711 -984291 -1237025 -1691956 -2379762 -2282648
14672 -2282648 -2741413 -3411807 -2362788 -631303 154377 -167343 -769689 -265530 456421
14663 456421 58541 -442260 -415834 -394761 -256991 -790559 -713929 522905 309751 171222
14653 171222 100600 839637 1763544 2808045 2740822 2886751 3997664 4050508 2580832 1774414
14643 1774414 1868631 522204 -191529 -351102 -357710 -318081 -300399 -5535 1478408 2825679
14633 2825679 3039596 3036413 2652033 1959591 2097753 1449121 812486 790550 424416 -629803
14623 -629803 -1072909 -478485 -194832 92239 255138 199189 -534494 -615208 -689637 -1346711
14613 -1346711 -1686582 -1436181 -1322485 -1467057 -1826255 -1689340 -1618416 -1893181 -2026267 -1366287
14603 -1366287 -1149703 -1564742 -1413436 -2078144 -2952756 -3050998 -3776597 -4742114 -4354255 -3572359
14593 -3572359 -3450286 -3307811 -2983747 -2835931 -2468930 -2145112 -2492313 -3009667 -2560377
14584 -2560377 -1786827 -1809794 -1632879 -268804 -37990 -1177965 -1231832 -1193413 -1986781 -2003535
14574 -2003535 -753451 -475406 -656160 -201411 -7164 425891 -510804 -1371591 -1527493
14565 -1527493 -1844579 -1864405 -726998 891636 949260 -147497 292444 812687 -852934
14556 -852934 -1417320 -530272 -340486 -623120 -1178424 -747123 -79930 -307244 180 726468
14546 726468 950936 1650669 2444786 1886962 749830 -502327 -1404102 -1938704 -1742889
14537 -1742889 -1375921 -264971 895682 1248825 1606901 2297690 2681259 2115835 2040451
14528 2040451 1715591 1179654 1038920 456252 -117432 -293918 -124567 36214 -20666 448546
14518 448546 1672581 1588805 747516 -438620 -1329560 -2171833 -2267594 -1477384 -554447 11354
14508 11354 1267563 2173023 1664722 1422572 1133656 720079 1555480 2395439 2497101 863819
14498 863819 -1378442 -2354747 -2544490 -2364634 -2040950 -1734203 -2315882 -2943011 -2368816
14489 -2368816 -1214614 -997056 -1345024 -907140 104546 -208027 -347029 1025493 2200926
14480 2200926 1918088 799995 56241 423668 1658791 2107734 1454517 638617 739745
14471 739745 672407 529991 -18211 2606 1174548 1667137 1479861 74663 -896814 -1200227
14461 -1200227 -850102 -87558 755603 676466 474904 -1075281 -2359812 -2444140 -2898336
14452 -2898336 -3488005 -3315495 -3549616 -3441752 -2822974 -2206777 -2993152 -3324918 -4051670
14443 -4051670 -3027062 -2338407 -2844843 -2419702 -2063341 -2125135 -2308159 -2475656 -2912470
14434 -2912470 -3054806 -2133321 -851450 -709098 -751002 213671 119558 -1088756 -2053259
14425 -2053259 -2025708 -1300644 -1153043 -1416339 -1309994 -577887 -124420 -236135 -74902 752937
14415 752937 145253 -460500 -183523 379687 835962 532904 -234401 -1091086 -742366 -241754
14405 -241754 -661998 -878182 -1057701 -740353 -778377 -985550 18573 912864 1133293 162770
14395 162770 -381111 -2695 -261792 -226701 786595 780519 174945 578521 1305981 1591522
14385 1591522 2002473 1957972 1096474 612021 -158078 -973692 -1000172 -1797739 -2070388 -1986820
14375 -1986820 -2059568 -964714 -100761 -83600 191652 -581026 -1593209 -2957197 -3400140
14366 -3400140 -3715667 -3951798 -2752910 -2224732 -581616 1117243 2572270 3346621 3526103
14357 3526103 2399015 1023807 -42080 -250200 -85077 26911 497991 481938 96961
14348 96961 -460821 -1001571 -1525314 -2152234 -2088681 -1131569 -143326 85729 -592825 -1020627
14338 -1020627 -1896868 -3230463 -3305340 -2107170 -512998 543836 1163952 997508 972805
14329 972805 828279 -62818 -330550 88606 -934273 -2068625 -2514382 -3341820 -3690149
14320 -3690149 -3040619 -1982051 -1005042 -402603 -247279 -1358002 -2075397 -1825021 -327803
14311 -327803 1706477 1938591 323446 -1762447 -2305425 -1415283 -811092 278416 542550
14302 542550 1503557 2846005 2735704 2038714 1948579 17957 -3084995 -5130781 -5275659
14293 -5275659 -4871556 -4511677 -2746835 -698338 -83741 358521 -306497 -1391506 -2384534
14284 -2384534 -1605340 -238803 175573 389309 668838 1058845 958228 666426 1078604
14275 1078604 1762568 1482785 1201419 1240728 821513 570557 1099760 782013 1323359 2283879
14265 2283879 2077020 1497324 2091012 4131548 5765537 4960166 3135722 1780725 1431769
14256 1431769 101389 -1968437 -2846543 -2715811 -1897033 -1404462 -1464119 -2022458 -2430073
14247 -2430073 -2941583 -2855747 -3352295 -4343224 -4593140 -4392707 -3686233 -2840216 -2251051 -1947539
14237 -1947539 -1710655 -873102 -651623 -1599972 -925543 17666 -963947 -2099109 -1653863
14228 -1653863 -1353687 -1196223 -1181426 -2189064 -2985878 -2129951 -985705 -257856 907355
14219 907355 1346737 1431627 1827073 1661094 687957 -442792 -992955 -1916749 -2908394 -2548321
14209 -2548321 -1915418 -1654923 -1981352 -1832236 -790622 -547437 -745966 -320985 790504
14200 790504 963603 1152811 1702441 1869190 1554132 262846 -1076756 -2390478 -3111342
14191 -3111342 -3941367 -3927434 -3107922 -2859127 -2634545 -1996698 -2385211 -2514661 -1412632
14182 -1412632 -677505 -522007 17078 6654 -584583 -1327237 -441834 1352125 534227
14173 534227 -527221 -395322 -916179 -2546867 -3075060 -2392159 -1856556 -1194650 -455300
14164 -455300 174281 450535 -186775 -650329 170424 849834 638370 -115842 -263356 -91478
14154 -91478 170923 1167294 1373677 1642017 2192073 2521801 1765726 384774 533869 1341972
14144 1341972 1131026 -100198 -1130848 -1519929 -2068608 -2897868 -3304309 -2703378 -2297175
14135 -2297175 -1344782 430257 2350569 3086591 1693238 -122027 -1344252 -1791781 -579755
14126 -579755 -90026 -997327 -1468202 -1538153 -1943525 -2071715 -830810 71899 15502 -644700
14116 -644700 -861795 -1373650 -2409063 -2494758 -2298521 -2195585 -1953012 -672522 201262
14107 201262 1192286 944764 -401983 -908969 -1322937 -889731 -981648 -2286539 -3465519
14098 -3465519 -4440850 -3993788 -3590554 -3122921 -2685999 -2056418 -1387526 -1708000 -1297049
14089 -1297049 162434 -291514 -1954802 -2675313 -1951893 -768834 -207036 319077 -796006
14080 -796006 -1636062 -1307258 -458341 -45397 -489631 -593552 -1260330 -1696470 -1933460 -2077545
14070 -2077545 -1798423 -529361 751379 698570 -697209 -964917 -184395 855290 1079161
14061 1079161 -194489 -1699014 -1413642 -1195058 -1814730 -3358039 -3668794 -2297019 -1718886
14052 -1718886 -1427160 -1060970 -1142055 -1920321 -1488011 -865988 -670151 -684884 -1577318 -1611079
14042 -1611079 -302936 841678 994464 -41702 -987112 -995033 -541919 555220 949955
14033 949955 1126834 1780613 1513996 1463525 1592883 -129295 -2201021 -2057604 -1732658
14024 -1732658 -2671170 -3630569 -2598733 -1177323 -1114091 -2756658 -4011753 -2884653 -1199866
14015 -1199866 -171602 -403710 -1220598 -1510577 -2179504 -2625974 -3438421 -3111158 -1330077
14006 -1330077 976821 2505094 2264360 1397560 195304 -1446575 -2731168 -1904279 305395
13997 305395 2615472 3028458 2972449 1820364 655952 410119 339531 411650 278139 381102
13987 381102 -717365 -2516690 -2442231 -1792729 -1563048 -1594020 -2288198 -3020513 -3242862 -4227497
13977 -4227497 -3816770 -2294072 -1098889 -898964 -1690104 -1868563 -1861597 -1890356 -1368208 -1188671
13967 -1188671 -1897009 -2550804 -2546106 -1384996 -627660 -693584 -1231057 -2606568 -4393006
13958 -4393006 -4077903 -2131623 -1645961 -1665711 -1567640 -1549463 -1129986 -146620 321427 -696134
13948 -696134 -720421 76410 592811 482272 216490 -6214 -843141 -1226095 -540471 117525
13938 117525 259600 -626388 -1457446 -1169378 -440176 76349 -74556 969788 1744860
13929 1744860 1935158 2137024 1770519 1194573 1451212 1387393 539966 260207 -122632 137239
13919 137239 35998 -72190 -410898 -809371 -737456 92272 692457 217686 21801 838725
13909 838725 575469 -313932 -394407 -137976 -1249492 -2119999 -2599196 -2241645 -1472272 -1293449
13899 -1293449 -1238790 -405202 -74774 -838021 -2073696 -2565748 -1854853 -2584381 -4067528
13890 -4067528 -4657104 -3940330 -2545637 -1767317 -1236533 -1438048 -1028882 289654 1003532
13881 1003532 874473 119077 -431220 166738 1735374 3307532 3762759 3479099 2207003
13872 2207003 1041216 619283 128287 983849 2304209 2080789 1058338 77006 -313119
13863 -313119 -725431 -1059884 -1552201 -1352140 451254 2099097 1762323 1779137 1740970 848454
13853 848454 282653 604467 1345994 1227920 664672 -521082 -775406 -845446 -1564263 -2186454
13843 -2186454 -1631138 66379 310526 -84569 -532916 -964434 -233838 1185263 1114367
13834 1114367 1120025 1620417 1676440 2455550 2008241 906667 713687 239 -254139 -309727
13824 -309727 -228105 208002 -381669 -822518 275106 1023955 428067 194210 -531077 -1850902
13814 -1850902 -2128013 -2256784 -1991621 -1117915 -551559 749227 1599215 995164 589984
13805 589984 867472 601836 278225 146170 759023 1990830 1805928 1051821 370853
13796 370853 -778811 -1426004 -1098055 -1553329 -1868585 -1745741 -1044210 -75329 -13210 -948629
13786 -948629 -2245562 -2122463 -885039 -1168535 -1699971 -464141 85558 -396034 -883336
13777 -883336 -1790368 -2446252 -2673254 -2930847 -2539937 -1349680 -61405 283485 -1072431
13768 -1072431 -1585250 106797 488465 -491000 -1401907 -1838199 -1862316 -1175867 323427
13759 323427 1618687 1942230 1395302 1043392 1277657 1786761 1406138 681681 1334722
13750 1334722 1627770 687371 -914618 -1583030 -1371010 -402773 267868 -507079 -674291
13741 -674291 -676697 -1153759 -958551 504794 1742964 1758563 1027152 170973 -330345 243363
13731 243363 787581 694732 757661 499646 1097429 1662455 1772394 901431 167997 1285306
13721 1285306 2328081 2046648 1491612 812083 1694627 3428690 3741992 2654627 1111622
13712 1111622 510290 1141170 2026720 2050641 345938 131820 1014739 1539524 1261906
13703 1261906 458576 555568 1189107 1664209 2089699 2837345 3817002 3773522 2921102 2177043
13693 2177043 439051 -462699 -284279 -641103 -1027273 -1758178 -2555106 -3116213 -3065705
13684 -3065705 -2307963 -1341479 -640420 -617138 -428270 -69788 648178 1877464 2468879
13675 2468879 2831354 3111586 2329786 744341 -44812 171317 418813 -130219 -776122
13666 -776122 -1279619 -799767 -1241175 -2171175 -3066759 -3867535 -4463505 -4024065 -2775633
13657 -2775633 -2309814 -1813461 -395804 577983 452349 -265429 -1126257 -1230796 -531177
13648 -531177 -544016 -923643 -875052 -1320333 -1315233 -2156844 -2554492 -26993 2108232 2713945
13638 2713945 2657138 2549575 3058963 2721215 1343889 -940841 -2466870 -3591191 -4485029
13629 -4485029 -4335501 -3395091 -2974790 -3338415 -2905250 -1788594 -704236 -940892 -679356
13620 -679356 -6483 203903 1078023 1509985 172835 -1150411 -2222431 -2569600 -1295248
13611 -1295248 118891 1644712 1057620 -687466 -1157691 -538189 -622749 -1148196 -1582531
13602 -1582531 -839493 -353837 -1083865 -1927746 -1566003 -416990 233903 768507 1770560
13593 1770560 2609801 2361716 1133259 1031729 1976232 1699188 578062 -791658 -2109644
13584 -2109644 -3196199 -3125858 -1750277 -745354 -216932 322578 -12839 -56328 -36515
13575 -36515 -367377 -966866 -1546598 -1343804 -708547 135628 -538508 -1019682 -840824 -1034960
13565 -1034960 -690400 156213 -470440 -1950099 -2299404 -1311453 154201 674350 837693
13556 837693 421656 -325223 -1046484 -1347241 -798837 -630051 -223066 908467 1019741
13547 1019741 806226 -613535 -1691208 -2411891 -3119908 -2026287 -585108 292580 862468
13538 862468 593324 675739 384651 435670 1055791 1758551 1800793 1472894 697434 426745
13528 426745 982836 80919 -1094587 -1753619 -1887050 -1413731 -707959 -806883 -549625 127000
13518 127000 1731067 2082778 1125199 794636 1169772 1262007 950204 1018414 2562191 3822067
13508 3822067 3025373 1819547 924178 703022 1051029 1570069 1464366 1223245 814158
13499 814158 976582 608525 28079 370713 1368839 2339587 2222802 1110817 -976296
13490 -976296 -1895061 -2079567 -1420426 -873693 -1000618 -453764 485262 1127936 1393990 773088
13480 773088 62511 61369 -883209 -2319398 -1678239 511879 2251293 1713665 507732
13471 507732 70225 -270838 -942563 -653418 -121056 -477963 -1091106 -1303861 -150511
13462 -150511 -272132 -1285430 -975242 -828810 -377439 994090 800633 617090 2150144
13453 2150144 3120008 2036622 165998 -429708 -62289 398127 467581 -100578 -1116257
13444 -1116257 -2406451 -2796512 -1936157 -1717587 -1670656 -483647 1620285 2546588 2738559
13435 2738559 2978316 2408000 1673899 1453658 1722753 2242764 2589563 2227145 2505418
13426 2505418 3419705 3422862 2943749 3121726 3559046 3645785 2692571 2071767 1935973 1444405
13416 1444405 1287058 152789 -502081 752163 2662569 2764885 1408777 805347 176523
13407 176523 -532292 -1041224 -1155242 -1159349 -1148538 -1818866 -2123491 -1866765 -2231137 -2839281
13397 -2839281 -3856104 -3865900 -3700580 -2568362 -2127029 -2757370 -3189048 -3587499 -3915340
13388 -3915340 -3635690 -2406305 -1557320 -466289 747696 594587 -32124 -625965 -1070140
13379 -1070140 -1144482 -1510665 -2320432 -2436398 -810641 958961 1917596 686017 -1399689
13370 -1399689 -2836926 -2343214 -1375871 335620 867344 -300257 -1107833 -672612 335700
13361 335700 -194103 -1726015 -2559394 -2173756 -1338686 -580054 -433166 -98384 -82291 -247014
13351 -247014 616011 941938 218455 -894728 -1498202 -558537 -561152 -1392801 -2040048 -1733099
13341 -1733099 -1052845 754941 2401007 2443223 1906069 1416293 1608193 2097700 2092170 657470
13331 657470 -416898 42033 968144 2311424 2477810 2294354 3091277 3734670 4685878
13322 4685878 5122617 3777159 2816801 3006286 2539044 1729898 1388156 227687 -1093033
13313 -1093033 -1663507 -1671021 -1206939 -801725 1063 1142957 777767 106724 502063 1160411
13303 1160411 667638 493571 1898178 2816373 2404751 2309248 2423262 2638522 3265347
13294 3265347 2801146 1659930 1050689 732498 -543474 -1682694 -1984462 -1972516 -872522
13285 -872522 931319 1075623 1849935 1869633 1339906 1361640 2024553 2994062 1676738 -496830
13275 -496830 -999236 -285288 451494 -57790 -317217 1099994 1098516 -19286 -13736 994210
13265 994210 1248809 284111 -116561 -1446721 -2414456 -1603690 -578332 -147124 -640340
13256 -640340 -100444 1070600 2115741 2937646 2837919 2302671 2131181 2676334 2588653 2525031
13246 2525031 3635628 4408720 3204380 1989731 1405052 35460 -1488872 -1381939 -526837
13237 -526837 -248936 42156 1114048 1455777 1233835 1034873 137162 -192957 552462
13228 552462 1705105 2462774 2552287 1594315 -652459 -2188892 -2421495 -1517030 -799408
13219 -799408 -1355966 -1106305 -1615761 -3317690 -3094801 -1247380 -7296 395951 993148
13210 993148 -127043 -1325008 -1140362 -1209905 -1122587 -1239439 -1259549 583712 2133716
13201 2133716 2188768 2070722 3075774 3819048 3109711 2721165 1551525 -76600 -1180731
13192 -1180731 -494890 334723 338335 102171 -60002 -69342 368709 393390 321752 1090461
13182 1090461 2575240 2949868 2807860 2787725 2732254 2291304 2190179 2910245 2940476 2045768
13172 2045768 2692804 3458355 2841715 1675451 139281 -180635 -78132 -483414 -34852
13163 -34852 1059649 1186913 467449 198315 125465 -283935 -890586 -754288 347332 1288198
13153 1288198 1967112 1989825 1352562 1247698 816821 -254161 -439398 -965812 -1915365
13144 -1915365 -2078477 -1767420 -1497622 -1443239 -992065 344898 2189431 3818218 3350866
13135 3350866 2890055 2184440 1432138 639031 -133308 479197 1573410 2902767 3263371
13126 3263371 1903277 936760 1415226 2467903 4415713 5422493 4495143 4224263 4592899
13117 4592899 3707594 3348845 3120375 2533719 1862583 1909543 2562216 2507164 2036606 1244262
13107 1244262 2128654 3710056 3816483 1896274 -331362 -1104357 147324 1461579 2137499
13098 2137499 2817911 3183406 2205136 1163644 1229628 1793129 1612291 1404726 1893515
13089 1893515 2449949 2922922 4028018 5283792 4526843 3666664 3557514 2851730 2602007
13080 2602007 4067149 6021911 5963088 4213132 2759304 1392090 458517 662396 2028188
13071 2028188 2995424 4042133 4143501 3490720 2978127 4128529 6399607 7744942 7965457
13062 7965457 6760370 4445659 2367619 2167260 2305503 2020291 2766872 2833788 2279082
13053 2279082 2323165 1042773 -770753 -753753 1427044 3030871 3162662 2712209 1114066
13044 1114066 -422516 -1400903 -1193291 1051941 3210206 4165410 4913324 6092527 6658764
13035 6658764 6504397 5716632 5879411 7059335 7276435 6170786 4953900 4404704 3841170
13026 3841170 3838029 4312505 5565423 6712642 7413252 7645813 7055127 7177720 7352715
13017 7352715 6952033 7698129 8146662 6896651 6679614 7533896 8760673 9451261 8929670
13008 8929670 9146381 11123182 13301682 15348294 16703711 17418219 17615262 18761604 19921234
12999 19921234 20495542 21826992 24238879 26104013 28504745 31815432 35254486 39843451
12991 39843451 45110374 51635741 61025827 72552483 86772726 104321907 126843299
12984 126843299 157015566 195416178 244335560 303863457 366371998 412720660 417371143
12977 417371143 375246673 311189437 249360590 198822114 159759279 130084094 107918541
12970 107918541 90971027 77151043 66573660 58060228 50599356 44375288 39585942
12963 39585942 35482467 31172426 28034535 25937874 23939212 22116761 20064285 18500016
12955 18500016 16421652 14789387 14276979 13581849 12291352 11630957 10624999 9178821
12947 9178821 6841119 6394966 7299634 8131033 8681346 8150897 8146799 8856331 9530893 9766112
12937 9766112 9509348 9591703 9988631 10842998 11076897 10568126 9864209 9269020 9840608 10995383
12927 10995383 12013047 12775833 13979076 15758301 17810397 18912611 20353564 22315485
12919 22315485 23197663 23339565 23138915 22001073 21598064 21289466 20973941 22071933 24983443
12910 24983443 27725066 29819000 31930038 34157187 37873485 43479952 49514534 55849388
12902 55849388 64644114 75573849 88984908 106379898 129370247 158982859 198613674
12895 198613674 250953177 315195406 382217756 426694974 422186914 373035978 306531793
12888 306531793 243117668 192097858 153730113 125654662 103769010 86961589 74388209
12881 74388209 63237878 53110359 46258276 40853597 35836993 31873013 28118144 25208983
12873 25208983 24367683 23252204 21124487 18589553 17257340 16751545 14846704 12476792
12865 12476792 10349452 10181189 10476579 9467062 8383604 6810130 6149602 6513234 7622473
12856 7622473 7983989 7232202 6635004 6019578 5208227 4464471 5257105 6469008 6788338
12847 6788338 6765608 6361859 5563290 5816610 6471685 6737776 7208915 7295613 7704622 8746055
12837 8746055 9894836 10482466 10703985 10762446 11122004 11558666 11595385 12487847 14199400
12828 14199400 15943144 18014427 20162746 21040586 22645414 25440099 28520212 31273991
12820 31273991 34662800 38058813 43376722 50404203 58313134 67448158 77348443 90503995
12812 90503995 108484458 132798338 164202741 204802905 258013690 321074848 382634633
12805 382634633 418611597 406372468 353091518 285920872 226060643 179269290 143585840
12798 143585840 116190213 95025119 78957893 66870123 57884796 50474364 43210996
12791 43210996 36611903 31923970 28817670 25652829 21830888 19776531 18677742 17325814
12783 17325814 14930373 12985001 11848358 11796860 11403934 9200240 7977948 7248646 6392378
12774 6392378 5757653 4946631 4250700 4364713 4884475 5058500 4180257 3533641 3254015
12765 3254015 3438944 4213364 4630843 4221747 4156342 4294092 3834340 3772557 3984604 3077612
12755 3077612 1196749 -463014 -1964774 -2092883 -1436833 -838910 32375 905743 943344
12746 943344 1250715 2095937 2132390 1256230 253344 106463 223048 -16389 696735 1535440
12736 1535440 2253867 2173590 1576236 533675 -142415 807027 2105087 2020797 1478293
12727 1478293 529219 -854461 -1437492 -1762148 -2027486 -1995381 -851525 324564 -280352
12718 -280352 -1232434 -1869374 -2473806 -2367960 -1629479 -1509633 -1754389 -1663634 -935778 -246243
12708 -246243 -1047784 -1961690 -2174300 -1605663 -479086 -169776 -74755 -110523 -385238 -99848
12698 -99848 612950 1307544 770411 -430555 -774433 -56025 552873 663150 263413 -711335
12688 -711335 -1900869 -2684816 -2629980 -2502648 -2382744 -1670843 -1689460 -1890634 -1308439 -759987
12678 -759987 -266599 261763 558647 675156 791759 1489383 1609311 96258 -1137302
12669 -1137302 -1196221 -341755 1745539 3702679 4119201 3638223 2396529 1298405 1183688
12660 1183688 606711 -44712 -204845 -593672 -514637 -189014 -82597 106286 -389436 -1396455
12650 -1396455 -1892194 -2195919 -1800109 -2064118 -2654343 -2045639 -1461792 -1909381 -2017139
12641 -2017139 -801848 251867 -250521 -1499177 -1367242 -1648257 -3253664 -4270964 -3972343
12632 -3972343 -2540302 -1390542 -663890 -462914 -762548 -508943 1396797 3710936 4873978
12623 4873978 3087106 1202854 1034194 1276641 962903 -296866 -749194 -960180 -1546260
12614 -1546260 -2155304 -2525928 -2844611 -2385836 -1700480 -2304940 -3212814 -2416556 -1820077
12605 -1820077 -2023205 -2495664 -2743113 -2618812 -2697785 -2936680 -1906818 -436191 -687458
12596 -687458 -1074506 903863 1961103 348866 -1368040 -1680839 -1179602 142597 754099
12587 754099 1675439 2146193 1926567 1458857 948825 575206 -100232 -931104 -1355775 -757925
12577 -757925 1029244 2084995 1707851 1165828 727849 -620961 -2319125 -2765119 -1385791
12568 -1385791 194804 659089 313336 -104842 43511 750590 725418 940492 1661524
12559 1661524 1543023 484279 -383832 -919992 -2163318 -2678343 -2055805 -1157836 -660712
12550 -660712 -1742995 -2888563 -2048838 71947 992486 911082 1009026 705263 -75451
12541 -75451 923873 1482774 1337375 1467146 1721727 785120 -466015 -1657760 -2039752
12532 -2039752 -2290404 -2622526 -2205871 -1578829 -1257560 -668224 -327846 -723003 -50735
12523 -50735 744185 824825 -219471 -360329 -279464 -322190 465386 1874332 2116316 1705350
12513 1705350 1701847 1805428 1102947 1091356 1594714 1241837 1516810 2043764 1735940 767110
12503 767110 -404121 -871156 -1061312 -60720 4503 -1409295 -2055496 -2263225 -2334416
12494 -2334416 -2750381 -3486428 -4173319 -4335910 -4801083 -4914415 -3117992 -1196182 184235
12485 184235 414991 333661 1067759 1167811 322863 802220 792697 564526 460047 277316
12475 277316 583542 -544875 -1093678 -253005 -187394 -476364 331556 1524043 1398925
12466 1398925 175139 -412340 246560 1301111 2048372 1724477 1683047 1329524 -775601
12457 -775601 -2345208 -1871381 -246337 872567 850411 811815 535689 -462180 -1148337
12448 -1148337 -1067171 -277109 168988 -678143 -1221747 -588490 -90371 -144380 44382 425256
12438 425256 532378 -396211 -158069 1709874 2285548 1845443 828499 -384591 -790621
12429 -790621 -274652 264219 -18613 356162 284060 -100081 -514002 -1563060 -2747543
12420 -2747543 -3854730 -4138629 -3000403 -1507326 -1699986 -2319876 -2194876 -2765521 -3185767
12411 -3185767 -4024127 -4426329 -2963877 -1159562 392292 1020103 1049841 1167513 784630
12402 784630 -277458 -1751548 -2560058 -3474574 -3526374 -2212827 -591245 -499462 -2094903
12393 -2094903 -3299156 -2884190 -2932377 -3109836 -2277471 -958445 -144187 413375 586041
12384 586041 146776 -331647 -798479 -239390 -153393 -240699 959485 1579675 1996883 1393747
12374 1393747 -530227 -1090301 136226 1265812 1650740 732873 527689 2202349 1923859
12365 1923859 553210 124500 362797 -110855 -1250677 -1282519 -601951 111131 1001149
12356 1001149 1887428 2624304 3381207 3257859 2228764 1491636 888827 567647 462203
12347 462203 -320663 -714209 -994473 -1391870 -1961638 -1931262 -1049602 737329 1556700 794750
12337 794750 -216898 -53102 154837 29790 -79161 -532178 519153 2141376 1968014
12328 1968014 773457 32875 -46668 -146156 -1207281 -1510533 -1758293 -806684 830982
12319 830982 1346955 1037581 1414766 1409157 208698 27178 846131 2359301 3829951
12310 3829951 4896391 5403053 4762311 3342211 1659853 664833 -380467 -966273 -1055024
12301 -1055024 -988897 -912094 -14869 188762 -619026 -1201436 -811127 -955850 -1619185 -585997
12291 -585997 386382 884958 919745 32784 -965819 -39338 623133 -12464 -571787 -1324880
12281 -1324880 -827663 488729 803699 -30551 -2132310 -3545600 -3477159 -2932314 -2105630
12272 -2105630 -1127189 -1198222 -1588305 -1606964 -2172830 -1908781 -1476590 -1661949 -1931571 -1752234
12262 -1752234 -1333323 -1342159 -640620 193253 611367 1070620 736664 839551 1582769 1357675
12252 1357675 -192521 -1539227 -2471901 -2347665 -1205223 -437836 -725040 -122969 633993
12243 633993 1120306 1565410 1187582 1415794 2628813 3098220 2831407 2256641 1854217
12234 1854217 1675563 1528959 720410 -942020 -2234933 -3042847 -3558227 -3367689 -3049788
12225 -3049788 -3335712 -2373645 -859067 150591 80836 -3288 302482 591827 495521 -650497
12215 -650497 -1259062 -1519231 -1721765 -804447 -995032 -851000 -476520 -376080 713216
12206 713216 775788 -171225 -1101315 -555956 478079 1157513 1791574 1300595 119221
12197 119221 -421441 -1138145 -1122649 -410695 239415 275101 1127691 1841149 2934957 3149772
12187 3149772 1588833 127793 -1346629 -2001528 -1680698 -1675864 -872512 -910154 -1309097
12178 -1309097 -442905 530940 1059980 775620 342677 -329711 -998639 -1001694 -1712092 -1950152
12168 -1950152 -1210341 -1161352 -1490125 -2211119 -2920135 -2706467 -1862837 -1607544 -750748 328994
12158 328994 -337746 -1877985 -2234735 -1616734 46269 157346 -767224 -714017 -1207586
12149 -1207586 -935197 -239170 -136175 114513 -365069 -318841 147424 1058474 1855366 1218288
12139 1218288 1223118 656971 -83396 -734743 -577933 -18167 -214436 -95773 -663415 -2336646
12129 -2336646 -3417965 -2504764 -542825 1251385 1487648 230768 441068 3048235 5450598
12120 5450598 5351848 3593474 2519089 1078348 461496 471711 208383 13274 -233072
12111 -233072 -329486 -185606 -457421 -1077114 -964996 -366524 1080158 1666804 1390348 754638
12101 754638 1421314 1735085 894246 -177487 -857854 -153550 -325708 -2091546 -2406934
12092 -2406934 -1037389 -701769 -1682969 -2172232 -2662088 -3468370 -4619571 -5544066 -4639874
12083 -4639874 -2241061 -628228 -855443 -165089 464636 -596258 -2397683 -2301075 -1626681
12074 -1626681 -1659048 -1483789 -1845773 -1322006 -539678 -303966 -53481 505250 1314414 1462607
12064 1462607 826679 98881 792542 1537240 1610373 2323505 2642856 2737298 2504487 2049760
12054 2049760 1449143 1140021 -16219 -664078 -991981 -1602586 -1608164 -599933 -156342
12045 -156342 -739192 -1012823 -1162952 -827205 -815823 -1187028 -446445 -580431 -1913892 -2223217
12035 -2223217 -1151256 -105714 85935 -812365 -1425366 -628497 62180 1426895 2056221
12026 2056221 1034791 -80553 -633318 -563915 300278 130874 -642191 -1723216 -1400381
12017 -1400381 -478137 -448235 -1172055 -1118493 -251909 1163077 1517630 1250876 802789 279004
12007 279004 599793 1692937 2482878 2354958 1657424 980058 -454813 -2111030 -2625676
11998 -2625676 -1677412 -382500 1128945 1824918 1912747 2291642 3333182 2841034 827727
11989 827727 -138499 580545 1178476 867029 464002 575729 1170810 1647373 2098653 1881705
11979 1881705 1673277 825822 -382826 -1042271 -536045 12275 -477886 -843989 -618742
11970 -618742 142857 1976741 2299369 167614 -415714 381001 1380613 1945083 2112555
11961 2112555 1029959 -12290 -558272 -995394 -968736 -783343 -1695730 -1346121 -318031
11952 -318031 -233876 -798830 -991582 -1029850 -1255604 -1023195 -512717 -507667 -960491 -1269059
11942 -1269059 -1164627 -280704 312151 214989 19068 -554592 -1677607 -2157344 -2246263 -1244135
11932 -1244135 -273435 -177906 -428497 -542687 -599071 -1237086 -1381428 -1445562 -1816732 -1530581
11922 -1530581 -922906 -28284 1019442 1468725 1174314 508824 -557378 -633367 1183586
11913 1183586 1799742 1076902 -34437 -1714900 -1853203 -1769493 -799849 -164199 -357592
11904 -357592 -17977 414134 88614 -396567 -14815 -726343 -1326650 -1875092 -2304030 -1665194
11894 -1665194 -612414 408323 -119230 -1030854 -1805726 -1041708 404562 755027 876542
11885 876542 1599365 1513188 1733898 2384532 2495570 1617530 1538897 1475804 1126716 629121
11875 629121 -523714 -82033 952675 1126895 422900 91639 960188 1403661 1752678
11866 1752678 1914710 2077754 2248177 2234886 1252587 -1210279 -2561999 -1044594 246071
11857 246071 -768071 -2404954 -1130207 603709 1160659 1198570 590147 -526199 -1743008
11848 -1743008 -2343985 -2576465 -1916809 -1346332 -1437829 -2127529 -1785885 -1559294 -972470 -1555355
11838 -1555355 -2087806 -676969 598392 1119676 1408416 2298104 1690489 -71063 -1134567
11829 -1134567 -1290568 -1682202 -1666810 -761527 43768 775887 1406472 2246098 2170063 1787200
11819 1787200 475485 -560262 -1169820 -1860359 -3179410 -4411533 -3498979 -2229639 -976047
11810 -976047 663959 855247 -38511 24936 292031 -436765 -1042717 -557300 -527536 -451412
11800 -451412 -118972 -175495 -241298 -209752 -394142 -913969 -748530 228294 958974 1601888
11790 1601888 1930041 941444 211673 558845 601883 185653 13222 789907 1186180 581805
11780 581805 -545659 -434823 -555469 -990495 -288625 250667 154898 556924 1101717 1492517
11770 1492517 1868836 1412074 9946 -71873 1059888 1358336 505904 761644 1486448
11761 1486448 1870772 1644085 1660984 1299470 481210 149991 904052 1438219 1899617 1145691
11751 1145691 -461170 -965442 -1582657 -3210231 -4049076 -2705771 -1137359 118237 -99586
11742 -99586 -1393503 -2480638 -3323291 -3285354 -4071579 -4259539 -5141740 -5557599 -2116420
11733 -2116420 -598236 1130357 1830709 967009 -178570 83609 863751 544056 -491185
11724 -491185 -1555178 -2530664 -2407182 -1610881 -1103399 -1680988 -2642192 -2803449 -3157190
11715 -3157190 -2651410 -1114085 269053 492715 958875 1574374 1528235 2339993 1879358
11706 1879358 670103 -873826 -2089212 -1735629 -2109890 -2564045 -1049720 -18141 437006
11697 437006 719775 7247 218695 1542354 2272962 2476576 1120100 -274154 29605
11688 29605 532542 1207358 1152553 861849 1584741 1641619 1551676 1153321 -834910 -2228864
11678 -2228864 -2890809 -2929721 -2596660 -1915250 -630820 -284175 -743965 -310439 801719
11669 801719 1462492 1271529 1003908 1163804 1676271 1031301 163725 -835130 -1377198 -1614788
11659 -1614788 -925899 -1262654 -2587877 -3380220 -2673564 -1380172 -1104168 -1003374 -226542
11650 -226542 230079 565694 565915 105085 -36484 -48701 25989 146091 968754 1005987 1470262
11639 1470262 2570601 2839075 2575209 1263508 342726 438343 922973 1717019 2157759
11630 2157759 2450977 2241585 1379853 683151 239078 -303739 -26433 380573 1330752
11621 1330752 1851896 1590588 1817964 1054579 409232 601924 1552322 1341757 745000
11612 745000 795646 653888 897233 802274 483521 -780976 -1351355 -939134 -431893 559799
11602 559799 944094 -100998 -582457 -828403 -1717537 -1193895 -984925 -1176410 -1112173 -759430
11592 -759430 -512283 -105299 868255 1455710 1482810 722636 -1082584 -1000985 280809 1187707
11582 1187707 2230456 1769238 1031138 773410 -535689 -1897908 -1124350 934109 2841000
11573 2841000 3138166 3344969 3118549 2016784 144394 -1077389 -1366463 -1130438 -595822
11564 -595822 -443028 -939872 -904928 -335389 217415 1936519 2343890 2862590 3553145 2598954
11554 2598954 1304608 587414 513339 -36043 -1634295 -2352379 -2275744 -1874725 -1035025
11545 -1035025 -555344 -251778 553674 1469645 1429352 934057 -474 -1444169 -3643377
11536 -3643377 -3468717 -1606029 -879479 -369322 585352 1080894 1463239 1141196 400828
11527 400828 -445237 -1122809 -857364 4476 541674 978692 735703 639965 866985 1231615
11517 1231615 1046748 -380912 -1565851 -1110449 67552 886548 688355 631765 689892
11508 689892 634818 -153062 -1921870 -3436705 -3914566 -2864845 -2049452 -859165 374412
11499 374412 1028408 868608 18020 -881109 -1201537 116194 1929201 2725956 1590176
11490 1590176 -781101 -2515276 -2990453 -3507081 -2961562 -1969206 -342378 862569 620625
11481 620625 -528904 -907374 -596502 -1335614 -1045325 -644173 803492 904355 7248
11472 7248 688127 1336502 940049 1238643 1785854 2075581 1831864 608820 -184948 -378848
11462 -378848 23662 565117 -492115 -1721771 -2772642 -3226721 -2338355 -1504549 -1224737
11453 -1224737 -1343458 -807704 -159732 -447379 -1285499 -77132 1633062 1939203 577087
11444 577087 -769702 -1304681 -1622469 -1893309 -953230 -300898 -478020 -828280 -1513417
11435 -1513417 -1489988 1881028 4584326 3858416 3515509 3730865 3925582 2994001 2106605
11426 2106605 1669972 2373690 2383326 766255 -312387 -569549 -1267097 139038 1195524
11417 1195524 1163325 991501 -175313 -2044434 -2525612 -1510821 -391814 -536766 -772925
11408 -772925 166477 1104806 1652708 1453725 1036 -643861 -257310 1153595 1511088
11399 1511088 386451 1157605 2538541 2694527 2200241 1151097 475275 103838 -495059
11390 -495059 -607401 -330746 3449 406889 401387 -219264 -1141723 -1256276 -541498 -284475
11380 -284475 469161 1012200 438376 -234265 -193029 -230435 -58585 -395 449609 409152
11370 409152 411924 158415 -1416836 -1659336 -389651 418049 -330387 -1807048 -1796302 -755842
11360 -755842 211769 659038 -17675 -841236 -531644 808279 1830531 1538032 973036
11351 973036 1347417 2185970 1698065 274159 -569973 -442437 586741 1346226 1088106
11342 1088106 861747 1002717 1238925 775926 46458 385234 1269855 1752530 1928450
11333 1928450 1765156 1662945 1533382 1028308 1290100 1827860 2070447 2100209 1830836 1800414
11323 1800414 2056974 2006036 888601 -556980 -668056 185173 309326 -36716 -430373
11314 -430373 312344 1537247 1160752 -71768 -341579 -389415 -799858 -924762 -967398 -1052232
11304 -1052232 -997827 115960 1458088 1785453 1359337 885503 1065150 2092600 2382679
11295 2382679 2520482 1953507 -407697 -1310252 -585981 -532754 -1091800 -2184883 -2664583
11286 -2664583 -2580232 -2378756 -2779539 -3655052 -4311831 -3333476 -2650832 -2474253 -1219667
11277 -1219667 -707626 -1337234 -1679244 -533657 832004 708052 315514 1040563 1119466
11268 1119466 993290 640183 1004438 1231179 1116052 1790633 2172992 2750415 2539177
11259 2539177 1273409 936633 1627396 2064629 1805276 1195853 822689 1399210 2291195
11250 2291195 2792094 1968223 1280772 1091607 572342 1273358 1941720 946042 -64150
11241 -64150 972281 1823801 1846605 929728 -1096385 -1944612 -1145849 641259 2093172
11232 2093172 2143218 1735576 1167105 -190112 -869311 -662591 -929770 -1281825 -943380
11223 -943380 -165366 1235187 2044368 805815 -973480 -1741274 -1659051 -523246 479885
11214 479885 664055 390868 944165 1510932 953765 1250733 1191246 508875 411469 563697
11204 563697 26872 -539317 -694662 -660247 -1565453 -1945547 -1275417 -49792 -381411 -947691
11194 -947691 -753675 -662082 525128 2057078 2463975 972037 -432165 199441 1199358
11185 1199358 845530 487753 -137561 -297281 -148895 -581679 -1069796 -712448 -244985
11176 -244985 -399974 -270911 -111519 -631649 -785144 -788735 -273928 1182335 2516336 2053296
11166 2053296 670246 948862 1189550 1030859 1037923 465074 -3924 458165 306953 446660
11156 446660 725809 1675485 2865299 2541575 1990594 2002237 1747740 1195193 864657 471248
11146 471248 271512 -388891 -1394189 -2382151 -2750881 -2349655 -2366259 -1919833 -1269310 -795211
11136 -795211 -428003 -501565 -485454 -638061 -980957 -1405259 -2529397 -2521017 -1358897 -132758
11126 -132758 1409229 1311680 516763 -301278 68541 -173394 -666077 -76714 557031 1370374
11116 1370374 3236218 4606720 3463634 1586123 98469 -836508 -71947 422278 385132
11107 385132 239186 624065 1847114 1926836 916464 1406986 2160141 66689 -1655149
11098 -1655149 -1836857 -1605761 -1613412 -1757936 -1539983 -2022321 -2102496 -1974893 -1066515 156334
11088 156334 250989 685085 1555809 2270366 1948535 1564565 1304099 1154457 1466877 1572408
11078 1572408 267311 -1072667 -905669 -313212 -88447 -447289 -614318 -466634 157187
11069 157187 1005998 1763575 2781198 3150482 3110780 3784794 3649089 2023863 667640
11060 667640 -35708 -440459 -471819 581884 1883168 1172151 -28807 -344285 80894
11051 80894 915391 1452114 2031430 2162067 1039492 876150 310430 -1083436 -1319527
11042 -1319527 194197 1299138 1821139 2692510 3174078 2507321 1937480 1622012 1534682
11033 1534682 1412971 1275544 1231174 168747 -277159 893151 2603016 3912862 4267333
11024 4267333 3292691 1287667 666451 950380 1302952 1357553 1351077 2245334 2507424 1350942
11014 1350942 1013616 1312065 540312 459619 1583379 2292819 2377454 2063431 1513658 975039
11004 975039 79075 -1140078 -1739074 -681650 166720 570777 1232587 1372288 1048342
10995 1048342 905084 1074181 1912454 2973374 3041969 2361977 3553710 4606649 4475215
10986 4475215 4168554 4355842 3981165 2420710 1288796 1798336 2883442 3990175 2897100
10977 2897100 1736916 3323192 4048775 3171739 1865288 372313 1151682 2788003 2798304
10968 2798304 1686575 1298753 1952770 2230893 2846001 3174859 3977370 4300561 5924515
10959 5924515 7636790 8388194 7849145 6975916 7013615 7831890 8843217 10247455 13288285
10950 13288285 16728631 19996182 23689584 28865051 34579217 41455509 50372324 62999821
10942 62999821 81845586 108882129 147329273 199116177 255017611 283032517 258806723
10935 258806723 208815826 165478682 136813712 121214058 116136741 119147006 129673362
10928 129673362 151840599 186793703 233436630 276238444 278815545 232203878 172688759
10921 172688759 126174402 94448259 73292568 58698600 48753451 40736855 33477848
10914 33477848 27768412 24839011 21644194 18793568 16397147 13960740 11189709 9462507
10906 9462507 8578933 6903255 6382417 5611892 4579418 4614584 4444097 3125487 2157028
10897 2157028 2997368 3601761 3902277 3550408 2055653 1693483 1834303 1342532 1035518
10888 1035518 1893936 2179284 2897417 3994579 3380024 2689592 3275894 3492618 2614174
10879 2614174 1353812 535910 693121 1501985 2749734 2898026 2339904 2395995 3409055
10870 3409055 3534179 2717068 1977133 1128054 823538 685929 802731 199187 -801402
10861 -801402 -642921 408138 1169802 1865011 2138996 1106430 3981 -477388 -446385
10852 -446385 93914 467596 -615716 -1613156 -1607476 -1492895 -1133316 -611936 -950184 -1235818
10842 -1235818 -1012210 -881739 -1050345 -1604972 -1507599 -1527045 -1494194 -912805 -919021 436188
10832 436188 2071668 2046981 1485516 382187 286550 1281725 1205228 -18682 -1020867
10823 -1020867 -1206695 380327 1090980 1563106 1848465 119369 -1493517 -1969550 -997943
10814 -997943 22201 -7192 -726366 -651781 -556638 -897102 -882150 -1260606 -1379745 -1195697
10804 -1195697 -1075585 -654800 -238184 256177 890453 429339 -569898 -1341574 -961928
10795 -961928 -413744 490916 1348367 496691 347540 384477 -480968 -2152141 -1863946 -174612
10785 -174612 925482 7507 -1221615 -732256 -822629 -904574 -13242 361451 130100 -435706
10775 -435706 -1507204 -1803531 -1404161 -429674 1407218 1708380 -57347 -1746788 -2233233
10766 -2233233 -2304539 -2788471 -2167265 -705201 -385863 525212 1388273 748318 -317722
10757 -317722 -269144 1396214 1520058 1017494 818597 312407 -1322732 -2653252 -2441285
10748 -2441285 -888360 -82787 282787 1330598 596506 -88079 1214994 2375010 3143601
10739 3143601 2690586 1221652 -544083 -1093630 -49681 1172650 286528 -1799 476597
10730 476597 -132978 -167361 189744 -165516 -935183 -1049801 -18744 128892 -130058 -670683
10720 -670683 -1376219 -1622513 -905460 -442230 -1158926 -1309816 -624135 533042 835716
10711 835716 585547 1292735 2656187 2836192 1658913 434109 -612147 -1846798 -1305470
10702 -1305470 -493421 253893 487305 -283882 -622225 -1014079 -1718206 -1574460 -786443
10693 -786443 -329222 -1007338 -990747 -178120 78379 178267 -399776 -1810295 -2518191 -2467624
10683 -2467624 -2197130 -1636754 -1446135 -899779 -32198 -360162 -655581 -849610 -1724639
10674 -1724639 -1586245 -336595 1279061 1883988 865748 109638 -308896 -307393 -91007
10665 -91007 519683 1155710 800427 827487 1854435 2239811 1774284 632763 113046 530577
10655 530577 -120399 -649873 -517108 343811 1064203 837755 1501890 1475884 737329 -201482
10645 -201482 -895712 -222825 684559 1851271 3196018 3893610 3302592 1851563 1570472
10636 1570472 2289505 3108814 2501039 1016367 716256 894954 1188817 1451586 522783
10627 522783 -955087 -2913727 -2674863 -768108 1023026 2401212 3090069 3477848 3665720
10618 3665720 2818795 1159370 165861 -498573 59172 1321110 1779267 924555 -68657
10609 -68657 -78936 1260337 1950736 2822463 2765546 2715676 3622996 3742698 1319852 -999577
10599 -999577 -2506899 -3002777 -1863070 -1146267 -539435 -307181 -570001 -122522 762697
10590 762697 1099782 550387 -42921 -468887 -354842 -311792 -311148 11286 235863 -72550
10580 -72550 -741549 -631411 77153 447848 673849 819564 -458182 -1807569 -2593321
10571 -2593321 -3266512 -2764465 -1724675 -1730282 -803108 852923 2873483 4576936 4485508
10562 4485508 3404641 2297828 1081026 421389 248468 96943 -227182 -1456181 -1701749
10553 -1701749 -1906861 -902413 6727 -413018 -966635 -1447798 -2244915 -1832565 -1168041
10544 -1168041 -1887110 -3435959 -3155613 -1048287 -1405692 -2892375 -2775308 -933612 281762
10535 281762 345699 837208 729645 -866316 -1296589 -1882246 -2350954 -2513803 -2434972 -1666181
10525 -1666181 -507834 74571 -875464 -253032 808304 1347350 997459 915278 57986
10516 57986 -1091450 -2507956 -3028190 -1035108 2071 -451901 -1353730 -1474608 -1767990
10507 -1767990 -1996996 -1020398 -294379 -43134 -10632 104230 21643 -727205 -2187315 -3157381
10497 -3157381 -2731994 -2008886 -2256727 -2706197 -2645300 -1993225 -1707557 -2227695 -1421885 -330098
10487 -330098 221807 -452336 -1022034 -492776 -366037 -375245 -430354 -391675 512192 66764
10477 66764 -1008289 -1604790 -2051974 -2368305 -1305816 -343756 48337 825113 1852800
10468 1852800 1518362 288885 -939161 -544247 -457655 -1468303 -2498100 -3019003 -2702648
10459 -2702648 -1987366 -1583600 -935528 -486363 1075260 2672113 1779798 141993 -151397
10450 -151397 329706 33456 -465503 -371682 -183843 506643 574566 116132 -55807 57087
10440 57087 458628 141275 1051325 2210994 1844461 644365 -556684 -1842665 -2842245
10431 -2842245 -2201977 -1287429 418880 1914325 1997705 2347410 2816761 2156433 124642
10422 124642 -787768 -269894 703297 982660 -96776 -1424831 -1037808 643511 1072091
10413 1072091 244650 -952237 -1617292 -1934761 -2509217 -2901547 -2732204 -2326537 -2731655
10404 -2731655 -1947041 -1602446 -1111634 253666 1802442 3578292 3277459 2093711 1566414
10395 1566414 598159 -159284 -238154 -234862 -697492 -452687 868054 1848028 975348 -186130
10385 -186130 -916149 -1619692 -2410268 -2011170 -586801 -21392 -798859 -1598167 -2276517
10376 -2276517 -2234976 -1486611 -1800581 -2460751 -3551600 -3550967 -1913026 -255759 1007112
10367 1007112 2100193 2473424 2542718 2891479 3214164 2438473 1124250 1054713 457442
10358 457442 -1403446 -1445579 -278444 -865002 -1556774 -1598142 -1319797 -637109 -417711 230649
10348 230649 959295 922188 -751209 -2282350 -3436840 -3498336 -2412636 -1569901 -1019073
10339 -1019073 -874335 -944645 -726728 -268864 -456922 -1282924 -2147598 -2202843 -834236 540704
10329 540704 2082479 3395988 2002633 -103152 -598570 -539565 -224536 -45488 -421127
10320 -421127 -879712 -828872 -1899923 -2533061 -1826130 23307 985080 1053620 2600888
10311 2600888 3706522 3048146 1588281 60694 -489192 -607181 -552204 459399 1007063
10302 1007063 1690682 1404304 852658 964862 2145088 2688383 1466114 125950 -335373
10293 -335373 -1083907 -1961517 -2617101 -2705228 -2807215 -3283352 -2430740 -768679 198666 680371
10283 680371 1577110 1099073 -113881 -406370 55435 1647938 2511003 2047132 650832
10274 650832 -147577 -564609 -466796 -277676 -1238354 -1799978 -975651 -254288 -751458 -1721352
10264 -1721352 -1936993 -1481365 -412252 -137656 -1025684 -1926119 -2349831 -2181419 -1869304
10255 -1869304 -1744870 -1828556 -1822109 -991604 -77741 688624 820438 -420706 -1115332 -17257
10245 -17257 1369336 1679553 1338584 1296114 1772587 2265888 1055459 -503802 -486288 1428311
10235 1428311 1860475 638741 910768 1894790 2036873 1253631 828440 1708503 2585256
10226 2585256 2357513 1923677 1925950 1434374 191890 -614980 -1183164 -1087639 -937340 -1031695
10216 -1031695 -832386 -127570 711112 1414438 1853085 1939886 1254408 884992 1418515 2701263
10206 2701263 3429831 3377123 3065349 2899285 1641571 32352 375356 1800458 1838017
10197 1838017 1682419 2258106 2208962 1157221 345307 872779 1222406 1213619 1971238 2921617
10187 2921617 2851821 2604921 2909736 3165874 3402012 3357022 2981899 2425621 1762596 1632217
10177 1632217 2187301 1926224 1694784 2444394 2111925 1327061 1117708 394162 -572141
10168 -572141 240391 -132420 -1455843 -2667186 -2707952 -1935603 -905123 486350 1467506
10159 1467506 1932733 1165910 1134042 1742246 1859566 1782999 822438 -675843 -732960 -957301
10149 -957301 -1074008 -117629 663276 1384249 1095597 -199433 -263505 -286913 -1252290 -1259260
10139 -1259260 -1232457 -1665226 -1939135 -194347 2372942 3069670 2749068 1426735 -292851
10130 -292851 -620902 -281369 -418091 -437731 45910 -279774 -1181645 -1195998 -88725 929231
10120 929231 407291 -480419 -1688465 -2358201 -2363237 -1718211 -971421 -263109 -12860 -398989
10110 -398989 -1152786 -1464918 -1682471 -1810152 -974163 -36874 559804 999568 872138 896926
10100 896926 373575 539584 2088161 2214810 2049869 1878043 1196940 1583134 1862169
10091 1862169 1520875 824773 82999 -581191 -42967 303519 -82124 -413636 -1280588
10082 -1280588 -1534696 -755232 336548 -798161 -1273061 61461 655670 763823 745677
10073 745677 721679 1045737 825019 813910 809984 418248 795178 1772150 1215682 417291
10063 417291 781992 711427 1033965 598756 -449689 -1067060 -1222588 -1161111 -1321100 -1793719
10053 -1793719 -1592224 -792585 -98470 840779 876137 107355 -629221 65046 1211421
10044 1211421 1193009 916223 360024 238461 506417 1476167 2006967 1695722 2203228 2014027
10034 2014027 1045025 489539 -51334 -465930 541086 2168077 2126092 2168304 2890515
10025 2890515 2361549 1412167 988265 1250540 1697511 3067321 4774465 5935380 6668950
10016 6668950 6917027 7486393 7295616 7275442 6949756 6846119 7987911 9238862 10278207
10007 10278207 11522662 12222327 14956316 18759613 22242907 27185655 34771966 43729308
9999 43729308 55047135 68763304 87473307 115825958 160470071 222991617 289094324
9992 289094324 305388093 249394455 179045150 128433202 95099188 73037148 57899296
9985 57899296 46927451 38358205 31508681 26016704 20604209 16669657 13494505 11342235
9977 11342235 9709091 8785289 8006503 7598033 7306937 7161079 6405544 5198019 4802098
9968 4802098 4606269 4100545 4225379 5261990 5165758 3872117 3408208 3710371 3634644 3519130
9958 3519130 4213477 3639452 2992940 2646246 2051527 1151522 1473797 2276064 2835817 2522141
9948 2522141 1884131 1746338 1955603 2250752 3311956 3380203 1393677 -345531 -363366
9939 -363366 108578 -463667 214769 1291424 918105 567007 388017 -647704 -1876407
9930 -1876407 -2074944 -1165724 -490497 -485205 -760520 -1248684 -2032871 -2117357 -2749072 -4895745
9920 -4895745 -5923108 -4608566 -4384306 -3921799 -2346873 -1233866 -214937 -190471 -1296550
9911 -1296550 -1390607 -1244037 -1036299 892203 2366224 2458316 2872642 3674689 4543959 4473308
9901 4473308 4269944 3588375 2441190 479137 -570061 -188541 1125329 1882104 894512
9892 894512 -222971 -147721 202887 -3256 -136696 -126044 -1332517 -1782327 -1770936 -2204398
9882 -2204398 -1632557 -281726 -390857 -1459861 -1869934 -1312392 -931353 -1381556 -1262860
9873 -1262860 -1010682 -1840742 -1601405 -1144879 -1790136 -2423211 -1930465 -347375 1252612
9864 1252612 1169654 -272950 -1527476 -1602829 -1474523 -1121878 -693562 -416058 246836 1623610
9854 1623610 1374574 -492402 -1871413 -2080786 -2158907 -2761394 -2401807 -1145648 -559782
9845 -559782 -8199 52832 -496318 -395772 655530 774791 -463275 -378535 728937 847344
9835 847344 483212 1024232 1008584 871733 897526 882871 1253270 919271 164238 455313
9825 455313 864195 268176 -64839 -1038790 -1609119 -673377 181232 1245373 3248637
9816 3248637 3692058 2485821 2154287 2117215 2773844 2344675 647452 92678 542559
9807 542559 1031000 733073 -335363 -1231295 -1142774 -411335 428618 670996 158368 844622
9797 844622 2830629 4137730 3104595 1574363 787253 -359070 -2007943 -1419740 574390
9788 574390 1327181 2054239 2008825 745247 483372 546821 1666015 2991094 2575055 1002032
9778 1002032 -583591 -703276 580844 1329054 847311 -769971 -1537018 -1297457 -683769
9769 -683769 -399445 921734 1680044 1038803 -161849 -345225 411348 65365 -237110
9760 -237110 88502 236078 -112005 188917 135241 -30581 -343660 -1666900 -2500348 -2030873
9750 -2030873 -1355722 -148218 1203143 1681912 1447211 -162954 -915645 -461446 -72879
9741 -72879 39288 -476352 -972209 -978851 9446 608042 703083 504558 -187265 221850
9731 221850 555957 -519524 -1182870 836172 2736795 2883312 2716873 3279505 2359925
9722 2359925 -583282 -1416386 -124636 951882 1094065 1435079 1535610 602015 137323
9713 137323 -6214 -403666 -1469616 -1641401 -712630 -524 -464934 -941043 -1270580 -1826956
9703 -1826956 -2152592 -1403518 497129 -169704 -1107197 -1086357 -1078708 -1033551 -1746173 -1841996
9693 -1841996 -1289588 -686850 -350420 -342414 155629 -41804 -749915 -621604 -1096035 -1584262
9683 -1584262 -1348038 -1084527 -271536 39206 -750387 -1392315 -1620409 -1895531 -1701703 -1375735
9673 -1375735 -383416 -632311 -1065087 -787677 -26281 406608 709727 1074295 1401194 1705629
9663 1705629 2350918 2115279 1618239 1234291 -110741 -1097699 -2107692 -2755484 -1937693
9654 -1937693 -1259157 -955528 240236 314696 -367060 -499063 -86990 58948 -931751 -1084644
9644 -1084644 -440341 13723 220025 -496077 -1446049 -2294329 -2418429 -1261674 119249
9635 119249 816374 1228896 1355576 181891 -1825937 -3409951 -3388838 -2754514 -1584920
9626 -1584920 -1281443 -577310 852377 1689313 1756979 1583680 986966 -455279 -693203
9617 -693203 990867 1576821 1222304 1071547 183520 723167 1362800 1378294 1691431 1822924
9607 1822924 1394345 1368896 1575561 774711 -606041 -1047077 -1530693 -2375869 -2186297 -268655
9597 -268655 1241391 1148369 131904 -85808 74943 1348619 1166918 -429133 -1270754
9588 -1270754 -1207588 -263198 1057872 2430415 2844427 2107442 765687 -455406 -242456
9579 -242456 520681 341050 -875356 -1413094 -1571200 -1852452 -2537974 -2696797 -2307829 -1475717
9569 -1475717 -187228 318519 20493 -112992 -568216 -503313 -4096 235256 957107 1537724
9559 1537724 858726 -1103311 -2236212 -1727840 -564256 -339263 -191908 928205 2761648
9550 2761648 3800468 4072679 2971259 1194163 540107 164619 -510525 -1724841 -2095289
9541 -2095289 -1519890 -1774303 -1974232 -2078646 -2362226 -2283105 -2081721 -1632307 -179592 1303693
9531 1303693 892072 -795665 -1566863 -1213675 -1641008 -1934014 -2090757 -1679774 -504339
9522 -504339 539887 752043 1124681 1682620 1094608 828900 1988061 2823599 2317311
9513 2317311 1137535 448717 390647 1037079 2384616 2515565 1342849 472078 -1208665
9504 -1208665 -2731042 -3478091 -3822173 -3057819 -3661733 -4755699 -4645843 -3707168 -3002727
9495 -3002727 -1894610 -76923 1502583 2315136 2124949 1300715 706193 491715 443872
9486 443872 -229118 -654089 -493505 -1702338 -2679721 -1403490 -598616 -369603 931688
9477 931688 1004946 285474 325110 295262 710478 1271947 1277505 1256933 1967365 2802207 2693140
9466 2693140 1972649 1284657 822214 801421 964721 1375692 1447477 1411896 817280 -528438
9456 -528438 -803751 -502938 -791001 -1241112 -1203039 -1574352 -1070878 -929697 -1649056 -1460884
9446 -1460884 -1100579 -641913 -431264 -104122 457330 1088593 818319 -210587 -1294883
9437 -1294883 -1642265 -688115 941077 2148632 2637473 1344974 110223 737765 1282116
9428 1282116 1643589 1847851 2104573 1791460 1017206 -158565 -627244 -295705 -1005374
9419 -1005374 -800551 968817 1608856 587682 227333 395463 336722 899279 624965
9410 624965 642837 787124 -415697 -1564570 -1794231 -611595 1117438 2111580 2157921
9401 2157921 1183121 728672 404841 152562 -86011 68089 446131 1231554 1483281 -10064
9391 -10064 -1153145 -544641 53565 -824284 -1546425 -2270954 -1860564 -1859245 -2095666 -1003233
9381 -1003233 -245222 -571411 -1679464 -2930060 -2190268 -1112245 -1187342 -1851801 -2110476
9372 -2110476 -2594725 -1963361 -880175 -396253 -763255 -2305564 -3084803 -2885015 -1660266
9363 -1660266 511477 1335088 1164172 939635 701119 891889 492156 388890 -365877
9354 -365877 -1831953 -2201899 -2780901 -2635145 -1826102 -1226803 -898519 -43770 170208 1098130
9344 1098130 1622590 266788 176255 1253047 759722 623417 2036224 2313573 1454698
9335 1454698 1409740 2526409 3161136 2810497 3252614 3441441 2655624 1787737 1148159 614612
9325 614612 753997 1677281 2546944 3045539 3626700 3300314 2497288 1027554 236197 1048549
9315 1048549 1551592 1934269 2432396 2882043 1935757 406027 -1047116 -754593 409387
9306 409387 -516446 -1277899 -576679 -449696 -314226 1033730 1961007 2200651 1457145 1442079
9296 1442079 1681359 2411099 4062735 4770067 3702919 2682822 2593142 2636681 2221903
9287 2221903 1305459 184117 -170720 536270 134308 116620 691586 532244 -368566 -639686
9277 -639686 389894 1384651 917923 237661 222192 -77768 138140 790322 1233409 1755451
9267 1755451 1458049 1380329 1417567 993208 -1112903 -2669789 -2280092 -1171994 -1078540 -1346107
9257 -1346107 -1180231 -533309 328436 409697 1123939 1741598 509808 -1287019 -2513167
9248 -2513167 -3843008 -3782656 -2442783 -953411 1057370 1763883 558546 -276287 -920795
9239 -920795 -1137130 374607 2514793 2534517 656704 -438855 -1024763 -416872 -99133
9230 -99133 -171749 -210355 -997565 144743 1538894 1531834 764170 -806331 -1859028 -2717861
9220 -2717861 -2832885 -1700175 347173 1135927 841174 470340 -227944 -270303 127333
9211 127333 449811 222352 291352 908799 967677 914406 1281520 1686367 340227 -945051
9201 -945051 -847799 -155955 643141 384040 -533124 -735970 -626283 -186214 570621 1682830
9191 1682830 2633807 3184997 2813797 2463242 2887393 3938588 3425099 1754892 1354050
9182 1354050 1216699 486671 -3992 841 761524 1415864 968077 823323 1718392 2040166
9172 2040166 1027742 771146 953728 1593179 1406807 -835874 -1623421 -1592858 -1581282 -1726025
9162 -1726025 -2583380 -2127522 -951129 354138 1211851 814913 208849 163821 862132
9153 862132 441500 158550 325784 335163 482477 715640 796910 836807 -30703 -721133
9143 -721133 -423518 -33959 114376 945241 1811954 2202922 1816713 2056282 1749197 669088
9133 669088 -272650 -378030 662948 1227773 1636335 1010705 -292868 -1594680 -2410730
9124 -2410730 -3166934 -2449451 -1131680 -801025 -423169 495137 867586 667955 473644
9115 473644 440907 -155449 -1520375 -1517535 -1366764 -1515724 -2272577 -3406845 -2035319 -287719
9105 -287719 1075846 1493205 743112 1026349 2028371 2372736 1369872 130395 -752711
9096 -752711 -709201 -437519 -549440 -1490908 -2268006 -3397858 -4395167 -3801703 -2194680 -2037131
9086 -2037131 -2584008 -2150772 -811112 179039 -401309 -1985884 -3018569 -3036405 -2488181
9077 -2488181 -1225872 -556028 -111783 265461 856210 209194 -839323 -1571103 -2163540
9068 -2163540 -2696937 -2792293 -2703521 -2835064 -2562980 -2137197 -1122515 195753 -246023 -732652
9058 -732652 -431124 -1396778 -3203792 -4084867 -3912655 -3060556 -2653053 -2120441 -1748601 -2322522
9048 -2322522 -2835297 -2507883 -2617020 -2984407 -2118604 -531777 -538792 -1058736 -957470 -1177494
9038 -1177494 -888045 -196541 589442 807482 1000492 1725544 2158265 1704596 683822
9029 683822 -433661 -112229 27111 -1188576 -2324291 -2038527 -716082 -1376340 -1950914
9020 -1950914 -1328432 -1496511 -1816524 -684886 416951 911887 385991 -883225 -1268402
9011 -1268402 -977058 -1110371 -1044166 -718770 -13232 697511 62210 -125187 783116 1422717
9001 1422717 2528226 2513878 2095821 1908741 1640983 671883 -794821 -1493625 -1446198 -148745
8991 -148745 -133669 55043 323795 67304 658971 1042597 596868 135796 884305 997381
8981 997381 1403175 2279377 1729302 337424 -87038 -618639 -1424746 -1853248 -2995091
8972 -2995091 -4443217 -4483638 -4079222 -3519477 -2926693 -1753975 -1094748 -395670 543779
8963 543779 2210119 3757066 4189983 3499713 1471957 330934 1103628 2713001 2940923
8954 2940923 3233466 3084713 2026916 658917 -831077 -2503466 -3340263 -2868097 -2505849
8945 -2505849 -2078631 -1439191 -308860 372559 -766302 -1958565 -1448839 -995912 -470888
8936 -470888 -316892 -890242 -1143156 -1184607 -222766 -360903 -1991360 -2532469 -2415386 -2774649
8926 -2774649 -2611802 -1207163 812424 2293570 2259900 2092569 1351351 1268428 2425257
8917 2425257 3257055 3200784 1719829 -321005 -218415 895221 -44552 -885987 -306907
8908 -306907 364822 -488796 -806023 510155 1216891 605027 -401108 -433747 -538121 -1235114
8898 -1235114 -1308817 -479278 1239137 1879295 780328 23500 1137645 1530466 906135
8889 906135 1098256 730722 139729 -512489 -1912791 -2684178 -2393827 -648374 1007685
8880 1007685 1500161 1250149 959203 -136530 -854048 25481 744503 -371846 -585059
8871 -585059 -35165 -109218 -163155 -1165796 -2010877 -2214115 -2359396 -2947915 -3412979 -4150357
8861 -4150357 -4826953 -4276388 -2438646 -1348011 -1510743 -1647541 -1295173 -546959 -818481
8852 -818481 -1535544 -808729 -97126 -345432 -1123284 -1131222 -309918 -350030 -1338520 -1994467
8842 -1994467 -1532074 -2121564 -3781112 -3761489 -3478245 -3349295 -1630396 -415294 -585650
8833 -585650 -1242259 -458281 650544 929364 482850 -292830 -239356 1197006 2490741
8824 2490741 2969936 2434390 1781261 1479865 1442746 1584299 1737568 1557450 698253 -504450
8814 -504450 -1052496 -1273924 -1060384 502148 1095472 553888 -557727 -627342 -835569 -1960393
8804 -1960393 -1253034 -308432 1079997 2598891 3325187 2593822 1637218 1078503 308910
8795 308910 -61511 511337 996406 1557351 1211056 88805 -1032862 -1560065 -2024069
8786 -2024069 -2114850 -616252 392670 309972 4570 -299345 -626968 -648927 -198246 447207
8776 447207 1811737 2206095 657487 -773059 -2128028 -1679543 -329121 -65868 43644
8767 43644 174709 550720 1422394 1921867 2668239 2247675 869618 -1304183 -2903280
8758 -2903280 -2601139 -1392616 -536590 -212959 833219 1156253 668318 549645 -437381
8749 -437381 -1183385 -2334599 -2657272 -2562047 -2142043 -1294914 -1351435 -1798003 -1379627 -1492409
8739 -1492409 -1434250 375667 1682594 1668368 1364394 1464650 2223493 1459875 625662 182871
8729 182871 389421 1313337 1085956 540320 698553 -335087 -573518 5931 -110274 483752
8719 483752 876479 1262411 1490300 1206008 1353626 1758657 1853089 1521974 126804 -551495
8709 -551495 14360 124055 288370 735793 21942 -1536358 -1791804 -996761 -1221705 -2015460
8699 -2015460 -2105295 -1491179 -794375 -469728 225544 505033 -11959 858973 1903517 1557201
8689 1557201 1095718 1498641 2125329 2212570 1396481 636902 1078728 1147659 710463 170363
8679 170363 -499189 -1152616 -1132291 -554573 -619479 -824852 -986795 -340370 113307 -479653
8669 -479653 -783144 264415 437850 -630077 -1353613 -1439421 -1979973 -1552822 -110311
8660 -110311 1524968 2366457 1846623 1420615 98700 -1736261 -2300551 -2621843 -1665224
8651 -1665224 -689880 -237092 966325 1744367 667175 -641817 4881 1584584 1926853
8642 1926853 1405860 487162 -230631 -474765 -434645 -166424 -116255 -467081 -756446 -630983
8632 -630983 -655066 29647 1011517 1842264 1748772 514282 379196 1382922 2370919 2707146
8622 2707146 2282799 1602211 1049427 398076 282954 739341 1239240 1935768 2012728 1650816
8612 1650816 2621557 3434565 3535506 3349778 2903436 2670383 1701277 -8750 -476150
8603 -476150 -489306 -735556 -349414 580879 671426 582650 -133997 -820782 -477850 -175509
8593 -175509 734817 1917957 2044908 1679718 879113 412719 252629 -333253 -877813 -1612768
8583 -1612768 -1798716 -1143105 -88937 1137424 1323871 211979 -312955 -164908 -234427
8574 -234427 -597552 -358070 55868 -39538 -552076 -6314 707366 -10324 -823748 -1045136
8564 -1045136 184519 689043 600036 535000 134119 340975 286875 -250417 484259 936515
8554 936515 465627 289629 -83499 -155295 -157751 -86919 -317260 -460718 251859 1623542
8544 1623542 2614554 3129146 2595563 744105 -400132 -1243269 -1819617 -2374850 -2275412
8535 -2275412 -2185133 -1790995 -435409 283341 1068286 1584717 1523054 2038534 1520525 350470
8525 350470 140896 687033 1201819 1434618 1171942 1131671 1399591 2698453 3790264 2904235
8515 2904235 1413070 623287 1454529 2424414 2094337 793711 906121 1612929 2292927
8506 2292927 2663321 2513927 965321 -588873 -827676 87927 894907 1304812 1034911
8497 1034911 666565 509746 727810 1759925 1796041 1319463 1849206 2081000 1670878 890843
8487 890843 -680742 -1601180 -2344927 -2769864 -2035658 -965224 128509 947711 677998
8478 677998 112754 -1199124 -2242174 -1649511 241381 2699416 4172709 3915548 3201863
8469 3201863 1799791 -339923 -1028405 -1285661 -1245252 -178491 610633 153773 -366868
8460 -366868 -907881 -1419908 -2113147 -1295821 -951750 -1930596 -2946679 -3327138 -2536105 -114569
8450 -114569 720927 101644 454368 1106191 914122 408992 26184 514694 1560300 1897125
8440 1897125 2529120 2683728 2419634 2378809 1769731 819309 -433542 -1246074 -25349
8431 -25349 1401315 2057463 2442694 2230750 1663863 1875966 2917557 3440879 2894051 1212452
8421 1212452 -685318 -462181 1569005 2333216 1105113 -992053 -2994470 -4249850 -3710451
8412 -3710451 -2337370 -949219 -499522 -464758 495308 951725 727642 921760 633826
8403 633826 750475 855713 614482 329341 -211452 -1196175 -2083600 -2671066 -2235612 -843202
8393 -843202 145150 553165 201851 690891 704392 268000 454215 348930 -239863 -1706383
8383 -1706383 -3058528 -3668757 -2765035 -1075711 612686 2473392 3283514 3472233 2786428
8374 2786428 1930416 1230626 1565399 1542240 674740 -299643 -746232 454404 2724104
8365 2724104 3353374 2696967 2856116 2383427 876809 699093 1508539 1524409 763761 540531
8355 540531 891783 908702 418566 -870325 -1917371 -1965700 -1446636 -796177 476115 1377687
8345 1377687 1112902 -545191 -1427414 -339713 945188 573118 617403 770957 992397
8336 992397 555814 404626 832377 1572922 1763645 1517719 1719161 1975223 1980313 1673411
8326 1673411 2691641 2618833 1980829 1233784 167020 -1527745 -2052742 -1155153 -1109074
8317 -1109074 -869363 1085311 2379578 1392462 -69686 -874478 -1162277 -74419 449522
8308 449522 455237 829419 -221075 -2161095 -2559514 -1023373 298643 1243934 1203343 774602
8298 774602 1085868 1008802 1575925 1616087 412316 -958139 -2476163 -2891825 -1776793
8289 -1776793 -1343519 -2007469 -2852510 -3675002 -4049824 -4467332 -4627881 -2371567 -313137
8280 -313137 -543519 -1782379 -2008611 -2228595 -2015797 -1320026 -2018628 -2369274 -1384236 -353698
8270 -353698 -196082 675664 1442926 517006 -1032196 -1430882 -1565255 -1241911 160891
8261 160891 2030977 3020553 3537161 2325183 632128 -173747 -262556 -394331 -839188
8252 -839188 -194118 150832 337567 306824 -1063297 -1901004 -2376858 -3142120 -2267985 -948457
8242 -948457 385321 964311 1161460 1101437 -233840 -1744019 -1869195 -1049895 -772226
8233 -772226 -523674 -467365 -480005 869173 2176557 1532761 400952 -466836 -414935 -428702
8223 -428702 -1037468 -653890 477652 1613698 1601390 1472340 1033457 445502 -736787
8214 -736787 -2286402 -2318426 -714181 636442 1632888 2527833 2175399 1952554 2375539
8205 2375539 1725206 -521441 -1159550 -855753 -847733 -275668 141814 269534 -12393 -490837
8195 -490837 82419 -382594 259798 1399949 330331 712322 1232999 1217505 659541 -103234
8185 -103234 14061 627139 568554 75297 -778093 -2772354 -4247999 -3310446 -2044002
8176 -2044002 -2528376 -3147735 -1741838 -1073398 -1445597 -1324945 -1124164 -873680 -642050
8167 -642050 -1043127 -2292647 -3055887 -2046031 -1655134 -1129845 807236 1890671 685223
8158 685223 -388187 -327468 882826 1188910 680835 825668 589536 31379 -105349 404496
8148 404496 467078 -628057 -747883 385480 1485575 2139017 1474619 65962 139911
8139 139911 1233791 1038157 776682 473883 1201304 2009784 1781832 2002627 2318302 2468379
8129 2468379 1750852 1000474 727538 900296 979036 828992 880523 111648 1159421 2789407
8119 2789407 2761665 2088373 1508173 646037 -855851 -2717352 -3293357 -2893492 -2966530 -3013702
8109 -3013702 -2803728 -1949199 -163152 806756 1825740 3324223 3897805 3147665 2081176
8100 2081176 970490 237262 1027005 1433028 1684154 2376413 2699731 1760686 688246
8091 688246 610219 824838 1523633 2274249 1891220 653316 594651 1666587 2292361 2170739
8081 2170739 189769 -1950984 -2232377 -2121750 -1911546 -1791569 -2031059 -1615236 -1680632
8072 -1680632 -1468697 -76579 585778 434364 606051 1149477 660035 511184 1361141
8063 1361141 2968570 3511854 1616110 100204 -550602 -1136322 -1428106 -2072382 -1731939
8054 -1731939 -1658260 -678648 -453694 -1168010 -1415108 -1238175 -785996 -558127 16846 267024
8044 267024 -10499 -633732 -1416949 -1855700 -2162532 -2712303 -2510390 -2450057 -3428925 -3767671
$$ [...]
##END NTUPLES=NMR SPECTRUM
##END=
