##TITLE=C13_53-2021
 DMSO-d6,  19600 sc

 7.7.2021
##JCAMPDX= 6.0         $$ Bruker NMR JCAMP-DX V2.0
##DATA TYPE= NMR SPECTRUM
##DATA CLASS= NTUPLES
##ORIGIN= UXNMR, Bruker Analytische Messtechnik GmbH
##OWNER= root
$$ XWIN-NMR		Version 3.5
$$ Thu Jul  8 08:28:45 2021 Russian Standard Time (UT+4h)  she@DPX200
##.OBSERVE FREQUENCY= 50.327896
##.OBSERVE NUCLEUS= ^13C
##.ACQUISITION MODE= SIMULTANEOUS
##.ACQUISITION SCHEME= undefined
##.AVERAGES= 19600
##.DIGITISER RES= 17
##SPECTROMETER/DATA SYSTEM= spect
##.PULSE SEQUENCE= zgpg30
##.SOLVENT NAME= D2O
##.SHIFT REFERENCE= (INTERNAL, D2O, 0, 222.082)
##AUDIT TRAIL= $$ (NUMBER, WHEN, WHO, WHERE, WHAT)
$$ ##TITLE= Audit trail, XWIN-NMR		Version 3.5
$$ ##JCAMPDX= 5.01
$$ ##ORIGIN= Bruker BioSpin GmbH
$$ ##OWNER= she
$$ F:/spectra/data/she/nmr/c13/1/pdata/1/auditp.txt
$$ ##AUDIT TRAIL=  $$ (NUMBER, WHEN, WHO, WHERE, WHAT)
(   1,<2021-07-08 08:26:03.57 +0400>,<she>,<DPX200>,
      <created by zg, POWCHK disabled, PULCHK disabled
       terminated by command 'halt'
       configuration hash MD5:
       00 E9 B6 7A A2 85 ED C7 34 08 36 98 17 FE 4E 26
       data hash MD5: 32K
       7C 15 59 32 88 11 00 74 6F E7 3C 2B 45 15 88 F7>)
(   2,<2021-07-08 08:26:08.23 +0400>,<she>,<DPX200>,
      <Start of raw data processing
       efp BC_mod = 2 LB = 1 FT_mod = 6 PKNL = 1 PHC0 = -336.2185 PHC1 = 30.36237 SI = 32K 
       data hash MD5: 32K
       82 46 FB 3E 2E 7F 04 89 F0 31 B9 DB 34 43 6E F0>)
(   3,<2021-07-08 08:26:32.37 +0400>,<she>,<DPX200>,
      <pk PHC0 = 4.596879 PHC1 = -16.99999 
       data hash MD5: 32K
       DB 78 9B 52 6E 0E 8A 14 E6 5F C4 CB D4 96 94 97>)
(   4,<2021-07-08 08:26:35.65 +0400>,<she>,<DPX200>,
      <abs ABSG = 5 
       data hash MD5: 32K
       E5 7F B3 C0 D9 57 DF 67 7D 41 66 E8 29 58 81 70>)
(   5,<2021-07-08 08:27:32.50 +0400>,<she>,<DPX200>,
      <pk PHC0 = -10.23997 PHC1 = 13.8 
       data hash MD5: 32K
       85 DC A8 4B 01 94 21 1C 56 61 85 2C FF C0 1C 9E>)
(   6,<2021-07-08 08:27:35.21 +0400>,<she>,<DPX200>,
      <abs ABSG = 5 
       data hash MD5: 32K
       C9 81 FF 26 E1 52 7C 8E 50 C6 3A 98 9B 54 E4 D9>)
$$ ##END=
$$ 
$$ hash MD5
$$ C1 71 94 D3 E9 83 3B AB 3F 9B D0 2C 8E 1C 58 DA
##$RELAX= 
##$RELAX= 
##$RELAX= 
##$RELAX= 
##$RELAX= 
##$RELAX= 
##$RELAX= 
##$RELAX= 
$$ Bruker specific parameters
$$ --------------------------
##$DU= <F:/spectra>
##$EXPNO= 1
##$NAME= <c13>
##$PROCNO= 1
##$TYPE= <nmr>
##$USER= <she>
##$AMP= (0..31)
100 100 100 100 100 100 100 100 100 100 100 100 100 100 100 100 100 100 
100 100 100 100 100 100 100 100 100 100 100 100 100 100 
##$AQSEQ= 0
##$AQ_mod= 1
##$AUNM= <au_zg>
##$AUTOPOS= <>
##$BF1= 50.322709
##$BF2= 200.13
##$BF3= 50.322709
##$BF4= 500.13
##$BF5= 500.13
##$BF6= 500.13
##$BF7= 500.13
##$BF8= 500.13
##$BYTORDA= 1
##$CFDGTYP= 0
##$CFRGTYP= 5
##$CHEMSTR= <none>
##$CNST= (0..31)
1 1 145 1 1 1 1 1 1 1 1 1 1 1 1 1 1 1 1 1 1 1 1 1 1 1 1 1 1 1 1 1 
##$CPDPRG= <waltz16>
##$CPDPRG1= <>
##$CPDPRG2= <waltz16>
##$CPDPRG3= <>
$$ [...]
##$SUBNAM4= <"">
##$SUBNAM5= <"">
##$SUBNAM6= <"">
##$SUBNAM7= <"">
##$SUBNAM8= <"">
##$SUBNAM9= <"">
##$SW= 239.972175391363
##$SWIBOX= (0..15)
0 1 3 0 0 0 0 0 0 0 0 0 0 0 0 0 
##$SW_h= 12077.2946859903
##$TD= 32768
##$TD0= 1
##$TE= 0
##$TE2= 300
##$TE3= 300
##$TEG= 300
##$TL= (0..7)
120 120 120 120 120 120 120 120 
##$TP= (0..7)
150 150 150 150 150 150 150 150 
##$TP07= 0
##$TPNAME0= <>
##$TPNAME1= <>
##$TPNAME2= <>
##$TPNAME3= <>
##$TPNAME4= <>
##$TPNAME5= <>
##$TPNAME6= <>
##$TPNAME7= <>
##$TPOAL= (0..7)
0.5 0.5 0.5 0.5 0.5 0.5 0.5 0.5 
##$TPOFFS= (0..7)
0 0 0 0 0 0 0 0 
##$TUNHIN= 0
##$TUNHOUT= 0
##$TUNXOUT= 0
##$USERA1= <user>
##$USERA2= <user>
##$USERA3= <user>
##$USERA4= <user>
##$USERA5= <user>
##$V9= 5
##$VALIST= <valist>
##$VCLIST= <CCCCCCCCCCCCCCC>
##$VD= 0
##$VDLIST= <DDDDDDDDDDDDDDD>
##$VPLIST= <PPPPPPPPPPPPPPP>
##$VTLIST= <TTTTTTTTTTTTTTT>
##$WBST= 1024
##$WBSW= 4
##$XGAIN= (0..3)
0 0 0 0 
##$XL= 0
##$YL= 0
##$YMAX_a= 139160937
##$YMIN_a= -74556096
##$ZGOPTNS= <>
##$ZL1= 120
##$ZL2= 120
##$ZL3= 120
##$ZL4= 120
##$ABSF1= 222.6533
##$ABSF2= -17.34351
##$ABSG= 5
##$ABSL= 3
##$ALPHA= 0
##$AQORDER= 0
##$ASSFAC= 0
##$ASSFACI= 0
##$ASSFACX= 0
##$ASSWID= 0
##$AUNMP= <proc_1d>
##$AZFE= 0.1
##$AZFW= 0.5
##$BCFW= 0
##$BC_mod= 2
##$BYTORDP= 0
##$COROFFS= 0
##$CY= -3
##$DATMOD= 1
##$DC= 0
##$DFILT= <>
##$DTYPP= 0
##$F1P= 0
##$F2P= 0
##$FCOR= 0.5
##$FTSIZE= 32768
##$FT_mod= 6
##$GAMMA= 0
##$GB= 0
##$INTBC= 1
##$INTSCL= 4.134877e-10
##$ISEN= 128
##$LB= 1
##$LEV0= 0
##$LPBIN= 0
##$MAXI= 10000
##$MC2= 0
##$MEAN= 0
##$ME_mod= 0
##$MI= 0.1934396
##$NCOEF= 0
##$NC_proc= 3
##$NLEV= 6
##$NOISF1= 120.0001
##$NOISF2= 80.00006
##$NSP= 0
##$NTH_PI= 0
##$NZP= 0
##$OFFSET= 222.0819
##$PC= 1.4
##$PHC0= -341.8616
##$PHC1= 27.16238
##$PH_mod= 1
##$PKNL= yes
##$PPARMOD= 0
##$PSCAL= 0
##$PSIGN= 0
##$REVERSE= no
##$SF= 50.3227588769931
##$SI= 32768
##$SIGF1= 140
##$SIGF2= 120
##$SINO= 11.81781
##$SIOLD= 32768
##$SREGLST= <13C.CDCl3>
##$SSB= 0
##$STSI= 32768
##$STSR= 0
##$SW_p= 12077.2946859903
##$SYMM= 0
##$S_DEV= 0
##$TDeff= 32768
##$TDoff= 0
##$TI= <>
##$TILT= no
##$TM1= 0
##$TM2= 0
##$TOPLEV= 0
##$USERP1= <user>
##$USERP2= <user>
##$USERP3= <user>
##$USERP4= <user>
##$USERP5= <user>
##$WDW= 1
##$XDIM= 32768
##$YMAX_p= 418227303
##$YMIN_p= -1211109
$$ End of Bruker specific parameters
$$ ---------------------------------
##NTUPLES= NMR SPECTRUM
##VAR_NAME=  FREQUENCY,     SPECTRUM/REAL,   SPECTRUM/IMAG
##SYMBOL=    X,             R,               I
##VAR_TYPE=  INDEPENDENT,   DEPENDENT,       DEPENDENT
##VAR_FORM=  AFFN,          ASDF,            ASDF
##VAR_DIM=   32768,         32768,           32768
##UNITS=     HZ,            ARBITRARY UNITS, ARBITRARY UNITS
##FACTOR=    0.368581032318806, 1,           1
##FIRST=     11175.7735987273, 0,            0
##LAST=      -901.521087262969, 0,           0
##MIN=       -901.521087262969, -1211109,    0
##MAX=       11175.7735987273, 418227303,    0
$$ Real data points
##PAGE= N=1
##DATA TABLE= (X++(R..R)), XYDATA
$$ [...]
10895a57861R3388n1140j57545l5918J26127J75340N8474R7089O3235k36810j66220
10884a91841q176j27122p8799o029l5330n4909N0837O1327J82398K63968K22824
10873B79148r8924k77182k65029P1902R7936L743J52036K5286L3086K03682K72498
10862D98182P5041r9709k14624j65456j10808k79697m57708j48850R6088J33652
10852f73889J48015J66857R4082Q1973J42719K26719J08753j45873l51466m7997
10842b50107K7979j29822j27855R9512L31358J89346Q5573L4574j74885k60690
10832a75017j27984Q514J89586L41557J22592m8221j0557p4759L1713n705p2205
10821A79514J08444j04955k42624M0513Q9146K9790R0448R0345p8180j31368J03496
$$ y = [-157861, -64473, -115613, -273158, -309076, -182949, -7609, 50865, 147954, 211189, -25621, -191841, -200017, -327139, -405938, -411967, -447297, -502206, -451369, -390042, -207644, 56324, 279148, 180224, -96958, -361987, -290085, -192149, -188406, -36370, -11084, 22002, 225684, 498182, 573223, 473514, 258890, 93434, -17374, -297071, -754779, -903629, -807541, -673889, -525874, -359017, -264935, -182962, -40243, 186476, 295229, 149356, -202110, -250107, -222128, -351950, -479805, -380293, -48935, 140411, 225984, 260558, 85673, -175017, -303001, -294487, -104901, 236656, 359248, 311027, 300470, 225711, 257424, 251719, 179514, 287958, 183003, -59621, -19108, 70038, 99828, 190276, 280621, 202441, 71073, 174569]
10810A74569K05258J21533L3286J18053J99330o3272j20793M247j97838l09594
10800A64779k16334o0787J96280J89825M676J08634p0305j41585N2984J9703j41950
10789A05920N6920p7823q0070j4781j14500j8194J33710Q4134J83077J96210j00505
10778C54098k07204l3126J26266M2286j12483m2521m661k15676j44080M0997m652
10767b00756J25479J50260R3705L907k75792j59588J1111J0827p8987K8326J49560
10756a41948J85215J88897P4869k46217j43380J4463J35742o9331l88305j07609
10746d97604K57880L51501J13561j06512J15240O7398j18032K3181J2358j46469
10736G2502l0600Q6130n1278J42523J85487K1156M6101m2670k01167n3248j08156
$$ y = [174569, 379827, 501360, 534646, 652699, 852029, 788757, 667964, 672211, 474373, 164779, -51555, -112342, 83938, 273763, 278439, 387073, 316768, 175183, 228167, 247870, 105920, 162840, 85017, 4947, -9834, -124334, -142528, -8818, 75316, 258393, 454603, 354098, 146894, 113768, 240034, 282320, 169837, 127316, 122655, -93021, -237101, -196104, -200756, -75277, 74983, 168688, 172595, -103197, -262785, -251674, -240847, -319834, -291508, -141948, 43267, 232164, 307033, 60816, -82564, -68101, 67641, -1690, -389995, -497604, -239724, 111777, 225338, 118826, 234066, 301464, 183432, 206613, 218971, 72502, 41902, 128032, 76754, 219277, 404764, 425920, 472021, 429351, 228184, 174936, 66780]
10725F6780k03130r9873J7107N5329N5147K11557K8305M2325P3400j29373J59909
10714B77483P366j01658J74106L7471n336L5469o3029l7206J27614K68393L54616
10703A075289M26689M6807l00060k95451j10717K02799J19317R694k81201l81000
10693E12166m3431J54772K75697L57995J88706k3321l91316k63344j89685l40749
10683B37490j19176J67394o646q9883p4869n6442M9416J86230J68192r1079k80229
10672I0398j66930J73296Q5868k41171j45824K8893J70345J51499j31782j67575
10662a52983M948M4516j9401k6895j12855J41510K25942O0322N0562j6244r6610
10651A02812k34528m2955J79625J6898o7739n2573k0762n745Q5957J04124J16919
$$ y = [66780, -136350, -236223, -219116, -163787, -108640, 102917, 131222, 173547, 246947, 117574, 277483, 284849, 183191, 357297, 394768, 389432, 424901, 361872, 324666, 452280, 720673, 1075289, 1501978, 1548785, 1248725, 953274, 842557, 1045356, 1164673, 1174367, 893166, 512166, 468735, 623507, 899204, 1257199, 1445905, 1422584, 1031268, 767924, 578239, 237490, 118314, 285708, 279062, 189179, 114310, 57868, 107284, 293514, 461706, 370627, 90398, -76532, 96764, 182632, -58539, -204363, -175470, -5125, 146374, 14592, -152983, -148035, -103519, -122920, -149815, -262670, -121160, 104782, 165104, 215666, 199422, 102812, -131716, -174671, 4954, 21852, -45887, -98460, -119222, -124967, -39010, 65114, 182033]
10640A82033n7083n3004m2112k13774k91307J09214L83931M3936j95038j39341
10630b72545j74256R508L38069L85679K9359j55080j95178k0005J88598J13850
10620B47999p8848j37868J4259J66313J22955O3229p1951j16217j6997P9777R422
10609B82073j78381j47067n174L1483p2751m1628p4976q3840J0035Q1082L4429
10598a64715M1961m4190P8439J67698P3989J18587j10094p9488K8268q9900j92149
10587a71594p3812R6264J04229K63287L27571K439k64690k34244k42283j62237
10577c55070j03480R9427K19196m3231q1290J53455K02693K9605k19535o3460
10567a61690R2704k9752l24888l6833J9997n4684J86552M6662K4628n7313n9854
$$ y = [182033, 124950, 71946, 29834, -183940, -475247, -366033, 17898, 61834, -133204, -272545, -446801, -437293, -99224, 286455, 315814, 160734, -34444, -54449, 134149, 247999, 169151, 31283, 45542, 211855, 334810, 398039, 326088, 209871, 192874, 272651, 282073, 103692, -43375, -48549, -17066, -89817, -131445, -206421, -290261, -280226, -199144, -164715, -122754, -166944, -88505, 79193, 153182, 271769, 161675, 82187, 110455, 20555, -171594, -245406, -149142, -44913, 218374, 545945, 548384, 283694, 49450, -192833, -355070, -458550, -359123, -139927, -183158, -264448, -110993, 91700, 121305, -98230, -161690, -68986, -98738, -423626, -460459, -440462, -495146, -308594, -261932, -237304, -294617, -354471]
10556c54471O8300Q8302L8184M5725p2008J1396R9282L6503j21495j64191q4986
10545d09459K00446L51370J21462k6683j24488j35603j56571k01530j29214K1257
10535d89013N6518R7367K85404K11734l8283q2235O6664k0825l78132m28545j66974
10524h86320j7764Q6266K21333J93145j35511j34449m2888N2157J50967M8897
10514d64167O355j2605N1309J09831J90046P8713m1553j41800j04119n5407K07949
10503a75448R9454P767J9732q1659K0873R1878o9193N5449O0682j24688q3267
10492a78420O0661M3808M4368q8766l2751L3288l7415R8626Q5113K4340j49942
10481i7090k289m2211k40091k081J18349O7025J12433Q9510M4012J4215l43954
$$ y = [-354471, -286171, -197869, -159685, -113960, -185968, -174572, -75290, -38787, -160282, -324473, -409459, -209013, 142357, 263819, 237136, 112648, -22955, -179526, -381056, -510270, -489013, -432495, -335128, -49724, 162010, 123727, 41492, 108156, 87331, -290801, -719346, -886320, -904084, -817818, -596485, -403340, -538851, -673300, -716188, -664031, -513064, -464167, -457812, -470417, -419108, -309277, -119231, -40518, -82071, -223871, -327990, -383397, -175448, -75994, -68227, -48495, -130154, -109281, -17403, -86596, -31147, 29535, -95153, -178420, -117759, -73951, -29583, -118349, -151100, -117812, -155227, -56601, 28512, 52852, -97090, -99379, -141590, -381681, -383762, -265413, -198388, -85955, 3555, 47567, 61782, -282172]
10470b82172k75548O4432Q3516Q4702L45666L45664K7217k32581m00424k20502
10460d60030P7857J33543J26539l0497p5210j29547o3165L0056n7638K9880J54880
10449b63332J30900M3088Q4300M7017R2742j08561k13860j70683R1648K48644
10439a8097J21802p7276j50070K28933L40515q0712k14287l9255j53869j81633
10429b23949j16998J53286K95742N0320k22032k00768j79952l048J09882j01937
10419d39454r4906J6441J74184R8326K854J63674P6482o4273L4279K1602k40792
10408b51583q2677L8134O7426J64334k945j76502j00907J29802K26984K2595j63534
10397a28873j29429l3635J21973R4178J20994N5607M7771K9370j14691l50119
$$ y = [-282172, -557720, -493288, -409772, -325070, 20596, 366260, 393477, 160896, -239528, -460030, -382173, -248630, -122091, -152588, -227798, -357345, -420510, -390454, -448092, -418212, -263332, -132432, -89344, -5044, 41973, 134715, 26154, -187706, -358389, -266741, -18097, 103705, 26429, -123641, 105292, 445807, 365095, 150808, 111553, -42316, -223949, -340947, -187661, 108081, 158401, -63631, -264399, -444351, -447399, -337517, -439454, -534360, -517919, -343735, -245409, -242555, -78881, -2399, -66672, -32393, -10791, -251583, -334260, -296126, -228700, -64366, -67311, -243813, -344720, -214918, 12066, 34661, -128873, -258302, -291937, -169964, -75786, 45208, 100815, 148586, 177956, 63265, -286854]
10387b86854l92497k16098J21279L57886K56413J37253O4411l7722J18773L16043
10377D38887M3624l84975m38467j04081k3443l3282J31558J78950J57869J25114
10367I1754j72104k67594l2903J70066J34188j7355k3278j65326k7593K56379
10357e3766l8293j34655m3912q3548l5027J22250J2088N283o2248k35917j3685
10346e61430K89933K63414J42873R0551l8267j67233j99269o5662Q0231L3503
10336a31356m7655k4747j40161p5917J35709P5920J47784J64447o2253l2969K88346
10325B97148J90666m2040l9018p9571k1049N0370M6173m0409j80851k03137k57404
10314b79122O2507L65655J99295J27661j03772k34534k28438L842o7531j31550
$$ y = [-286854, -679351, -895449, -774170, -416284, -159871, -22618, 41793, 4071, 122844, 438887, 482511, 97536, -340931, -445012, -468455, -501737, -370179, -191229, -33360, 91754, -80350, -347944, -380847, -210781, -76593, -93948, -117226, -282552, -310145, -53766, -92059, -226714, -270626, -354174, -389201, -266951, -254863, -249580, -311828, -547745, -561430, -271497, -8083, 134790, 225341, 187074, 19841, -179428, -245090, -164859, -131356, -179011, -203758, -343919, -419836, -284127, -208207, -60423, 104024, 41771, 8802, 297148, 487814, 445774, 406756, 327185, 306136, 356506, 402679, 362270, 181419, -21718, -279122, -216615, 149040, 348335, 475996, 372224, 137690, -90748, -86906, -154437, -285987]
10304b85987k45695j19799O5540R9560Q7119N3206J07495R2393l1098J12500R1507
10293B6741K6255j41471p8203J15251J41619O6189j44842k80309k1902P1230Q1044
10282a38398J23970p3376j78853M745L5887J56853K33027m1085k9754J2230k7092
10271G8154k4935J3360J58319j48999l42402j33756J91665P9701r1458l1896j40731
10260c92978n4103P6530l6282j02868J2294Q6437J13541q7330k2419J54348K27589
10249b5241J60621J05228J07625n9984j06958o7257r5267k0221j6655o239K2517
10238a831m6033j84845k18109q6592P2215K70555L51051K60887Q8775j18305p6884
10227C10884m649j60962j24642J98932L15139J79616j13797m90331l40914j47315
$$ y = [-285987, -531682, -651481, -585941, -486381, -399262, -346056, -238561, -146168, -177266, -64766, 26741, 52996, -88475, -166678, -51427, 90192, 156381, 11539, -268770, -290672, -219442, -138398, -14428, -87804, -266657, -261912, -226025, -69172, 163855, 122770, 93016, 105246, 78154, 53219, 66579, 224898, 75899, -266503, -400259, -208594, -128893, -220351, -252247, -392978, -447081, -370551, -406833, -509701, -497407, -410970, -297429, -384759, -407178, -252830, -25241, 135380, 240608, 348233, 288249, 181291, 114034, 18767, -1454, -18109, -24348, -1831, -47864, -232709, -450818, -537410, -465195, -194640, 156411, 417298, 506073, 387768, 310884, 306235, 145273, 20631, 219563, 534702, 714318, 600521, 110190, -230724, -378039]
10217c78039J4723J24630j8699K6437M046k6107j06602J05635N0702k53426K28
10206d56472M5145J4106k5322J39351J61529K03502K51928p5162p9690R4464j40086
10195A33293l25274j19735n2003J91853K88479K2025j05535j8105m4824j9598
10185d9424P9150P2689j06714m4625J9411J12459P5823k93914k29934K49985N2695
10174f2399n1523j07841P0178K35471Q2360r4242r3139J64116M544j41502P6346
10163H2369J6235j75039k14319J2498K7496m8999J38041k9352j24243k1922r3058
10152d30293p530K12195P5293p9678J64567K40319p0555q1157N6874J66830J56730
10141D03595R9845R2326M2554j1812q3650k57576j93135N9366J76570m4673j54200
$$ y = [-378039, -363316, -238686, -257385, -230948, -226902, -253009, -359611, -253976, -203274, -456700, -456472, -411327, -397221, -422543, -283192, -121663, 81839, 333767, 258605, 178915, 273379, 133293, -191981, -311716, -363719, -171866, 116613, 138638, 33103, 14998, -29826, -49424, 29726, 102415, -4299, -48924, -29513, 82946, 158769, -135145, -365079, -115094, -62399, -113922, -221763, -151585, 83886, 166246, 72004, -21135, 142981, 147525, 6023, 82369, 98604, -76435, -290754, -278256, -250760, -299759, -161718, -191070, -315313, -337235, -430293, -437823, -225628, -150335, -230013, -65446, 174873, 104318, 23161, 80035, 246865, 403595, 503440, 595766, 638320, 626508, 542858, 285282, 92147, 151513, 328083, 283410, 129210]
10130A29210P8599k4683q8758O8089j00306n1971J92539K37026P8157N6297l5392
10119E38807k35772k55073k30961q6088J49493J85088O8097j0509O4758J55717
10109C43557o9587Q7116l44k33711j5964l1585j01818k33640l35577k05560J9716
10098g77397K07433L34270K48894K36194J56762j42326M6376K8871j19542j21016
10088I8519j56010k4414L4269L166k4004R0949J80515n5807j60853j39355L4074
10077a18951L32595J90925n4278n0491m4435K8079J2133J13933J36422p8185k38593
10066B29154k24268j35212n0181l8907J63487J89337J41704K65293Q0871j51267
10056D70011j9341j49820k93726p4928K1833M0147o0600l4666K48210K78170l2487
$$ y = [129210, 207809, 183126, 94368, 162457, 62151, 10180, 202719, 439745, 517902, 574199, 538807, 303035, 47962, -182999, -269087, -119594, 65494, 133591, 123082, 187840, 343557, 273970, 361086, 360742, 127031, 111067, 79482, -22336, -255976, -591553, -797113, -777397, -569964, -235694, 13200, 249394, 406156, 263830, 310206, 339077, 219535, 98519, -57491, -81905, -47636, -44470, -68474, 22475, 202990, 147183, -13670, -153025, -118951, 213644, 404569, 350291, 299800, 255365, 283444, 295577, 409510, 545932, 467747, 229154, 4886, -130326, -180507, -219414, -55927, 133410, 275114, 540407, 621278, 470011, 450670, 300850, 7124, -67804, -45971, -5824, -66424, -101090, 147120, 425290, 392803]
10045C92803r0910n2198k05346j36821K14260K82917L24368K43771J17025k3333
10035A066536r0541j59926j30537J02735Q2426q5031l6003L3771r509R3535K46341
10024A113797L11540K71900K58928J68162j2505J79319M63611O28032Q35876J020542
10014E239202J167546J638085K053663K533197L247329M776917P155360J0466304
10006C8277603J4033161J2280763n51839j2246524j2633626r017184o285867m863751
9998A8992736l633378k946260k321573j479773j185762j027730p75946n22251
9990E100063j80635l20368n94676m96876m17898l22190k37522l64593m61996k21547
9980A481762L9918j05926j22071j74913k91516j24924n1951m240P3915q9014j23753
$$ y = [392803, 301893, 249695, 44349, -92472, 121788, 404705, 729073, 972844, 1089869, 1066536, 975995, 816069, 685532, 788267, 870693, 785662, 749659, 783430, 773921, 867456, 1113797, 1425337, 1697237, 1956165, 2124327, 2111822, 2291141, 2754752, 3382784, 4218660, 5239202, 6406748, 8044833, 10098496, 12631693, 15879022, 20655939, 27811299, 38277603, 52310764, 64591527, 64039688, 51793164, 39159538, 30142354, 23856487, 18992736, 15359358, 12413098, 10091525, 8611752, 7425990, 6398260, 5622314, 5100063, 4919428, 4599060, 4004384, 3507508, 3089610, 2767420, 2529898, 2165305, 1703309, 1481762, 1521680, 1415754, 1293683, 1118770, 827254, 702330, 650379, 646139, 720054, 631040, 507287]
9969E07287Q4469J89652J78976K6920j56021l14321o2994P2770O1610J3541l5942
9958E65947M3635r9581k2502P414r7078p015j07940l60640k90808L5292R2392
9947b40884Q9502L09715J67759j89723l05953k3011n37P939K06454J83500k5678
9936A79083K9688n1489K7717J15025o2796j66540j54493Q2414L27905K33188n0176
9925E09526j40339j58329l9524r0044j074N3094j32728q9884J75091J34793m2044
9914A78538k60400j96799L7957q9504N3527J81441J03032j39019o4155K3379M510
9903a67493J25958K10565j79800k72946N1976N6465P900J41617J66385o0308k01304
9892a20985j59247l010J42019J16295p8381q906l5412j35314J59321L01550j10638
$$ y = [507287, 591756, 781408, 960384, 987304, 831283, 516962, 453968, 526738, 588348, 601889, 565947, 609582, 510001, 487499, 494913, 397835, 390820, 282880, -77760, -368568, -333276, -240884, -151382, 158333, 326092, 136369, -169584, -192595, -193132, -185193, 21261, 204761, 179083, 208771, 157282, 184999, 300024, 237228, 70688, -83805, -1391, 326514, 559702, 509526, 369187, 210858, 171334, 81290, 80216, 133310, 582, -89302, 85789, 220582, 178538, -81862, -278661, -240704, -330208, -276681, -95240, 7792, -131227, -195382, -172003, -167493, -41535, 169030, -10770, -283716, -231740, -175275, -167375, -25758, 140627, 80319, -120985, -280232, -283242, -141223, -24928, -103309, -112215, -147627, -282941, -123620, 177930, 67292]
9881F7292k18310j14160J48295K70545J8855j19792m5273J39484K62422P8249
9871D87607k49726l46141j29965K49292K09910m6569r4675j35608j77321j64725
9861c97921j37814j23491k5996K8226J11829L23482J60085j602j93970k54900
9851e12072r0365J04981J19472J54366J07376P7102J00156p2948o5497R497n9688
9840a27620J29484J32569j15248m8989l8759R8863K22739R933j27864m2460l0784
9829F1864r6544k09000p1268O927R3158K23335J57656j68670j87012Q1735J75165
9818F7346J04556q2141m7138L1413q9733k18671j41803j14147j87437L6605K66440
9807c74710L85504N6553j44129j49446J6497j40811j7774K48440K04532J4372
$$ y = [67292, -151018, -265178, -116883, 153662, 172517, 52725, 7452, 146936, 409358, 487607, 237881, -108260, -238225, 11067, 220977, 174408, 79733, -55875, -233196, -397921, -535735, -659226, -685222, -656996, -545167, -221685, -61600, -63202, -257172, -512072, -602437, -497456, -377984, -223618, -116242, -39140, 61016, -11932, -77429, -67932, -127620, 1864, 134433, 19185, -29804, -68563, 30300, 253039, 262972, 135108, 92648, 61864, -34680, -243680, -314948, -308021, -214863, 8472, 166128, -2542, -189554, -107819, 67346, 171902, 89761, 42623, 74036, -15697, -234368, -376171, -490318, -677755, -641150, -374710, 10794, 67347, -76782, -226228, -209731, -350542, -368316, -119876, 84656, 99028]
9797I9028j08797k86687j74089J43596K57137L29377J55088r9627k53457k76211
9787b14642r7224J42838K61218P1385j816k5761k71369j61020K41475J93601k9275
9776A09410k40330j63834N1286j12260k06955p6899P2374L22326K11813j30374
9766a63443k8046K54388J23065o9033J8327N234l8319J6641J16970J50561J21111
9755E07456o2708n4548j00024j30631o7036Q5000j0316k11350R2365J13150o8252
9744I3106j93886j98917N798J22062M03093L27102M4043j60377k95764m15444
9734b69184j78928j09006j3846M1384J73507J40232r463j18272k04685j47219
9724f95480J25238J80404J23471L01770O5588j12095j8872j6007m3039q2802n303
$$ y = [99028, -9769, -296456, -470545, -326949, -69812, 259565, 414653, 315026, 61569, -214642, -311866, -169028, 92190, 163575, 161759, 135998, -135371, -296391, -54916, 138685, 109410, -130920, -294754, -243468, -355728, -562683, -639582, -567208, -244882, -33069, -163443, -191489, 62899, 185964, 116931, 135258, 140492, 102173, 118814, 235784, 386345, 507456, 444748, 390200, 290176, 159545, 92509, 177509, 167193, -44157, 48208, 161358, 93106, -100780, -299697, -293899, -171837, 231256, 558358, 602401, 442024, 146260, -269184, -448112, -557118, -570964, -529580, -356073, -215841, -225304, -343576, -548261, -695480, -570242, -389838, -266367, 35403, 100991, -11104, -29976, -45983, -89022, -171824, -177127]
9713a77127j14902l8794J17037J6162O082j11407k56627j3116K31511J34843q1016
9702b87354j05645j50259r8611O654J61317L60397R2262k1483j21695j01956J07042
9691a59331N2676J33935K56054J96635K9387J5695N5008k5392k16078k66410j0252
9680F1927O4195R1237L0754J04242J45942j03304k21696j30017O4996K44055J48452
9669E00783j02307j34885j31920q0051j40715j09595O0122J97457K16884r0446
9659A85327j79948r1217l6734L2050k6058j83075j4916J42020J47988J07475p9009
9648C903k2672L9319n4889k4819o5419j6242J50719J30484K47305J61956j77899
9637C71746k65682q9082j05191l4680O6636q1077k12497j03224R3533J08700J18410
$$ y = [-177127, -292029, -330823, -213786, -197624, -191542, -302949, -559576, -572692, -341181, -206338, -287354, -392999, -543258, -641869, -635215, -473898, -113501, -21239, -42722, -164417, -266373, -159331, -106655, 27280, 283334, 479969, 509356, 525051, 580059, 554667, 338589, 72179, 61927, 126122, 217359, 248113, 352355, 498297, 394993, 173297, 43280, 108276, 352331, 500783, 398476, 263591, 131671, 51620, -89095, -198690, -138568, 58889, 275773, 185327, 5379, -85838, -122572, -90522, -116580, -299655, -314571, -172551, -24563, 82912, 3903, -18769, 20550, -34339, -59158, -124577, -140819, 9900, 140384, 387689, 549645, 371746, 106064, 16982, -88209, -122889, -56253, -137330, -349827, -453051, -359518, -250818, -132408]
9626a32408J11886K15524J13807j47224j21237j44071j12243O4666J46732K15715
9616B11147K538j05536K22488J83912j67675j18982k55950j58408Q8062n7341
9606a55745k73328p627R2688q3713n2138j8272l7319J8941L77685J51782j52291
9595a39337P7302L46616J70146k14937k16104k12386p7686J01333J76227J92149
9585B03323J51308k8207j71325j25346j05729r6562n9171m6630L5359J46473K18307
9574A21800m085k25631k34671N2199J79983N7822q8625k2079J17681q1314k32366
9563c59286p7569j3545M4838P3730J07173L2176J86476J69752r7082j06495p5810
9552a15642j53420j29971O2410O2675j09580j43652L2078J71875J73320q8609
$$ y = [-132408, -20522, 195002, 308809, 161585, 40348, -103723, -215966, -151300, -4568, 211147, 213685, 108149, 330637, 514549, 346874, 227892, -28058, -186466, -98404, -155745, -429073, -436700, -344012, -427725, -479863, -498135, -535454, -516513, -138828, 12954, -139337, -62035, 284581, 454727, 239790, 23686, -188700, -266386, -165053, 11174, 203323, 354631, 326424, 155099, 29753, -75976, -172538, -231709, -278339, -242980, -96507, 121800, 117715, -107916, -342587, -290388, -110405, -52583, -141208, -163287, -45606, -126920, -359286, -436855, -450400, -405562, -331832, -224659, -192483, -6007, 163745, 66663, -39832, -115642, -269062, -399033, -336623, -273948, -383528, -527180, -495102, -323227, -149907, -238516]
9542b38516j14248r9N9361J7171p5653O870l3989M4352M2553o7235q5522j57643
9530f02598K9306J32555J71131M4015o4628j14866Q6350K93051L09031O9920p237
9519C46030k79134k62608l166L3829J548L5631l0528j0158k7988k15501l4975
9508d47020K85522J21633p405j8224j67597L079K91463K28402k2989M076R5199
9497C66139k12228k57224j31182M429J41737P0120L218M8150K11478P9764J30132
9486D54533K00833L4619L0888M3535k75506k03509k75155k95994k11353N3551
9476d43558J38786N3869j6544l6373n1232j51075j19615Q2315J29180k5460J44878
9465b94829K22674J14828P0747J87008J13992j35319m15655j46630P9538J60873
$$ y = [-238516, -352764, -352863, -293502, -276331, -351984, -345114, -379103, -334751, -292198, -359433, -444955, -602598, -573292, -440737, -269606, -225591, -290219, -405085, -318735, -25684, 283347, 353267, 346030, 66896, -195712, -198878, -165049, -163501, -127870, -158398, -168556, -196544, -412045, -447020, -161498, -39865, -47270, -65494, -233091, -230012, 61451, 289853, 266864, 270940, 366139, 153911, -103313, -234495, -230066, -88329, -18209, -14991, 33159, 244637, 324401, 454533, 655366, 689985, 720873, 764408, 488902, 285393, 10238, -285756, -497109, -443558, -304772, -250903, -267447, -303820, -355052, -506127, -625742, -543427, -414247, -439707, -294829, -72155, 42673, 113420, 300428, 414420, 279101, -136554, -283184, -203646, -42773]
9455d2773k7936k04359j80567N7812K26970J18822o1478j65269p0538j0913l7872
9444c98101Q0068R8295k5970J32569O7130n1629J803K27661J17160k4718l7235
9433A87033k36479k47498o8659r510j31154J48974L15983J83053J14496m5793
9423B10446l31006j75030j49070k79196l4638J89548J40160M6949R3643N8589
9413b29605N4262K5056k896l2768j32655l6264K35840M1896j54508N349N3960
9402a72333p54J11348J5569o9390j42545p6095K52815K45295L3777l4089P9966
9391B43564L9247o0198L1278l1741P2190K9242j39709j11646p3745J01293K6769
9380A26544l1508k071j15138j18733j58682q7594P9014N1271P3033M9245K6961
$$ y = [-42773, -70709, -275068, -455635, -397823, -170853, -52031, -113509, -278778, -349316, -360229, -398101, -318033, -219738, -245708, -113139, -46009, -97638, -95835, 131826, 248986, 224268, 187033, -49446, -296944, -365603, -375113, -506267, -357293, -41310, 141743, 256239, 210446, -120560, -295590, -444660, -723856, -758494, -568946, -428786, -381837, -288194, -229605, -175343, -150287, -153183, -185951, -318606, -354870, -119030, -77134, -231642, -226293, -172333, -173087, -61739, -46170, -115560, -258105, -334200, -81385, 163910, 197687, 163598, 243564, 282811, 222613, 253891, 222150, 294340, 323582, 183873, 72227, -1518, 99775, 126544, 95036, 92965, -22173, -140906, -299588, -387182, -308168, -256897, -183864, -134619, -107658]
9369a07658m6845J53408J1097j05964m7667j2000R0669R1797P5961o6088j24948
9358h8238j31309N0213J12985k7213O7714R7670O5387l289p1194q7547m00872
9347d15693m40988o6564K98232K13734J39627Q4581M7468N6093P7170Q4166R8828
9336A76654L809j75013j54038J70022R8195j28943o7032O2479J27553R9445m0246
9325A72885m8689J9652Q6356O0658p894j16209l7425r0337k15153p9359J78183
9314g7332J37530j75103j31515K2975O0236J18015k9178j98426n1272j6763J44404
9303a96429R4967K1105N4199R09K0423l9209L1889Q676J19562J11177j6263m0886
9291A70120L6140j7335P4212J76121J60987k9746j27545k12001k15656N8065q8259
$$ y = [-107658, -154503, -1095, 10002, -95962, -143629, -155629, -64960, 26837, 102798, 36710, -88238, -219547, -169334, -56349, -83562, -15848, 81822, 147209, 143920, 72726, -14821, -415693, -856681, -923245, -625013, -411279, -271652, -187071, -139603, -83510, -6340, 77826, 176654, 180463, 5450, -148588, 21434, 119629, -9314, -76346, -13867, 113686, 213131, 172885, 124196, 143848, 230204, 290862, 282968, 166759, 129334, 38997, -176156, -255515, -77332, 60198, -114905, -246420, -223445, -163209, -45194, -74372, -272798, -324070, -340833, -196429, -101462, -80357, -26158, -25249, -4826, -44035, -12146, -3470, 116092, 227269, 211006, 170120, 206260, 188925, 263137, 439258, 600245, 570499, 442954, 230953, 15297, 73362, -14897]
9280a4897k21373m9300P8594J59229J66947K117L4468n6437j05901p962J43139
9269A28624K5789q5817L0082M5459j38916k19071j5830N0016o5825o8033j0136
9258c23658J58059J93061o1545k00559j21603p8144J39971K84230K22619Q8652
9248C01083j71921p5280J7532r4997r1774j24344l5605l195k0413J493m8r1995
9236c89464J53288L42601J67900j50658k76K37685L6563n7872j97287j39751n8472
9225e5743m2307N614j12575n7609Q5222O0347M5618l2182n2922J6034k6825l04446
9213d71774j53841L4746Q713P7672J48171J56970P7159J69058J75330q2154j76518
9202c6468n2476K7912r549j13063k82007k49581q3212P3090Q8097j35629l0004
$$ y = [-14897, -236270, -285570, -206976, -47747, 119200, 121317, 155785, 99348, -6553, -14515, 128624, 154413, 68596, 98678, 144137, 5221, -213850, -229680, -179664, -245489, -313522, -323658, -165599, 27462, -34083, -234642, -356245, -434389, -294418, -10188, 212431, 301083, 129162, 53882, 71414, -23583, -115357, -239701, -275306, -278501, -298914, -297421, -297469, -389464, -236176, 106425, 274325, 123667, 123391, 361076, 397639, 339767, 142480, 2729, -55743, -98050, -92436, -205011, -262620, -177398, -117051, -71433, -103615, -156537, -140503, -167328, -471774, -625615, -590869, -582156, -504484, -356313, -199343, -122184, 46874, 222204, 140050, -36468, -88944, -61032, -70581, -183644, -465651, -715232, -798444, -725354, -637257, -772886, -802890]
9191h02890K89222K02401J71650P7076k56810k39927q6827K05704J79231L9336
9181b21834J27805J26346q2768j23256m8175o8291M1795J3597P3142J35509K17023
9170A90893P5499k47698j70371M5625j03694l50247j56250j00141n7105O6790
9160h06699R6489J56128J62677p1295m4157K06032L32887M6783j08580n9262j359
9149i0356K30681Q3311k05343k92248r5912K07427J56921R4976j23106k88530
9139c22179m7104P1852J83438J84621j29261k46918q937Q5590J6197j53041r2239
9128d57981J52503N4739n0107J4697K6757j10324J38136K10481L3179N0948J02938
9117A65966p0998r7717j5917j30725m02158j19336K39860J73426K66895K16976
$$ y = [-802890, -513668, -311267, -139617, -62541, -319351, -559278, -646105, -440401, -261170, -221834, -94029, 32317, -50451, -173707, -221882, -290173, -248378, -234781, -161639, -26130, 190893, 266392, 18694, -151677, -106052, -209746, -559993, -716243, -816384, -873489, -806699, -710210, -554082, -391405, -462700, -506857, -300825, 32062, 78845, -29735, -88997, -90356, 140325, 223636, 18293, -273955, -369867, -162440, -5519, 89457, -33649, -322179, -369283, -297431, -113993, 70628, -58633, -305551, -314488, -228898, -212701, -365742, -457981, -305478, -250739, -300846, -286149, -259392, -369716, -231580, -21099, 12080, 63028, 165966, 94968, -2749, -18666, -149391, -551549, -670885, -431025, -257599, 9296, 226272]
9107B26272R0202k2898m4299R243j50455p1805J9119r7265j05390M6441o6297
9096a67132p3651K45098J37916m1018j73167j69637j28445j11931k63611k06919
9086i52497J67998J88339J01549J53918J67388M7245L0105k144k4386N4041j3348
9075h1792j4814P7576J61956J4074r5787n9515k34227j96479l208J48364O6985
9064b16867J69763N8290j47751J35291L21935J08867j57294k5009k03621k60404
9054b16800j88172j08011m872O7581J40936R5630K1734m3069j0714R9373J14976
9043c1408N845r363j12921o243J84119J8061j0467P400P634j00403j65701L8910
9031a74537K26486J54819o437q8832J53505J52239L1071j02974L4331J4799j33121
$$ y = [226272, 316474, 293576, 249277, 258520, 108065, 36260, 55379, -41886, -147276, -100835, -167132, -240783, 4315, 142231, 101213, -71954, -241591, -370036, -481967, -745578, -952497, -784499, -596160, -494611, -340693, -173305, -126060, -95955, -98099, -122485, -68444, -81792, -96606, -19030, 142926, 157000, 61213, 1698, -232529, -429008, -432216, -283852, -216867, -47104, 11186, -136565, -1274, 320661, 429528, 272234, 247225, 43604, -216800, -404972, -512983, -517855, -450274, -309338, -213708, -191974, -235043, -245757, -146384, -31408, -25563, -34926, -147847, -154090, 30029, 48090, 37623, 45023, 52657, -47746, -213447, -174537, 51949, 206768, 200331, 111499, 265004, 417243, 448314, 345340, 379671, 394470, 261349]
9020B61349p9804J691o3024j77305p3301N510k09075j54059K10799K38825J98650
9009A60256j06375j94816Q3254K04115L9819p5858m163l9760l8581Q8754r6988
8998A9657l24904q9274R6961K48511J96428L706o4659j79397j93758n6210j6633
8987c59572j1274o6955O5600J49010L1407O7780K5505O036Q0227R8243L6515j3596
8975A08926l7543k1928o5488k9767O4667J01870J58703j51052j97413k94779l27989
8964f91793O176K01507K41048o0646j84242m8609o6803r412K42136J42602J61177
8953f6859K18047Q2324J39662n9036j72946k59575j21441P8507l9499k2056R9310
8942a23562R6136p9447J59082N5461j14830n9369P116K4850j7884k8378j13040
$$ y = [261349, 181545, 183236, 120212, -57093, -130394, -124884, -333959, -488018, -277219, -38394, 160256, 53881, -140935, -57681, 146434, 186253, 110395, 106232, 66472, 27891, 116645, 19657, -305247, -394521, -297560, -49049, 147379, 151085, 86426, -92971, -286729, -342939, -359572, -370846, -437801, -372201, -223191, -191784, -124004, -98499, -92463, -12236, 86007, 122522, 108926, 71383, 49455, -16033, -45800, 18867, 120737, 279440, 128388, -69025, -363804, -691793, -685617, -484110, -243062, -303708, -487950, -536559, -603362, -612774, -370638, -228036, -66859, 151188, 233512, 373174, 314138, 141192, -118383, -239824, -161317, -200816, -222872, -123562, -27426, -106873, 52209, 107670, -7160, -66529, -59413, -34563, -52447, -80825, -193865]
8931a93865j74323j61756K6309J72846K87530K16228o7385j773k03832k08105
8921c08126Q9522K63478J67353k54814l57159k36336o1506m2803J1237J21558
8911f07596L06512K87541P4667r3178n3809p0489N6722M4012j28887r2038o2183
8900c38726J5498R2307Q0604J17669L1258j63704n3670r2249k38449L7409L16908
8889a95145N8878j23377R8958O1671M1956K15201R6437j65013k0445J43218K6115
8878B38454n2732j13061k76064l32627j58741j40755P5864L45670J11716p551
8868c09827p6383r255J48270J80484J2543r2346M0372r5654j16115J7371J52696
8857a47844Q5874q1889r0913j62859M9997K20505k6339k6656J529r3599L6550
$$ y = [-193865, -368188, -529944, -503635, -330789, -43259, 172969, 105584, 103811, -100021, -308126, -218604, 44874, 212227, -42587, -399746, -636082, -697588, -740391, -729154, -607596, -301084, -13543, 61124, -32054, -85863, -156352, -99630, -55618, -184505, -276543, -338726, -323228, -230921, -150317, -32648, -1390, -165094, -218764, -311013, -549462, -512053, -195145, -136267, -259644, -160686, -99015, -57059, 158142, 254579, 89566, 69121, 212339, 238454, 185722, 72661, -203403, -536030, -694771, -835526, -759662, -413992, -302276, -309827, -386210, -395465, -247195, -66711, -54168, -146514, -106142, -201796, -317911, -300540, -147844, -61970, -143859, -234772, -397631, -347634, -127129, -153468, -180124, -178595, -272194, -235644]
8846b35644j983j53109J2398j2491j30046R2989J35727J7523J91707J84578k2435
8835G9214o350j27698j81389O2406J96524J67626J4614p2888j66870n3375O9782
8824a8404N6222J12076j26698k07965j2252j02207r5120J66700Q9968K907r292
8813a44065k8174P0916J51360N0937j3482R5856k7305j50440q3413J76278K6132
8802A24600k6451J03555M1624k39919m4190K2305l3192q4366J49256L90519L18652
8791G22393O3509k43793j54043p1449k65227l14577j25138p428J55921K33495
8781f337J39078K5619p0732l38619k42144J12861P1159p5371j10091N1311Q8945
8770c54321j55033r7967P3945J33796n249q5279r2346M8043K08488K36484J17252
$$ y = [-235644, -237627, -390736, -378338, -390829, -520875, -427886, -292159, -274636, -82929, 101649, 79214, 72864, -54834, -236223, -173817, 22707, 190333, 204947, 132059, -34811, -88186, -18404, 37818, 149894, 23196, -184769, -197021, -299228, -394348, -227648, -137680, -134773, -144065, -172239, -101323, 50037, 100974, 87492, 183348, 156043, 5603, -77810, 98468, 124600, 98149, 201704, 243328, 3409, -40781, -18476, -51668, -136034, 13222, 403741, 722393, 785902, 542109, 388066, 316617, 51390, -263187, -388325, -395753, -239832, -6337, 132741, 158360, 87628, -250991, -493135, -380274, -309115, -384486, -494577, -443266, -354321, -509354, -607321, -533376, -399580, -404829, -490108, -582454, -534411, -325923, -89439, 27813]
8759B7813O1452J9479M7876j49924o4998M5612p4990o5617J8585P9399j617n3280
8747a10210j57362j51584J8163K7680m1764J22441K39503P5665o8295m0767j35790
8736b22320M7707P0711p4873r4855J5594J33799N3267r6494k90717j46803K21900
8725c83084J63490j1750k28276m73488j54474L73905K64177R9949q5100k26790
8715f61441M0478K40320J01063j02796j52332j77167p9956r5553O7673J68801
8705f50910L11179K88777Q4950j91429l79812j48053L28344K09620Q6085J57532
8695I6283K97353L6199j5533J7819o8267j8544L3044R3171j68463k00729o4399
8684C7934r8691j16565Q007N6400N4835n1515l14114l86844m1242J65930J87388
$$ y = [27813, 89265, 108744, 156620, 6696, -58302, -12690, -87680, -153297, -134712, -55313, -56930, -110210, -267572, -419156, -400993, -373313, -415077, -292636, -53133, 22532, -45763, -86530, -222320, -174613, -103902, -178775, -273630, -258036, -124237, -70970, -167464, -458181, -604984, -383084, -219594, -231344, -459620, -933108, -1087582, -713677, -449500, -349551, -434651, -661441, -620963, -380643, -279580, -382376, -534708, -711875, -791831, -887384, -819711, -650910, -339731, -50954, 33996, -157433, -537245, -685298, -356954, -147334, -61249, 96283, 393636, 429835, 414302, 432121, 363854, 345310, 378354, 471525, 303062, 102333, 37934, -60757, -177322, -169315, -112915, -58080, -109595, -423709, -810553, -851795, -685865, -498477]
8673d98477R9097M513O5208J15420m234j49113j18777R8909J70026K40094P9900
8662A02566j53151k81491j33057J29586L92228J37607k3928k01023j78231q1454
8652b90348M1678J09625J15315L2350j27976Q4941K63066N4843j89887n4159M0368
8641G9816J0916J89284j0640r5894J54479J29474Q7608j4768k43331k26842k84352
8630b24250j15400K3148J14641J23218M0045L4741L4811l4970k3228j8591K7937
8619a7898O2997j49720k48658k38762j44981N0125J52869J40077K01374N1457
8609a41120j31058j52621q4325j21291k71844k73772O995L62831L41324K6338
8599d38543l6511J12412J18866J43427k0581l3760L2974n6312j04034K31168J13623
$$ y = [-498477, -399380, -394867, -329659, -214239, -218473, -367586, -486363, -387454, -217428, 22666, 102566, -50585, -332076, -465133, -335547, 56681, 194288, 170360, -30663, -208894, -290348, -248670, -139045, -23730, 8620, -119356, -34415, 228651, 283494, 93607, 39448, 79816, 90732, 280016, 269376, 173482, 327961, 457435, 545043, 530275, 286944, 60102, -224250, -339650, -316502, -201861, -78643, -38598, -3857, 30954, -4016, -27244, -45835, -17898, 45099, -104621, -353279, -592041, -737022, -686897, -534028, -393951, -192577, -141120, -272178, -424799, -509124, -630415, -902259, -1176031, -1169036, -806205, -464881, -438543, -475054, -362642, -243776, -100349, -120930, -154690, -121716, -178028, -282062, -50894, 62729]
8588F2729j39342K2615j47846k05120M3077J04880r0926j95181m6022K75042M24169
8577A08075K58668j9954O2683k27893j80563Q7061o2745k74502j20129j2315P0546
8566c11068M807N4225J50176J7868o6546n2263P5321J63761N3122K7605Q3607
8555B00615K1320l94517m86630K3721K67339l8942J3454L10439J48520p9945L5030
8544B0404N8012L1411J07340N7868j69457j01502n5471l3929m0517j2130J09554
8533b8417J18708j15287l32017Q666K61483L2705r3881j85875K3637N2075J60614
8522i7589K04530N9004j03733J5896J33874J33721K3557j83783q3763R7291M9191
8511B48196K1267j30719r293N8147j45276j63532k9105R2685M8550j36817o2316
$$ y = [62729, -76613, -53998, -201844, -406964, -363887, -259007, -349933, -545114, -591136, -316094, 108075, 366743, 346789, 409472, 181579, 1016, 88077, 25332, -249170, -369299, -381614, -311068, -306261, -252036, -101860, -83992, -150538, -202801, -127480, 36281, 89403, 117008, 200615, 221935, -172582, -659212, -635491, -368152, -407094, -393640, -83201, 65319, -14626, 20404, 78416, 109827, 217167, 275035, 105578, 4076, -51395, -85324, -125841, -137971, -28417, 90291, -24996, -357013, -348347, -86864, -54159, -148040, -333915, -310278, -258203, -97589, 106941, 165945, 62212, 78108, 211982, 345703, 369260, 185477, 101714, 199005, 248196, 269463, 138744, 129451, 187598, 42322, -121210, -150315, -57630, -9080, -145897, -208213]
8500b08213Q6236J08769M3676N6281M3600m1225j54459m4381J91942n0987k52429
8489b21190j15108r1123K0128J51796R3044L0265M0541J87469J46633L3689J2376
8478B88520j07404p4846l7842m5654R5716J07816l3679O3521M4762j15799k56311
8467g1200j01380L4175n9443q3032J05019K05540J48092J35998p2274k9313m0707
8456A71475j10080k4835Q2167j92798k24634k7381J18169K27030J60026J20088
8446B99227O6207k10081j67510r7863M6575K88555K18332j05895k09510J27544
8436B55581K51160k04649l16262j16229K0102r6154k18028J37514J28923m9344
8426b07386K9942J38021K50540K61466J04341j14844k46695l78953j66603q1803
$$ y = [-208213, -121977, -13208, 30468, 86749, 130349, 89124, -65335, -109716, 82226, 31239, -221190, -336298, -427421, -407293, -255497, -162453, -132188, -91647, 95822, 242455, 276144, 288520, 181116, 106270, 68428, 22774, 118490, 226306, 192627, 256148, 300910, 185111, -71200, -172580, -138405, -197848, -280880, -175861, 29679, 177771, 313769, 241495, 212182, 171475, 61395, 36560, 118727, -74071, -298705, -326086, -207917, 19113, 179139, 299227, 365434, 155353, -12157, -110020, -63445, 225110, 443442, 337547, 128037, 255581, 506741, 302092, -14170, -130399, -110297, -206451, -424479, -286965, -158042, -207386, -177444, -39423, 211117, 472583, 576924, 462080, 215385, -163568, -330171, -411974]
8416d11974L8954M785j91642p2283K41290K96189J78661l7600j30980j18545R926
8405a93219m9174j80314r9814J3243Q0456J32372O5791P3466K28692K62862J37406
8394D71767o6676j49488m0491j37025M6225L01821N5222l65018k85065J5833O0215
8383i2680l1622j32335o5191j12987k2609O8222j19808N2967J84998K6255j52487
8372c97277k08553j58035k7940J32845P3229Q3513K08953O9124N1996J56143Q6504
8361G0502p1246j11111p4797j37592J0205K00314K51429P126k74503J2139J08648
8350h886m5341j68016r6524J64894J56119K4559j6053N8387R6876L1769N8188
8339B55972J32162J02046j08024J18992R2338j44937j25863p6303j69363J21144
$$ y = [-411974, -373020, -368235, -559877, -632160, -390870, -94681, 83980, 46380, -84600, -203145, -193219, -242393, -422707, -522521, -509278, -428822, -296450, -230659, -157193, 71499, 334361, 471767, 405091, 255603, 215112, 78087, 124312, 426133, 481355, 116337, -168728, -152895, -92680, -124302, -256637, -321828, -434815, -457424, -389202, -509010, -456043, -271045, -244790, -397277, -605830, -763865, -791805, -658960, -585731, -502218, -293265, -224141, -172145, -16002, 70502, -744, -111855, -186652, -324244, -314039, -113725, 137704, 144830, -129673, -117534, -8886, -54227, -222243, -318767, -153873, 2246, 26805, 10752, 69139, 166015, 197784, 255972, 388134, 490180, 382156, 501148, 593486, 448549, 322686, 246383, 77020, 198164]
8329A98164K80326O6365q434N869j04183k87902j38723J34211J14812j8374P8591
8318C20722k6722k40785l30541J1994K85825J19744j17933P4960P1457j58448
8308A0273m7418j51504k35247n898J99302K31985K771j18801p1650j4210l9389
8297b39786l9941j60122k61462j2538J58277J16258K27609L22840J37576o292
8287B42419j88838j68827n4372K7899j9483j18113j29666j90191j15754p6509
8277g91435p1881J69352L13156J40649N9581j12473r3504K023m9322l6381N3437
8266d16798r641K2957J08070K39471J38074j9910r0275J07227K92057J67969N7764
8255E96965j49594q5152J00445K18591Q5845j57338k54139j97233J15065P2374
$$ y = [198164, 478490, 544855, 536421, 542290, 438107, 150205, 11482, 145693, 260505, 242131, 320722, 294000, 53215, -277326, -265332, 20493, 140237, 22304, 97264, 168721, 10273, -37145, -188649, -423896, -429794, -230492, 1493, 4264, -114537, -186187, -200397, -239786, -279727, -439849, -701311, -713849, -555572, -439314, -211705, 111135, 248711, 242419, 53581, -115246, -169618, -141719, -161202, -279315, -408981, -599172, -714926, -791435, -863316, -693964, -380808, -240159, -180578, -293051, -386555, -384532, -433854, -470235, -416798, -426439, -403482, -295412, -55941, 82133, 62223, -28052, 79175, 371232, 539201, 596965, 447371, 362219, 462664, 681255, 767100, 609762, 355623, 158390, 273455, 345829]
8245C45829k03292j88183J3895J22991j40154k30444N225r361r7479L0133P8695
8234b72145k11732K5210K42264q8238p6127J26777K44871J07777k551j09578p8208
8223i1680P4608L9228J0275r3566j21227j56496j99130j14192K85521M50833K17416
8212C01590Q072Q7094L5174l22346k10169J47198R5511j00359k2200K8314j30633
8201h2754o2165J23352P7957M961J668J08063J19503J61541R3415J73867J92707
8190I12115j2180k68299l30786n0620r3480N5281J43600K1137Q0308J92860L7695
8179F87631n8623k1546m528m5622j85891j3450j06612l34767k61413R7659L19802
8168G2640K35088J06834J68062Q9928j38103o1174n2105j54921l9173M1506J73942
$$ y = [345829, 142537, -45646, -31751, 91240, -48914, -279358, -274133, -283494, -380973, -350840, -272145, -483877, -458667, -216403, -304641, -380768, -253991, -9120, 98657, 96106, -13472, -91680, -17072, 22156, 32431, -61135, -182362, -338858, -537988, -652180, -366659, 84174, 301590, 309662, 396756, 431930, 109584, -100585, 46613, 142124, 41765, 19565, 47879, -82754, -144919, -21567, 56390, 61351, 63019, 171082, 290585, 452126, 545541, 719408, 912115, 899935, 631636, 300850, 250230, 156750, 212031, 355631, 376768, 457076, 649936, 687631, 629008, 607462, 602934, 557312, 371421, 357971, 251359, -83408, -344821, -247162, 72640, 307728, 414562, 582624, 672552, 534449, 473275, 421170, 266249, 227076, 268582, 442524]
8157D42524N5371j53590j03994r4319k9573j00795R3529J98015J60230J28865
8147E96263m7673p7257j2458Q3831n4609k75941o0993K20491J52376K01000K18399
8136I43429J88971K1750j42060j46256m3590K8073j9012j2192j56127k16598l9266
8125D07122K5389P8628P9426j1720j05893j43406n6607M1701n8121k60086j6830
8114b0397J4373J02797R9669j8345M0615J1484p3253O3875J73046K51134K00149
8103H45147Q3184L8780k721j72694j52112J5155J31771L3062J3520j01805k66335
8092D64952j70406L7367J42050K0503j21329l369J44419O5650K46367K38760M5681
8081A110645l4593m6720p942J89502L40591K72080n5165j93971j57075j25055
$$ y = [442524, 497895, 344305, 240311, 145992, 116419, 15624, 109153, 307168, 467398, 596263, 548590, 471333, 458875, 542706, 488097, 212156, 151163, 371654, 524030, 725030, 943429, 1132400, 1154150, 1012090, 865834, 822244, 850317, 831305, 819113, 662986, 446388, 407122, 432511, 511139, 590565, 578845, 472952, 329546, 272939, 314640, 256519, -3567, -20397, -6024, 96773, 196442, 178097, 218712, 230196, 156943, 220818, 393864, 644998, 845147, 928331, 967111, 964390, 791696, 639584, 654739, 786510, 819572, 833092, 731287, 464952, 294546, 331913, 473963, 494466, 373137, 369768, 514187, 579837, 826204, 1064964, 1110645, 1076052, 1029332, 1021390, 1210892, 1551483, 1823563, 1768398, 1574427, 1417352, 1292297]
8071A292297N9725O5851J12295R3961l1074j04744j13115l0314j55558o5990M8918
8060A172252J27876K79078J13554M2480m7338j77274m6362J73228K13431J90137
8050B041062p4854j42796Q1928K35703J18946q3015q4575J23687J03208j23631
8040B195663m7270O7264j44137j18996K37831K35714j03376K88l9039n2502j00757
8029B130683j89637Q4495L05089K80113R2839j75843q9639m4791j12575j9486
8019B261248L8938R6229J66756K19131K59798K15423J48351P5615K184J4293J72977
8008C670943L38687L06000L54365K99982L79140P00117Q92198R01521R19884J162698
7998I925535J285567J365655J859780K789418L442617L923620M718662N628769
$$ y = [1292297, 1352022, 1417873, 1530168, 1624129, 1593055, 1488311, 1375196, 1344882, 1189324, 1123334, 1172252, 1300128, 1579206, 1692760, 1735240, 1687902, 1510628, 1464266, 1637494, 1850925, 2041062, 1966208, 1823412, 1905340, 2141043, 2259989, 2176974, 2092399, 2216086, 2319294, 2195663, 2148393, 2215657, 2071520, 1952524, 2190355, 2426069, 2322693, 2322981, 2283942, 2231440, 2130683, 1941046, 2025541, 2330630, 2610743, 2703582, 2527739, 2438100, 2393309, 2280734, 2261248, 2300186, 2396415, 2563171, 2782302, 3042100, 3257523, 3405874, 3481489, 3483673, 3497966, 3670943, 4009630, 4315630, 4669995, 4969977, 5349117, 6049234, 6941432, 7842953, 8762837, 9925535, 11211102, 12576757, 14436537, 17225955, 20668572, 24592192, 29310854, 34939623]
7990C4939623O354876O407282N819981M387322K075141n88738l030741m644920
7982E1719826n520238n992761n641840m740454l845886l252386k606409k124507
7974A7995345j691182j359103j083739p56387m94276m21791l27876q3226J0372
7965A1788137n9801j39626k16522k61672m57301l50960j37615j4462O2909J0067
7955A0223154O4371J85372K58580M48951N22556O53433R10847J065027J278925
7946A5611216J644842J707005K016005K516744L123418L830290M776749N908314
7938D1134583P524518R506145J2077966J5126070J7698422J9681366J9965140
7931A42714210J7853989J3120105O021775j978945r382191j4920032j8100508
$$ y = [34939623, 41294499, 47701781, 53521762, 57909084, 59984225, 59395487, 56364746, 51719826, 46199588, 40206827, 34564987, 29824533, 25978647, 22726261, 20119852, 17995345, 16304163, 14945060, 13861321, 13104934, 12610658, 12188867, 11860991, 11777765, 11788137, 11728336, 11588710, 11372188, 11110516, 10653215, 10302255, 10164640, 10150178, 10213087, 10223154, 10287525, 10472897, 10731477, 11180428, 11702984, 12356417, 13267264, 14332291, 15611216, 17256058, 18963063, 20979068, 23495812, 26619230, 30449520, 35226269, 41134583, 48659101, 58165246, 70243212, 85369282, 103067704, 122749070, 142714210, 160568199, 173688304, 179710079, 177731134, 168348943, 153428911, 135328403]
7924A35328403j8631291j7134669j4725811j2111384r853088q196992o468893
7917D8206275n212310m329747l475719k809306k176171j689429j298296q91847
7909B6323450p83224q73428p60941n48678m72594n73002o55444o09062l85068
7900B0662009j24582K5537P5575J28252N26824P72056J160484J328839J506468
7891B6061462K008368K359772K753001L323649M252515N097383O295208P881304
7883F0032662R817973J2124441J5182580J9350218K4173955K9527258L5115955
7876B05325042L9065023L9486394L5107651K5460967J1540436m741680j9706624
7869C31537209l0503711l6188036l7116679l4454647k9836679k4767195j9999362
$$ y = [135328403, 116697112, 99562443, 84836632, 72725248, 62872160, 54675168, 48206275, 42993965, 38664218, 35188499, 32379193, 30203022, 28513593, 27215297, 26323450, 25540226, 24666798, 23905857, 23357179, 22884585, 22311583, 21656139, 21047077, 20662009, 20537427, 20562964, 20638539, 20766791, 21293615, 22065671, 23226155, 24554994, 26061462, 28069830, 30429602, 33182603, 36506252, 40758767, 45856150, 52151358, 60032662, 69850635, 81975076, 97157656, 116507874, 140681829, 170209087, 205325042, 244390065, 283876459, 318984110, 344445077, 355985513, 351243833, 331537209, 301033498, 264845462, 227728783, 193274136, 163437457, 138670262, 118670900]
7862A18670900j6113248j2991939j0417021q685973p087005n714671m631784l763944
7854D9265315l120699k364659k072205j914426j826300j628626j532783j623733
7846C3181884j469623j157070q72101n44725m00805J7621K97208K91802N88632
7837B9932823J000888J315772J536288J894604K623024L200396L717288M698299
7829D9919382N935738P258923Q768075J1137943J4156432J7985766K2614872K8085829
7821A65862960L4606997M1103672M5550005M6245107M1393505L0080484J3384573
7814D18227303o005615k3747380l6496579m3351246m4495591m0998750l5411407
7807A87720735k9283164k3596130j9037056j5392185j2475224j0250624q345902
$$ y = [118670900, 102557652, 89565713, 79148692, 70462719, 63375714, 57661043, 53029259, 49265315, 46144616, 43779957, 41707752, 39793326, 37967026, 36338400, 34805617, 33181884, 31712261, 30555191, 29683090, 29138365, 28737560, 28755181, 29052389, 29344191, 29932823, 30933711, 32249483, 33785771, 35680375, 38303399, 41503795, 45221083, 49919382, 55855120, 63114043, 71882118, 83020061, 97176493, 115162259, 137777131, 165862960, 200469957, 241573629, 287123634, 333368741, 374762246, 404842730, 418227303, 412221688, 388474308, 351977729, 308626483, 264130892, 223132142, 187720735, 158437571, 134841441, 115804385, 100412200, 87936976, 77686352, 69340450]
7800F9340450o785957n617915m817086l990655l121219k588738k236793j999716
7792C8182371j671307j659693j830109j595452j073094o24708o90127n39088l76690
7783B8122103j61079K32822M40734O66844R01634J328918J621214J946745K603268
7774C7703203L046092L945408N071691O288508P791689R720560J2105596J5186947
7766A00859694J9220040K3990272K9480810L4759324L8303762L8612062L4434107
7759C19660071K4956160J0787589n373533k0060569l1052536l6906608l7695414
7752B24315160l4967749l0245008k4995707k0401292j6397261j3405677j1111337
7745G2791129r023514p227654n765489m779599m061651l436533k787926k569768
$$ y = [69340450, 62554493, 56936578, 52119492, 48128837, 45007618, 42418880, 40182087, 38182371, 36511064, 34851371, 33021262, 31425810, 30352716, 29728008, 29037881, 28498793, 28122103, 27961024, 28193846, 28634580, 29301424, 30203058, 31531976, 33153190, 35099935, 37703203, 40749295, 44694703, 49766394, 56054902, 63846591, 73567151, 85672747, 100859694, 120079734, 144070006, 173550816, 208310140, 246613902, 285225964, 319660071, 344616231, 355403820, 350030287, 329969718, 298917182, 262010574, 224315160, 189347411, 159102403, 134106696, 113705404, 97308143, 83902466, 72791129, 63767615, 56539961, 50774472, 45994873, 41933222, 38496689, 35708763, 33138995]
7737C3138995k498250k208170j776465j675883j636071j194122q73104j023715
7729B0253215o51291m02353n28162k71419l9991J66409K51978J49672K54622P90370
7719A9973050J423870J392829J381374J829616K343713L038974L708753M675785
7711C9767964O026458P570560R525583J1892349J4644143J7198414J9024110J9234089
7703A44883670J7107584J2144970N164620k960956j0430720j5788585j8560908
7696A31559675j8925787j7396722j5090702j2839442j0394090q294231o729799
7689D1888902n435781m470732l698238l179807k730265k265022j840326j593869
7681A6674862j499539j060328q49534r71420o44350m81100o29144o82832o70851
$$ y = [33138995, 30640745, 28432575, 26656110, 24980227, 23344156, 22150034, 21276930, 20253215, 19601924, 19199571, 18671409, 18399990, 18359999, 18526408, 18778386, 18928058, 19182680, 19973050, 21396920, 22789749, 24171123, 26000739, 28344452, 31383426, 35092179, 39767964, 45794422, 53364982, 62890565, 74782914, 89427057, 106625471, 125649581, 144883670, 161991254, 174136224, 179300844, 176339888, 165909168, 150120583, 131559675, 112633888, 95237166, 80146464, 67307022, 56912932, 48618701, 41888902, 36453121, 31982389, 28284151, 25104344, 22374079, 20109057, 18268731, 16674862, 15175323, 14114995, 13265461, 12294041, 11649691, 11168591, 10539447, 9856615, 9185764]
7672I185764l96717k73221l16172j39291k3106Q278j49829l6882J17377K39020
7662H215221K43706K80726L83863P39847R60770J098821J295305J487098J789008
7653A6494365K286321L141668M091547M863451N537363O068083O025200N248748
7645E3756746L572616J468212p87194l221624n055984n972454o246128n689921
7637C1824269m895252m171704l506266k869344k292717j933502j548828j169295
7629I437361r96926p87185o64901o21839m56863m18939n80174m42965l78444l75431
7619C713694l05766k43026j73875j24802l44316l93781p6636K28424K00672j74166
7609B306422k73154j06914M1783L2398j38339n9731k05436j11276L0514j5640
$$ y = [9185764, 8789047, 8515826, 8199654, 8060363, 8037257, 8045535, 7895706, 7858824, 7976201, 8215221, 8458927, 8739653, 9123516, 9863363, 10824133, 11922954, 13218259, 14705357, 16494365, 18780686, 21922354, 26013901, 30877352, 36414715, 42482798, 48507998, 53756746, 57329362, 58797574, 58010380, 54788756, 49732772, 43760318, 37514190, 31824269, 26929017, 22757313, 19251047, 16381703, 14088986, 12155484, 10606656, 9437361, 8440435, 7653250, 6988349, 6366510, 5909647, 5490708, 4910534, 4467569, 4089125, 3713694, 3407928, 3164902, 2991027, 2866225, 2521909, 2128128, 2051492, 2279916, 2480588, 2306422, 2033268, 1926354, 1968137, 2000535, 1862196, 1802465, 1597029, 1485753, 1516267, 1500627]
7599A500627r867k5123r3983m2845K3474R1463o7136l23825l75602j86516j06849
7588C83818r3281J39228K91661Q9253j53576O4110J35319L404j73102k07320j28936
7577C50578K3804j48658k50919J18903K46098O2335P5010k5897j81303n769j4840
7566B49342r0091J5578K44673J77613J18558N5939J81852J98442j40625j48686
7556H62595J59214K18785J14033j82720j28259j31769p7444k26820k34814j15123
7546B57678j20424J6978o8061p540O1303l2175M7180R8114Q7872q5955j31980
7535A22990J22820J04939m5256j60448J33022J35016k25997o3654J37919J26973
7525C88324R2279K69724O9379j25945k78959l12289k45486R3583J87378K11654
$$ y = [1500627, 1490760, 1465637, 1371654, 1328809, 1352283, 1443746, 1376610, 1052785, 677183, 490667, 383818, 290537, 429765, 721426, 810679, 657103, 721213, 856532, 859936, 686834, 479514, 350578, 374382, 225724, -25195, 93708, 339806, 402141, 477151, 451254, 269951, 264182, 249342, 159251, 174829, 419502, 597115, 715673, 771612, 953464, 1151906, 1011281, 862595, 1021809, 1240594, 1354627, 1171907, 1043648, 911879, 834435, 607615, 372801, 257678, 137254, 154232, 86171, 78631, 139934, 107759, 154939, 253053, 340925, 254970, 122990, 245810, 350749, 305493, 145045, 278067, 413083, 187086, 123432, 261351, 388324, 480603, 750327, 819706, 693761, 414802, 102513, -142973, -49390, 137988, 349642]
7515C49642J37322j01333n6629O7469j06124j04670l4839j26156Q963K51771k0271
7504B65145j06189r1180q9866P5591J91646O2668J2817O9743j26339j87579n7839
7493A8618m4766j65195L7616K99131J49791r4487j49242p2998P1855m7703J47842
7482A50462J39604O7144N7024j17161j26094o6673l3713N8923K10013K01451J19125
7471F60105l26582j99873P047j93138N9227P3215Q4851K10820j8548j21717J16003
7460C51410n9800j66322j7343K54003L08884J48687r4051j00101Q3200J14706
7450H23273j75913k33749l04343k06078p619p8775q1262Q3445J47664J82435p206
7439A41872K0194J18385j12601r6717N1554k5004k09738o2157J99628L32777K78897
$$ y = [349642, 486964, 385631, 329002, 396471, 290347, 185677, 150838, 24682, 33645, 285416, 265145, 158956, 67776, -22090, 53501, 245147, 307815, 320632, 390375, 264036, 76457, 18618, -26148, -191343, -153727, 145404, 295195, 200708, 51466, -21532, 50323, 2620, 150462, 290066, 357210, 414234, 297073, 170979, 104306, 70593, 129516, 339529, 540980, 660105, 333523, 133650, 140697, -52441, 6786, 80001, 164852, 375672, 357124, 235407, 351410, 291610, 125288, 107945, 361948, 670832, 819519, 725468, 625367, 708567, 823273, 647360, 413611, 109268, -96810, -104429, -183204, -264466, -181021, -33357, 149078, 141872, 162066, 280451, 167850, 71133, 122687, 97683, -112055, -174212, 25416, 358193, 637090]
7428F37090J89581k07020k00577P4650J21832n6800r8097L6360j0452J40394j74032
7417D52929j24312J25487K57812J15918k3804o088j00244m9291j38294l79725
7407A30388k87349J16931J7920k43861m9386L5575j26376r8879Q1059J98319K25671
7396A2K57066J06632j49508p8623j8609J7276M6928J530J247l4139o4204M7157
7384A32765M6767K8477l3631o4854N6337J12116R2258K43696l9695l06028j72384
7373I5824K8941O214O1415N0145j58409k23113J16025P4799j6726k8880r0139
7362h3904j04313l0282j25087L216K33325N3842J40612K52313o3558p5765k5528
7351A74871R0000L68450K22158j52137k86870j33872j06819P03l8041j22181p2253
$$ y = [637090, 826671, 619651, 419074, 493724, 615556, 558756, 460659, 497019, 486567, 626961, 452929, 328617, 454104, 711916, 827834, 804030, 797942, 697698, 648407, 510113, 130388, -156961, -40030, -22110, -265971, -315357, -279782, -406158, -505037, -423978, -225659, 12, 257078, 363710, 214202, 135579, 116970, 134246, 181174, 182704, 183951, 149812, 85608, 132765, 179532, 208009, 174378, 109524, 165861, 277977, 370235, 613931, 574236, 268208, 95824, 124765, 130979, 192394, 242539, 84130, -138983, -22958, 51841, 35115, 6235, -83904, -188217, -218499, -343586, -340370, -107045, -53203, 87409, 339722, 276164, 200399, 174871, 264871, 633321, 855479, 703342, 416472, 282600, 175781, 176484, 138443, 16262, -55991]
7340e5991R9404J35409J7875N7998J21324J52400o667n4709K6610L2j08353O7773
7328D53105M4290l2085n7037k11460j73090O1770P5839j9771k2208J97990M19019
7317G36362J54420j51415k74392l21431P3080J73664j26531k20015p3810L5209
7307E141K00355J61982l902j0922j54795l4786r2307k4535j02189r5150J14257
7296c6851J82454Q3291J92999P6569J29478P1575j98938k15366o9789L483k10661
7285H244k28117k5757O5479J07755l3302m6590j8930R3315j8654l8378k2812J6488
7273a41259K26996K96039R0029m3212r7121k27286j18902J54102J68541M3884
7263C51811J3938m2140j02729o5827k61885l15026J6149L76500M94400M16883
$$ y = [-55991, 43413, 178822, 196697, 254695, 376019, 528419, 521752, 467043, 493653, 493685, 385332, 453105, 497395, 465310, 408273, 196813, 23723, 85493, 161332, 141561, 119353, 317343, 736362, 890782, 739367, 464975, 143544, 216624, 390288, 263757, 43742, -30068, 5141, 205496, 367478, 363576, 352654, 197859, 163073, 70766, 46231, -55958, -151108, -36851, 145603, 228894, 421893, 498462, 627940, 699515, 500577, 285211, 215422, 218905, 8244, -219873, -245630, -180151, -72396, -105698, -152288, -171218, -77903, -96557, -134935, -157747, -141259, 85737, 381776, 471805, 428593, 331472, 104186, -14716, 139386, 307927, 351811, 365749, 323609, 220880, 155053, -106832, -421858, -405709, -29209, 465191, 882074]
7253H82074N3921j56480l44243k32212O9075J85649n4543l83841j51989j2890
7243a45479J52565P9089j31894k02144k07642p2254Q3844N7023Q7294K96105L51695
7232C48202J35777J8840m9621o6488M0684M1389O1188j18444j42297j89422r0115
7221a0307J82436J82300q4602k18119j43134p5454m6385J13133J37531l5670m8430
7210d6701j8314Q7245p1665j30353K3786J18667N6878K2888J50657P9521j77280
7199I5329j57772J26869J66025n2507m3091l3114l2024P1038J15645N2413J14860
7188D23671O048P3182M2593j31666p0724J1997O0505k9012k50017j27750N228
7177A4055J99742J18219j26596L18R8713M6814l2144p4691m8233J9535J19543
$$ y = [882074, 935995, 779515, 435272, 203060, 272135, 457784, 403241, 19400, -132589, -145479, 7086, 86175, -45719, -247863, -455505, -527759, -443915, -386892, -299598, -3493, 348202, 483979, 502819, 453198, 386710, 427394, 468783, 529971, 411527, 269230, 79808, -10307, 172129, 354429, 269827, 51708, -91426, -166880, -213265, -100132, 37399, 1729, -46701, -65015, 22230, -49435, -179788, -156002, -37335, 19543, 42431, 193088, 272609, 95329, -62443, 64426, 230451, 177944, 134853, 101739, 69715, 140753, 256398, 308811, 423671, 429719, 502901, 545494, 413828, 343104, 355101, 415606, 386594, 136577, 8827, 14055, 213797, 332016, 205420, 205738, 304451, 351265, 319121, 244430, 196197, 215732, 335275]
7166C35275J5161m5639j12664q4555k7341K8553J28929m254k35169r1102Q4251
7155h555K7325J47010P2562j8144K37200n2208k31205j70881n7533r7346j80049
7144c31824Q3066K57158K42900j88303j53605K54117J60399j09818l9553M1689
7134B16226J22917o5966j53918j16449j21015l3594J44955K84106J66717j54098
7124B89881k15739j37279j18058Q197J46402M7399o248O9458R0587l0499j6594
7113A27507k484J18364Q2393O558j76234j01613Q9239K64316P652o5433k42305
7102A07960j94663r1210p6844K23537J95880R8094R316j12102j56427m4497K38852
7091A97896Q7748j88077r0129m1202j753K10424K58235q5987k41954j71646j29367
$$ y = [335275, 350436, 304797, 192133, 107578, 80237, 108790, 237719, 233465, -1704, -92806, -8555, 18770, 165780, 238342, 220198, 457398, 405190, 173985, 3104, -54429, -151775, -331824, -248758, 8400, 251300, 62997, -90608, 163509, 323908, 214090, 174537, 216226, 339143, 273177, 119259, 2810, -118205, -151799, -6844, 277262, 443979, 289881, 74142, -63137, -181195, -172998, -26596, 20803, 14555, 84013, 174600, 144101, 127507, 125023, 243387, 325780, 332338, 156104, 54491, 143730, 408046, 415698, 350265, 107960, -86703, -177913, -254757, -31220, 164660, 262754, 272070, 159968, 3541, -40956, 197896, 285644, 97567, 7438, -33764, -35517, 174907, 433142, 347155, 105201, -66445, -195812]
7080a95812j30189J10237O3141J96055J12489J34684Q2086j58930k20091L447
7070b883K69694J48316O8201R7610P7035o1371j19699j59463j08644j91857k36241
7059b19302j00558J3647J20881J12397J14108J41441K766j664L5270M0463P9448
7048C38897L6533k73495k10814J1690J20665J31537m0971O959N4170P723Q5887
7037B68781M5824k32756l08229j5902J95823J81031K35220J35034P8593k4303
7027E59116l5681l5403j8668J71837l6443j54477l0015L9302j53519k26022j33345
7016e3318Q5142K30032J9555m16380k38802K99480K32392p1916k42982J08510
7006d8287J62142m6975J51196J7338j00871J2987M283j7940P7117j8072n7631
$$ y = [-195812, -326001, -215764, -152623, 43432, 155921, 290605, 372691, 213761, -6330, -2883, 266811, 415127, 483328, 580938, 657973, 596602, 476903, 317440, 208796, 16939, -219302, -319860, -306213, -185332, -72935, 41173, 182614, 185380, 183716, 218986, 259449, 338897, 375430, 101935, -108879, -97189, 23476, 155013, 114042, 121001, 175171, 182894, 268781, 314605, 81849, -226380, -242282, -46459, 134572, 369792, 504826, 583419, 559116, 523435, 488032, 469364, 641201, 604758, 450281, 420266, 459568, 306049, 80027, -53318, 31824, 261856, 281411, -134969, -373771, -74291, 158101, 86185, -156797, -48287, 113855, 66880, 218076, 235414, 134543, 147530, 151813, 133873, 210990, 192918, 135287]
6995A35287L9607J8516J17736p1417j6645L4019N2887J8297k63r8389j95160q5585
6983e1110J8319K12150K24841k0152m1088l6272k9252j44030N0119N2288p0808
6972A65005l530J5723J8233P8758Q5039K52855K52284l2434k22834k59065j23072
6961B26962j0700J20661P7321k01844l28299j39222r708l254o9665o210J57943
6950a86015K01347k8077n8383O6087J24610O3844N292j10998n6817R0425Q1071
6939A92386K25727J85974O2337r5385j18318j76381j11167r911k06006o4408M9740
6928f5412p0837k6492L4628n9947l652p9704j69597J35639M35844J29310J1251
6917B71031K9060j00680p8058j6676N6484P7297J11474N592n2896N421o6764k10038
$$ y = [135287, 174894, 193410, 311146, 239729, 223084, 257103, 309990, 328287, 328024, 229635, 34475, -51110, -32791, 179359, 404200, 384048, 342960, 306688, 277436, 133406, 183525, 235813, 165005, 161475, 177198, 195431, 274189, 359228, 612083, 864367, 831933, 609099, 350034, 226962, 216262, 336923, 414244, 212400, -115899, -255121, -264829, -268083, -337748, -343958, -186015, 15332, -12745, -71128, -5041, 119569, 183413, 188705, 77707, 20890, 111315, 192386, 418113, 604087, 666424, 571039, 452721, 276340, 165173, 155262, -50744, -115152, -65412, -136249, -162741, -128113, -188060, -191712, -271416, -441013, -305374, 130470, 259780, 271031, 300091, 199411, 121353, 104677, 161161, 238458, 349932, 355524, 302628, 308049, 241285, 31247]
6905C1247j40522p325l7837r2626O104Q0930J51135M7142J93286K15837m084j23038
6893C20249j75279k4072J61970R7382j17022j78713m0579j02768J22351K01360
6883B64879j52026j84491J30154K36303K9539j9885j2208R1636O8005j63468r8884
6872A89554Q4597J56933K252n9823j04438l4648l2078q9101r1846j64697n2246
6861a95541O9996J82315L8591p2623j74011q6555J54557K18519J74329J90046
6851D99623J0449l55435k52265n2763K07355J77649k87572k18654p1780J55664
6841a87729K16182K4246K3122K06226J47690j9006p9917l2452q4963m8296p9533
6830H5570O4191L1762j37952j20108n6187p5088R0030J38938j41756M8166K6881
$$ y = [31247, -109275, -116600, -154437, -247063, -240959, -160029, -8894, 38248, 231534, 447371, 443287, 320249, 144970, 120898, 282868, 380250, 263228, 84515, 43936, -58832, 63519, 264879, 112853, -71638, 58516, 294819, 324358, 304473, 292265, 383901, 451906, 288438, 189554, 274151, 431084, 433336, 373513, 269075, 234427, 202349, 113248, 21402, -143295, -195541, -125545, 56770, 95361, 22738, -151273, -237828, -83271, 135248, 309577, 499623, 510072, 154637, -97628, -150391, 56964, 234613, -52959, -271613, -343393, -187729, 28453, 52699, 75821, 282047, 429737, 410731, 330814, 298362, 213399, 165103, 85570, 149761, 181523, 43571, -76537, -132724, -207812, -117782, 21156, -120600, -72434, -45553]
6819d5553p4700L8389N5654J14928q9378j26954R3018P7733p5396j49464P5707
6808a06016l7875k45798n5908j35514o710J86212K61255J32170n0072j44877l08138
6797e11271l7488J48332J29650O7804K07055K07294p1240n7766L9303N9247k2289
6786A58631K2770M0229j61721j67837q1966j9176J01760K26296J68494J19833
6776D07313r3539k05573n0639r8234j89883j01531M5719J96098K30398N2894p68
6765A92255j18125j48608j08889q9253n456O4902J53553P1431j33170r9726K7371
6754a93715P297l9089l8750J875K75500K77755Q0415J3788n2887M6942j58743
6743B20388j94482Q2539J75881J36047J89936L0001q3948j65548L731R0727J08025
$$ y = [-45553, -120253, -81864, -26210, 88718, -660, -127614, -34596, 43137, -32259, -181723, -106016, -143891, -389689, -445597, -581111, -587821, -401609, -140354, -8184, -58256, -203133, -511271, -548759, -400427, -270777, -202973, 4082, 211376, 140136, 82370, 121673, 180920, 158631, 181401, 221630, 59909, -107928, -189894, -209070, -107310, 118986, 287480, 407313, 313774, 108201, 57562, -40672, -230555, -332086, -286367, -90269, 140129, 193023, 192255, 74130, -74478, -183367, -272620, -278076, -213174, -59621, 11810, -121360, -221086, -193715, -186418, -225507, -264257, -262382, 13118, 290873, 371288, 385076, 332189, 379131, 220388, 25906, 108445, 284326, 420373, 610309, 640310, 556362, 390814, 394545, 485272, 593297]
6732E93297l8719j17115j39122M6142Q6476o916l8837m6144j42610j18117o9586
6721H749m5181R9628J69005K88419J57684j14821j47158k51449j57550R3378J56795
6710B57499J77140k7697l714j5573k43230k74778m9706O3746j84293j82878k6311
6699e09795K70757L20491J39027l5447j94719j45306K2258n0409j34518j05053
6689d22714m3956j0J41429J37554J5158n0995l6749O4591R9181K9580P1848M546
6677I463k33403j39029K6981Q6436m3360n5660O170J95943K48701K226r4793k26034
6665b16359j75773J1273J13605K16191j8404k52391M7708K85699Q2074P9988J06179
6654B79790L8197j76871k05855p0541Q6343N0346o8070j76176j48944Q594J37963
$$ y = [593297, 554578, 437463, 298341, 344483, 430959, 424043, 385206, 339062, 196452, 78335, 8749, -36432, 63196, 232201, 520620, 678304, 563483, 416325, 164876, 7326, 100704, 257499, 434639, 406942, 403228, 387655, 144425, -130353, -180059, -116313, -300606, -483484, -509795, -239038, 81453, 220480, 185033, -9686, -154992, -132734, -183143, -317661, -422714, -466670, -466680, -325251, -187697, -172539, -223534, -260283, -195692, -96511, -66931, 4917, 9463, -223940, -362969, -335988, -249552, -292912, -348572, -342402, -146459, 102242, 104468, 9675, -216359, -392132, -380859, -267254, -51063, -69467, -321858, -274150, 11549, 93623, 173611, 279790, 317987, 141116, -64739, -135280, -48937, 1409, -66661, -242837, -391781, -383187, -245224]
6643b45224J80516k27346p0211L02678J06453o8506l8499k5730m952M5586J25214
6632G9979J88234p142J38794O5147N4852q0618p6480J19756K531j16234j8596
6621C50223k62495k27036n6606j9251J59919O7652j64876J5932J19929m1537J7317
6610d0829K9871r9155j99409j19346J01662K98960J39660p2532r0210m7796Q1058
6599a8066Q168J02800L58834J05592J5663J15516l5165k29868l61172j44220N0720
6588c1198J3810P989J5016q5154p7091K11201J99719q8361k60547k46661J32414
6577b08863K64082K50565k2938r5375J2594j43577k4633K00253K77220J93790
6567G03118j08923l24455j19837n1255k58693q6656q721J30345Q8326K089J46485
$$ y = [-245224, -64708, -292054, -362265, -59587, 46866, -21640, -60139, -85869, -90821, -45235, 79979, 268213, 261071, 399865, 465012, 519864, 439246, 362766, 482522, 485053, 368819, 350223, 87728, -139308, -195914, -215165, -55246, 12406, -152470, -136538, -16609, -58146, -40829, -10958, -110113, -309522, -428868, -327206, -28246, 111414, 38882, -51328, -99124, -18066, -9898, 92902, 451736, 557328, 572991, 688507, 653342, 423474, 62302, -81918, -31198, -17388, -9399, 5617, -79537, -156628, 54573, 254292, 165931, -94616, -341277, -208863, 55219, 305784, 282846, 187471, 200065, 56488, 31855, 232108, 509328, 703118, 594195, 269740, 149903, 98648, -160045, -246701, -255422, -125077, -36751, -34662, 111823]
6556A11823J21154K1246N7671j39646m1001N6307J77697L8833k75082j39329L3012
6545B2685K6176J26709J39251n6658p3609o4253l7915J3807N8343J569m5293o0192
6533E0620j80737j41251O5833K07777M06137J44121j92502K7725M4771m5478N0491
6522D37507J30260o0740k77149L1804J82694K267M9941J19057j21039k53783k19704
6511B1115k62043j97803J00684K24032K19850K13253O872j26357j27143j48415
6501g5955l09445k95781p3169J92906J14647J21304K18150K04925R9731r9159
6491I8154j38637j43020J69303Q3389j87572j63017R6570L7915r7898J04113N5888
6480h4812r5492M6281K24050Q0065k5967q357n5616q7429j12033J04127J30738
$$ y = [111823, 232977, 254223, 311894, 172248, 131247, 187554, 365251, 404084, 129002, -10327, 22685, 48861, 175570, 314821, 258163, 184554, 120301, 82386, 96193, 154536, 156105, 110812, 50620, -130117, -271368, -205535, 2242, 408379, 552500, 359998, 387723, 432494, 387016, 437507, 567767, 507027, 229878, 261682, 444376, 446643, 496584, 615641, 494602, 240819, 21115, -240928, -438731, -338047, -114015, 105835, 319088, 325960, 199603, 72460, -75955, -385400, -681181, -754350, -561444, -446797, -325493, -107343, 97582, 197313, 98154, -40483, -183503, -14200, 69189, -118383, -281400, -184830, -146915, -244813, -140700, -84812, -180304, -134023, 90027, 170092, 144125, 135768, 80152, -7277, -119310, -15183, 115555]
6469A15555l4431j210p616l6191J0693j33220p8509J08357J44772J80719m8335
6458B20584m6942j05738j80193m1230O3005j5638r5789r5181j98919K3372J62361
6447c10308J42463J84104R4951j31703q0599k1911J29948O2857J69739N0165j99430
6436I0276j98197o6992N8574J50722J48046R7841J84378J54415Q857q435k23367
6425C96118l54398m9550K34616k7540j26494K1880j27513j58979o4285j53968
6415d10113O7227M57785K45067k27570k89689J7749m9875m5665N1006P6824n787
6404a13041k43717k77271N9660L66209J15370J0685q4894j52709J47241J66250
6394f217r7098o7828l1300M5949J97223L31851O8842J2830O3270J12610j06337
$$ y = [115555, 81124, 79914, 72298, 36107, 46800, -86420, -164929, -56572, 88200, 268919, 220584, 173642, 67904, -112289, -153519, -90514, -106152, -201941, -297122, -496041, -472669, -310308, -167845, 16259, 111210, -20493, -101092, -123003, 6945, 69802, 239541, 289706, 90276, -107921, -174913, -116339, 34383, 182429, 280270, 464648, 619063, 627920, 619485, 396118, 41720, -7830, 226786, 199246, 72752, 94632, -32881, -191860, -256145, -410113, -342886, 114899, 359966, 132396, -157293, -139544, -189419, -235084, -184078, -107254, -113041, -356758, -634029, -574369, -208160, -92790, -82105, -166999, -319708, -172467, -6217, -103315, -171143, -202443, -156494, 40729, 372580, 441422, 454252, 517522, 630132, 523795]
6383E23795l06451j18983R4253N7069k00170j06290O4576M9276j97138m4571J55017
6372b9617k2384j42382o4117k6970M677R9912J09294J98430J81755J71651J0986
6361D91235j27882j4131M460J6746J45526k40674l61223j99556j3629L4019J64792
6350a00317P6980j04763n2756Q4752n582k46257m3687J37025J08449K00576L56207
6339D10627K94567J15952k2704l34823k89929j14241j82421j57996Q4201J70661
6329b6106O5835J27330K446j3175m2039K51537K03357k55428j38363n6102j72385
6318e3093L3214K54238n3349k62456j61341o8405J38865K34146L27210L38120
6308G27149K99591n9760k19426m2174j32070j37514l1557q628p7292k48057k01851
$$ y = [523795, 217344, 98361, 192614, 249683, 49513, -56777, 7799, 57075, -140063, -184634, -29617, -52001, -194383, -258500, -285470, -280793, -180881, -71587, 126843, 308598, 480249, 491235, 363353, 349222, 353682, 370428, 515954, 275280, -85943, -285499, -299128, -265109, -100317, -23337, -128100, -180856, -96104, -101686, -347943, -391630, -254605, -146156, 54420, 410627, 705194, 821146, 798442, 463619, 173690, 59449, -122972, -280968, -196767, -26106, 39729, 167059, 169505, 156330, 114291, 365828, 569185, 313757, 175394, 119292, -53093, -19879, 234359, 181010, -81446, -242787, -311192, -172327, 61819, 389029, 727149, 1026740, 966980, 747554, 705380, 573310, 435796, 404239, 395611, 318319, 70262, -131589]
6297a31589k04115j40946K7187M4731K07312J06979P4948P5876l2031J19514J23488
6286B71354k4846o9211k27318k50405l6935J49380J35566R1178j7835j64186l5996
6275a79254n0766P7214J26418j45413k00731J37518J17635J03846K1770J42265
6265A50502K55468J60897q4094j41843j36218j46039q8116r9851m4652J88531
6255A4585L15924J79926J68960J15661J45788L0640j14527k11256k78308p4203
6245B93190j61145k45473j49123o5390m1047j7638m2819O7591O5653j63069j84358
6234f43628J37903M11368L35756J48893j36349j84199r7664J38399J84051O0305
6224C54835j27470j28502M9212J25124J88578Q0482m9764l31492j77760N1915
$$ y = [-131589, -335704, -476650, -449463, -404732, -197420, -90441, -15493, 60383, 28352, 147866, 271354, 246508, 177297, -50021, -300426, -337361, -187981, -52415, 38763, 20928, -143258, -179254, -230020, -152806, -26388, -171801, -372532, -235014, -117379, -13533, 8237, 150502, 405970, 566867, 482773, 340930, 204712, 58673, -29443, -129294, -173946, 14585, 330509, 510435, 679395, 795056, 940844, 971484, 856957, 645701, 367393, 293190, 132045, -113428, -262551, -327941, -368988, -386626, -429445, -361854, -296201, -459270, -643628, -505725, -94357, 241399, 390292, 253943, 69744, -27920, 110479, 294530, 354835, 227365, 98863, 148075, 273199, 461777, 542259, 492495, 161003, -16757, 35158]
6214C5158l7809q9606n6538q9346k0155J08768N2394j7844p130R8759J52362J34176
6202B63189P4736n0538j09700j03743p3988M0505O0342J1361J46340R5748J8861
6191C73113N4201p2262p0719l9134j64986j99881q0994O1698K4303o3339Q0064
6180i7936Q1363M7158k8476K08115J83896j98751j34978Q7346J16679Q3883R352
6169C57651o074r4407k69944o9236R7245L4099J52386N2677j07268k23083j01188
6158a77142J60235R8281K0843R4678J3168j01650l9971O3336l3428j41773l400
6147d6823j1961k9698j66509m8633n4722k01480r652N8143J11310N1477M4320
6136c04228J41572P4934p1982J21871P0170m1861J10353j4607r6730j17292n8662
$$ y = [35158, -2651, -92257, -148795, -238141, -258296, -149528, -97134, -114978, -122108, -23349, 129013, 263189, 337925, 287387, 177687, 73944, -44, 40461, 100803, 112164, 258504, 354252, 373113, 427314, 355052, 284333, 245199, 80213, -119668, -200662, -138964, -114661, -178000, -97936, -16573, 30585, 2109, 210224, 394120, 195369, 60391, 147737, 264416, 348299, 357651, 351577, 257170, -12774, -82010, 15235, 49334, 201720, 254397, 147129, -75954, -177142, -16907, 81374, 102217, 196895, 210063, 108413, 68442, 131778, 98350, -43423, -46823, -58784, -88482, -254991, -303624, -358346, -559826, -569478, -511335, -400025, -348548, -304228, -162656, -87722, -159704, -37833, 32337, -9524, 100829, 86222, -10508, -127800, -186462]
6125a86462L1411j6418J02842K32287m7704o5758R651J88170K45422k9377p1859
6114C92205J1803J77346o7439q2667j17256j47223L8804j7101J0751J58450m8875
6103C08798m6881R5406K7171M7876j05914j37276j50265j14901j22398R0033J49102
6092D0751q1195k74047J5120K06089K67279J45934l0426J7862r7092n595K17210
6081D21890K77121j5428l10533l54344k26613O8145L05630J43977Q1783J2662
6071D04290j83974r5489j68439k1625r924K20019J79758n5022L0325J05676j32563
6060B73032k11709j547J20602j14m5403m3523M732P824k4776o0953j453j18482
6048a01770r1050K7174P8152J89819L12029P9825m9468n305j84033K3926K05842
$$ y = [-186462, -155051, -171469, -68627, 163660, 115956, 50198, 59849, 248019, 493441, 464064, 392205, 404008, 581354, 513915, 431248, 313992, 166769, 205573, 188472, 199223, 357673, 308798, 261917, 357323, 384494, 432370, 326456, 189180, 38915, -75986, -198384, -108351, 40751, -40444, -314491, -299371, -93282, 173997, 319931, 289505, 307367, 210275, 204680, 421890, 699011, 683583, 373050, 18706, -207907, -139762, 165868, 309845, 391628, 404290, 220316, 124827, -43612, -65237, -75161, 144858, 324616, 269594, 299919, 405595, 273032, 61323, 59776, 180378, 180264, 134861, 91338, 96070, 103894, 79118, 18165, 16712, -101770, -192820, -165646, -87494, 102325, 414354, 494179, 444711, 439406, 255373, 279299, 485141]
6037D85141j69614k27804q1459k4959J0922p3550J27338J71376r2899j01226k40847
6026b17581k17951J49894L22371L08466J12309n0797k29748j82521M8451j6864
6016B6029J22277J43841n5775m3268K8658p8055j25K40294P8190k35406j67410
6005E9250o2891j08170k00407j52044R6057K82079K77640J4407o7907k69647k90047
5994d21680r1217J08556L32113M2509j53997J9225j1104p1054j03044N9022J9613
5983b71058p2171P3189K01574r61o1532l43L0090m7202L2865J20511m1043M7133
5971A1052P7888j18416k06841j96732P3607K56215P8066j40024P6291n7604P8842
5960f7656J56087R8017O643J5886k5976J05672K97503j2282k04486k36792q5986
$$ y = [485141, 315527, 87723, 6264, -18695, -7773, -81323, 46015, 217391, 124492, 23266, -217581, -435532, -285638, 36733, 345199, 457508, 406711, 176963, -5558, 42893, 26029, 148306, 292147, 236372, 193104, 221762, 143707, 143582, 383876, 462066, 226660, 59250, -3641, -111811, -312218, -464262, -368205, -86126, 191514, 205921, 138014, -131633, -421680, -512897, -404341, -72228, -29719, -183716, -164491, -175595, -246649, -349693, -290671, -271058, -343229, -270040, -68466, -69427, -130959, -131302, -101212, -148414, -115549, 4962, -36081, 11052, 88940, -29476, -236317, -433049, -359442, -103227, -25161, -165185, -88894, -146498, -67656, 88431, 186448, 193091, 208977, 183001, 288673, 586176, 573894, 369408, 132616, 46630]
5949D6630q8601j68459K0000M1735j89431j30916J83452K69456P2123k43n312
5938E0434N4111J33433q8457l3038p9914n4090j08341l66735M3534K31828L8810
5927a78425r3269j7594J18333n4928j21991R2304K47670J69992j5030o4544K2947
5916A05465N9722P2050k23324l26384o4370J62461n7643J9094L59053L63821P1756
5905E41701j5445l8849r6167j90098L154K6539p7987j65630o9567N6850o2479
5894h7978N0762J28631K8867j51879J3298J94519O6711j7660m0216k2384K8007
5883A90678J6250k79775m3151K51573J50976n5592j60971K7823J63842j4060j26573
5872A21020j21225r414Q7507M2794q8865L4996J23893n0276j23796k02395p4671
$$ y = [46630, -41971, -210430, -190430, -148695, -338126, -469042, -285590, -16134, 55989, 55746, 50434, 104545, 237978, 149521, 116483, 36569, -17521, -125862, -492597, -449063, -217235, -178425, -271694, -289288, -170955, -225883, -347874, -255570, -7900, 162092, 147062, 82518, 105465, 165187, 237237, 13913, -312471, -376841, -214380, -272023, -252929, 106124, 469945, 541701, 526256, 487407, 391240, 201142, 204296, 230835, 152848, -12782, -82349, -25499, -87978, -37216, 91415, 120282, -31597, -18299, 176220, 242931, 225271, 185055, 162671, 190678, 206928, -72847, -115998, 135575, 286551, 230959, 69988, 97811, 261653, 247593, 121020, -205, -9619, 77888, 120682, 31817, 66813, 190706, 140430, 16634, -185761, -260432]
5861b60432K03393K97650J696o1464o8470L7008P8806p356j26298j20185l0183
5850e5835m2870N7644P4732K5158m5256k829K0210j65242M9486O2669J8628J11469
5838A07964P7288o9541k22920j96095l8129L7348J22306J62539J49967Q9248M9785
5827B69760o3087j61487j22983o0554L2114J58016Q2615j98869k39694j01896
5817d06065M9888K11289L47699K19547k8804q5739k16324k17658M2461P4719J20207
5806A11220K6274J42051L40815P8907k22055m15384k47237n1572P0902K26043
5796E9964P8048j68852k19730m2598J6442N598r0572j55011o5787J22256K51584
5785b08658J67405q2273j48346j3512J0494j83561N5480L18483O1463m7426J16844
$$ y = [-260432, -57039, 240611, 242307, 180843, 112373, 149381, 228187, 220831, 94533, -25652, -55835, -98705, -41061, 33671, 58829, 13573, 10744, 30954, -134288, -84802, -22133, -3505, 107964, 185252, 115711, -107209, -303304, -341433, -304085, -181779, -19240, 130727, 219975, 269760, 206673, 45186, -77797, -138351, -106237, 51779, 134394, -64475, -304169, -406065, -356177, -144888, 202811, 422358, 393554, 307815, 91491, -126167, -83706, -8987, 111220, 137494, 279545, 620360, 699267, 477212, 61828, -185409, -236981, -166079, 59964, 138012, -30840, -250570, -293168, -276726, -271128, -361700, -516711, -582498, -460242, -208658, -41253, -123526, -271872, -285384, -274890, -458451, -402971, -84488, -23025, -70451, 46393]
5774D6393K5912k5517l9973j30079q2913j55340p8791o06N4199J26336R9125n3035
5762b14289Q165P2476j21111j57815j269J00536j0207R4006J29905R2537m6694
5751e3760J3610M2718j7018q064N4142q569j93797j52452j7883J5249P2852J81029
5739g1943r835m7800k09115j24052P0223n7855O334J57571K28182K44065O952
5728A92727m3801O0839P8997n273Q647o9198j16046j36158r2853j6053J25993
5717a2179p1380l3641L9980j07475R4037P2901n8834k36997j79011J46400J34127
5706b12072m3630n5079J53149J74800R6241k9052j39890j45133K99802K79566
5696C78702L0536P8208J15882j76260k49783o2027L4769p222n9543p8477p5807
$$ y = [46393, 72305, 46788, 6815, -123264, -206177, -361517, -440308, -440914, -386715, -260379, -161254, -214289, -206124, -133648, -254759, -412574, -413843, -313307, -323514, -229508, -99603, -7066, -53760, -40150, 2568, -14450, -22514, 31628, 23059, -170738, -323190, -341073, -325824, -252972, -71943, -81778, -129578, -338693, -462745, -392522, -450377, -444043, -286472, -58290, 185775, 192727, 148926, 209765, 288762, 283489, 292136, 222938, 106892, -29266, -122119, -138172, -12179, -83559, -117200, -77220, -184695, -90658, -17757, -76591, -313588, -492599, -346199, -212072, -255702, -310781, -157632, 17168, 113409, 84357, -55533, -200666, 99136, 378702, 409238, 487446, 603328, 427068, 177285, 115258, 150027, 142805, 83262, 4785, -71022]
5685g1022R0044O8525j04582n4358J75327J86314r4999k40797k6073J48347J50683
5674B27409R3511m6625j89154j50167j05696n0052J18397L34341K09695n2823
5664C88836o7074q1482j46840j14500M6312J03286m8076j06888j66352j2146N0196
5653a54728O5340K4801j36000K7090l2231N8093P7175j06568l07765k40620m5717
5642g71130J46933K29862J16795P0017R9296J08629K32058Q9996o4815r2239j04896
5631F0506k46459j20901J01892K78591K01683K29242J80726j16431r5184q5652
5621C88013j16367M1374N2580j43493j93878o4615K44403n5532k17396q6501Q7289
5610f4123K24427J41164j28065j89560j51835n9567n7950r7486k0420J4864M5056
$$ y = [-71022, 19022, 87547, -17035, -71393, 103934, 290248, 195249, -45548, -71621, 76726, 227409, 320920, 274295, 85141, -65026, -170722, -220774, -102377, 231964, 441659, 388836, 321762, 240280, 93440, -21060, 25252, 128538, 80462, -26426, -192778, -204924, -154728, -89388, -64587, -200587, -173497, -205728, -147635, -70460, -177028, -484793, -725413, -771130, -624197, -394335, -277540, -207523, -108227, 402, 232460, 322456, 257641, 165402, 60506, -185953, -306854, -204962, 73629, 275312, 504554, 685280, 568849, 473665, 388013, 271646, 313020, 365600, 222107, 28229, -36386, 208017, 152485, -64911, -151412, -64123, 160304, 301468, 173403, -16157, -167992, -227559, -285509, -382995, -403415, -388551, -343495]
5599c43495J91138K25020k1886j38217j8244J57426J48300m5241k12159L8109
5589a9249Q1562J8207J0182j22236j09599M0914K01051N8373J05713J89014K1168
5578D75100k21972k53879r4298J54332K41877J98101N7233k0446k29001j66034
5568A41013J00967J98816p0135j97908K3591k15049l41295j06884K17919K33216
5558a5749K12655K9812k14296k09169m3327K55578J53410r9746q4693k8061j16134
5547a59720J54469K69167J08450r3098m3453Q1060J28063n8929j25684k34824
5537B5501j02273j5408n7770K24085L39583J95269r7913k12948k90950l14966
5527c07790k66853Q8878J87154K20395J60139J02030L6259l6297p2686L3499J75421
$$ y = [-343495, -152357, 72663, 50777, -87440, -105684, 51742, 200042, 154801, -57358, -19249, 62313, 80520, 90702, -31534, -141133, -100219, 100832, 159205, 264918, 453932, 475100, 253128, -751, -95049, 59283, 301160, 499261, 556494, 536048, 307047, 141013, 241980, 440796, 370661, 172753, 196344, -18705, -360000, -466884, -248965, -15749, 196906, 226718, 12422, -196747, -240074, 15504, 168914, 69168, -15525, -43586, -159720, -5251, 263916, 372366, 279268, 235815, 316875, 444938, 386009, 260325, 25501, -76772, -92180, -149950, 74135, 413718, 608987, 511074, 298126, 7176, -307790, -574643, -485765, -298611, -78216, 81923, 183953, 220212, 183915, 111229, 144728, 320149]
5516C20149J63670R3353M2330j07611p6840k00884l17113n5322l7446o2717m0289
5505b78720K3500O3830J07457J60932P0554J38280K7703k8456R1858r2246k11582
5494G3110o7447o4007q4346n5472J46044L9587p7022J8621j9079j82194k34287
5483e06492J05702K09859K2097O8851K2576o9590J43795J93930k5890o1913Q1742
5472A84667Q127L7727L505j62887k38384j21393J72420K28390M319k12566j97590
5461b93665j7688P6441O1122K5263J21235K46800M04580K13863p6566k22031k12335
5450C27019j38735k17860r5857N4453J50712J16788j45281o7701J0468r4387o5792
5439a66173n366J51288J10531l5853K5460J419J10834J47048k4135L4757M5647
$$ y = [320149, 483819, 577172, 619502, 511891, 435051, 234167, -82946, -138268, -175714, -238431, -278720, -255220, -191390, -83933, 76999, 147553, 285833, 313536, 285080, 376938, 284692, 73110, 5663, -58344, -142690, -198162, -52118, -12531, -89553, -70932, -90011, -272205, -506492, -400790, -190931, -168834, -99983, -77407, -146997, -3202, 190728, 164838, 102925, 184667, 192794, 230521, 234026, 71139, -167245, -288638, -116218, 112172, 116491, -96075, -293665, -311353, -234912, -173790, -148527, -27292, 219508, 624088, 837951, 761385, 539354, 327019, 188284, -29576, -125433, -70980, 79732, 196520, 51239, -16462, -5994, -100381, -166173, -171539, -20251, 90280, 54427, 79887, 81306, 192140, 339188, 315053, 349810, 395457]
5428C95457j76935l4533J48407N3913l60494j53221L6948j85980k05807J2458
5418d69787J09191J89586Q9828o0460j30068j83045j72527K3410J77380J43871
5408b82621J02157L8010J57725K71949R363r1034m8438j21494q1890J30578J60000
5397B44305j20227j72252j25006J4623K39314K67640K34303j04581m41986k29988
5387a93855R7034K74174N3458o6702J17794L7251j46103j91981n0511j46837k7579
5376b43857P3149M9473J00278Q2734J40201q0274k39715K3015J32335K18195J30007
5365C85541j68931j28813j42995m873M4222m2936j55807k84745j03637Q8976Q2592
5354d31406q2235K7914J41464o893j74066j07276R1121J78978K9962J63782J13788
$$ y = [395457, 218522, 183989, 332396, 386309, 25815, -127406, -90458, -276438, -482245, -469787, -360596, -171010, -81182, -141642, -271710, -454755, -627282, -603872, -426492, -282621, -180464, -142454, 15271, 287220, 296583, 205549, 157111, 35617, -46273, 84305, 244305, 124078, -48174, -173180, -158557, 80757, 348397, 582700, 478119, 36133, -193855, -96821, 177353, 230811, 164109, 281903, 319154, 173051, -18930, -69441, -216278, -243857, -170708, -121235, -20957, 61777, 201978, 121704, -118011, -94996, 37339, 255534, 385541, 216610, 87797, -55198, -60071, -15849, -58785, -214592, -499337, -602974, -513998, -431406, -513641, -485727, -344263, -351156, -525222, -632498, -541377, -362399, -332437, -168655, -54867]
5343e4867m9032o657n5103j0673P6356L6541k2297n8741j13170Q8802K09250N3291
5331I3700J12859K51500O3475j72413l19605j83318K6418L02818M6093J9136J54908
5320C95571R3984m3331k30374k71835j95647m8124L4907P9091j812J7604J24472
5309d5494J41996R7597J74601J01966k09275k33732n9258k4825o6075r2542j11510
5298c26551j07640l6105M6125J49615J78503J50613n709M7704N1857j82723j83636
5287b17947K9741l4668k21735r6116J96170K87054J08163K9071N4938q6383m5863
5276B425n4017J5665J41028Q8760k2210k43695k65672j36134K0859J50207Q7102
5265b15682K4385N8484J03145L19535N5414j60576j9847J24866j36042k65229
$$ y = [-54867, -103899, -110556, -165659, -176332, -99976, -63435, -85732, -144473, -257643, -168841, 40409, 93700, 206559, 458059, 521534, 349121, 29516, -153802, -127384, 175434, 221527, 240663, 395571, 489555, 446224, 215850, -55985, -251632, -299756, -264849, -185758, -187570, -169966, -45494, 96502, 194099, 368700, 470666, 261391, 27659, -31599, -56424, -122499, -215041, -326551, -434191, -470296, -424171, -274556, -96053, 54560, 48851, 96555, 148412, -34311, -217947, -188206, -222874, -444609, -540725, -344555, -57501, 50662, 79733, 134671, 48288, 2425, -51592, -35927, 105101, 193861, 171651, -72044, -337716, -473850, -452991, -302784, -215682, -191297, -132813, -29668, 289867, 345281, 184705, 164858, 289724, 153682, -111547]
5255a11547l5048K2596j19529j52893j5031J9798J05440K04564K26950K20586
5245C65886M8629k85862k51918r4665P224J08894L0332L0527J1656R7808K67850
5234C36361k1627j48830j95965j27295l0931K0501O3483L3906J62204J26641J2109
5223B30557j47885j36510j36986k23081O4481L05387J70983j88298k18369n1910
5213c31631m4802O8136Q6844K97136J57135j4894L4777j54788q6340p6608j36384
5202b01419j6270j19569n3315N2332O4772L8919r636R0019J74533L5152j61225
5191a05707k95459j42483j891J24718J55543J40518J05640J69599J56883O449
5181C13810j97057j87079J07447K81330J60166p9489j83921m4601m5680j03464
$$ y = [-111547, -146595, -123999, -243528, -396421, -411452, -391654, -286214, -81650, 145300, 365886, 414515, 128653, -123265, -217930, -210706, -101812, -71480, -40953, -29297, 68511, 336361, 314734, 165904, -30061, -157356, -188287, -167786, -104303, -70397, 91807, 218448, 230557, 82672, -53838, -190824, -413905, -349424, -44037, 126946, -61352, -279721, -331631, -376433, -308297, -221453, 75683, 232818, 217924, 252701, 97913, 11573, -65035, -201419, -217689, -337258, -390573, -338241, -273469, -234550, -244186, -154167, 20366, 55518, -105707, -401166, -543649, -545540, -420822, -265279, -124761, -19121, 150478, 307361, 313810, 116753, -70326, 37121, 318451, 478617, 399128, 215207, 170606, 124926, 21462]
5171B1462k38750r5736J22314P1039N2092j2945J03525K36184J47979k5642k8121
5160C53401k1055j26895j52842j03462K14154K17848r5326p6135q1699j78556
5150e0567p8863j28705j28899N2311J52049K32602J11862j68783k31574p9281
5140c17848P479K6228R9557K827k5707P5197N8444m6158p07J19501J21521M2802
5128A63136j2722j88683p7778n9576L6302Q2032L5671m7621j82615j55053L7785
5117c69122P9503j5739L0823J23358L1774j1988O1382K5725o1433k44246k23147
5106e73110m8862j41994j23095K44645L43089J98723N223k0647j81786j69116
5096d66930N380L04334K64987L7518j67829k53776j52046j28256n5687K05170
$$ y = [21462, -217288, -313024, -190710, -119671, -67579, -80524, 23001, 259185, 407164, 381522, 353401, 332346, 205451, 52609, -50853, 163301, 381149, 285823, 209688, 127989, -50567, -129430, -258135, -387034, -334723, -182674, 49928, 161790, -6993, -238567, -317848, -310369, -284141, -184584, -181757, -207464, -132267, -73823, -119981, -120688, -1187, 120334, 163136, 150414, -38269, -116047, -175623, -139321, -57289, -21618, -69239, -251854, -406907, -369122, -289619, -305358, -274535, -151177, -119403, -131391, -70009, -44284, -105717, -349963, -573110, -621972, -763966, -887061, -642416, -299327, -100604, -95381, -116028, -297814, -466930, -461550, -157216, 107771, 145289, -22540, -276316, -428362, -556618, -612305, -407135]
5086d07135K25199k232L0549J02886J95054J85152j98671m45370j99027J58316
5076c55279J67225J93634O7041M8170K2505K2337O5387L5874L116j84748k40008
5065a54746o376l3615Q0572o5872k07688K07723J74376m9480j27084J43578K84465
5054B45853l7971k51059K2743J22834O1451n5276O9745j6866j42566j39451J35941
5043A5378L23972J14976j87994j96379R8573K10529Q3849j98069k45221m1956
5033b2342j52202k08809J28519K60516P8223k14111l7650J47010J12295J29313
5023B20762K5277L7566K9983q1183L0285M3248J07093j9823j28362j19972J02100
5012B46974k8016k19204k98643k0943K84616N0916j06397q6459o2088L3590j14282
$$ y = [-407135, -181936, -184168, -153619, -50733, 144321, 329473, 130802, -314568, -513595, -355279, -188054, 5580, 72621, 120791, 143296, 165633, 231020, 266894, 270010, 85262, -154746, -161122, -194737, -114165, -180037, -387725, -180002, -5626, -55106, -182190, -38612, 245853, 207882, -43177, -20434, 102400, 163851, 108575, 178320, 161454, 18888, -120563, 15378, 339350, 454326, 266332, 69953, 168526, 379055, 462904, 264835, 19614, -22342, -174544, -383353, -254834, 5682, 83905, -130206, -167856, -20846, 91449, 220762, 246039, 283605, 313588, 232405, 262690, 305938, 413031, 393208, 264846, 144874, 246974, 218958, -246, -298889, -319832, -35216, 15700, -90697, -177156, -239244, -205654, -319936]
5001c19936J1359L8074J01761K15276R9522m2115q7884o3843R640K23108K56512
4990D41474J70086l1141j09081j31191j21618k26033j74825j66318j38221J06770
4980c80098J79346K0196j47246r3829J36107J85678J75259Q4257r445J937q1714
4969G0448q5624O8558J92084k9007Q7293J98288m1419j34361j13551j19557j53679
4958f0527J05990M01772K37432q6860l05215l54298j47811L7144L2922P0182L07235
4947B37966J99257j58826m45746m15695j29233J04136J3622j36792j7253K38698
4937e09866L82905J20845L4309K484J7697j7948p914P5044Q36Q8597J06665p5903
4925B17751k67639k41994p3235J25132R6203m4508j23834Q1933J75635J19075
$$ y = [-319936, -308577, -270503, -168742, 46534, 146056, 103941, 16057, -47786, -38146, 184962, 441474, 611560, 580419, 471338, 340147, 218529, -7504, -182329, -348647, -486868, -380098, -200752, -180556, -327802, -421631, -285524, -99846, 75413, 159670, 150225, 152162, 70448, -15176, 53382, 245466, 216459, 303752, 502040, 460621, 326260, 212709, 93152, -60527, 45463, 447235, 684667, 597807, 292592, -61706, -209517, -172373, -139451, -69269, 237966, 437223, 278397, -167349, -583044, -712277, -608141, -594519, -731311, -748564, -509866, -126961, -6116, 28193, 30677, 48374, 30426, 22512, 97556, 98392, 186989, 293654, 217751, -49888, -291882, -365117, -239985, -143782, -188290, -312124, -230191, -54556, 64519]
4915F4519K01139J76436J19175p3214k56770k52216q9741N3014P3660J36775J64838
4904C17615j14615q3738R8851j91452j84255J75288J21881j11884j18325M9122
4894d1512M1732o2417k8966p8590k29064j27195P2352K34752K04415J30644N1451
4883A67602m9248j70287j23635p2239J33132J63920J82664J24952p2747r3368
4873A90746p2267Q4857P1278r5863M2308q3331p8128J2731q057j0848p0075j12241
4861a28890k07115q6760J74732K07153J58754m6457r5623J39664J6188J35628
4851B67274J29531J9052L700k86792l76053q1846Q8043J65833L2678q6281m6476
4840a71337N0851K56850J39759k07379k36647O247L6619J24198L63964K55193
$$ y = [64519, 265658, 442094, 561269, 488055, 231285, -20931, -110672, -57658, 16002, 152777, 317615, 203000, 119262, 218113, 26661, -157594, 17694, 139575, 27691, -90634, -41512, 220, -62197, -91163, -169753, -398817, -526012, -453660, -218908, -14493, 116151, 167602, 118354, -51933, -175568, -247807, -114675, 49245, 231909, 356861, 284114, 190746, 118479, 203336, 274614, 178751, 221059, 137728, 59600, 72331, 64274, 53426, -16649, -128890, -336005, -422765, -248033, -40880, 117874, 71417, -24206, 115458, 131646, 267274, 396805, 415857, 419557, 132765, -243288, -325134, -237091, -71258, -38580, -124861, -171337, -120486, 136364, 276123, 68744, -167903, -161656, -125037, -839, 363125, 618318]
4830F18318q064r6600m1402m9150n5284N3643j26840k77288j69441q3314M3663
4819a91759J05902J38250J5983j17182k03243K06453L50514P7894n5813k89220
4809C7779m02712o7389J68002J01665J23223j0712j30916L8557R1056J33177j22345
4798d0615m3449m5381q3346l5857j0416Q212m2726O4774J65980J49148n2226k33343
4786a99245j21710j6285K19172J89989J02246P6809j02587r7974O02N8550R5332
4775B04899l0789j95632j21791J03213M7195j7992L18805N749k01620N770m4494
4764G3313K8964J50893Q3989j0609j85821p5424R0121Q4190j08068q370p612m0312
4752G5254l8119J10363m8466k28085n3748m5348j69293j93384L616K42102J39392
$$ y = [618318, 610254, 513654, 472252, 423102, 367818, 421461, 294621, 17333, -152108, -235422, -191759, -85857, 52393, 68376, -48806, -252049, -45596, 304918, 382812, 326999, 37779, -364933, -432322, -264320, -162655, -39432, -50144, -181060, -142503, -51447, 81730, -40615, -84064, -129445, -212791, -248648, -259064, -250852, -293578, -228804, -62824, 86324, 34098, -199245, -320955, -337240, -118068, 71921, 174167, 250976, 148389, 50415, 51017, 109567, 204899, 174110, -21522, -143313, -40100, 7095, -10897, 307908, 313657, 112037, 117807, 73313, 102277, 253170, 337159, 326550, 140729, 65305, 155426, 239616, 131548, 123178, 115566, 75254, 37135, 147498, 99032, -129053, -182801, -228149, -397442, -590826, -587210, -345108, -205716]
4741b05716o06j17529k75888r4399L6466K2626J0972N6843J82936K20413m7317
4730b11199Q598M0835p9394P2162K69354P2986k32988j69730r4206O1351J59903
4719a02328M6965R3115K22092J09246j67812o8146L0565P1786O546j60755j93168
4708a11894j92726l0692R8939m946P1265R947m5790J1101n3199j8346P163j7845
4696b77023P9691K93931K76355M6021J20533n5492j40717m8224j07504k55153
4686f7582p7875j4995J22117L21238K8395j24882j4857M7845J2446p2874j04514
$$ y = [-205716, -206322, -323851, -599739, -694138, -657672, -635046, -624074, -567231, -384295, -163882, -211199, -202601, -161766, -241160, -168998, 100356, 173342, -59646, -229376, -323582, -262231, -102328, -55363, 37752, 259844, 369090, 201278, 133132, 163697, 235483, 242029, 81274, -111894, -304620, -335312, -236373, -241319, -170054, -160107, -205897, -194796, -247995, -266341, -259178, -277023, -197332, 96599, 372954, 418975, 539508, 484016, 343299, 295075, 187571, -67582, -145457, -160452, -38335, 282903, 311298, 186416, 171559, 219404, 231850, 158976, 54462]
$$ [...]
##END NTUPLES=NMR SPECTRUM
##END=
