##TITLE=C13_47-2021
 DMSO, 600 sc

 30.6.2021
##JCAMPDX= 6.0         $$ Bruker NMR JCAMP-DX V2.0
##DATA TYPE= NMR SPECTRUM
##DATA CLASS= NTUPLES
##ORIGIN= UXNMR, Bruker Analytische Messtechnik GmbH
##OWNER= root
$$ XWIN-NMR		Version 3.5
$$ Wed Jun 30 11:21:49 2021 Russian Standard Time (UT+4h)  she@DPX200
##.OBSERVE FREQUENCY= 50.327896
##.OBSERVE NUCLEUS= ^13C
##.ACQUISITION MODE= SIMULTANEOUS
##.ACQUISITION SCHEME= undefined
##.AVERAGES= 604
##.DIGITISER RES= 17
##SPECTROMETER/DATA SYSTEM= spect
##.PULSE SEQUENCE= zgpg30
##.SOLVENT NAME= DMSO
##.SHIFT REFERENCE= (INTERNAL, DMSO, 0, 222.653)
##AUDIT TRAIL= $$ (NUMBER, WHEN, WHO, WHERE, WHAT)
$$ ##TITLE= Audit trail, XWIN-NMR		Version 3.5
$$ ##JCAMPDX= 5.01
$$ ##ORIGIN= Bruker BioSpin GmbH
$$ ##OWNER= she
$$ F:/spectra/data/she/nmr/c13/1/pdata/1/auditp.txt
$$ ##AUDIT TRAIL=  $$ (NUMBER, WHEN, WHO, WHERE, WHAT)
(   1,<2021-06-30 11:20:28.78 +0400>,<she>,<DPX200>,
      <created by zg, POWCHK disabled, PULCHK disabled
       terminated by command 'halt'
       configuration hash MD5:
       00 E9 B6 7A A2 85 ED C7 34 08 36 98 17 FE 4E 26
       data hash MD5: 32K
       98 15 8B 2E 07 F3 F5 D6 6A 4E DF 95 90 F0 9B 8E>)
(   2,<2021-06-30 11:20:30.93 +0400>,<she>,<DPX200>,
      <Start of raw data processing
       efp BC_mod = 2 LB = 1 FT_mod = 6 PKNL = 1 PHC0 = -352.0596 PHC1 = 34.36243 SI = 32K 
       data hash MD5: 32K
       99 B8 9A 23 8A 09 0B AE 1E 91 EB BA 7C 84 D7 0E>)
(   3,<2021-06-30 11:20:33.56 +0400>,<she>,<DPX200>,
      <abs ABSG = 5 
       data hash MD5: 32K
       EF 97 D8 D7 97 1D FD B6 D6 6C D6 76 B5 70 DE 94>)
(   4,<2021-06-30 11:21:20.84 +0400>,<she>,<DPX200>,
      <pk PHC0 = 13.71896 PHC1 = -14.2 
       data hash MD5: 32K
       3F 77 3F 78 37 91 9C E6 B4 C7 A8 C3 D3 47 9A E7>)
(   5,<2021-06-30 11:21:25.51 +0400>,<she>,<DPX200>,
      <abs ABSG = 5 
       data hash MD5: 32K
       61 75 1E 7F 79 22 E9 73 66 68 E9 03 6B 71 E5 35>)
$$ ##END=
$$ 
$$ hash MD5
$$ B2 6D E1 EB B6 C3 BF E8 5F F4 E9 D5 C3 E1 7B 0C
##$RELAX= 
##$RELAX= 
##$RELAX= 
##$RELAX= 
##$RELAX= 
##$RELAX= 
##$RELAX= 
##$RELAX= 
$$ Bruker specific parameters
$$ --------------------------
##$DU= <F:/spectra>
##$EXPNO= 1
##$NAME= <c13>
##$PROCNO= 1
##$TYPE= <nmr>
##$USER= <she>
##$AMP= (0..31)
100 100 100 100 100 100 100 100 100 100 100 100 100 100 100 100 100 100 
100 100 100 100 100 100 100 100 100 100 100 100 100 100 
##$AQSEQ= 0
##$AQ_mod= 1
##$AUNM= <au_zg>
##$AUTOPOS= <>
##$BF1= 50.322709
##$BF2= 200.13
##$BF3= 50.322709
##$BF4= 500.13
##$BF5= 500.13
##$BF6= 500.13
##$BF7= 500.13
##$BF8= 500.13
##$BYTORDA= 1
##$CFDGTYP= 0
##$CFRGTYP= 5
##$CHEMSTR= <none>
##$CNST= (0..31)
1 1 145 1 1 1 1 1 1 1 1 1 1 1 1 1 1 1 1 1 1 1 1 1 1 1 1 1 1 1 1 1 
##$CPDPRG= <waltz16>
##$CPDPRG1= <>
##$CPDPRG2= <waltz16>
##$CPDPRG3= <>
##$CPDPRG4= <mlev>
##$CPDPRG5= <mlev>
##$CPDPRG6= <mlev>
##$CPDPRG7= <mlev>
##$CPDPRG8= <mlev>
##$CPDPRGB= <>
##$CPDPRGT= <>
##$D= (0..31)
$$ [...]
##$SUBNAM4= <"">
##$SUBNAM5= <"">
##$SUBNAM6= <"">
##$SUBNAM7= <"">
##$SUBNAM8= <"">
##$SUBNAM9= <"">
##$SW= 239.972175391363
##$SWIBOX= (0..15)
0 1 3 0 0 0 0 0 0 0 0 0 0 0 0 0 
##$SW_h= 12077.2946859903
##$TD= 32768
##$TD0= 1
##$TE= 0
##$TE2= 300
##$TE3= 300
##$TEG= 300
##$TL= (0..7)
120 120 120 120 120 120 120 120 
##$TP= (0..7)
150 150 150 150 150 150 150 150 
##$TP07= 0
##$TPNAME0= <>
##$TPNAME1= <>
##$TPNAME2= <>
##$TPNAME3= <>
##$TPNAME4= <>
##$TPNAME5= <>
##$TPNAME6= <>
##$TPNAME7= <>
##$TPOAL= (0..7)
0.5 0.5 0.5 0.5 0.5 0.5 0.5 0.5 
##$TPOFFS= (0..7)
0 0 0 0 0 0 0 0 
##$TUNHIN= 0
##$TUNHOUT= 0
##$TUNXOUT= 0
##$USERA1= <user>
##$USERA2= <user>
##$USERA3= <user>
##$USERA4= <user>
##$USERA5= <user>
##$V9= 5
##$VALIST= <valist>
##$VCLIST= <CCCCCCCCCCCCCCC>
##$VD= 0
##$VDLIST= <DDDDDDDDDDDDDDD>
##$VPLIST= <PPPPPPPPPPPPPPP>
##$VTLIST= <TTTTTTTTTTTTTTT>
##$WBST= 1024
##$WBSW= 4
##$XGAIN= (0..3)
0 0 0 0 
##$XL= 0
##$YL= 0
##$YMAX_a= 4137983
##$YMIN_a= -2106202
##$ZGOPTNS= <>
##$ZL1= 120
##$ZL2= 120
##$ZL3= 120
##$ZL4= 120
##$ABSF1= 222.6533
##$ABSF2= -17.34351
##$ABSG= 5
##$ABSL= 3
##$ALPHA= 0
##$AQORDER= 0
##$ASSFAC= 0
##$ASSFACI= 0
##$ASSFACX= 0
##$ASSWID= 0
##$AUNMP= <proc_1d>
##$AZFE= 0.1
##$AZFW= 0.5
##$BCFW= 0
##$BC_mod= 2
##$BYTORDP= 0
##$COROFFS= 0
##$CY= -3
##$DATMOD= 1
##$DC= 0
##$DFILT= <>
##$DTYPP= 0
##$F1P= 0
##$F2P= 0
##$FCOR= 0.5
##$FTSIZE= 32768
##$FT_mod= 6
##$GAMMA= 0
##$GB= 0
##$INTBC= 1
##$INTSCL= 4.134877e-10
##$ISEN= 128
##$LB= 1
##$LEV0= 0
##$LPBIN= 0
##$MAXI= 10000
##$MC2= 0
##$MEAN= 0
##$ME_mod= 0
##$MI= 0.1934396
##$NCOEF= 0
##$NC_proc= -2
##$NLEV= 6
##$NOISF1= 120.0001
##$NOISF2= 80.00006
##$NSP= 0
##$NTH_PI= 0
##$NZP= 0
##$OFFSET= 222.6533
##$PC= 1.4
##$PHC0= -338.3406
##$PHC1= 20.16243
##$PH_mod= 1
##$PKNL= yes
##$PPARMOD= 0
##$PSCAL= 0
##$PSIGN= 0
##$REVERSE= no
##$SF= 50.3227301278049
##$SI= 32768
##$SIGF1= 140
##$SIGF2= 120
##$SINO= 11.81781
##$SIOLD= 32768
##$SREGLST= <13C.CDCl3>
##$SSB= 0
##$STSI= 32768
##$STSR= 0
##$SW_p= 12077.2946859903
##$SYMM= 0
##$S_DEV= 0
##$TDeff= 32768
##$TDoff= 0
##$TI= <>
##$TILT= no
##$TM1= 0
##$TM2= 0
##$TOPLEV= 0
##$USERP1= <user>
##$USERP2= <user>
##$USERP3= <user>
##$USERP4= <user>
##$USERP5= <user>
##$WDW= 1
##$XDIM= 32768
##$YMAX_p= 312106908
##$YMIN_p= -6262389
$$ End of Bruker specific parameters
$$ ---------------------------------
##NTUPLES= NMR SPECTRUM
##VAR_NAME=  FREQUENCY,     SPECTRUM/REAL,   SPECTRUM/IMAG
##SYMBOL=    X,             R,               I
##VAR_TYPE=  INDEPENDENT,   DEPENDENT,       DEPENDENT
##VAR_FORM=  AFFN,          ASDF,            ASDF
##VAR_DIM=   32768,         32768,           32768
##UNITS=     HZ,            ARBITRARY UNITS, ARBITRARY UNITS
##FACTOR=    0.368581032318806, 1,           1
##FIRST=     11204.5221822817, 0,            0
##LAST=      -872.772503708586, 0,           0
##MIN=       -872.772503708586, -6262389,    0
##MAX=       11204.5221822817, 312106908,    0
$$ Real data points
##PAGE= N=1
##DATA TABLE= (X++(R..R)), XYDATA
$$ [...]
12749 -1363988 -2850180 -2171818 -1523972 -1211668 -311203 177792 -279039 165545 1065660
12740 1065660 1935855 1805294 841177 640264 461444 -225204 -986180 -1281587 -983073
12731 -983073 -241502 -423593 -481802 -176790 -340892 510374 1130892 774604 294804 79464
12721 79464 200544 45401 -652004 -532233 105897 261451 -760705 -2096958 -2048576 -1433156
12711 -1433156 -1373309 -856708 379745 1367244 1888893 1731829 1747583 1377343 299254
12702 299254 430232 1197002 1341043 1358017 780525 448214 548930 -406362 -1899847 -2163335
12692 -2163335 -1916888 -2003768 -1254751 -338847 -288847 -56532 726178 1352136 1487576 542068
12682 542068 587921 1504357 2693450 3353724 2447610 1789279 574482 -159271 310638
12673 310638 1276885 1595199 1844166 1768572 638558 -1215205 -2435779 -2098610 -484287
12664 -484287 624666 1143395 1849819 1541159 1439897 2260784 2100891 1658714 1779295
12655 1779295 2969092 3226922 2039868 1392117 -115884 -422304 693351 1421393 654758
12646 654758 -501487 -1260900 -1834079 -2841721 -3296431 -2988220 -2625507 -2721512 -2507640
12637 -2507640 -1971600 -2730376 -3382710 -2550469 -1768689 -2345061 -3211617 -2513074 -1453161
12628 -1453161 6625 296959 18197 -402074 -1803373 -2043334 -1790520 -2295782 -1750758
12619 -1750758 -1601313 -1345528 -552036 -1432859 -2240854 -1761246 -5771 1555636 1076561
12610 1076561 -628346 -796112 120206 86509 -389187 -1114893 -2202319 -1610572 -921129
12601 -921129 -1312514 -2102609 -2585751 -2701237 -2014833 -747155 53256 -336372 -1640023
12592 -1640023 -2930266 -4032402 -4780534 -4661881 -4213788 -2420069 -1328501 -1904257 -3020914
12583 -3020914 -3585599 -3921145 -4589401 -4760667 -3933511 -2944802 -2029987 -352984 764453
12574 764453 1306055 1710012 1259743 754581 548711 496510 -654226 -1327777 -583980 267824
12564 267824 -88829 -1480479 -2460756 -1707016 -379374 234163 672655 98186 -844145
12555 -844145 -2007541 -2021739 -1688239 -1992921 -2776236 -1332212 667260 160762 -1465952
12546 -1465952 -2455527 -2642509 -2568109 -1788394 -1518679 -2271337 -2791699 -2755774 -1567342 -539919
12536 -539919 -478375 -30155 81058 -295848 53454 1155855 1008249 124426 -578506 -484832
12526 -484832 -1120 -410438 -1058171 -2201234 -3430595 -4176794 -4218706 -3823241 -4332772
12517 -4332772 -3547749 -2641642 -1471301 203516 323016 -554825 -731580 -688323 -474523
12508 -474523 510657 862508 -164998 -1058575 -1284405 -708043 -1102899 -1156820 127608
12499 127608 1079009 940270 978148 1170104 938341 654256 1507155 2920899 2744278 1350212
12489 1350212 1098443 1742839 1199433 256817 -457558 -691022 503808 1639309 2334103
12480 2334103 3187102 2587499 1119243 -387974 -1728253 -1769722 -960623 -716120 82349
12471 82349 509162 944434 1117851 1451831 2648844 2780185 2162440 1901916 523899
12462 523899 -430643 -143528 1045000 2104260 1785061 1762069 2602400 2423256 1503006
12453 1503006 1164683 1048309 1118744 979531 511123 333256 1047616 1566111 2992675
12444 2992675 4331963 4756399 5080463 4144180 2275756 60467 -1232327 -980626 -115407
12435 -115407 531673 844272 1868774 2963194 3148771 2428270 1675379 1347170 1582242
12426 1582242 1389240 891802 127500 -448875 -473592 -380101 -1004358 -1469292 -1795223 -1641058
12416 -1641058 -937369 271203 2053378 2172711 1368298 1269065 448320 -685333 -866193
12407 -866193 -2062222 -3051177 -1559937 437730 1048492 1472662 1402986 1187955 1228636
12398 1228636 1055611 1179415 1315746 2155484 3179755 2901629 1633627 -341016 -1343415
12389 -1343415 -324295 437846 374078 -632044 -1755753 -2429745 -2003098 -1764469 -1594338
12380 -1594338 -2510600 -3188813 -2677934 -2022265 -845717 34291 -143576 -823143 61147
12371 61147 1304420 1611446 574294 -80521 136483 715623 373004 249768 325511 -149621
12361 -149621 -966342 -1227209 -630471 -734026 -1337990 -1882243 -1536595 -699429 -722478 -624061
12351 -624061 -788813 -1449643 -1801213 -2334675 -3340375 -3248592 -3416855 -2983605 -1820739
12342 -1820739 -1366744 -1963951 -2698940 -1946852 -461862 -320414 -444092 -503991 -310045
12333 -310045 647860 1072183 44513 -1829271 -2333574 -1961769 -2334026 -1546906 -416737
12324 -416737 -633525 -1806442 -2213871 -2443686 -3098650 -2590671 -2394835 -2894132 -3299285
12315 -3299285 -3185915 -3677561 -4390477 -3460008 -2411361 -1947723 -700671 898341 1148503
12306 1148503 350675 1016106 1334525 580650 177386 1129376 1266913 309362 -615598
12297 -615598 -989741 -757397 -780387 -1323591 -1856281 -2152895 -1781834 -358456 795421
12288 795421 1273349 1509999 859722 794879 497534 553319 936404 59640 -716419 -953915
12278 -953915 -285792 166293 -341242 -1416938 -1502158 -1876280 -3074877 -4378087 -4178079
12269 -4178079 -3187353 -2462430 -2416954 -2670686 -2501530 -2422914 -1330456 -338642 -1489446
12260 -1489446 -2296891 -1310664 543772 906794 223495 -409312 -2034689 -1174234 1340992
12251 1340992 1420539 853192 92241 -537421 181913 932055 1361981 886002 840793 669157
12241 669157 264044 538692 -162419 -152110 206658 -907747 -1080038 -251275 229882 572866
12231 572866 384077 914192 476013 -645739 -21005 1426193 995072 -467397 -1200599
12222 -1200599 -537659 688615 1099352 288532 -148220 -87248 -434046 134367 889353
12213 889353 976785 836980 1224172 1694893 1353614 1123069 -171864 -1343816 -1256402 -415636
12203 -415636 468697 444606 213861 -547042 -2720588 -3683925 -2752169 -1382896 -520338
12194 -520338 -1002574 -1476691 -1313315 -1425042 -1340797 -19075 475977 1035363 2727016
12185 2727016 3618679 3425824 2714452 2232103 2411337 2024449 413669 -1484818 -2985353
12176 -2985353 -4427921 -4425296 -2478806 -1016385 -764024 -319682 617168 180827 -1756494
12167 -1756494 -2679908 -2681067 -1854550 -739227 561368 906548 847020 1121602 1042246 1266253
12157 1266253 1273977 169423 150394 1085025 1425386 1154683 -476631 -1782141 -2654451
12148 -2654451 -2766206 -1419961 -861499 -1225070 -938593 -17823 133141 -315553 -339780
12139 -339780 -345431 517318 1336374 797019 -444099 -1337380 -807212 -867188 -433084 1361320
12129 1361320 2187910 923999 -385238 -438185 324277 1075362 1102867 984628 653861
12120 653861 -212387 -292260 -8746 -800517 -918979 -801284 -1324574 -2156445 -1946932 -677315
12110 -677315 -329627 -987361 -1066235 -568356 -70467 981673 2029624 2884004 3261352
12101 3261352 2501494 1860382 1630343 863337 237634 265813 -829900 -1634133 -889998
12092 -889998 59602 31665 -1280160 -2365946 -2077270 -1637438 -1988363 -2143480 -1204454
12083 -1204454 -391103 -1014942 -1614456 -1201116 -1414752 -1728837 -2357764 -2419570 -1878836 -1543090
12073 -1543090 -2186315 -2363120 -1629611 -1046178 -622150 -395240 -334119 -484735 -748339 -1358953
12063 -1358953 -1900604 -2923403 -2195288 -1386189 -1566323 -780361 567228 1387036 1670131
12054 1670131 1138504 1173331 847298 -575643 -1048108 -422255 228709 404003 121582
12045 121582 -1001794 -1701770 -727206 -408165 -1272830 -2804013 -2456937 -1457292 -1420434
12036 -1420434 -704388 -363634 -1051078 -2114973 -1317694 -417246 -88927 77921 -112447
12027 -112447 -164867 80103 52791 -106102 -542130 -1632560 -1864298 -1043199 -413866 58192
12017 58192 567228 413256 998406 1265606 1453670 1569049 445988 -502859 91568 677117
12007 677117 724774 954533 1255199 -100671 -614238 86627 423063 364037 484182 920771
11997 920771 840175 -319867 -1022174 -755651 -654987 -593460 31366 1273884 2127964 1670612
11987 1670612 95800 -1001799 -670748 -470936 -687469 -671470 326374 1052542 94031
11978 94031 -501408 281156 1064937 820765 -1254037 -2086827 -1241705 -643862 -265788 -754682
11968 -754682 -1967261 -2510263 -1844384 -982839 -671192 -267146 -378932 -226896 173224
11959 173224 1366205 2154306 2872537 2955705 2025082 1854333 1346757 857924 478274 1032518
11949 1032518 1550715 1396129 632842 -140262 -992280 -996568 -613083 -471395 -792818 -643296
11939 -643296 -873986 -943777 -1546945 -2769711 -3174434 -2952677 -2515707 -1917326 -2440831 -2523652
11929 -2523652 -385241 662582 591912 280783 -456791 -268102 -950192 -667293 444293
11920 444293 1380927 1032745 -303282 -859225 -1468343 -1869342 -1194291 -372089 -248801
11911 -248801 -971496 -1426204 -1130983 -831249 -85745 361148 816833 1426418 1634180 760495
11901 760495 -371467 327541 1414816 1416925 803266 874776 505820 -1246913 -1957441 -1859187
11891 -1859187 -2557838 -3093147 -1834899 -209234 403750 -193887 -344830 126480 65887
11882 65887 537302 638339 388111 696421 1196158 950008 903068 1697835 1770308 1236580
11872 1236580 882096 732767 367057 155815 936998 2201366 1353455 -124971 -921521
11863 -921521 -789301 123337 1303226 2422039 2737173 3399869 3261020 2687843 1777172
11854 1777172 934789 609125 512200 442846 -427853 -940440 -779369 -537055 -674660 -493988
11844 -493988 -1362650 -2177776 -1701618 67576 1648439 1601135 29032 -965540 -118961
11835 -118961 1240870 2099824 1979379 1859393 1982968 1728792 1527515 1835224 986486
11826 986486 52459 -404009 -290502 669167 1388795 1411239 1452821 2252214 2684651 2614173
11816 2614173 1724263 670376 -29373 254284 904912 1644944 2449292 2450348 2560884 1661711
11806 1661711 325146 -691249 -633854 -586744 127673 861395 1352280 1445127 1570500 1721737
11796 1721737 2370919 2548634 2503169 1009788 -755217 -1235841 -573280 672126 2293397
11787 2293397 3344467 3595476 3048759 2212533 2813368 2533387 1486862 1086773 1176113
11778 1176113 1575820 2770007 3534653 2767395 1237949 -178550 -1036675 -228264 -218932
11769 -218932 -1210133 -1282938 -574673 -1052110 -1542702 -621939 -77998 -1282 146208 106618
11759 106618 -202104 -491579 -355794 -665997 -1137250 -897172 -1442587 -2412957 -3771173
11750 -3771173 -4037847 -2228601 -441330 -116571 -647319 -1615401 -2739663 -3327342 -3837012
11741 -3837012 -2807797 -1479346 -1651851 -1924533 -1104151 275096 1248552 1030264 1608868
11732 1608868 2531995 2452190 1997865 1423183 492424 425584 389978 198662 1726035 2228267
11722 2228267 1556962 -127011 -1405287 -1473557 -772689 -239145 336705 940024 828977
11713 828977 439377 -519813 -750147 -859778 -1726382 -2449495 -2223424 -1846691 -847361 473884
11703 473884 1377591 1680212 1409100 1173135 467762 -249002 120618 568102 -223102 -374754
11693 -374754 299247 775299 1481175 1866956 1933124 122209 -2036658 -1731017 -234277
11684 -234277 1174450 1472130 775270 104135 504004 697844 -75254 -368876 -839609
11675 -839609 -1415453 -1578450 -1801804 -1463130 -981772 55205 414985 173687 -128704
11666 -128704 50550 42026 -236799 -616609 -739059 -804706 -488196 1595581 3280836 2980968
11656 2980968 2025282 -186274 -2996268 -3472260 -2588549 -617159 786277 1090033 1212801
11647 1212801 1675263 1770564 1350723 484701 32046 -566323 -1139705 -1839896 -1835835 190006
11637 190006 2702133 2704745 2545795 3275944 2515083 1131319 -427634 -1588307 -1527568
11628 -1527568 -786088 240236 952249 1556844 2275448 2744799 2457247 1671169 1873522
11619 1873522 2575728 3103381 2875215 2258000 1631813 131548 -202587 -151595 358361
11610 358361 1581229 2294553 2240331 2006963 1500116 471166 11905 624558 943388
11601 943388 1626352 2130197 2358938 1917586 805866 169668 546220 836852 1039940
11592 1039940 2177052 3511791 3653869 3136417 3692005 3306180 1446509 -562941 -1344539
11583 -1344539 -280943 783048 1412600 1166176 -276941 -1429376 -990311 -171844 77660
11574 77660 -527850 -1895475 -1723569 -903543 -1044425 -918129 -601958 -490559 -432684 -384066
11564 -384066 -10584 1335081 3072536 2405308 1168261 653015 -549208 -1584024 -1655304
11555 -1655304 -1596599 -2431638 -2807275 -1493459 -190260 682857 951579 1004784 2297199
11546 2297199 1880301 -304435 -644627 -493929 -501438 51113 1040109 616779 -465698
11537 -465698 -1087954 -298142 404130 -494837 -446017 491889 1398091 1558325 1665242 1731607
11527 1731607 2084080 2344782 1841424 724079 -232237 -69549 1249125 2393160 2321448
11518 2321448 1412100 544782 570452 442116 320352 703515 859186 353380 -91240 1075266
11508 1075266 2766094 2716401 1454056 2044958 3669866 4396541 4380012 3776964 3042495
11499 3042495 1822225 -39151 -881000 -712798 148689 1772322 1954481 2652948 3819366
11490 3819366 3612886 2840245 1664133 145558 -1005075 -1138180 -383518 434606 1503913
11481 1503913 2964654 3687694 3047755 2696800 3202716 3459204 2712854 1064925 -47615
11472 -47615 -107541 80736 639965 1297613 2103152 1310752 -162233 -673837 -961172 -1367412
11462 -1367412 -2021743 -1209882 138284 298243 736777 1720460 2566886 2097035 553991
11453 553991 -561088 -959452 -1034381 -709334 -606591 -1084527 -1384815 -1558225 -1118004 -702515
11443 -702515 -1746979 -2825602 -2447641 -2067980 -2398106 -2324205 -2924785 -2959503 -1602314
11434 -1602314 -408804 86976 75566 221264 999393 1496558 1262974 1682670 489365
11425 489365 -606505 582970 1107167 642184 -19807 -151879 -627462 -391056 -384389 -2043490
11415 -2043490 -3908053 -3713522 -2374623 -1575322 208864 896081 694855 1144137 800628
11406 800628 52334 236974 1551335 1706548 1389987 841775 1490009 2020581 1389747
11397 1389747 1066689 1102629 1487169 1026210 44649 39213 738853 115914 -728504 -1193760
11387 -1193760 -1292298 -396005 557129 1580609 1862424 1432057 1251018 -70025 -297115
11378 -297115 521440 559826 561401 1012653 2207329 3711672 3722280 2043531 375557 -237328
11368 -237328 328350 1116033 1680081 1207766 1182520 2149794 1541618 -389672 -1580469
11359 -1580469 -1691019 -1456577 -1360417 -1228672 -443193 -631009 -1260078 -1183634 -1063062 -1327972
11349 -1327972 -1649507 -1028725 -55739 11220 -763071 -1125777 -1877964 -1713616 -290074
11340 -290074 1365842 1982079 1899363 1244000 -230022 -869764 -1753669 -1927629 -1375916
11331 -1375916 -1531921 -1444539 -555859 -306811 -913844 -1110450 -197075 566158 197351 -1396104
11321 -1396104 -1690035 -1270366 -501650 394097 326396 427354 806128 1199141 1098877 1001313
11311 1001313 631987 1198362 1348203 1232063 1215035 948083 343963 528665 2361128
11302 2361128 3211400 2657230 2793900 2780765 1712339 292680 714693 1320905 247630
11293 247630 -1703490 -1356230 222460 330554 -794863 -2037382 -1655006 -399457 686798
11284 686798 691185 106458 -1828114 -2641946 -1362381 -1333386 -1962720 -2394524 -1600484 -239795
11274 -239795 -686500 -1535349 -2007027 -436137 1446779 1274478 104556 -835305 -920732
11265 -920732 -1593331 -2961099 -3827916 -3845955 -2423740 -1757433 -2478217 -2460106 -1393656
11256 -1393656 -1536199 -1643094 -1171604 -487642 411031 926116 764588 261448 -276343
11247 -276343 -1395897 -2063563 -1658360 -1031646 -430085 542142 1430921 1304879 742163
11238 742163 160684 -247177 -438979 -748373 -1043390 -1696557 -1690503 -768098 397741 1447959
11228 1447959 1259178 1107623 1826505 1829894 45615 -1821210 -1475506 -41843 1481520
11219 1481520 1581912 1232701 657715 -243442 -127387 1215083 2173256 1237891 -545029
11210 -545029 -520834 880382 2202008 2393400 1597909 1282486 1445355 1030136 682529
11201 682529 370145 -456236 -188497 372568 1214040 1559774 2134050 2193627 2209138 1322385
11191 1322385 -23091 219379 1026547 1015527 636646 434770 519973 1124588 404786 -547024
11181 -547024 -1150849 -169107 1276959 1699473 1771143 655388 115115 -579492 -1751283
11172 -1751283 -1777958 -1599738 -1120793 -36973 -128691 -449475 268269 1235759 747550 943833
11162 943833 1544322 1763507 2096744 2465059 3137013 3175712 2215384 1381717 -83460 -1404740
11152 -1404740 -1979193 -2130251 -1546817 -1000615 -1204751 -1465571 -1955814 -2519239 -2445239 -1741905
11142 -1741905 -705741 -939377 -2570290 -2359631 -1592276 -599894 -478260 -44420 854215
11133 854215 1171890 1665743 1661504 1710908 952664 -243905 -731228 -884306 -1031211 -692301
11123 -692301 -852797 -1379626 -1421171 -796512 310594 1900284 2670615 3682759 3606445
11114 3606445 2465986 2594554 3494381 3764614 3309613 2918649 2460947 2928318 2998165
11105 2998165 2849770 1667749 866696 928950 521846 -373058 -204945 620798 67080
11096 67080 -175352 -960195 -896485 -391251 -978548 -2185809 -2325562 -1677265 -857792 -1015106
11086 -1015106 -1937599 -2508626 -2855151 -2707049 -1957876 -1697877 -1736399 -1570203 -2032321 -1244367
11076 -1244367 -208742 495645 1081536 915343 -953117 -2607103 -3284525 -2624057 -1545042
11067 -1545042 -685721 -453124 -1519310 -3144355 -2729260 -617710 -719677 -941869 -833346
11058 -833346 -330668 -133210 -885770 -1882564 -2266917 -2471876 -2247200 -1500146 -175748
11049 -175748 -308497 -177998 618928 934367 762159 -754831 -1925392 -1100294 274515
11040 274515 1376057 2294275 2100836 12951 -2647222 -3595632 -3009897 -1983048 -1022199
11031 -1022199 -1185747 -1201547 -633362 124767 54251 -245452 35874 -805448 -962558 -397509
11021 -397509 -578373 178326 1301477 1798297 1751326 917664 268812 756882 877975 523951
11011 523951 701400 1651416 1727266 1603836 1323954 1511308 1938269 1393348 794745 -546408
11001 -546408 -591432 386646 -439190 -1216791 -450927 258876 124345 -210923 -105223 -147281
10991 -147281 -1125245 -1566459 -1911211 -2008367 -847277 570113 1396822 2365387 2800389
10982 2800389 2119625 1521012 1939944 2053357 1659920 2289248 1444523 -305976 -1276690
10973 -1276690 -1171053 -689449 -1119218 -1089180 -743251 601637 1939254 2133534 2328352
10964 2328352 1673771 1025001 1713550 2229672 2775645 2891308 2260128 1505963 1240905
10955 1240905 1049437 648523 671301 636492 141601 -822268 -719856 206519 -143680 -1183757
10945 -1183757 -400957 1187790 2434545 1110237 -837129 -1209468 -604360 1195126 2378203
10936 2378203 1708062 1449364 1903766 1959656 605852 -248072 37273 313533 -212605
10927 -212605 -959299 -1152767 -1036455 -947524 -487351 264819 572785 985492 776839 829717
10917 829717 1081474 1792617 1685914 934005 1480210 2289962 1994904 1568805 2274172 2430955
10907 2430955 276506 -1018636 -98554 442433 -95703 -996014 -1064052 -415598 772582
10898 772582 981021 239255 -441939 -628427 -943241 -1406644 -1593075 -2020542 -1980872 -2080184
10888 -2080184 -1303637 -66102 227696 959951 2080541 1688359 1590313 1471117 904647
10879 904647 1161435 1745389 1794674 1717580 1218769 265587 -396038 -1007832 -2020463 -1972807
10869 -1972807 -1613732 -1418935 -319086 1063252 983343 -121335 -733844 -767133 -198023
10860 -198023 -234259 -860418 -2263585 -2018671 -1479853 -2053749 -2200579 -1181266 233829
10851 233829 -352535 -214561 70631 -984566 -1644028 -1901804 -1193371 501725 181947
10842 181947 -588220 -1010845 -2041516 -2190840 -1332990 -487051 748409 1149547 871742
10833 871742 927443 511701 -957226 -2044018 -1150348 92425 1718295 2490091 1330821
10824 1330821 -220048 -769819 -286886 532926 1342433 1794494 2093215 1693670 852196
10815 852196 47280 -1597093 -1864435 -1094325 -470503 -862986 -1725498 -2650552 -2764403
10806 -2764403 -1775809 -947678 -879123 -1013384 -1271848 -1582918 -1260522 -1613824 -2634047
10797 -2634047 -3085159 -1820592 -191906 -1123709 -3018848 -3535009 -3697254 -3168352 -2020461
10788 -2020461 -1400855 -560997 -217037 44267 273672 -847453 -423321 1510881 1707703
10779 1707703 554260 -143209 803470 1301810 630414 -68440 -383046 597506 1402897
10770 1402897 1494134 1777892 2144349 3690551 5858806 5830123 3165819 -97457 -1482718
10761 -1482718 -1527336 -1759008 -2502357 -2700665 -1655152 -883989 -219406 -375842 -1431093
10752 -1431093 -2749519 -3840884 -3581917 -2430495 -1974543 -966441 -424806 -151145 391838
10743 391838 1055291 1248531 1581577 1132256 402320 -114628 -218233 1290616 1945501
10734 1945501 1799328 2053622 2041566 2156306 2008256 274971 -2130048 -3001134 -1506163
10725 -1506163 -509672 -850918 -848244 -525078 -109776 -140045 216239 439642 1132378 1225990
10715 1225990 2182706 2675582 2092883 1582059 1159432 669301 227248 424770 1270704
10706 1270704 1401918 -340860 -1359743 136636 2147770 3083913 2766816 1440539 -378029
10697 -378029 -1537573 -1223772 260268 1155551 1315130 1420255 1118091 706928 339937
10688 339937 249681 92668 244831 48705 -67078 385695 986884 1089425 2084967 3955132
10678 3955132 4207564 2917952 1835114 1618970 1546260 776102 723076 901163 910100 1184130
10668 1184130 1736430 2782255 2769841 1919546 1092731 435392 316195 -266893 -740867
10659 -740867 -29777 375975 284213 333209 1189934 731012 -630752 -1384561 -1267612 -420102
10649 -420102 -7656 -117890 -180265 -641793 -429445 866978 792521 124385 -408850 7424
10639 7424 449917 -517615 -170783 1256197 1161898 412370 -109368 382210 737576 268682
10629 268682 -70658 18924 216519 258645 -37693 469885 636180 719194 826267 913940
10619 913940 679429 1657411 2372284 1577351 -760042 -2009520 -1875521 -679786 347168
10610 347168 760255 372950 -507163 -756657 -892014 -1894826 -1353492 -438478 -752426
10601 -752426 -1317317 -914486 746385 1634020 1582986 2126222 2431519 2210946 1736113 1104692
10591 1104692 678114 839196 1126687 1292243 1925679 2155141 2569097 2898316 1527962
10582 1527962 -711856 -1581956 -772295 -178749 -217349 -105866 301378 104477 -222454
10573 -222454 282435 254633 315865 93661 309082 1090809 724083 -21488 357376 1084686
10563 1084686 1399661 1396270 1334216 850955 109727 -833300 -2277043 -3235801 -3631112 -3134696
10553 -3134696 -2818661 -3335047 -3473060 -2894555 -1980907 -256581 983565 531587 -22230
10544 -22230 237936 675355 993444 1570919 782333 303042 750612 1534298 1303963 1689761
10534 1689761 2647492 3070451 3207803 3448607 3993672 3302783 2437679 2246475 2777252
10525 2777252 3081670 1991967 1483873 2272719 2615635 2624819 1927437 1030503 1622026 711874
10515 711874 -436922 -825350 -1265004 -1381649 -959185 -487447 -285917 267103 -525171
10506 -525171 -1365240 -1457822 -1368759 -1311410 -2171914 -1597650 -159983 -98763 -950615 -1462676
10496 -1462676 -1200689 -636837 -682489 -1220634 -1451726 -1769039 -2423382 -3079167 -2273057 -800895
10486 -800895 205972 1216155 2426492 2507443 2346276 2046410 1472888 1895777 2799931
10477 2799931 2330578 679269 -416188 -712384 -1639939 -1605928 -27349 913764 1565808
10468 1565808 1428646 468393 800443 1309836 -342875 -1818828 -1627151 -1081311 -1082474
10459 -1082474 -1096020 -1336415 -2020490 -1261853 -1509135 -2500546 -1213650 489146 1577833
10450 1577833 1818142 611254 -1009141 -1323975 -445048 -181232 24182 -157674 55682
10441 55682 234887 211738 47022 -393924 -423991 -846330 -1105187 -1081309 -63407 1060578
10431 1060578 525852 -412418 -1031170 -1724657 -1051179 429754 928152 404630 -99505
10422 -99505 -541143 -846387 -1155743 -1125993 -1678651 -1734787 -1343604 -1548617 -1298347 -1396225
10412 -1396225 -536989 755480 1205748 422389 -1179434 -1857004 -809351 1274961 1693701
10403 1693701 1124083 464139 -369179 -709337 -864546 -1212740 -504752 644760 1835717
10394 1835717 2240959 2188966 1415777 131334 -1185208 -1937202 -1554012 -887165 -227262
10385 -227262 86771 686095 2146756 3617894 3988248 3870106 3226280 2031429 1462736
10376 1462736 1278154 1773757 2271371 2613290 3340611 3785780 3028985 1859461 1633691
10367 1633691 2610747 3771810 4128027 2700190 319994 -1593586 -2249589 -2041700 -1147140
10358 -1147140 677721 2206350 2328193 1134556 -137479 -1041913 -1741888 -1439225 -1063143
10349 -1063143 -564624 361432 553531 138292 -330215 -672662 -785248 -821490 -334781 236479
10339 236479 -304289 -1040646 -1361582 -1775443 -1478218 -699838 -305417 272154 1197574 1065825
10329 1065825 -428999 -1713751 -2283791 -1297580 -748000 -587047 -797167 -883746 -310362
10320 -310362 263572 387869 835217 262811 -895956 -260738 810537 1461045 1094998
10311 1094998 355298 103120 -566133 -373573 169849 39300 376676 1012738 1595527
10302 1595527 1550699 777596 1091496 2971288 4584744 4245022 2477272 1279014 777474
10293 777474 1060906 800450 -228171 -468861 509657 516101 500719 462554 12380 499441
10283 499441 1034903 1885463 2957155 3770337 4071316 3316525 1937462 519576 421077
10274 421077 1780138 2841523 2768067 1859974 1203240 1152151 1108670 1754928 2697910 2642160
10264 2642160 776971 -367692 -1312560 -1777486 -836761 415491 1255269 1076965 979939
10255 979939 687700 593138 1237823 1718974 861731 106420 444157 1995514 2653923 1632121
10245 1632121 893943 1413481 2194739 2138823 1584420 2506015 3854674 4245749 3971486
10236 3971486 3916759 2656391 1300133 1501659 2212308 1855844 1129495 1801179 2112189
10227 2112189 1178483 306608 -729861 -906947 -63650 -257756 -999192 -1532631 -867171
10218 -867171 479419 1158916 1194738 542242 984718 1418887 567506 -605620 -1079322
10209 -1079322 -929122 -608244 -709822 -1942996 -2931401 -2358644 -931470 -1604738 -3252272
10200 -3252272 -2689813 -862534 888285 2386536 3208209 3031935 2334718 1009392 437686
10191 437686 828402 118756 -708123 171763 801548 558084 290187 225309 -424303 -1044481
10181 -1044481 99330 1587338 1293849 1051762 1431861 692853 -827563 -1953014 -2484425
10172 -2484425 -2302352 -1185149 212762 1187773 2379754 3443097 3603200 3188324 1813894
10163 1813894 907513 157487 7627 741916 1292249 2406464 3666063 4617842 5505920
10154 5505920 5945819 4866442 2956033 1556806 778245 382675 127461 338331 1737084
10145 1737084 3201516 1940280 -417904 -1725591 -1483314 -671559 -987770 -1636568 -1982786
10136 -1982786 -1719822 -1755948 -2444660 -3772229 -5315075 -5389215 -4692614 -3898291 -2983622
10127 -2983622 -3336679 -3541452 -2839741 -1677868 -197088 120123 -263796 -426502 -1443499
10118 -1443499 -2365002 -3123723 -2358692 -1730616 -1860229 -789398 227784 1139470 1681989
10109 1681989 620408 -134220 251907 1129645 238773 -1363956 -1645105 -2184801 -2568111
10100 -2568111 -2357790 -1899878 -1080366 -393778 -216283 113832 480477 1199521 1722463
10091 1722463 1239125 406988 -164963 -232552 -290331 -810216 -263710 -814434 -1637361 -1585861
10081 -1585861 -1356385 -1076386 -1225017 -467462 -372800 -1495435 -1894629 -1472012 -878323
10072 -878323 -1493713 -2115142 -2254521 -2443986 -3448867 -3758693 -3373775 -2765849 -2064956
10063 -2064956 -2223182 -2545978 -2124952 -1251347 -984966 -691204 7866 502604 1364931
10054 1364931 1600491 627014 584526 565561 603883 1846477 2905861 2709237 1722698 1551633
10044 1551633 1185235 1254229 1640805 1020060 800208 368108 -284247 -429672 -824114 -1581252
10034 -1581252 -1474637 -500677 -26607 -14526 -922902 -1254111 -1136276 204654 1917449
10025 1917449 1711433 1170081 569653 -921453 -1621931 -861762 -243060 459303 2405479
10016 2405479 3669968 3520421 2735377 1457035 -217815 -1655730 -2253550 -1963316 -1491772
10007 -1491772 -641249 110207 854163 244051 -1936956 -3602770 -3239387 -2419031 -1734461
9998 -1734461 -1768224 -1696336 -791981 195667 365880 524367 -158380 -1370052 -1353358 -1048140
9988 -1048140 -1100547 -498345 -16514 155415 317151 34369 -87123 -209789 -631559 -1411973
9978 -1411973 -2400675 -2610426 -2006273 -107697 1705165 3733229 5010366 4788450 3748487
9969 3748487 2925955 2528235 1099312 -238910 -136566 846768 1557331 3581802 5163068
9960 5163068 5359846 4375746 3419878 2755646 1356204 602139 594528 843471 1485986 794151
9950 794151 -521510 -1127430 -496839 319127 -136530 -138266 -565061 -1547894 -1096570 -626784
9940 -626784 -351597 -398793 -42983 729821 1752584 2905051 3050609 2037529 991952
9931 991952 -257039 -1539959 -2331314 -3087289 -3082599 -2451868 -2345459 -1585351 -1702244 -2128418
9921 -2128418 -1849276 -2460436 -3687119 -3592869 -3198702 -3388460 -3646277 -2002582 -966610
9912 -966610 -546174 -762762 -1400510 -1304852 -1165052 -269504 447852 539281 110816 -1161272
9902 -1161272 -1646366 -1809684 -2522115 -2545778 -1252505 -521686 -1158425 -2677280 -3002269
9893 -3002269 -1689653 -260403 170307 818575 1612650 1138255 388095 431379 -843742
9884 -843742 -1733867 -1136098 -645816 -954914 -1093651 -349115 589993 1046998 498273 555764
9874 555764 75803 -780471 -972751 -911035 -279598 147228 266507 113809 -442016 -1019261
9864 -1019261 -1143436 -785772 -211481 -43821 528402 1707205 2213895 1834402 1067840
9855 1067840 576907 809779 974114 462793 36785 222973 434032 403260 1236037 1132613
9845 1132613 724830 798251 -184265 -2181163 -1616601 -345074 -319734 -303552 55069 1045773
9835 1045773 1744996 939696 152649 -641222 -711399 -548549 -1004495 -1733589 -1175306 315398
9825 315398 706451 1548298 2190739 1412676 -384414 -1540561 -1183230 -557043 -513460 393134
9815 393134 2176084 2053856 267953 -1334996 -2651750 -3707018 -3409575 -1096968 1573746
9806 1573746 1828954 940855 808329 67128 -649321 -816622 -688451 -452722 -895968 -1227708
9796 -1227708 -386982 527161 552787 52998 650743 887736 1584515 2267597 1470073 237659
9786 237659 -1059135 -1331786 -1355552 -1984810 -2187620 -1861566 -824407 100508 123278 -119893
9776 -119893 -340817 -178311 575598 1685561 2127440 1235212 -33980 72690 997860
9767 997860 1335986 753565 -972632 -1418501 -762321 -270047 323387 -14669 6176 -418851
9757 -418851 -1914938 -1936428 -331135 348520 -313012 -952925 -560766 1081102 1400128
9748 1400128 419126 348168 1067899 1520801 1558406 1047374 -239651 -1033236 -520000 -346480
9738 -346480 -131379 757224 1937853 2328189 1903811 291071 -696440 -166069 434562
9729 434562 1274689 1339465 1425805 1871118 1522425 98328 -466700 47763 435009 -200202
9719 -200202 -1215651 -877900 -315821 -289805 347080 -435856 -1789995 -1974155 -2307932 -2921286
9709 -2921286 -2380044 -539810 562003 1515919 2935778 2838055 2076937 1025870 357616
9700 357616 -349439 -934882 -280692 1119631 1668451 1577971 2941127 4357720 4381120 3330077
9690 3330077 1566055 667646 -59448 -901201 -1653487 -2182329 -1901597 -1283328 -1055079
9681 -1055079 53960 510923 699595 1013649 383259 -511016 -1114412 -1965443 -2367453
9672 -2367453 -1749391 -1206483 -830317 -1028445 -308325 557131 949033 1069669 900930 1155269
9662 1155269 1747002 2316318 2346631 2758019 2816518 2229460 1482706 85865 181977 679592
9652 679592 228777 331906 421051 296550 1306787 2212000 2916793 2868292 2438015 2620139
9642 2620139 2266534 2263770 3075086 1843841 -394435 -1846175 -2256659 -2138132 -2285681
9633 -2285681 -1149822 751765 1352513 1004290 1148758 1692548 1618166 224913 -1256038
9624 -1256038 -1225545 -1650030 -2506581 -2477554 -1475279 -879893 -445694 335179 -438830 -1027623
9614 -1027623 -775443 -70099 72903 96441 126953 333948 1215399 1203604 675790 378150
9604 378150 298054 2301610 2501466 1207138 951386 -21897 -1956495 -2168556 -786325
9595 -786325 553194 626099 -458426 -736569 -989571 -1004375 -684368 -1317154 -1338870 -627395
9585 -627395 404635 940503 79482 -1180292 -875324 160757 394830 451408 519054 88842
9575 88842 -432152 -423160 181119 1031978 728242 236754 -67408 -52571 1229224 1545060
9565 1545060 1775477 3387539 2900208 1669878 153 -434626 723240 2626903 2539680
9556 2539680 2018781 2197045 756895 -687033 -1046434 -735919 169623 1501185 1448392
9547 1448392 438450 -87179 -707107 -1111741 -457706 446925 -86183 -444845 84760
9538 84760 58717 -714224 -1752543 -1938518 -1215776 -721429 347110 540574 -679006 -1824499
9528 -1824499 -1732820 -919299 388468 228369 -975629 -1330288 -585899 1085678 1291032
9519 1291032 1147243 1708986 2847933 3011711 1516713 -851173 -2393099 -2825200 -2241684
9510 -2241684 -1041444 -105649 -96637 524538 911304 1484498 949403 -97263 -616610 330759
9500 330759 1884772 1996063 2533042 3257160 2376394 506216 -533651 -528940 -711840 -805217
9490 -805217 -1304729 -1689502 -1499578 -474856 1465108 2653137 3343757 2432515 1064201
9481 1064201 1240498 604139 -570481 -1938766 -2056496 -895506 845472 1935926 1095430
9472 1095430 -309796 -1174587 -1805429 -2306382 -1892658 -1882934 -2692469 -2831706 -1455582 -281749
9462 -281749 -282467 -867668 -293814 825655 1012434 87730 -1036948 -1492455 -955049 -90660
9452 -90660 -381188 -853382 -1448472 -2150270 -2585466 -2450117 -637746 1376403 1690228 1347843
9442 1347843 1147227 260755 -888003 -220441 1286190 1115744 396909 1402261 1899616
9433 1899616 2369006 2033921 1460209 61958 -1511368 -1819497 -1727911 -817266 652957
9424 652957 1111327 1274138 1582371 1237904 852312 3921 -1431008 -1669170 -1042419 -615991
9414 -615991 737279 2461631 3100428 2558914 2883617 3149636 1710329 551664 828331
9405 828331 996534 1789618 2466708 2868438 2495778 1711886 1758500 2350028 2569715 1913349
9395 1913349 221707 -40360 -709308 290590 1626918 1326063 716220 201046 -882998
9386 -882998 -958370 -1233415 -1604691 -1663606 -1607941 29610 1842568 2883377 3141558 2641154
9376 2641154 2162959 1234125 -374305 -896468 -227570 585722 1172769 1777449 1441670
9367 1441670 -244390 -878336 -1407356 -1341969 -1416203 -865422 -20023 1266058 1780582 1753772
9357 1753772 1907080 1723790 1550400 600142 -298471 -909161 -1169470 -1805341 -3065943
9348 -3065943 -3614557 -3569995 -2705535 -2519664 -2887073 -3324387 -2918557 -2169712 -2776407 -3600246
9338 -3600246 -2990779 -1498984 -1315279 -1101667 -892688 -1060675 -1256211 -2028168 -2422057
9329 -2422057 -2042242 -1304122 455900 1774888 1702123 1065265 725254 1399294 2978790
9320 2978790 3029176 2028134 1398519 1244763 434891 4311 -159566 124904 286339 98835
9310 98835 79035 -392375 -794360 -1162357 -1525919 -1778796 -1313693 -973652 -943813 -1160832
9300 -1160832 -1405636 -2011845 -3554229 -4709955 -4262349 -3797981 -3273402 -2984802 -2887297
9291 -2887297 -2647152 -2164248 -1636612 -14912 973352 463994 471320 818501 880400 520541
9281 520541 313216 407601 1344116 2142819 2194372 1548370 1069340 14853 167107 865117
9271 865117 216685 -238024 409780 1662422 1793814 869669 734295 957612 1333382 2755844
9261 2755844 1912798 252705 -377083 -31115 -52663 -765547 -1660804 -1913226 -1737143 -1129011
9251 -1129011 -540163 -958771 -1440524 -1982913 -1629909 -1361065 -854485 -147740 -167815 -1746431
9241 -1746431 -2095926 -1782545 -1164992 -1202146 -1751298 -2579770 -2618903 -1230337 791356 2282448
9231 2282448 2254125 2241166 3466511 3497543 2535216 1001154 298505 -450 -200019 -352896
9221 -352896 425983 754012 365889 -1666294 -2967653 -2834936 -2777505 -2472268 -1475229 78389
9211 78389 604075 -131587 -739381 -957199 -1042793 -981270 -598986 -45118 82198 1053484
9201 1053484 1734557 1771599 821380 -147772 297955 463393 972026 1486255 100343 -1222594
9191 -1222594 -661892 -112312 -287129 -571971 -755464 -924537 -1071323 -1222272 -525637 1266156
9181 1266156 2700614 2848337 1581315 231519 -888860 -949814 -1551492 -1806106 -506263
9172 -506263 629739 526668 178627 -286395 -246574 346170 816007 1052603 1379597 1362433
9162 1362433 579779 -97292 -57492 -280503 -1804913 -3017447 -3065411 -2368434 -2560345 -2231799
9152 -2231799 -1390216 -1722229 -2941555 -2848926 -1946676 -840962 -335344 -293090 -626495 -1915181
9142 -1915181 -2567532 -2791015 -1749818 414213 401472 -1428934 -2447892 -2976171 -2412177
9133 -2412177 -974964 -820591 -2172045 -2558705 -2169530 -2108435 -1374331 -370513 497429
9124 497429 1209755 1541290 1105070 13134 -138259 -118417 256182 53137 -662334 -1345511
9114 -1345511 -593898 890027 1485196 1756907 1328669 591933 473784 299601 204388 628483
9104 628483 1187397 1285703 -177572 -1328356 -643412 361589 305579 -388316 -1370673 -1607208
9094 -1607208 -1398386 -1583399 -1726823 -1705159 -1965438 -1877258 -568342 1178243 846972 -1168518
9084 -1168518 -2623541 -1626886 -548818 -365756 -366016 -1428766 -2614200 -2727795 -2103914
9075 -2103914 -1941119 -2226525 -2234954 -1213167 -530470 532478 866187 1344984 1480917 917049
9065 917049 352500 -745810 -1455758 -1655697 -1661712 -1097549 -576351 -1106889 -1110987 -1313173
9055 -1313173 -1072961 -632039 -736863 -182766 398155 -389000 -1245161 -966938 -422674 -306566
9045 -306566 -1465140 -1242578 178222 1011477 1416953 1244387 606394 -382175 -1117105
9036 -1117105 -322908 -308837 -1882660 -2229955 -1570767 -1263712 -1593171 -2315862 -1682218 -1299098
9026 -1299098 -1911556 -3095132 -3692449 -3155544 -2039130 -613221 15633 54277 -128378
9017 -128378 -296063 -639592 -1095458 -1895315 -1759497 -672470 -358957 -1114541 -2230612
9008 -2230612 -2160447 -1922087 -1481360 -826577 -1069817 -1446839 -1983696 -1752850 -1606093 -417430
8998 -417430 1324561 1942207 2821175 3021453 2330687 1518223 2224920 2445938 2305866 2694743
8988 2694743 2686869 1884327 896594 594308 472280 -376802 -2304954 -2454933 -1251058 -747113
8978 -747113 -125308 647605 1246991 1618051 3520811 5092091 4665702 3965355 3880690 2870003
8968 2870003 2419799 2690448 2065373 1022966 100667 -470599 -216252 367023 868133
8959 868133 830238 -407809 -847397 -280487 178312 370753 310758 366747 609006 950976
8949 950976 1144603 -191287 -1454090 -1243323 -90130 566569 383488 574015 802840
8940 802840 763536 456656 757813 1418159 868057 879240 438905 -684199 -2129351 -2830599
8930 -2830599 -2757829 -1592801 -448837 -14511 803230 735879 1172563 1831176 1647513 850317
8920 850317 -1072798 -2450900 -2209812 -220022 749149 146540 408078 717465 459718
8911 459718 -194824 -1328579 -1434109 -701170 -1074184 -643635 328828 1500625 2063756
8902 2063756 1884785 2817197 2994070 1650847 337147 283220 637415 594912 367134 -360826
8892 -360826 -966551 -411657 542297 1533243 1074298 531040 581415 -83223 -677671 -750428
8882 -750428 -167780 601466 1509949 1432147 1396872 1120089 644597 1687870 3228088 3013214
8872 3013214 878887 -850955 -1555564 -791000 -89272 355517 401083 477913 1303114 2920574
8862 2920574 4699299 5247398 4641447 3123656 1763992 1202659 1996800 1677726 507686
8853 507686 160892 -71700 78390 129991 119375 -271838 -884608 -1452262 -973582 -714245
8843 -714245 -557692 49050 748657 692960 372768 760376 827974 122189 -852578 -520962
8833 -520962 -506864 -646966 -1040006 -2019094 -2254336 -2213710 -1008705 224902 843191 1931248
8823 1931248 1585599 -271995 -1129802 -1433585 -2922583 -3405178 -2402701 -1734511 -1215146
8814 -1215146 -38602 711932 973624 715436 341409 230438 120214 -484953 138496
8805 138496 1510239 1324541 -1071859 -1901405 -971913 -73018 502267 907169 730812
8796 730812 454728 689475 1104061 1485482 889719 415801 254846 397467 68829 -311191
8786 -311191 -213325 154171 61052 -698620 -1629447 -2525122 -2607810 -1435093 -31005 523096
8776 523096 505178 541038 1385508 1727845 765180 -283403 -538405 -28001 -301287 -1208052
8766 -1208052 -1188868 -921128 -1381124 -1425844 -1563896 -1378414 754332 2123719 2742198 2644359
8756 2644359 2934907 2853820 1944976 509579 -355002 -1314783 -1436119 -344250 -1236198
8747 -1236198 -2885736 -3903623 -3327584 -2647829 -3318916 -4111997 -3900051 -3009240 -1852928
8738 -1852928 -1787411 -2301459 -2859502 -2937662 -2745528 -1964604 -1530975 -2177611 -3001416 -3046622
8728 -3046622 -1777562 -1042961 -1105407 -817196 -624971 202981 1286630 2119670 2163557 1636544
8718 1636544 1488695 920552 301164 -578455 -1647561 -1337886 -266081 690530 1420039
8709 1420039 829170 -739500 -742831 -212525 -1275616 -1730317 -2438681 -2957755 -2326234 -1534414
8699 -1534414 -737504 355631 1277003 659162 -429458 -1871979 -2444877 -2640748 -2826892
8690 -2826892 -3782536 -4180646 -3072073 -1398287 -700744 -587735 -830926 -332716 573511
8681 573511 108380 -1118414 -1272507 -955420 -1352319 -2207565 -3273975 -1936879 454785
8672 454785 1806373 2592378 2388363 1321915 476924 477966 1451698 1138690 197638 1437085
8662 1437085 2864246 1733137 564780 644291 368584 -1033987 -2280467 -3165356 -3277530
8653 -3277530 -2258463 -941437 -906091 -1185911 -1409136 -504787 823579 1015420 1875378
8644 1875378 1515311 149654 -217741 -30093 -65186 -151621 378327 876076 367398 -1548848
8634 -1548848 -1954459 -990467 -1234014 -983728 -207118 -1232318 -2588861 -3031548 -3180834
8625 -3180834 -2833956 -2094344 -1031070 -997567 -383397 -83106 -137037 -357003 -454490 -563828
8615 -563828 -988180 -511062 125092 611539 1767607 2216028 2341535 2122801 1226644 761031
8605 761031 1499607 2357252 1871803 1973815 2038491 1256646 569737 -632879 -1393985 -624243
8595 -624243 391574 1163878 1080224 444152 562174 1137664 2295205 2968880 2858417 1178956
8585 1178956 375120 -123721 -441087 -613693 -1627051 -1544978 -401417 4552 -93745 -211765
8575 -211765 -1139233 -2642257 -3593741 -3083333 -1016199 -110015 505831 2782355 4310138
8566 4310138 5094474 4389981 2589402 1248716 985057 483037 -80651 715978 1838546
8557 1838546 2591576 1319732 66763 -1008496 -2493422 -4098214 -3041978 -1185017
8549 -1185017 -432488 605292 938431 -646008 -1139792 -309739 168826 813088 738841
8540 738841 -988463 -2301473 -1793094 -2152207 -2342135 -2165777 -2428553 -1465143 601546
8531 601546 1713452 1214052 1353946 1832977 178490 -1359134 -1198267 -1247044 -1804077
8522 -1804077 -1404964 -2633990 -3424191 -3692226 -3614301 -3022077 -869595 -28944 820492
8513 820492 802108 -947423 -2258473 -1241741 -617659 665054 3413755 5128571 5552782
8504 5552782 4330100 2485115 1870903 2228731 1162968 -226937 131369 1150156 224237
8495 224237 -1383744 -1727236 -254683 -70741 -1060453 -800683 123597 939766 1037236 -30457
8485 -30457 -1732911 -1303807 197371 651971 614225 44883 -662425 -1299277 -34832 1978798
8475 1978798 2715816 2405797 1672837 1628656 761479 -1051234 -831520 1270364 2698450
8466 2698450 3066317 2561448 2576663 2012293 1309444 1109908 893199 1722241 1708415 1308235
8456 1308235 1751504 1442833 546455 -278957 -915438 -848779 -1117443 -2187851 -2678661 -2836575
8446 -2836575 -3144349 -3450273 -3086735 -2243696 -1188783 -555457 -591858 -1795425 -2805572
8437 -2805572 -2448728 -2569839 -2012328 -699845 109139 406917 1321511 2145077 1429525
8428 1429525 452706 809174 1683904 2145099 1041916 -1028875 -543143 933311 1354791
8419 1354791 546697 -742309 -1129327 -735764 -279938 -663870 -552879 746845 1796462
8410 1796462 1945077 1504415 1288215 676226 336973 310462 121058 -462459 -1057562 -870385
8400 -870385 43659 1281482 1301389 1394386 1882676 2689884 2199125 402962 -813449 -660848
8390 -660848 -56197 800200 1371538 1047680 1034203 1856994 2804495 3141827 3062224 3368089
8380 3368089 2488875 1786426 -93285 -1364610 -863471 -407260 112215 353191 252881
8371 252881 6724 556138 732754 -157592 -1652203 -2682669 -2496670 -2232695 -580148
8362 -580148 349868 806311 2700548 3350538 2781709 2309392 1789022 1214103 1122507 1613428
8352 1613428 1913246 1828107 1719334 1905875 1370958 -226781 -357444 225476 57141 -1616459
8342 -1616459 -2022340 -1722387 -476892 607775 566930 51550 -1230348 -935809 966242
8333 966242 2100718 3340802 2796024 849535 -110719 244127 821803 1084178 1342402
8324 1342402 2065596 2327379 1914481 1610363 1071264 372460 55566 -63527 -1053348 -1790674
8314 -1790674 -1174541 145669 301734 -435434 348647 1151202 1758438 825518 244047
8305 244047 963184 1071281 398345 -452313 193876 1119818 1167878 1480822 722402 -775337
8295 -775337 -983665 -123915 -96630 -508813 -3709 589002 620342 1036006 1331022 846885
8285 846885 1012772 928561 859619 -447546 -2331134 -1609558 266132 1638059 2648516
8276 2648516 3187975 4344817 4295030 2751906 1278695 1295250 1253373 1425983 2615193
8267 2615193 2499319 1641274 1179350 376548 -335197 -306549 -94559 -531367 -148654 316296
8257 316296 207435 648436 283248 -150851 -523080 -484553 -280058 -257309 89446 -799297
8247 -799297 -1792416 -2028093 -1090119 208716 982140 1646682 1751106 751550 255797 -79889
8237 -79889 518294 2199025 3014780 2584777 2232506 1929807 2225732 3226364 3878032 3131563
8227 3131563 2976630 3000726 2322239 1887764 1906472 1835593 1622485 1628771 939938 -30757
8217 -30757 -800936 -630070 -320611 -304287 -50818 -446819 -605209 -1110556 -1394773 111882
8207 111882 1438932 940893 164028 -139081 -23155 1429226 2714919 2957423 2679857
8198 2679857 3134890 2391489 1400121 2338040 1927763 1139198 534328 -162922 -1087386 -1301344
8188 -1301344 -1821750 -2291170 -1321257 -128298 384956 -1015748 -2045394 -1843634 -1853680
8179 -1853680 -711424 568196 2290477 3379035 2128994 945939 538710 810362 1286406
8170 1286406 1861748 2639163 2604129 2515495 2320891 912139 48990 500166 868819 1482585
8160 1482585 1437698 1187769 1105146 1222756 1184420 1455278 1391171 104772 -761155 -393689
8150 -393689 1290398 2471915 3312480 3174376 3387770 2774390 2118859 2132358 2128470 3212825
8140 3212825 4368146 3104287 984561 -319677 397624 1912579 3371619 3180089 2589863
8131 2589863 1804152 1137834 1151440 2103947 3621852 3217092 2234361 1770582 768229
8122 768229 -340640 -877736 339382 1876039 1850161 852473 -687312 -1554218 -1501479
8113 -1501479 -61548 178578 -707926 -838046 243434 1616225 2976359 3499549 3097308
8104 3097308 2519501 2720617 1337469 -1202705 -1511979 114699 996793 403803 302677
8095 302677 1300379 2242677 1996778 1614796 2030690 2548857 3211789 3776665 3056007 2113396
8085 2113396 2320420 1516713 923592 1109075 1294378 925688 -135117 -807232 -1337614
8076 -1337614 -719646 1024593 1400481 918327 529007 888400 1749270 2802884 3427724
8067 3427724 2729499 2431845 2235862 1185785 975261 1213815 799107 498070 134391
8058 134391 -639763 -1016534 -942572 -880711 28257 -16934 -586331 -988659 -621872 -563884
8048 -563884 -138623 1058263 913043 107775 368864 1789578 3740087 5044497 4827061
8039 4827061 3921206 3671203 2507525 1421030 1493581 629386 791706 2409361 2886531
8030 2886531 1837659 1080920 74403 -634960 -986668 -1210247 -477098 440205 1003247
8021 1003247 508488 562347 1973101 4809248 5200790 3854141 4392753 4864641 4604027
8012 4604027 4147277 4597121 6241991 7501092 8200203 7235350 5286932 3765817 3154153
8003 3154153 4109668 4264396 3381106 3093840 3712291 4398347 4445289 3657065 4083454 6140890
7993 6140890 7030814 6666141 6258808 5366805 5140629 5926434 7070925 8317511 11099148
7984 11099148 14406721 18560767 23116051 28275210 32890002 36495702 38888413 41070791
7976 41070791 42924097 43565910 43480475 41164360 36479325 30469160 26496215 22729809 19338219
7967 19338219 17317544 16142220 14592571 13444908 13186721 13205088 13211744 12275021 11162346
7958 11162346 9628717 9008271 10332721 11313830 11881378 11475108 11137566 10870324 10582919
7949 10582919 10472343 10328080 10913222 11713743 12067969 11776643 10564525 10922426 11374654
7940 11374654 11033908 11411440 13190690 14684653 15933106 17528352 18733626 19260521 21267102
7931 21267102 24949915 29692465 34423641 39322598 45978930 54263257 64231784 77362498
7923 77362498 91828387 106408874 120044112 129994924 134619796 133521851 127594838 117548630
7915 117548630 104481874 89954203 75997921 64251070 56329731 49524164 43313322
7908 43313322 37937111 33421067 28947591 26063103 24623453 23636711 22533579 21110934
7900 21110934 20047822 19978011 20596339 20596685 19830880 19204320 18296692 16959335 16660296 16999663
7890 16999663 16925074 17008186 17681671 17517203 17007010 16809240 17152328 18466810 20200607
7881 20200607 21799339 23784243 25733021 26736846 28814026 33821322 39841960 45710837
7873 45710837 52466592 61819338 74234984 88747868 105303791 125883550 150047172
7866 150047172 176884093 206695386 235142953 257329025 268486661 266888619 253317418
7859 253317418 231469445 204815221 176974689 150180116 126021100 105687663 89263549
7852 89263549 77363036 67837682 59456264 52465394 46630279 42779116 40294146 37957795
7844 37957795 36113150 34037662 32592177 31304498 30265635 30393976 29638958 28343895
7836 28343895 26860164 26739401 26476003 24943231 23558728 23393959 24032666 24771482 25518599
7827 25518599 26258237 27251653 28265860 29710771 31630453 33126030 35131282 38562934
7819 38562934 43146032 49088170 56079250 65326500 77237803 90351722 105779858 125643221
7811 125643221 149992887 179755191 213464639 247255088 276566021 299660298 312106908
7804 312106908 309535995 293019893 266981153 235136342 201340884 169532272 143172164
7797 143172164 120370538 99565911 83025415 71091505 62177193 54647862 49371633
7790 49371633 45733938 43273704 40954666 37859393 35143710 33864937 31846579 30540526
7782 30540526 29735687 28349849 26103065 24196795 23018812 22895165 23337693 24493094 24960729
7773 24960729 24799034 23769043 22716938 22550274 22799225 22960976 24190876 26099606 28900634
7764 28900634 32503077 35711448 38870076 42904648 48116201 55240471 65440883 77136080
7756 77136080 90669244 108066544 128531799 152883127 180823900 209616667 236210934
7749 236210934 256177635 265298960 261292491 246950900 225686195 199496516 171235326
7742 171235326 145023653 122649819 104044551 87804164 74642944 63856753 54994460
7735 54994460 48270526 42511161 37272125 32795033 28736114 25519620 24079244 22660350
7727 22660350 20817948 19333764 18314340 17657512 15767233 14337823 13898786 13557787 12801660
7718 12801660 12270930 12777886 14187319 14358721 14885788 15806630 15797577 15516152 14601709 14787415
7708 14787415 14992102 14938857 16507109 18591928 21034275 23968055 27972330 32903836 37830059
7699 37830059 43654088 51464102 61782189 75356300 89762256 103937751 117254915
7692 117254915 127005124 130234987 128337686 122706894 113391154 100485871 86773288 73976517
7684 73976517 61816767 51491321 43159440 36738335 31278672 26844650 23807085 20450961
7676 20450961 16085910 12556926 10922684 11109368 9820487 8069059 7839582 8058030 8530269
7667 8530269 8892757 8648197 8112858 7467976 6904728 6893768 6982441 7127221 6394536 5377448
7657 5377448 4465724 5190559 6834606 7004420 6175288 5435776 5772421 5787306 5365017 4839516
7647 4839516 5443207 7722328 9321701 11165853 14377195 17630028 20375139 23584497
7639 23584497 27463177 31382565 34657479 37894153 40566482 42400731 42614102 40270066
7631 40270066 36001973 31364343 26685948 21212078 17513723 14972592 11714877 9950469
7623 9950469 9391521 9004066 9537905 9250550 7684689 5953385 5138422 4309482 3304345
7614 3304345 2793908 1949310 1717325 1412094 411679 692528 1838367 2285162 1992340
7605 1992340 1781162 1730261 1615975 2140071 3599250 3996588 4619984 4596293 4692915 3511477
7595 3511477 956171 -385997 -938243 -924273 -352592 844313 2525972 3233016 1675979
7586 1675979 946911 1299059 1077068 2060654 2701498 1934742 144988 175986 879432 814308
7576 814308 1380944 2008323 2536276 1947828 1732093 2038348 2259276 1448042 245232 -883485
7566 -883485 -680244 -697749 -1603831 -2210918 -1808859 -1596031 -1758016 -1223726 -893004 -620719
7556 -620719 -430929 -483653 228103 1375557 2564423 2298327 1039106 -297559 -773808
7547 -773808 28747 1366398 2448840 2180358 1519713 590194 -571214 -738767 -1272545
7538 -1272545 -2106179 -2348597 -2080975 -406196 821082 -24079 -275124 132868 325941
7529 325941 -298478 -1022826 -1092443 -1761805 -1970092 -710874 1032802 1476556 974826 1151482
7519 1151482 922900 402873 151135 -499191 -1272916 -1716075 -710358 1002589 2126957
7510 2126957 1134263 -1088045 -2355342 -2722826 -2866351 -2983584 -3226904 -1765042 -1200403
7501 -1200403 -1777710 -1394964 -1178584 -1404646 -1096214 28272 152115 -394080 -754719
7492 -754719 68330 1446287 1555146 1491900 1162351 -485305 -821991 -258384 -489477 -1219355
7482 -1219355 -976557 -679093 -283231 -541046 -798468 -1348244 -1962656 -2041988 -2069750 -1258290
7472 -1258290 -324835 209260 390925 458481 -1022491 -1766535 -1060546 -382570 -4237 398482
7462 398482 1095428 1624241 1540092 241555 -1089662 -382197 191424 -96315 -876425 -1263688
7452 -1263688 -1211048 -942621 -1478680 -2226537 -2798922 -2633839 -2008037 -1840397 -1459597 -1244420
7442 -1244420 -1462690 -1349636 -1814656 -1795518 -1553124 -2694636 -2967267 -1403662 -840195
7433 -840195 -740475 -869973 -844604 -1073805 -1818715 -2350317 -2649194 -2224512 -1995098 -2036541
7423 -2036541 -2377185 -2540995 -2182141 -1492812 -1748241 -2557417 -3261944 -3113092 -3362222 -3657371
7413 -3657371 -3218264 -3349914 -3679442 -3408115 -2665473 -2573353 -2192390 -1798239 -2387292 -2452119
7403 -2452119 -2145341 -1646761 -579001 864281 1407012 -63937 -758991 102524 1165687
7394 1165687 2530837 2957190 2920007 2423968 1792205 1918874 2896907 3399886 2950681 1250893
7384 1250893 -1016510 -1780938 -1186214 -1098934 -1073709 -1082929 -620373 308998 1224592 1525134
7374 1525134 1605375 1724810 1659391 1020402 314904 312990 353586 -298100 -778977 -918692
7364 -918692 138639 1980058 2929899 3741301 3370298 2560498 1390623 820444 699286
7355 699286 701760 793277 1390333 1268345 726189 691629 906464 1069518 1075973 316646 725731
7344 725731 915566 473868 -688767 -1019023 -45725 210635 7650 -768063 -1092576 -1180616
7334 -1180616 -1870268 -2222824 -2620278 -2309107 -2169657 -1925573 -1432795 -704729 -288175 -750383
7324 -750383 -1731792 -1927218 -994309 -78306 503251 346997 836898 1437181 1742883 2358184
7314 2358184 2319666 1710346 913024 394783 -314428 -1593529 -1087228 508807 888570
7305 888570 -109568 -941323 -1026636 -722723 -570940 159761 511989 261838 516186 699428
7295 699428 711510 424594 -332701 214099 677549 142574 -1326619 -2125078 -1742749 -1214083
7285 -1214083 -481630 -31830 959827 1641401 1294885 1360472 1516015 1216373 287279 -1065903
7275 -1065903 -1595515 -1220149 -1229991 116815 2360781 3145595 2773685 1961834 437433
7266 437433 -816948 -2068805 -2209421 -1097740 693563 684887 183979 -15444 -607616
7257 -607616 -2050166 -3574159 -3371953 -1767484 -373929 190203 -471709 -699494 -572614
7248 -572614 -1027830 -733881 96286 -242914 -1006981 -690339 575129 1327282 1101244 1630526
7238 1630526 1211616 182318 -232345 -1233140 -2161340 -1879518 -591421 266652 1480875
7229 1480875 2370266 2180248 2471291 1788488 -289055 -2299062 -2968742 -3048259 -3709270
7220 -3709270 -4100883 -3635849 -3271311 -2845216 -2443513 -2752664 -2534399 -1308025 -978106
7211 -978106 -377474 -471071 -1597801 -2971933 -3962767 -3402068 -2978940 -2928417 -2427400 -2447832
7201 -2447832 -2705832 -1828503 -1455844 -2256185 -2842646 -3883738 -3306032 -1585741 -2264973
7192 -2264973 -2843695 -2209688 -1244090 -911517 -135097 58237 -1117152 -2008320 -1705166
7183 -1705166 -1220484 -592606 21950 522151 1416351 2233718 3286665 4176447 3800278
7174 3800278 1891109 -643702 -1428030 -727601 -897248 -641957 -209380 64040 -248056
7165 -248056 -489496 -300596 43909 -148984 -343218 686188 632660 70618 148707 57491
7155 57491 398101 1369175 1104631 405750 -293703 -283092 494375 1324559 2195025 2662819
7145 2662819 2682382 2621941 2787104 2805562 1632935 22012 -562037 -923272 107499 718760
7135 718760 91969 -1248942 -3175041 -2939761 -1465233 -739743 -779512 -1868188 -1372582
7126 -1372582 -331078 -850724 -1459307 -2003005 -2634655 -3018205 -3025549 -3669036 -4026291 -3617510
7116 -3617510 -2010285 -339610 279995 713697 175882 -361259 -593492 -1955360 -4118394
7107 -4118394 -4297455 -2907645 -1844399 -611218 390652 -444543 -862460 -846507 -728202
7098 -728202 -796951 -1121686 509555 1303102 696479 681920 102261 -1154703 -1534354 -1412915
7088 -1412915 -1091231 474707 1259984 808789 1583524 1398517 312385 655292 877840
7079 877840 657158 951820 1720802 1271752 -1291789 -3482409 -3328492 -2351980 -893762
7070 -893762 781218 776895 -1110387 -2118831 -1819626 -1507752 -966141 -470478 -231316 1014826
7060 1014826 2096973 2288750 1912922 2056758 1949239 1405059 -134637 -2241013 -2390162
7051 -2390162 -568811 412435 375136 -50562 -332679 -565663 -1677130 -808703 881448
7042 881448 160851 168713 1205172 1234449 1554570 2561717 2815067 2779332 1641134 302818
7032 302818 672500 554810 346188 557406 877685 693841 -608588 -1076096 -1106612 -1439245
7022 -1439245 -747757 998771 1643915 911691 -541451 -2353058 -2675594 -2454811 -2242849
7013 -2242849 -1323234 -860996 -1344032 -1086088 -785313 -1931819 -3108396 -2840494 -3102090
7004 -3102090 -3030309 -2379081 -768096 1263735 1654529 1758493 1645589 1472975 1135024
6995 1135024 1198935 835337 -624530 -1084717 -1202788 -417782 268054 523619 -189794 -1150307
6985 -1150307 -932759 -1568158 -1795423 -1890939 -2510463 -2279067 -1586395 -752602 135480 -360145
6975 -360145 -606754 565706 832408 -850808 -1984450 -1892639 -2292989 -2516982 -1546519
6966 -1546519 -390320 -129365 -131266 55113 -93374 -87955 22100 1577929 3710314 4352042
6956 4352042 3343037 1894203 1677680 1123024 -20807 -424703 -125749 270689 804871
6947 804871 1414141 1664926 2428971 2182017 1569026 -452733 -2287894 -1531370 -110264
6938 -110264 154452 1365114 2509007 2061100 783013 -207510 -203173 -10983 14871 -467023
6928 -467023 -947702 -763063 -496061 -1020977 -1361985 -1444006 -1717510 -1440035 -1174612 -423946
6918 -423946 95351 -655739 -2647971 -3962586 -3583383 -2814189 -1220637 -546267 -1299911
6909 -1299911 -1224823 -140436 -56194 -120946 398008 830122 561097 -84491 -20748 168779
6899 168779 -182628 -57721 -440444 -544944 -195384 -82527 243658 259591 -233257 -1516017
6889 -1516017 -2242677 -1780689 -978908 -577103 -377812 322678 707821 -309557 -1664073
6880 -1664073 -2167464 -1555240 -1381279 -1565130 -685144 103983 438100 802066 45272 -1604876
6870 -1604876 -1255670 632365 2843006 3572647 2733959 2331200 1718386 429704 -449447
6861 -449447 -630771 -1104757 -1636335 -86519 1903055 3360148 3079713 1995240 1294861
6852 1294861 1020631 732625 1378463 2534587 2122328 1025486 1268493 1990016 2771761
6843 2771761 2303171 1717578 1669501 1771369 1866069 902564 509389 965500 284370 -564425
6833 -564425 -420093 45247 -403080 102654 1716622 2575810 2005644 2565320 3661560
6824 3661560 4070614 3448588 2893098 2442849 3317282 3900230 3283430 2343992 1165436
6815 1165436 110801 -584251 -240123 672552 660611 111256 -608070 -2025986 -1741469
6806 -1741469 -570936 -616198 -1430949 -1517514 -413287 286842 -471495 -75951 1061596
6797 1061596 740519 730513 1093380 112415 -700563 -1085278 -1095411 -83617 1775095 2284187
6787 2284187 1410302 863935 1280538 1553109 994620 -185159 -2445649 -3777439 -3703026
6778 -3703026 -2147500 -255385 454117 -298862 -585753 -515415 -483109 -432318 873544 1206456
6768 1206456 119284 -326490 -363393 390910 479560 -423802 -1022198 -958145 83702 383104
6758 383104 -657192 -1056001 -614226 -228315 -287295 305438 126056 -175632 -656030 -1561532
6748 -1561532 -2231657 -1902147 -1352162 -1065684 -673920 -467716 508462 1270023 1490834 1155977
6738 1155977 323197 -388179 -400138 -718724 -1665105 -1563889 -1808132 -1521505 -934421 126792
6728 126792 1185040 1224994 1033310 1424869 1910901 1141604 126821 395248 354126 53521
6718 53521 245670 638513 600265 1014057 2498479 3583531 3111818 1900108 -162344
6709 -162344 -979112 -337217 355915 505141 904530 2884048 4840806 5169146 4026812
6700 4026812 2146983 790512 277851 353462 191286 52331 141376 908813 1643827 1783828
6690 1783828 626424 -1539528 -1460114 -61899 1149231 1089063 55379 686508 1379970
6681 1379970 1011734 1650093 2151774 1962377 3283552 2621763 927448 3320 -917728
6672 -917728 -1414023 -733805 -1574361 -2510540 -2151500 -1341954 -332258 -9869 -154442 -10134
6662 -10134 248493 66340 -156430 62450 1458568 2450190 2506370 1781825 1207358 234552
6652 234552 -460620 -1024079 -1962100 -2252634 -2165956 -1292704 -911528 -996010 -1123889 -1446782
6642 -1446782 -2064638 -1415843 -810236 -1339252 -2387244 -2681031 -1950450 -1552799 -899997
6633 -899997 -167798 -643961 -2109845 -3334117 -2307025 -850574 -863792 -136105 1123601
6624 1123601 1984468 2177882 2173126 1751573 587177 -1101960 -1921357 -1897509 -1682127 -902334
6614 -902334 -435633 -256165 552772 898226 807608 197173 -433759 -530995 -201741 522602
6604 522602 982354 1565020 1067434 33265 75031 424688 311204 -621939 157559 1329407
6594 1329407 1066401 354221 -143609 256247 567215 525869 75979 194789 461793 899350
6584 899350 966532 1172059 1934045 1127499 -352131 -1387454 -1208018 -862591 -998946 -795451
6574 -795451 -1363949 -1600610 -1268831 -1554706 -1734561 -960223 -587196 -999255 -725997 47049
6564 47049 1361431 1496338 1255941 1210938 878857 511449 1095370 1370208 1110123 1339041
6554 1339041 1055555 69761 -179601 -669758 -928185 449584 675647 -10278 -1576129
6545 -1576129 -2869124 -3326775 -3487260 -2893200 -2667512 -2479481 -1565821 -284808 -150256
6536 -150256 -613622 467799 3024136 3383386 1702802 -422634 -1133361 -1255626 -1597668
6527 -1597668 -945192 -592725 -1094366 -1455298 -1721158 -2161976 -2407326 -2273928 -1793547 -1553407
6517 -1553407 -601848 -130296 290525 2737 -218133 -391328 -1065103 -1090541 -798958 -166809
6507 -166809 1059084 1967217 2590701 3488202 4618136 4104219 3269445 2313867 536762
6498 536762 -437712 -609478 -425694 -804222 -997763 -804250 -936308 -2233339 -2996347 -1576615
6488 -1576615 -763693 -694187 -163536 779941 2254730 2153770 1340391 110960 -594154
6479 -594154 -731197 -393719 200300 320423 783873 255132 -676424 -1001298 -1082710 -771673
6469 -771673 -266859 382493 1212102 2445848 2445185 1788798 1673434 2668141 2516625 980435
6459 980435 340320 2046565 3370003 2436054 1174384 -52207 -1721798 -1750802 -404340
6450 -404340 550134 -130912 -694357 -1244443 -1695277 -1276234 -496611 1704137 3539473
6441 3539473 3888239 3086533 2147906 2749008 3492337 3070688 2104451 1935127 1586358 1018337
6431 1018337 426638 -528423 -122810 911229 2130224 3419562 3029715 1627264 797997
6422 797997 664052 1257258 1737002 840354 -891193 -1151401 -681696 -574703 -1853523
6413 -1853523 -1696427 -722542 -659360 -373734 -150461 386560 507040 92336 -1422234 -2703619
6403 -2703619 -2189650 -555181 575915 2048122 3731372 3630053 2407701 1041271 -264501
6394 -264501 -1464550 -1722594 -1562572 -1449779 -792080 906690 2021927 2047773 2441627
6385 2441627 1869668 -222587 -1383202 -966888 -638568 422112 1120520 250669 -533864
6376 -533864 -463990 -89574 800864 827566 738203 1186860 859102 1315876 1644166 1121592
6366 1121592 960287 1544911 1723442 1955669 2648630 2929055 2433782 1278294 623573
6357 623573 193261 -998492 -1408716 -924690 49766 1175597 2133019 2387792 1760200
6348 1760200 679217 -497905 -2059787 -3026580 -2445568 -2413549 -3115607 -2835546 -2417314
6339 -2417314 -1579905 -135499 359131 -334826 -1907275 -2281879 -1741615 -1218675 -356726
6330 -356726 341738 1060740 2535617 2806076 1899932 1435876 1509593 1632789 1088758 925461
6320 925461 904215 453286 1276684 1526335 158604 -893043 -1147301 -1282588 -2066951 -2639389
6310 -2639389 -2678741 -1266238 -24840 975712 975077 -242165 -657241 -619711 -697399 -1189615
6300 -1189615 -2071443 -1634341 307508 489799 573550 1619934 1368596 1295247 1017521 443656
6290 443656 508719 -418997 -1686895 -2057283 -2114461 -2299130 -1558674 -670991 285709 296595
6280 296595 -520267 -1358376 -675603 61091 -114118 122645 481571 -403181 -2066306 -2862174
6270 -2862174 -2383576 -1104792 -529604 162384 1098049 2025889 2587814 1589043 425851
6261 425851 -1036556 -2616958 -2394294 -2381356 -2059524 -877068 -818769 -898503 -97617 -86543
6251 -86543 -297878 -843356 -1298281 -892061 -1163262 -1128191 -744785 -1328511 -1779885 -2220979
6241 -2220979 -1837665 -842624 -224973 901714 2076470 1919256 702717 -810908 -1163702
6232 -1163702 -1542504 -1209267 -623776 -1530181 -2544353 -2961543 -2523255 -2334054 -3065156
6223 -3065156 -2488804 -1990636 -1227045 -840521 41655 475180 608817 581191 510865 510509
6213 510509 -805382 -1812347 -1548740 -651979 -258957 -562684 -596200 -26946 335007 -746963
6203 -746963 -1045226 -10501 923707 2219812 2148249 -57321 -1422490 -824570 -344740
6194 -344740 95093 1387641 1804790 1115257 299106 -330360 -44471 -272587 -117318 1159936
6184 1159936 2149632 2766912 2276289 1347448 -199394 -1578406 -720792 949234 1202492
6175 1202492 195766 -11897 313231 941376 1988258 3271284 3853289 3187478 1589041
6166 1589041 1023286 1603267 2116883 2451971 3178389 4083369 4271072 4278552 4386167 5529377
6156 5529377 6067494 5887351 6636715 8170077 9648616 10576589 12034743 14189711 16206169
6147 16206169 19191307 23684119 29721239 38617868 50223835 64302546 84890319 115208267
6139 115208267 152070105 178825458 180214041 157326180 121398886 89707589 67210739
6132 67210739 50843236 39088353 30199524 23550509 18453082 15310733 13927008 12383334
6124 12383334 10885100 8706722 6861294 5853856 5426632 4665021 3870204 3988745 5120195
6115 5120195 5435525 4998803 3595883 2383825 1441893 815671 1322378 2676618 3271530
6106 3271530 3124957 3011079 3525445 4195288 3813805 3648365 4100934 3891557 3611707 3483630
6096 3483630 3358780 2501964 1702211 824144 593779 849288 457608 -223188 -998849 -1891728
6086 -1891728 -3446354 -3930983 -2756727 -1279137 -584395 -564227 -876664 -779069 -484161
6077 -484161 87888 522321 815981 1401630 2182817 892573 -1164104 -1458556 -1445173 -1924923
6067 -1924923 -2771730 -3571303 -2854073 -1945293 -1655708 -1320912 -869665 -1566746 -1664512 -1030544
6057 -1030544 -639974 -398868 -939788 -1459255 -2031839 -2294112 -3112676 -4037910 -3778648 -3733457
6047 -3733457 -2355308 -1168131 -1230289 -883117 -106638 1155448 2381978 3335213 3622023
6038 3622023 3625053 1645465 -553739 -121887 1335724 2220306 2244458 2165844 1467021 867962
6028 867962 239247 -699797 -1668250 -1866669 -786542 -740892 -1754956 -2206512 -3193008 -3264596
6018 -3264596 -1772449 -1365750 -1993488 -2898804 -2710700 -882232 1514139 1976898 1938337
6009 1938337 1200675 672059 1737022 2485702 2252303 1062583 535565 282986 285376 234098
5999 234098 -318969 -37801 -95359 28628 1064848 1728471 2610145 3182453 2845909 2295033
5989 2295033 1136260 334773 285339 -177803 -1919265 -2905357 -2657622 -2570769 -2969871 -2468979
5979 -2468979 -1939628 -1575895 -1552437 -1765480 -1175487 -735423 -1065555 -1253641 -763618 -244252
5969 -244252 -478825 -824466 -1808877 -2398476 -1700741 -643311 -669210 -663312 203433 247602
5959 247602 400956 283244 17188 245633 162300 257582 1053002 814325 688223 548377
5949 548377 -876016 -1774282 -966842 -423551 555102 2184212 2953351 2147675 1413935
5940 1413935 1227255 415450 -603681 -1448327 -1571077 -1313053 -1520968 -1548888 -2971683
5931 -2971683 -4113860 -4771793 -3521165 -1538387 -555627 360903 480516 392499 627114
5922 627114 1619469 2296094 1831503 623917 -720947 -2485735 -4203197 -3580181 -824968
5913 -824968 465713 -19989 -566052 -1340752 -2038407 -2471898 -2142503 -1714241 -2306504 -2971525
5903 -2971525 -3436937 -2967396 -1304413 -274478 -752551 -1316182 -1151016 -818776 -316182
5894 -316182 204996 1412227 1042921 -370183 -11227 863116 946461 856427 1744881 2739820
5884 2739820 2821827 1553952 159587 296836 411592 -604660 -1688357 -1486062 -943488
5875 -943488 -33161 1096742 855995 -7250 931368 1749626 478976 -505410 -850950
5866 -850950 -307337 351243 877806 826552 87006 13239 519750 -199857 -851083 -666351
5856 -666351 -773137 -1105979 -1370395 -1994301 -3121077 -3206404 -3434999 -3856829 -3599844 -2865673
5846 -2865673 -572454 565553 34672 -573125 -282058 770510 1730828 1753817 1701486
5837 1701486 1831098 1567884 341110 -638306 -982567 -1391338 -856754 -175681 -73083
5828 -73083 -23164 782288 1445990 770723 -197276 304637 631474 7130 -1740562 -2417957
5818 -2417957 -1021123 798431 2362086 3160983 2867998 1905084 815329 -366452 -897018
5809 -897018 -938182 -1367803 -1471484 -883333 7522 665461 530154 47469 -160071 -1002726
5799 -1002726 -2167610 -2363277 -2119350 -1234028 -951633 -1381093 -1535587 -2310415 -2969488
5790 -2969488 -2241489 -2052399 -2629230 -2494925 -2709889 -2714051 -2290314 -386092 1302685 1668479
5780 1668479 1222856 999821 770679 295968 326822 -281901 -689818 -1119826 -1183528 -1393847
5770 -1393847 -2216329 -3214872 -3443481 -3863889 -3990389 -2894277 -1229019 -495008 -933737
5761 -933737 -1159469 -183203 1194428 1919039 1674166 -692545 -1402206 -109921 662038
5752 662038 957666 -162301 -645963 -757333 -1069403 -779065 294178 1320353 1862894
5743 1862894 2021495 1926762 1471706 1019703 781346 655750 1119776 1045029 845733 481801
5733 481801 -98236 -129724 255549 151701 -53741 -993612 -1615607 -1219519 -1952615 -1733918
5723 -1733918 -1121537 -1305564 -687463 253487 2938 -1185881 -1822436 -1959006 -1253235
5714 -1253235 -194375 -156718 -371780 -750970 -1144633 -1322307 -112514 71254 565686
5705 565686 2156202 3005600 2533678 1263319 -11253 -693538 316547 1556191 1744603
5696 1744603 588608 440713 631804 916221 1272508 1150069 1223023 861063 -420173
5687 -420173 -519773 -866352 -1279682 -1304475 -1765410 -2518040 -1920262 -964538 312378 1526061
5677 1526061 1584547 1817873 1405762 385414 -850998 -1677073 -1799734 -2255165 -3076705
5668 -3076705 -3793330 -3750082 -3431239 -2665395 -2249144 -2785816 -2656644 -1077014 198071
5659 198071 638973 566194 438839 -210137 -1502653 -2595568 -3988337 -4127136 -3691693
5650 -3691693 -3846037 -3332480 -2296828 -2281717 -1504108 24963 1978276 427722 -2276750
5641 -2276750 -2538812 -1967710 -1933105 -1648593 -1222213 -1812561 -2495037 -2727576 -2707126 -3206672
5631 -3206672 -3084010 -2298758 -1737347 -555048 408147 1014588 1191954 -68587 -380677
5622 -380677 217308 598610 1227131 204435 -1987013 -2405135 -1873895 -1459889 -1329411
5613 -1329411 -1825492 -1464547 -1213682 -1561261 -1170404 77058 1084448 2287368 3714448
5604 3714448 3669997 1844144 242445 -267044 -680973 -494057 34150 -173741 -474285
5595 -474285 -1146643 -1395140 -915756 -750639 -688513 375953 1570342 2393133 2678125 2197101
5585 2197101 2140105 1852431 1690660 1636329 1301783 671010 -245298 -510045 571564 872802
5575 872802 501388 -630563 -2114321 -2823863 -3281623 -2662597 -2076186 -2065486 -2047762 -2014247
5565 -2014247 -1146589 90542 954144 117055 -1018740 -1463400 -1498838 -1993896 -2040165 -2167894
5555 -2167894 -1253204 -369868 -4366 553030 119852 -239924 348919 851434 2083032
5546 2083032 3131236 2955707 3008123 4183833 3949475 2747381 1807572 1437193 1975407
5537 1975407 2783904 2250335 1323100 1458078 934105 -37265 -243079 -833790 -35438 1010612
5527 1010612 584169 -643320 -885088 -207282 -489304 -1294539 -1532982 -519599 -392436
5518 -392436 -1298945 -1758989 -585334 56299 -491359 -256649 1142672 1055780 704380 869173
5508 869173 589060 905358 818416 -155575 -263312 187515 398781 -316678 -2399697 -3071880
5498 -3071880 -2847482 -2199784 -2358614 -3668144 -2664236 -1354071 -481323 -51231 337540
5489 337540 2528127 5159632 4983989 2424922 957488 1593864 2557496 3754401 3676842
5480 3676842 2808585 2606679 2725560 1507536 24999 -725434 -937341 -207658 632581
5471 632581 441995 287765 -259642 -307305 472273 164913 -654923 308391 2621735 3111367
5461 3111367 1623763 -512697 -1547088 -961208 502437 1599678 1374084 607431 -1003268
5452 -1003268 -1297669 -504721 682722 1847767 1944061 804102 578330 1127677 1921672
5443 1921672 2232938 1242947 -292198 -659401 -741244 -157642 -3740 -1167424 -1193121 -741408
5433 -741408 -837795 -1600326 -1632873 -956294 -64877 109490 150282 490615 490506 1587796 2438702
5422 2438702 2293569 1923708 1515436 1673546 2319704 3007869 2907857 2811819 2705261 2963901
5412 2963901 3183226 2789807 1662890 1327537 917889 -192159 -376497 124599 28228
5403 28228 308691 936245 1684498 1423441 878704 318114 18079 748585 973112 595871
5393 595871 583320 1085819 1233228 1620985 1509495 1269714 864818 -166197 -862649 -2242858
5383 -2242858 -2819827 -987944 -167763 409291 1445463 1297344 601358 862815 1235028
5374 1235028 -168817 -1769681 -2481365 -1654613 89218 885462 199534 -1079082 -434752
5365 -434752 -9618 -1069205 -1631820 -2273341 -2094463 96156 1496115 1538624 1001519
5356 1001519 1125154 1173483 -166571 -1461363 -2002281 -1003594 -169248 -1116915 -1763006
5347 -1763006 -875319 -630564 -723805 -653102 -586852 -380611 819309 2952743 3274120 2483423
5337 2483423 1637426 1016467 1643701 2083197 1992859 -30500 -2278081 -3666090 -5523144
5328 -5523144 -5464110 -3397448 -2305719 -1378472 -1012311 -595969 55665 1097657 2311034
5319 2311034 2779536 2636527 1849060 146348 -666304 -183070 -11487 594685 1588033
5310 1588033 3110382 3523450 2545417 1681120 1391526 1592106 1013159 306747 268815 37234
5300 37234 -800691 -1798516 -2002894 -526087 -60135 -698978 -1162781 -1234650 -1197391 -1285915
5290 -1285915 -1523440 -1131257 19880 849278 1017472 1113725 1907172 1978545 1021203 732518
5280 732518 598113 1123014 1480268 405161 -1333156 -3309046 -3781681 -2958634 -2723365
5271 -2723365 -2659400 -1613566 -859558 -1483730 -2490296 -2969440 -2288102 -1781731 -1567939
5262 -1567939 -1716936 -2664901 -3176322 -2886133 -3094497 -3941795 -4168126 -3486262 -1741013
5253 -1741013 391031 -179220 -555778 -331025 -902518 -1304730 -2773043 -3579955 -2302313
5244 -2302313 -1100011 -821423 -590725 -1392521 -1527267 -1400009 -1852434 -2481075 -2161247
5235 -2161247 -1217102 500287 804395 -56431 -823880 -1407676 -1246224 -938881 -977018 -1360529
5225 -1360529 -841558 146479 1797302 2066216 148683 -1698435 -1765980 -1539355 -1326595
5216 -1326595 -832505 -859033 -803074 -647566 -319159 -857045 -1093214 -774078 -168402 52894
5206 52894 -373993 -888611 -1179349 -1072568 -311166 -93180 401980 742744 753274 147003
5196 147003 -1299582 -1311088 -450548 595931 733663 13001 84691 473661 -66954 -1580613
5186 -1580613 -1657012 -1343813 -1071526 -931589 -1389852 -2215299 -1571798 -308857 -574385 -1177001
5176 -1177001 -1239736 -2300118 -3748698 -3025820 -2348079 -1603927 -189629 -532149 -2339881
5167 -2339881 -2321688 -664057 -29975 206830 679378 937478 1059450 1852892 2298616 1504690
5157 1504690 435152 227540 375110 119547 -132197 -94838 -958655 -360834 -22219 -122194
5147 -122194 386522 603158 1458034 1191402 382589 -1023509 -2313334 -2399524 -1494522 -1126803
5137 -1126803 -958926 -516059 -121429 2915 1354242 2244861 1961003 1909462 1480666 980348
5127 980348 236757 -328043 -512704 -718080 -843049 -446296 686068 1872075 2340458
5118 2340458 1187542 -419430 112378 -100346 -1573066 -2826896 -2986200 -2726529 -2363646
5109 -2363646 -2304359 -2246788 -2327398 -1867475 -379802 -245129 -116094 419907 841736 1599163
5099 1599163 3060745 3577963 2974125 1961431 -23841 -763346 -1189041 -1933586 -3059398
5090 -3059398 -3605639 -2731963 -2372322 -1554815 -777835 -1866496 -2956614 -3160840 -3143563
5081 -3143563 -3241762 -3535717 -3411539 -3221479 -3208347 -2657407 -2178352 -1749365 -1410593 -1637276
5071 -1637276 -2014602 -2190740 -2391116 -1429527 -402060 -442817 304396 -9916 -711208 -2251726
5061 -2251726 -3923770 -4049892 -4571256 -5615681 -5762885 -4442525 -1944762 131990 1134081
5052 1134081 358955 -350538 -539148 -84361 652368 929167 1594294 1416769 115111
5043 115111 -621653 -518733 793384 726453 91720 302404 481926 682069 1184127 2230819
5033 2230819 3132620 2544738 1096222 -21732 203947 365400 661102 749044 51106
5024 51106 -1171788 -1904108 -1053073 -432433 45726 535092 686430 623490 -24695 -96819
5014 -96819 -377627 -835249 -2158959 -3628667 -3633236 -3691621 -3713884 -3933029 -4361209 -3817827
5004 -3817827 -2246991 -1160030 111983 848055 387977 -418745 -678766 -844381 -29456
4995 -29456 663246 576808 657474 753696 573585 -646730 -822770 -239565 128589 398646
4985 398646 144448 -237917 985141 2396582 3663521 4065677 2477385 1334528 1572962
4976 1572962 1636525 2292189 2461693 2277467 2072106 1605888 1631386 2291270 2549691 1809118
4966 1809118 -449257 -2368199 -3051656 -2749470 -996885 1477735 1987537 1796573 1171546
4957 1171546 63466 1208927 955604 137242 -617710 -654460 -47373 274620 69684
4948 69684 -808279 -1189344 -1177386 -837183 350147 1344337 1824310 1950434 1475782 617948
4938 617948 384584 -988388 -1865708 -1847030 -308833 1214933 2210690 2301496 1516451 392761
4928 392761 -616008 -753916 -494212 -403590 -816094 -1229923 -233005 -404153 -300592 -503747
4918 -503747 -1177765 -114404 242238 345380 822372 681985 123179 39607 773108 1374595
4908 1374595 1428989 988162 783485 657001 -395574 -1272399 -2130920 -2119506 -1325469 -1016952
4898 -1016952 -251213 758771 1183020 1087859 539419 1332076 1720438 1263622 798084 1532898
4888 1532898 1940545 299738 -784639 -645172 -139615 757498 911771 368423 128931
4879 128931 897566 1434333 1855803 1294763 1109752 1210066 324067 -531717 -1036009 -1111678
4869 -1111678 -753660 517378 1818984 1423144 821232 -72562 -33442 -218378 -350317
4860 -350317 -208571 -1245373 -1824072 -2019976 -1780370 -687686 386993 724378 232020
4851 232020 195161 542239 248005 -986379 -2262145 -1213981 -342937 -407020 110971 1015158
4841 1015158 2148472 2500854 1873690 1848616 1997485 1877215 1142331 383224 -133858 228101
4831 228101 -251197 -1286974 -1558381 -1270749 -636050 -897006 -1448116 -1035887 139591
4822 139591 173660 86845 366588 562350 2060599 3400450 2847284 969120 -349464
4813 -349464 -439614 -366239 197485 176569 -386735 -970856 -215141 449895 599458 1457289
4803 1457289 416417 -1473960 -2728565 -2389318 -2145925 -1261746 -201248 -103652 -1298590
4794 -1298590 -1524437 -1119800 -1052053 -721597 -785078 -404079 415529 -334682 -1161827 -1720710
4784 -1720710 -2136271 -1674356 -1151677 -279874 -424335 -974409 -606682 200853 749583 1470275
4774 1470275 1284430 701083 1001168 1429302 1648966 1548058 1755087 1228642 9176
4765 9176 -823946 -746503 -1265125 -1825110 -1124575 -571857 -811725 31720 915900 1671798
4755 1671798 2472223 2949742 3036210 2367687 2385576 3559164 4283165 3295646 2098140 1360982
4745 1360982 627216 637534 515201 -746403 -566142 -154129 -790208 -2436740 -3495855
4736 -3495855 -3099680 -1367327 -308130 -281384 362713 456588 208565 545843 839991 1051102
4726 1051102 125820 -843360 -894978 -1261875 -1273003 107482 1929561 2447363 1768392 1852149
4716 1852149 2757406 2856385 2496429 2333576 1924736 361626 -1778855 -2065944 -953641
4707 -953641 -1645868 -2492161 -2492868 -2401147 -2729291 -2875852 -1929935 -1201061 -1000974 -1095312 -1814169
4696 -1814169 -1493545 -79547 980776 1331465 1250723 592169 -536573 -500564 -102479
4687 -102479 -408588 -664737 -323919 339617 819353 125241 -1051181 -1549151 -1756583 -1491201
4677 -1491201 225895 1413426 1260586 1580867 1824721 911184 -46555 -60093 157089
4668 157089 -248521 -595861 -71794 213467 555038 726336 594531 -1205641 -2816923
4659 -2816923 -3059591 -2273638 -559952 -41387 481406 1853146 3190562 3737009 3901556
4650 3901556 2566125 712007 -28668 -502489 -144980 1358248 1438929 1243689 761861
4641 761861 -140427 -352403 6953 1106755 1734666 1360799 1202740 2054444 3250919
4632 3250919 2998343 2523104 1732453 744164 914980 1267818 2209866 3395665 3800504
4623 3800504 2980681 2226130 1428975 1275585 1259168 1576689 2217066 2483043 3257362 4123366
4613 4123366 3908145 2073785 1581269 2653737 3831223 3737327 3959513 4033997 3503541
4604 3503541 3016702 4348758 5442051 5963563 7235957 8924472 9855822 10148271 11641227
4595 11641227 13727408 17233730 21329061 25517860 29488791 36438896 47470795 63000583
4587 63000583 85602927 116214766 153736509 188107235 197298897 168798625 125236955
4580 125236955 90749442 67461727 51036428 39449012 30974901 23785059 18293777
4573 18293777 14978605 13269968 11318278 9218016 7869028 6552174 5310330 4611750
4565 4611750 4617300 3364630 1974460 1358915 1202428 687794 155109 1627036 3180281
4556 3180281 4034516 4310302 3971406 3282858 3016257 3247552 2894519 2390307 1761536 1161330
4546 1161330 429360 -237456 643053 880685 -294062 172185 2074080 4582335 5825207
4537 5825207 5010030 4522917 3961130 3078474 3387771 3871062 4386794 4674431 3936519 2014221
4527 2014221 856766 879796 898183 692132 -406267 -632116 -60004 -477214 -2200702
4518 -2200702 -3246757 -3146552 -2379069 -396528 928264 927608 733450 420043 1195529 2165700
4508 2165700 1896453 1902738 2106420 2130769 2536735 2003399 128563 -1322300 -2074041 -1329227
4498 -1329227 29146 -311598 -1218362 -1294656 -1504083 -2255520 -2351086 -2260634 -1564027 -1448176
4488 -1448176 -2390413 -3347996 -3096383 -2529032 -2120734 -2203010 -2222344 -1145973 -654004 -1005280
4478 -1005280 -518867 -942473 -2743967 -3123869 -2273558 -1223638 -45188 63559 -181061
4469 -181061 -872153 -883397 -377210 -815618 -218559 626993 1238288 1790176 2311551 2704825
4459 2704825 2034320 1314438 426532 1136365 1970426 1678228 2096081 2760295 3175724 3165583
4449 3165583 2811458 1481633 -641013 -2298293 -2763260 -2569115 -2737070 -2916743 -2948052
4440 -2948052 -3201569 -3931850 -3468826 -780327 1408960 1837757 820127 -336492 -1214150
4431 -1214150 -1899859 -1998804 -1942981 -2049748 -1201593 588377 1295655 255280 214194 684060
4421 684060 831825 584891 583843 1398696 2233028 2492866 2062665 757255 -863585 -434920
4411 -434920 807273 2108132 1968472 1718891 689692 -808715 -211488 2118904 3612941
4402 3612941 3536117 3470493 2901109 2728922 3945378 4361473 3899969 3224291 1885711 571538
4392 571538 545971 1724134 3143567 3896801 3923493 2619610 1103504 866095 1788777
4383 1788777 2775951 2477531 2093183 1090023 322470 804074 624222 632467 890938 1373128
4373 1373128 1422168 1389259 2126064 3355988 3473783 2209878 839445 191021 -163501
4364 -163501 839932 1725830 1242697 1004717 947444 124420 -476636 -17315 142289 -542414
4354 -542414 -1291648 -856296 39129 -117548 -43042 577066 930968 521893 -335815 -317433
4344 -317433 989129 1433852 1263657 963660 -767975 -957327 -372663 445923 733617
4335 733617 282234 964935 2287485 2757462 2708376 2806840 2405785 1493677 472783 -738085
4325 -738085 -2179470 -2863175 -1799219 -951056 -843317 -345102 -185179 -526821 -568869 -892858
4315 -892858 -252289 307765 -56999 318537 1492812 1543306 828285 377001 -623157 -1964048
4305 -1964048 -1631397 -1763728 -2866151 -3140300 -2288905 -1170186 -579284 -211300 -26549
4296 -26549 -414817 -793813 -602947 -966427 -1442537 -1620731 -1295290 -109 1454611 2500191
4286 2500191 2723758 1335475 545952 287819 62185 966791 1976354 1784238 2087189
4277 2087189 2737889 2665922 1806854 1206755 1740039 2981468 3215432 1588424 -431174
4268 -431174 -1538448 -2139084 -2183414 -1112083 -602064 353469 598588 -189761 -941237 -825462
4258 -825462 229073 -107278 -1207424 -1171334 121757 572617 -643971 -1725716 -2153783
4249 -2153783 -1611195 -1439379 -1361483 295497 116272 -1190710 -1171097 4536 1237614
4240 1237614 2207632 2770792 2798973 3258863 4047376 3632544 2511968 1436862 783610
4231 783610 -37530 -697349 -1287025 -2580302 -2363093 -1111705 49318 189114 -200905
4222 -200905 -1553398 -2696637 -2860837 -2147208 -1022161 401641 1441427 1617693 899807
4213 899807 978546 772529 -583515 -663957 -186447 510544 941681 1012848 2219054 3727895
4203 3727895 4645286 4166788 3042774 2084060 1697806 915616 -102061 -784892 -628932
4194 -628932 373438 935173 196625 -867984 -941346 -1124825 -757532 -57424 1616915
4185 1616915 2634916 2129515 1270481 439335 -373477 -265789 136610 24608 -232880
4176 -232880 -624768 -24272 1775054 3377543 2755063 1236370 -161807 -1281510 -2121683
4167 -2121683 -2376942 -2477685 -1716704 -673269 157991 631300 319595 286539 487842 591655
4157 591655 1218757 2010481 1644590 390006 -1235808 -872902 1691733 3286920 4043123
4148 4043123 4818312 5008553 2602170 -260902 -1098705 -1651288 -1901498 -1707514 -1093188
4139 -1093188 651939 1116634 455059 1060700 1751174 1330818 1138483 1296782 907320
4130 907320 384655 442189 1198374 2605175 3172193 2897338 2245049 431111 -1645691
4121 -1645691 -2645001 -2042027 -703295 -646493 -1565670 -1983904 -1580194 -1386698 -441412 968478
4111 968478 1098367 1123984 1079225 1284965 1889850 3018639 2992584 2516701 1388886 375171
4101 375171 238758 22741 437887 99450 -579483 143030 920667 609451 74794 57628
4091 57628 920720 2327474 3812350 4828040 4861183 4093190 2423629 888555 -124601
4082 -124601 -306768 -759923 -1025520 -550121 504161 1463965 1270284 796003 269463 222154
4072 222154 823781 2334960 2945404 2378871 2503477 2983093 2493204 1264661 -9784
4063 -9784 -660785 -1313008 -1361358 -76841 731337 1050905 931347 800589 383668 315998
4053 315998 -97383 -553717 -745903 -1476370 -2454861 -2328764 -2201678 -913242 757219
4044 757219 1052229 828756 446107 -368924 -657392 -873700 -1425645 -1538234 -1108926 -416608
4034 -416608 -62940 857019 314168 -1027210 -1749997 -1737059 -1415100 -1578632 -1133876 -877884
4024 -877884 -1009805 -134824 1286393 1832002 1772651 1411325 1560356 2916953 3165930 3050513
4014 3050513 3154345 2520613 2468943 3045415 1901923 -587110 -1215093 -842716 -1234252
4005 -1234252 -2474773 -3989859 -4422805 -2503742 -110045 1782681 3008598 3225372 2477161
3996 2477161 2335085 1708958 1951625 3685001 3580719 1892539 -299074 -679674 -578884
3987 -578884 -323051 1223879 1217420 516418 495243 1343086 2219566 2083908 1594531 1972749
3977 1972749 2019797 1592679 1607670 526053 -1766340 -2782327 -3120999 -2510059 -1073469
3968 -1073469 -349661 644863 1286337 1708472 1161266 320663 -976617 -1906083 -1065215
3959 -1065215 1083643 2449327 2369680 1648938 902931 787762 513355 553583 713682 248500
3949 248500 -106094 181654 1419759 1856482 2553434 2656259 1743575 811568 761115 1152319
3939 1152319 1674047 2464229 2906807 1440247 -219918 -1219586 -831154 430200 50057
3930 50057 -858387 -266428 107911 -492965 -953926 -895078 -1187025 -1288969 -1203837 -786021
3920 -786021 -318004 444523 1805519 2898948 2839989 2028636 1098917 -520982 -586676 -174600
3910 -174600 4164 332552 841550 493295 -868651 -1220111 -463652 -314788 -1599073
3901 -1599073 -2979755 -3065841 -2377771 -2243731 -2380441 -1689321 -1287987 -470364 975623
3892 975623 1359343 57705 -98839 862811 1473644 1801442 1409078 1747761 2272329 2281331
3882 2281331 2025400 271958 -86503 443348 -102977 -610771 -163871 161003 789275
3873 789275 933880 -453266 -393619 -420875 -1743092 -2004071 -1819012 -1308977 236714 794374
3863 794374 -194155 -1218580 -1889307 -2531454 -2368278 -3042994 -4100748 -4428451 -2783824
3854 -2783824 -1095135 -493639 -267659 15613 -115623 178743 992813 529974 125517
3845 125517 -300868 -1127077 -1267248 -688462 -664064 -471905 -109245 -298583 -1208441 -1040871
3835 -1040871 505862 1312323 1543330 1391576 1049735 1199818 935530 -69688 -1066210
3826 -1066210 -920625 -1164691 -1820997 -1720698 -1971261 -1378392 166073 1605225 1826711
3817 1826711 376280 -1021552 -2830451 -3852784 -3593429 -3085873 -2113101 -727463 -162111
3808 -162111 -557943 -1135987 -1301159 -1167569 -964393 -730994 -46384 831954 1680164 2250322
3798 2250322 2306973 752184 -191119 -92657 705564 1201870 1253488 1298071 1271381 1239866
3788 1239866 1212967 719763 -394243 -1442142 -1328358 -447136 388764 613017 111843
3779 111843 -256235 780567 1118931 396972 -349930 -556500 -180292 1127609 1420203
3770 1420203 1527250 1991752 2082577 1399555 -669199 -2988211 -2778212 -1506954 -1709211
3761 -1709211 -1978224 -1165905 -774764 360436 1689316 1259197 673869 1712703 3337704
3752 3337704 3024603 888211 -301858 615564 1348112 1542952 1370672 1574568 1199081
3743 1199081 355797 -203331 -729677 -707457 314536 715031 894783 1341590 1832683 1634095
3733 1634095 1294501 318604 288346 764155 832475 -415452 -1536336 -2268152 -2743370 -3161579
3723 -3161579 -2461151 -2287301 -1764606 -908158 -812752 -1280949 -283252 998424 1656296 1618251
3713 1618251 450484 -180532 -27464 725205 1369443 2027085 2848755 1960811 1070122
3704 1070122 1146756 797127 834148 1167065 1713224 2196919 1602163 796325 471727 913428
3694 913428 1352769 995708 -248276 -1535864 -1968544 -2261066 -2166921 -1753458 -2079292 -2030725
3684 -2030725 -1284539 -233593 789792 1738046 1954300 894844 211993 -512777 -1385505
3675 -1385505 -1044108 -355956 -441627 -868582 -695472 62974 398631 638625 808309 -331479
3665 -331479 -1465569 -1253231 -1328952 -1609294 -585402 1265434 1876153 1028840 3386
3656 3386 60174 873959 774578 942037 1712495 1966660 1674431 2011729 2645454 3137683
3646 3137683 2827127 1482502 -350066 -1544806 -915230 786874 1877736 1529116 63558
3637 63558 -889034 -288219 647781 393226 173482 868838 1926147 2488498 1896844 917236
3627 917236 -525384 -1243517 -1488366 -1771311 -349891 1143060 1941361 1965356 456917
3618 456917 -743543 -1322340 -1503918 -1490597 -151887 518160 471873 1213550 2141471 2135607
3608 2135607 1284833 -110027 -1396940 -1671621 -965518 -258952 -659531 -710163 35133
3599 35133 411843 -15520 -452817 -218128 661574 1237491 147031 -510883 -130306 132001
3589 132001 -1122086 -1964264 -1506264 -1405409 -1498382 -1992481 -2792223 -3557378 -3820805 -3828006
3579 -3828006 -4302971 -3605687 -1824922 -271705 443719 -37308 -62518 71774 145673 1487903
3569 1487903 2711940 1853003 269035 -643936 -268295 846751 1699937 2251645 2354460
3560 2354460 1486073 1213866 842332 -428453 -948056 -591421 -561559 -1277085 -1009442 -424119
3550 -424119 412728 397456 -771234 -1549406 -1672171 -1165967 -395618 269497 318855 624966
3540 624966 1181170 552010 457606 271924 176445 242373 210551 684875 1071795 861433
3530 861433 -6762 -199589 392505 741079 720115 815489 1364132 1500726 1165566 1002091
3520 1002091 1275289 587288 -790248 -912339 -977031 -1062002 -1178480 -565542 111621 678696
3510 678696 947645 758985 -181203 -1250727 -1100018 -715516 -935009 -1006457 -998336 -957370
3500 -957370 -1107822 -80659 96217 -290769 -301189 -314980 -411169 -531822 -833073 -162234
3490 -162234 309001 -60612 303139 1363147 1194338 1141104 2013847 1878200 1443426 1274376
3480 1274376 967433 224916 -177559 -1085692 -293529 726055 760687 619103 1448633 1803242
3470 1803242 1349575 874229 400000 -491995 -1051485 -222189 1826302 2907640 2732699
3461 2732699 2350037 2272989 1859388 859345 710879 1144444 771457 384100 613995 1096739
3451 1096739 1445434 1074358 -346408 339189 1657178 1355170 1132957 1886712 2750433
3442 2750433 2920333 1865415 1239899 1752220 1695545 116584 -1045473 -592408 -682440
3433 -682440 -795450 -135681 272394 112624 108134 -377960 -1580214 -1195866 -940226 -222454
3423 -222454 760738 968819 817264 937574 1177542 349922 -1042749 -1404933 -1682806 -1874455
3413 -1874455 -963654 -620183 -1805746 -2264558 -1621580 -676408 -439994 -464506 -526667 -730213
3403 -730213 -713910 -1058283 -2255677 -2961405 -3261889 -3513710 -2477218 -1552795 -793633 -232609
3393 -232609 -312383 -1160358 -1382718 49590 1445995 1365605 1109768 1316037 2385699 3791136
3383 3791136 3919881 2766166 1763142 1508708 2667032 3585314 3384804 2469729 1411501
3374 1411501 -376827 -1348335 -1024498 -517947 -302382 88673 -170171 918033 3261021
3365 3261021 3989528 3504057 2683596 1822121 1431987 -188224 -1181543 -835875 -800049 -224546
3355 -224546 426483 566518 -122223 -564523 -733737 -601569 -438059 -486214 197747 1441855
3345 1441855 1577524 220932 -514762 -1072387 -325010 164188 -287265 294588 757387
3336 757387 653476 -209889 -1532317 -1680804 -519177 958089 2765059 3990524 3606233
3327 3606233 2907484 1375730 -157733 -1333910 -2889976 -4163873 -3891436 -1946829 -714492
3318 -714492 -1087720 -1635528 -1421200 -1595454 -1062389 -201299 -14180 -79709 895935 1199584
3308 1199584 377724 554176 1618415 1147993 102508 -757032 -2969372 -4289082 -3761674
3299 -3761674 -1131051 1495534 1853418 1224553 799070 -292878 -814583 -566889 -334377
3290 -334377 267748 1026524 925445 -147279 -1239277 -2196302 -2958975 -3299022 -3121300
3281 -3121300 -443040 1892591 1222659 1471476 1777758 1583040 1671318 1288331 156662
3272 156662 -702240 -844324 -1461645 -2038335 -1809760 -1002607 -471011 290299 410466 533613
3262 533613 1673263 2606661 3761853 4269609 4002825 2730676 864433 -188773 -1627344
3253 -1627344 -2037121 -1465626 -851229 353243 956653 758862 773617 351733 -312649 -232254
3243 -232254 388149 -181132 -994955 -671196 -400194 -75528 -170835 -638807 -478055 -384574
3233 -384574 -1126482 -1764759 -2557403 -2752074 -3802165 -4920876 -4251057 -3200890 -2381206
3224 -2381206 -2311062 -1760431 -617499 -1470407 -3103595 -4173276 -3957868 -2525947 -1910192
3215 -1910192 -2705731 -3404071 -1866628 -590394 -446373 -601867 -315314 557094 641236
3206 641236 218164 600463 1757016 1627025 517392 115484 -39286 -537407 -1205310
3197 -1205310 -1479812 -1171339 -1079139 -384890 213768 268797 -519810 -784758 17202 1076637
3187 1076637 2027833 2470228 1255285 393246 534138 -213011 -1030842 -955745 -226280 421042
3177 421042 592562 -760732 -2627851 -3276564 -2940895 -2385082 -2695865 -2627410 -1708673 -381763
3167 -381763 1006779 399815 161842 766585 1524062 1198596 775004 1027192 1057467 769436
3157 769436 722855 1193272 1142327 1086077 389089 -188804 -306503 -625931 -33476 758965
3147 758965 904200 1341616 892069 -454062 -43229 741809 -43097 -1889943 -3518446
3138 -3518446 -4157648 -3230079 -2059521 -1066274 -980774 -1054475 -980433 -104843 105991 73588
3128 73588 162518 422342 302336 69212 1102794 2892821 3627308 3458649 3153085 2863388
3118 2863388 2281489 1522594 345608 -1758991 -2830865 -2994170 -3030806 -2575929 -1916121
3109 -1916121 -657742 169592 -1029942 -2868790 -4028711 -2928182 -1451677 -1335399 -1418997
3100 -1418997 -1156308 -612300 -725992 -1245960 -1373053 -1121104 71172 988404 1123799
3091 1123799 825929 176433 -958461 -345600 997857 1924400 2018147 1624773 720409
3082 720409 1173797 1772942 1625745 978244 666737 364559 475870 1061378 653107 120492
3072 120492 -1390735 -2764694 -3217614 -2313812 -1566449 -1586824 -1799937 -2067040 -2425339 -2214523
3062 -2214523 -1962595 -1713027 -974676 509329 1356122 1186208 571906 -276077 -1752644
3053 -1752644 -2358824 -2853988 -2721201 -2391042 -1923923 -1387851 -1822534 -1634071 -1725588 -1593254
3043 -1593254 -1142266 -871653 -958363 -465471 523908 839468 958863 2144132 2596240 2281124
3033 2281124 2165088 1150987 -357138 -85740 974552 2023785 1833704 1058998 633026
3024 633026 688685 371531 -128369 -392864 367099 508969 331425 1087444 2522483 3237380
3014 3237380 2803964 1842935 1652446 1610682 1489237 1895612 2240716 1973298 1027869 963387
3004 963387 1455805 1764690 1827305 959126 -253597 -561428 -923310 -1647672 -1951511 -1637100
2994 -1637100 -897728 -301225 -1055553 -1708349 -2441766 -2723763 -1662997 107742 1752817
2985 1752817 1836837 751727 106578 -871088 -1540413 -1055672 -423550 -665673 -918743 -115839
2975 -115839 207725 686011 1509423 964230 -196866 -973563 -156664 650378 1056993 2246148
2965 2246148 3109152 3892326 4733898 4518128 2894241 2129931 2283855 2485073 1318658
2956 1318658 -462636 -1137186 -1551538 -1610353 -1312417 -1066380 -1825970 -2549782 -1995278 -1359629
2946 -1359629 -1820088 -1984643 -2204396 -1515787 76829 422688 -326923 -1228696 -2266502
2937 -2266502 -2480586 -1405128 -387715 1106306 1401971 1584349 1917335 767360 -522579
2928 -522579 -1635704 -2858533 -2472722 -1533202 -1659915 -961428 -778821 -980789 -985837 -1207313
2918 -1207313 -269251 31272 -52571 1187764 1382538 252339 -219608 -468608 76720
2909 76720 1692944 2602732 2521097 2417411 2165150 1885816 1472677 1074561 1020697 1214144
2899 1214144 943119 55700 -989313 -2015889 -1854105 -1044929 -203175 491796 186029
2890 186029 -401237 -968567 -967431 -467016 -525271 -1472060 -2139725 -1238215 146260 861471
2880 861471 -532040 -2994585 -4208240 -3629161 -1761898 10695 826306 -52594 -1166305
2871 -1166305 -1857216 -1149518 -65298 -295187 -738026 -2155934 -3827640 -3570244 -2559026
2862 -2559026 -2599701 -2240834 -497638 653700 1131202 1997874 2763458 2145239 1218052
2853 1218052 1327714 1295746 1223635 1727311 1353448 987674 798718 936433 493923 -18809
2843 -18809 -652399 -983426 -733289 -548917 -176028 232212 347174 -1496244 -2683867 -2828277
2833 -2828277 -2999005 -2712687 -1678413 184146 2324087 2752420 854701 6939 1915264
2824 1915264 3075543 3008865 2725860 1995830 1077491 103920 56351 563613 101276 -1110190
2814 -1110190 -1912489 -2978810 -3995633 -3845968 -4226387 -4464429 -3113130 -1725023 -1300539
$$ [...]
##END NTUPLES=NMR SPECTRUM
##END=
