##TITLE=C13_16-2024-Bay
 DMSO-d, 1800 sc

 11.3.2024
##JCAMPDX= 6.0         $$ Bruker NMR JCAMP-DX V2.0
##DATA TYPE= NMR SPECTRUM
##DATA CLASS= NTUPLES
##ORIGIN= UXNMR, Bruker Analytische Messtechnik GmbH
##OWNER= root
$$ XWIN-NMR		Version 3.5
$$ Mon Mar 11 16:21:47 2024 Russian Standard Time (UT+4h)  she@DPX200
##.OBSERVE FREQUENCY= 50.327896
##.OBSERVE NUCLEUS= ^13C
##.ACQUISITION MODE= SIMULTANEOUS
##.ACQUISITION SCHEME= undefined
##.AVERAGES= 1801
##.DIGITISER RES= 17
##SPECTROMETER/DATA SYSTEM= spect
##.PULSE SEQUENCE= zgpg30
##.SOLVENT NAME= CDCl3
##.SHIFT REFERENCE= (INTERNAL, CDCl3, 0, 222.646)
##AUDIT TRAIL= $$ (NUMBER, WHEN, WHO, WHERE, WHAT)
$$ ##TITLE= Audit trail, XWIN-NMR		Version 3.5
$$ ##JCAMPDX= 5.01
$$ ##ORIGIN= Bruker BioSpin GmbH
$$ ##OWNER= she
$$ F:/spectra/data/she/nmr/c13/1/pdata/1/auditp.txt
$$ ##AUDIT TRAIL=  $$ (NUMBER, WHEN, WHO, WHERE, WHAT)
(   1,<2024-03-11 16:20:31.45 +0400>,<she>,<DPX200>,
      <created by zg, POWCHK disabled, PULCHK disabled
       terminated by command 'halt'
       configuration hash MD5:
       00 E9 B6 7A A2 85 ED C7 34 08 36 98 17 FE 4E 26
       data hash MD5: 32K
       DA A1 58 E7 60 C8 C4 F6 C4 A1 C3 4A 12 3F AB D6>)
(   2,<2024-03-11 16:20:35.78 +0400>,<she>,<DPX200>,
      <Start of raw data processing
       efp BC_mod = 2 LB = 2 FT_mod = 6 PKNL = 1 PHC0 = -386.3643 PHC1 = 16.9201 SI = 32K 
       data hash MD5: 32K
       45 AC 13 D4 D9 CC F1 34 47 5A 0F 16 66 A9 64 75>)
(   3,<2024-03-11 16:20:38.90 +0400>,<she>,<DPX200>,
      <abs ABSG = 5 
       data hash MD5: 32K
       BE 8E A6 D6 E1 A7 FC 04 91 1E E0 CB F0 30 CB F8>)
(   4,<2024-03-11 16:21:12.76 +0400>,<she>,<DPX200>,
      <pk PHC0 = -2.619223 PHC1 = 5.599999 
       data hash MD5: 32K
       75 5E 04 D2 FA F6 48 5F 40 45 1C 1D F3 56 FF BC>)
$$ ##END=
$$ 
$$ hash MD5
$$ 55 5C D7 F0 64 26 7A 30 F5 53 17 55 11 7E C0 60
##$RELAX= 
##$RELAX= 
##$RELAX= 
##$RELAX= 
##$RELAX= 
##$RELAX= 
##$RELAX= 
##$RELAX= 
$$ Bruker specific parameters
$$ --------------------------
##$DU= <F:/spectra>
##$EXPNO= 1
##$NAME= <c13>
##$PROCNO= 1
##$TYPE= <nmr>
##$USER= <she>
##$AMP= (0..31)
100 100 100 100 100 100 100 100 100 100 100 100 100 100 100 100 100 100 
100 100 100 100 100 100 100 100 100 100 100 100 100 100 
##$AQSEQ= 0
##$AQ_mod= 1
##$AUNM= <au_zg>
##$AUTOPOS= <>
##$BF1= 50.322709
##$BF2= 200.13
##$BF3= 50.322709
##$BF4= 500.13
##$BF5= 500.13
##$BF6= 500.13
##$BF7= 500.13
##$BF8= 500.13
##$BYTORDA= 1
##$CFDGTYP= 0
##$CFRGTYP= 5
##$CHEMSTR= <none>
##$CNST= (0..31)
1 1 145 1 1 1 1 1 1 1 1 1 1 1 1 1 1 1 1 1 1 1 1 1 1 1 1 1 1 1 1 1 
##$CPDPRG= <waltz16>
##$CPDPRG1= <>
##$CPDPRG2= <waltz16>
##$CPDPRG3= <>
##$CPDPRG4= <mlev>
##$CPDPRG5= <mlev>
##$CPDPRG6= <mlev>
##$CPDPRG7= <mlev>
##$CPDPRG8= <mlev>
##$CPDPRGB= <>
##$CPDPRGT= <>
##$D= (0..31)
0 2 0.00345 0 0 0 0 0 0 0 0 0.03 2e-05 3e-06 0 0 0 0 0 0 0 0 0 0 0 0 0 
0 0 0 0 0 
##$DATE= 1710153571
##$DBL= (0..7)
120 120 120 120 120 120 120 120 
##$DBP= (0..7)
150 150 150 150 150 150 150 150 
$$ [...]
##$SUBNAM4= <"">
##$SUBNAM5= <"">
##$SUBNAM6= <"">
##$SUBNAM7= <"">
##$SUBNAM8= <"">
##$SUBNAM9= <"">
##$SW= 239.972175391363
##$SWIBOX= (0..15)
0 1 3 0 0 0 0 0 0 0 0 0 0 0 0 0 
##$SW_h= 12077.2946859903
##$TD= 32768
##$TD0= 1
##$TE= 0
##$TE2= 300
##$TE3= 300
##$TEG= 300
##$TL= (0..7)
120 120 120 120 120 120 120 120 
##$TP= (0..7)
150 150 150 150 150 150 150 150 
##$TP07= 0
##$TPNAME0= <>
##$TPNAME1= <>
##$TPNAME2= <>
##$TPNAME3= <>
##$TPNAME4= <>
##$TPNAME5= <>
##$TPNAME6= <>
##$TPNAME7= <>
##$TPOAL= (0..7)
0.5 0.5 0.5 0.5 0.5 0.5 0.5 0.5 
##$TPOFFS= (0..7)
0 0 0 0 0 0 0 0 
##$TUNHIN= 0
##$TUNHOUT= 0
##$TUNXOUT= 0
##$USERA1= <user>
##$USERA2= <user>
##$USERA3= <user>
##$USERA4= <user>
##$USERA5= <user>
##$V9= 5
##$VALIST= <valist>
##$VCLIST= <CCCCCCCCCCCCCCC>
##$VD= 0
##$VDLIST= <DDDDDDDDDDDDDDD>
##$VPLIST= <PPPPPPPPPPPPPPP>
##$VTLIST= <TTTTTTTTTTTTTTT>
##$WBST= 1024
##$WBSW= 4
##$XGAIN= (0..3)
0 0 0 0 
##$XL= 0
##$YL= 0
##$YMAX_a= 3185362
##$YMIN_a= -10063406
##$ZGOPTNS= <>
##$ZL1= 120
##$ZL2= 120
##$ZL3= 120
##$ZL4= 120
##$ABSF1= 222.646
##$ABSF2= -17.35081
##$ABSG= 5
##$ABSL= 3
##$ALPHA= 0
##$AQORDER= 0
##$ASSFAC= 0
##$ASSFACI= 0
##$ASSFACX= 0
##$ASSWID= 0
##$AUNMP= <proc_1d>
##$AZFE= 0.1
##$AZFW= 0.5
##$BCFW= 0
##$BC_mod= 2
##$BYTORDP= 0
##$COROFFS= 0
##$CY= -3
##$DATMOD= 1
##$DC= 0
##$DFILT= <>
##$DTYPP= 0
##$F1P= 0
##$F2P= 0
##$FCOR= 0.5
##$FTSIZE= 32768
##$FT_mod= 6
##$GAMMA= 0
##$GB= 0
##$INTBC= 1
##$INTSCL= 4.134877e-10
##$ISEN= 128
##$LB= 2
##$LEV0= 0
##$LPBIN= 0
##$MAXI= 10000
##$MC2= 0
##$MEAN= 0
##$ME_mod= 0
##$MI= 0.1934396
##$NCOEF= 0
##$NC_proc= -1
##$NLEV= 6
##$NOISF1= 120.0001
##$NOISF2= 80.00006
##$NSP= 0
##$NTH_PI= 0
##$NZP= 0
##$OFFSET= 222.646
##$PC= 1.4
##$PHC0= -388.9835
##$PHC1= 22.5201
##$PH_mod= 1
##$PKNL= yes
##$PPARMOD= 0
##$PSCAL= 0
##$PSIGN= 0
##$REVERSE= no
##$SF= 50.3227304925793
##$SI= 32768
##$SIGF1= 140
##$SIGF2= 120
##$SINO= 11.81781
##$SIOLD= 32768
##$SREGLST= <13C.CDCl3>
##$SSB= 0
##$STSI= 32768
##$STSR= 0
##$SW_p= 12077.2946859903
##$SYMM= 0
##$S_DEV= 0
##$TDeff= 32768
##$TDoff= 0
##$TI= <>
##$TILT= no
##$TM1= 0
##$TM2= 0
##$TOPLEV= 0
##$USERP1= <user>
##$USERP2= <user>
##$USERP3= <user>
##$USERP4= <user>
##$USERP5= <user>
##$WDW= 1
##$XDIM= 32768
##$YMAX_p= 432410620
##$YMIN_p= -4117949
$$ End of Bruker specific parameters
$$ ---------------------------------
##NTUPLES= NMR SPECTRUM
##VAR_NAME=  FREQUENCY,     SPECTRUM/REAL,   SPECTRUM/IMAG
##SYMBOL=    X,             R,               I
##VAR_TYPE=  INDEPENDENT,   DEPENDENT,       DEPENDENT
##VAR_FORM=  AFFN,          ASDF,            ASDF
##VAR_DIM=   32768,         32768,           32768
##UNITS=     HZ,            ARBITRARY UNITS, ARBITRARY UNITS
##FACTOR=    0.368581032318806, 1,           1
##FIRST=     11204.1544566776, 0,            0
##LAST=      -873.140229312654, 0,           0
##MIN=       -873.140229312654, -4117949,    0
##MAX=       11204.1544566776, 432410620,    0
$$ Real data points
##PAGE= N=1
##DATA TABLE= (X++(R..R)), XYDATA
$$ [...]
$$ plain form
10730 -1218804 -1509979 -1732037 -1737345 -1615607 -1453892 -1305589 -1244060 -1228679 -1244391 -1301204
10720 -1301204 -1348280 -1307763 -1124910 -871469 -748317 -867530 -1064537 -1172814 -1294191 -1441728
10710 -1441728 -1582708 -1785835 -2028950 -2237490 -2332218 -2377785 -2382329 -2265114 -2082000 -1979454
10700 -1979454 -2016464 -2128214 -2196489 -2161526 -1968917 -1527186 -917767 -372375 -43080 10746
10690 10746 -129873 -323842 -539508 -803784 -1060285 -1246393 -1305720 -1273974 -1129346 -801387
10680 -801387 -294640 265399 738708 1018401 1000489 646839 121937 -298260 -421181 -289512
10670 -289512 -90880 30369 79371 166808 314100 426230 453912 455738 404958 260319 66811
10659 66811 -161522 -338817 -402961 -350949 -169286 104990 370731 490495 454793 472436
$$ packed form
10730a218804k91175k22058n308J21738J61715J48303O1529J5381j5712n6813
10720a301204m7076M0517J82853K53441J23152j19213j97007j08277j21377j47537
10710a441728j40980k03127k43115k08540r4728m5567m544J17215J83114J02546
10700a979454l7010j11750o8275L4963J92609M41731O09419N45392L29295N3826
10690A0746j40619j93969k15666k64276k56501j86108n9327L1746J44628L27959
10680h01387N06747N60039M73309K79693j7912l53650n24902m20197j22921J31669
10670b89512J98632J21249M9002Q7437J47292J12130K7682J826n0780j44639j93508
10659F6811k28333j77295o4144N2012J81663K74276K65741J19764l5702J7643
$$ plain form
10649 472436 592245 660247 745523 1018724 1373063 1636718 1861472 2126770 2332014 2355196
10639 2355196 2179172 1836434 1476076 1168896 616279 -320095 -1312131 -2054188 -2435549
10630 -2435549 -2370684 -1860509 -1206477 -726243 -505050 -562443 -782642 -979683 -1059107 -1007542
10620 -1007542 -907458 -721169 -442789 -195583 -66167 -2365 61960 44131 -80859 -214019
10610 -214019 -259961 -202511 -115702 -65635 -155499 -292713 -231212 95440 599172 1172080 1704882
10599 1704882 2050456 2149598 2037529 1937254 2033920 2100767 1847534 1394356 999063 660287
10589 660287 210405 -300939 -608337 -547475 -217915 36142 13739 -193053 -426608 -588464
10579 -588464 -708323 -888231 -1049023 -1008954 -747151 -319829 152778 497749 655392 672499
$$ packed form
10649D72436J19809O8002Q5276K73201L54339K63655K24754K65298K05244K3182
10639B355196j76024l42738l60358l07180n52617r36374r92036p42057l81361
10630b435549O4865N10175O54032M80234K21193n7393k20199j97041p9424N1565
10620a007542J00084J86289K78380K47206J29416O3802O4325j7829j24990j33160
10610b14019m5942N7450Q6809N0067q9864j37214O1501L26652N03732N72908N32802
10599A704882L45574R9142j12069j00275R6666O6847k53233m53178l95293l38776
10589F60287m49882n11344l07398O0862L29560K54057k2403k06792k33555j61856
10579e88464j19859j79908j60792M0069K61803M27322M72607L44971J57643J7107
$$ plain form
10569 672499 544131 334739 274677 403234 464779 257743 -122999 -418473 -474214 -385275
10559 -385275 -322964 -328423 -334913 -349035 -367637 -362957 -409039 -491066 -499111 -353439 25351 643026
10547 643026 1309434 1826307 2266979 2648274 2767681 2501988 1925410 1297173 1015236 1190320
10537 1190320 1510351 1686176 1589184 1237184 821446 518984 307505 50882 -355369 -822818
10527 -822818 -956130 -570497 27202 489787 693537 597792 298782 -32573 -232096 -173167
10517 -173167 12966 80961 -38336 -277370 -565639 -783386 -833691 -812814 -835604 -823434
10507 -823434 -768891 -763300 -806466 -790645 -741006 -850398 -1158461 -1521804 -1718140 -1606284 -1265604
10496 -1265604 -826830 -390547 -159749 -219579 -390035 -464806 -417147 -411348 -550792 -697798
$$ packed form
10569F72499j28368k09392o0062J28557O1545k07036l80742k95474n5741Q8939
10559c85275O2311n459o490j4122j8602M680m6082q2027q045J45672L78790O17675
10547F43026O66408N16873M40672L81295J19407k65693n76578o28237k81937J75084
10537A190320L20031J75825r6992l52000m15738l02462k11479k56623m06251m67449
10527h22818j33312L85633N97699M62585K03750r5745k99010l31355j99523N8929
10517a73167J86133O7995j19297k39034k88269k17747n0305K0877k2790J2170
10507h23434N4543N591m3166J5821M9639j09392l08063l63343j96336J11856L40680
10496a265604M38774M36283K30798n9830j70456p4771M7659N799j39444j47006
$$ plain form
10486 -697798 -757445 -784371 -833165 -774806 -508336 -161189 110179 216037 117885 -67492
10476 -67492 -135743 12604 182197 181031 95976 56051 64943 103988 105225 -53905 -331265
10465 -331265 -547737 -536699 -297073 -80014 -143686 -464341 -759382 -821094 -729123 -696918
10455 -696918 -887788 -1255600 -1544562 -1617674 -1569717 -1397861 -1023498 -485962 112989 601470
10445 601470 782568 665064 466315 353386 388493 536169 626353 533540 348392 168878
10435 168878 -42707 -292767 -426945 -297140 -48954 66405 66991 32400 -151029 -490575
10425 -490575 -828384 -1131899 -1414510 -1626106 -1790622 -1952286 -2040206 -1911392 -1505798 -963407
10415 -963407 -585661 -489172 -547608 -693426 -851618 -854888 -718862 -565444 -480743 -513577 -646978
$$ packed form
10486f97798n9647k6926m8794N8359K66470L47147K71368J05858r8152j85377
10476f7492o8251J48347J69593j166q5055l9925Q892L9045J237j59130k77360
10465c31265k16472J1038K39626K17059o3672l20655k95041o1712R1971L2205
10455f96918j90870l67812k88962p3112M7957J71856L74363N37536N98951M88481
10445F01470J81098j17504j98749j12929L5107J47676R0184r2813j85148j79514
10435A68878k11585k50060j34178J29805K48186J15359N86l4591j83429l39546
10425d90575l37809l03515k82611k11596j64516j61664q7920J28814M05594N42391
10415i63407L77746R6489n8436j45818j58192l270J36026J53418Q4701l2834j33401
$$ plain form
10404 -646978 -863330 -1086210 -1302756 -1593086 -1959870 -2334137 -2642888 -2778593 -2652075 -2307476
10394 -2307476 -1943649 -1801066 -1997022 -2372525 -2644955 -2671465 -2455898 -2127812 -1887939 -1761382
10384 -1761382 -1591027 -1403275 -1404833 -1508514 -1421823 -1083769 -661772 -293558 -43744 71363
10374 71363 78588 -11013 -100492 7964 230771 356601 431146 522497 680186 843790 815562
10363 815562 491174 -26307 -569112 -979276 -1198529 -1317816 -1361871 -1257923 -1099075 -1028460
10353 -1028460 -962771 -727881 -367185 -25529 283609 469446 358543 -23749 -623073 -1343443
10343 -1343443 -1979354 -2369162 -2512613 -2555721 -2527967 -2344929 -2093488 -1838062 -1603228 -1452760
10333 -1452760 -1362997 -1321512 -1309409 -1373684 -1531096 -1685792 -1817145 -1923062 -2022085 -2030481 -1754691
$$ packed form
10404f46978k16352k22880k16546k90330l66784l74267l08751j35705J26518L44599
10394b307476L63827J42583j95956l75503k72430k6510K15567L28086K39873J26557
10384a761382J70355J87752j558j03681Q6691L38054M21997L68214K49814J15107
10374G1363P225q9601q9479J08456K22807J25830P4545R1351J57689J63604k8228
10363H15562l24388n17481n42805m10164k19253j19287m4055J03948J58848P0615
10353a028460O5689K34890L60696L41656L09138J85837j10903l82292n99324p20370
10343a343443o35911l89808j43451m3108K7754J83038K51441K55426K34834J50468
10333a452760Q9763M1485J2103o4275j57412j54696j31353j05917r9023q396K75790
$$ plain form
10322 -1754691 -1253257 -761050 -381919 -116759 20509 18460 -65789 -61947 160569 581282
10312 581282 1000392 1201290 1217123 1052517 652702 268123 165315 205789 159082 55044
10302 55044 -19256 -98394 -217866 -325257 -320369 -164542 12693 51376 -91435 -253953 -213559
10291 -213559 14639 274875 420651 352768 100444 -148995 -337297 -506270 -676659 -836667
10281 -836667 -956416 -954953 -826496 -690123 -665455 -755155 -792748 -726544 -655693 -621861 -581279
10270 -581279 -441984 -263123 -128974 34901 155085 94592 -11378 -84392 -135130 -177700
10260 -177700 -302262 -454100 -489336 -340796 -118761 -48866 -260707 -595477 -899989 -1253712
10250 -1253712 -1656022 -1932094 -2046282 -2032590 -1897678 -1687610 -1467544 -1196918 -900408 -749346
$$ packed form
10322a754691N01434M92207L79131K65160J37268k049q4249L842K22516M20713
10312E81282M19110K00898J5833j64606l99815l84579j02808M0474m6707j04038
10302E5044p4300p9138j19472j07391M888J55827J77235L8683j42811j62518M0394
10291b13559K28198K60236J45776o7883k52324k49439j88302j68973j70389j60008
10281h36667j19749J463J28457J36373K4668q9700l7593O6204P0851L3832M0582
10270e81279J39295J78861J34149J63875J20184o0493j05970p3014n0738m2570
10260a77700j24562j51838l5236J48540K22035O9895k11841l34770l04512l53723
10250a253712m02310k76072j14188J3692J34912K10068K20066K70626K96510J51062
$$ plain form
10240 -749346 -735280 -648031 -480184 -392434 -417241 -495028 -575243 -625666 -574720 -336120 28969
10229 28969 268536 364621 502818 719326 1007007 1336042 1539307 1457571 1174543 803526
10219 803526 395447 75820 -87345 -195236 -316955 -400107 -440550 -438153 -394002 -428761 -541379
10208 -541379 -571847 -507753 -505402 -609910 -703035 -686897 -609538 -565757 -523449 -446133 -425309
10197 -425309 -408871 -268692 -154460 -287890 -660666 -1110463 -1488878 -1745929 -1855032 -1680556
10187 -1680556 -1273013 -878542 -634307 -549972 -514387 -351096 -56438 154010 169084 169587
10177 169587 327841 562590 650200 486606 135140 -274675 -626319 -782336 -684864 -428370
10167 -428370 -50885 364843 724255 967599 1112362 1256622 1413585 1476490 1427740 1376303
$$ packed form
10240g49346J4066Q7249J67847Q7750k4807p7787q0215n0423N0946K38600L65089
10229B8969K39567R6085J38197K16508K87681L29035K03265q1736k83028l71017
10219H03526m08079l19627j63165j07891j21719q3152m0443K397M4151l4759j12618
10208e41379l0468O4094K351j04508r3125J6138P7359M3781M2308P7316K0824
10197d25309J6438J40179J14232j33430l72776m49797l78415k57051j09103J74476
10187a680556M07543L94471K44235Q4335L5585J63291K94658K10448J5074N03
10177A69587J58254K34749Q7610j63594l51466m09815l51644j56017R7472K56494
10167d28370L77485M15728L59412K43344J44763J44260J56963O2905m8750n1437
$$ plain form
10157 1376303 1409342 1425128 1208693 793861 420157 208441 205604 454838 847630 1192170
10147 1192170 1418424 1545014 1503996 1292663 1089688 1067954 1216439 1487681 1751758 1868141
10137 1868141 1804339 1602068 1285267 853796 481902 323900 317324 331345 379784 571445
10127 571445 858978 1076262 1169400 1217099 1339401 1470944 1439027 1209112 921950 741810
10117 741810 691577 628933 531801 508944 574853 639878 676701 755867 761661 625333 538125
10106 538125 575217 604908 619456 702484 805362 949047 1302058 1766948 2086789 2262864
10096 2262864 2315834 2223505 2110671 2004140 1744367 1254780 683376 125415 -444666 -898329
10086 -898329 -1012744 -692432 -96126 471701 813070 968145 1107266 1235741 1308919 1317795
$$ packed form
10157A376303L3039J5786k16435m14832l73704k11716k837K49234L92792L44540
10147A192170K26254J26590m1018k11333k02975k1734J48485K71242K64077J16383
10137A868141o3802k02271l16801m31471l71894j58002o576J4021M8439J91661
10127E71445K87533K17284R3138M7699J22302J31543l1917k29915k87162j80140
10117G41810n0233o2644r7132k2857O5909O5025L6823P9166N794j36328q7208
10106E38125L7092K9691J4548Q3028J02878J43685L53011M64890L19841J76075
10096B262864N2970r2329j12834j06531k59773m89587n71404n57961n70081m53663
10086h98329j14415L20312N96306N67827L41369J55075J39121J28475P3178Q876
$$ plain form
10076 1317795 1304525 1331834 1387865 1458603 1526526 1499120 1304139 1063396 886899 670548
10066 670548 391451 182007 52264 -57029 -113398 -62850 187857 645174 1010082 1040691
10056 1040691 845790 620300 468082 507341 724175 904617 871154 555692 23105 -485220
10046 -485220 -859964 -1124172 -1253298 -1162647 -872800 -668123 -837033 -1285246 -1685836 -1892312
10036 -1892312 -2011182 -2213502 -2499393 -2696832 -2633709 -2355637 -2038326 -1766131 -1598196 -1494786
10026 -1494786 -1315801 -1104484 -1116211 -1374698 -1608786 -1622084 -1448146 -1230777 -1020570 -806326
10016 -806326 -621564 -448083 -367572 -522957 -772369 -839119 -685019 -539751 -625853 -882573
10006 -882573 -1090151 -1178839 -1273102 -1360674 -1245868 -894437 -455471 -34548 242619 204789
$$ packed form
10076A317795j3270K7309N6031P0738O7923k7406j94981k40743j76497k16351
10066F70548k79097k09444j29743j09293n6369N0548K50707M57317L64908L0609
10056A040691j94901k25490j52218L9259K16834J80442l3463l15462n32587n08325
10046d85220l74744k64208j29126R0651K89847K04677j68910m48213m00590k06476
10036a892312j18870k02320k85891j97439O3123K78072L17311K72195J67935J03410
10026a494786J78985K11317j1727k58487k34088j3298J73938K17369K10207K14244
10016h06326J84762J73481Q0511j55385k49412o6750J54100J45268q6102k56720
10006h82573k07578q8688r4263q7572J14806L51431M38966M20923K77167l7830
$$ plain form
9996 204789 -54062 -290621 -370365 -344257 -339799 -385142 -502417 -722498 -968749 -1110603 -1085396
9985 -1085396 -939031 -810186 -789304 -867491 -1022671 -1185123 -1169456 -938552 -611499 -316217
9975 -316217 -65424 122240 124080 76867 125669 159310 60552 -54866 13025 246558 534411
9964 534411 715160 707613 615093 504097 377850 196273 21577 -36656 102143 369165
9954 369165 696984 1142559 1607776 1874221 1969521 2118387 2270280 2166276 1863881 1617043
9944 1617043 1429403 1145672 792894 534728 423189 398693 411039 360537 221090 179419
9934 179419 242954 130929 -238595 -652366 -915625 -1053883 -1124739 -1166790 -1156839 -1079262 -938866
9923 -938866 -790486 -681481 -448855 -67962 219004 249291 109 -356787 -622314 -759389
$$ packed form
9996B04789k58851k36559p9744K6108M458m5343j17275k20081k46251j41854K5207
9985a085396J46365J28845K0882p8187j55180j62452J5667K30904L27053K95282
9975c16217K50793J87664J840m7213M8802L3641r8758j15418O7891K33533K87853
9964E34411J80749p547r2520j10996j26247j81577j74696n8233J38799K67022
9954C69165L27819M45575M65217K66445R5300J48866J51893j04004l02395k46838
9944A617043j87640k83731l52778k58166j11539k4496J2346n0502j39447m1671
9934A79419O3535j12025l69524m13771k63259j38258p0856m2051R951P7577J40396
9923i38866J48380J09005K32626L80893K86966L0287k49182l56896k65527j37075
$$ plain form
9913 -759389 -772618 -692229 -607312 -522956 -402087 -279134 -280729 -499624 -833895 -1116865 -1145119
9902 -1145119 -874767 -446175 45092 505857 767168 798198 717785 558251 320390 44059
9892 44059 -111294 -75575 -37525 -215913 -531028 -702959 -695478 -706368 -802561 -882405 -840483
9881 -840483 -679574 -569523 -563927 -552872 -464038 -294868 -115485 130086 514980 817101
9871 817101 813894 501818 -14637 -640698 -1177319 -1436415 -1407748 -1149261 -873238 -830040
9861 -830040 -1106076 -1576116 -1913771 -1944023 -1622666 -1022603 -410808 27122 285801 374676
9851 374676 267553 -11203 -379686 -784800 -1057990 -1060888 -896496 -700868 -468800 -237270
9841 -237270 -85395 51074 274348 565438 838406 1073672 1224769 1242334 1100217 750815
$$ packed form
9913g59389j3229Q0389Q4917Q4356J20869J22953j595k18895l34271k82970k8254
9902a145119K70352M28592M91267M60765K61311L1030q0413j59534k37861k76331
9892D4059j55353L5719L8050j78388l15115j71931P481j0890r6193p9844M1922
9881h40483J60909J10051N596J1055Q8834J69170J79383K45571L84894L02121
9871H17101l207l12076n16455o26061n36621k59096K8667K58487K76023M3198
9861h30040k76036m70040l37655l0252L21357O00063O11795M37930K58679Q8875
9851C74676j07123k78756l68483m05114k73190k898J64392J95628K32068K31530
9841b37270J51875J36469K23274K91090K72968K35266J51097J7565j42117l49402
$$ plain form
9831 750815 271369 -195631 -645523 -1072331 -1315714 -1289880 -1056720 -775365 -512001 -106164
9821 -106164 417687 816375 986187 936137 745568 536816 315001 353 -427597 -798647
9811 -798647 -925360 -789882 -511312 -234206 -55495 -33263 -265736 -777688 -1361253 -1670043
9801 -1670043 -1576871 -1276384 -1020575 -947111 -1075799 -1283845 -1430156 -1528700 -1536172 -1482937 -1555605
9790 -1555605 -1758021 -1923905 -1900270 -1609951 -988590 -81366 881458 1630099 1845846 1414585
9780 1414585 745503 315257 138450 40002 -88684 -213097 -181688 -26198 95025 188754
9770 188754 264612 342344 374705 299176 267502 454539 835031 1295983 1737741 1952066 1830932
9759 1830932 1443893 919940 328231 -194475 -511037 -782865 -1135542 -1652939 -2283129 -2769547
$$ packed form
9831G50815m79446m67000m49892m26808k43383K5834K33160K81355K63364M05837
9821a06164N23851L98688J69812n0050j90569k08752k21815l14648m27950l71050
9811g98647j26713J35478K78570K77106J78711K2232k32473n11952n83565l08790
9801a670043R3172L00487K55809P3464j28688k08046j46311r8544p472N3235p2668
9790a555605k02416j65884K3635K90319O21361R07224R62824P48641K15747m31261
9780A414585o69082m30246j76807r8448j28686j24413L1409J55490J21223R3729
9770A88754P5858P7732L2361p5529l1674J87037L80492M60952M41758K14325j21134
9759A830932l87039n23953n91709n22706l16562k71828l52677n17397o30190m86418
$$ plain form
9749 -2769547 -2954347 -2911751 -2816181 -2662958 -2345792 -2008286 -1866487 -1720352 -1220045 -439695
9739 -439695 197597 532745 623850 477611 128093 -321327 -767303 -1086393 -1245915 -1383627
9729 -1383627 -1426002 -1242559 -960067 -706092 -475747 -158116 259662 524991 468601 277779
9719 277779 120363 -10077 -120541 -175310 -251929 -463884 -800292 -1073782 -1100862 -971467
9709 -971467 -848550 -729437 -581639 -397647 -220389 -120692 -75849 79522 353922 537903
9699 537903 607816 649440 539933 269645 14083 -108743 -63635 95872 300324 521885
9689 521885 799989 1065274 1176163 1063765 765917 417306 123407 -212665 -669826 -1135143
9679 -1135143 -1402492 -1442871 -1405423 -1341930 -1226988 -1053787 -859247 -805046 -952689 -1179341
$$ packed form
9749b769547j84800M2596R5570J53223L17166L37506J41799J46135N00307P80350
9739d39695O37292L35148R1105j46239l49518m49420m45976l19090j59522j37712
9729a383627m2375J83443K82492K53975K30345L17631M17778K65329n6390j90822
9719B77779j57416j30440j10464n4769p6619k11955l36408k73490k7080J29395
9709i71467J22917J19113J47798J83992J77258R9697M4843J55371K74400J83981
9699E37903O9913M1624j09507k70288k55562j22826M5108J59507K04452K21561
9689E21885K78104K65285J10889j12398k97848l48611k93899l36072m57161m65317
9679a135143k67349m0379L7448O3493J14942J73201J94540N4201j47643k26652
$$ plain form
9669 -1179341 -1539930 -2028019 -2308280 -2214998 -1920927 -1621527 -1358706 -1069923 -768402 -556864
9659 -556864 -432915 -407524 -493659 -675083 -848567 -774577 -450777 -120864 33151 30305 25379
9648 25379 167075 449308 772185 1039740 1106458 942839 738460 614799 480178 338953
9638 338953 293612 214896 -10578 -233944 -367050 -400410 -262838 -54630 12956 59239 215040
9627 215040 300422 133457 -322005 -915459 -1439178 -1678837 -1473908 -968117 -436668 -128180
9617 -128180 -103187 -247701 -510702 -782000 -784375 -414606 100143 567351 998685 1362619
9607 1362619 1541691 1499972 1291894 1034229 871307 891898 1109749 1367744 1482292 1410852
9597 1410852 1203010 849728 349321 -11008 70538 532179 1037646 1405559 1602827 1573031
$$ packed form
9669a179341l60589m88089k80261R3282K94071K99400K62821K88783L01521K11538
9659e56864J23949K5391q6135j81424j73484P3990L23800L29913J54015k846m926
9648B5379J41696K82233L22877K67555O6718j63619k04379j23661j34621j41225
9638C38953m5341p8716k25474k23366j33106l3360J37572K08208O7586M6283J55801
9627B15040Q5382j66965m55462n93454n23719k39659K04929N05791N31449L08488
9617a28180K4993j44514k63001k71298k375L69769N14749M67208M31334L63934
9607A362619J79072m1719k08078k57665j62922K0591K17851K57995J14548p1440
9597A410852k07842l53282n00407l60329Q1546M61641N05467L67913J97268k9796
$$ plain form
9587 1573031 1276392 868246 640554 669606 747592 721209 453298 -103491 -690597 -951520
9577 -951520 -780425 -457582 -221052 -48248 171347 368549 324494 111520 1375 38716
9567 38716 74776 23620 -84879 -138375 -17692 256112 534868 671217 657730 509501 201283
9556 201283 -286964 -837856 -1227289 -1386085 -1402694 -1386706 -1349160 -1247116 -1050901 -652929
9546 -652929 -153949 92323 153 -174182 -206505 -177768 -345246 -829048 -1514739 -2139777
9536 -2139777 -2368988 -2200809 -1966373 -1802332 -1616775 -1331329 -1007332 -829995 -889404 -1072602
9526 -1072602 -1125291 -1042130 -935224 -801137 -615657 -327811 42770 365434 631220 879400
9516 879400 1011717 896327 648258 501015 355512 141878 -4915 -158747 -312595 -167557
$$ packed form
9587A573031k96639m08146k27692K9052P7986k6383k67911n56789n87106k60923
9577i51520J71095L22843K36530J72804K19595J97202m4055k12974j10145L7341
9567C8716L6060n1156j08499n3496J20683K73804K78756J36349j3487j48229l08218
9556B01283m88247n50892l89433j58796j6609J5988L7546J02044J96215L97972
9546f52929M98980K46272r2170j74335l2323K8737j67478m83802o85691o25038
9536b139777k29211J68179K34436J64041J85557K85446L23997J77337n9409j83198
9526a072602n2689Q3161J06906J34087J85480K87846L70581L22664K65786K48180
9516H79400J32317j15390k48069j47243j45503k13634j46793j53832j53848J45038
$$ plain form
9506 -167557 316189 841480 1091755 964089 673032 545620 618108 657859 514004 158652
9496 158652 -352222 -879341 -1318032 -1596841 -1671200 -1605341 -1555637 -1591030 -1531254 -1320231 -1108976
9485 -1108976 -946826 -875057 -880803 -860184 -743766 -441035 60615 566491 873231 945207
9475 945207 895394 763978 522975 274909 273437 553136 923674 1197183 1282116 1183117 851219
9464 851219 353101 -120884 -530909 -950459 -1409749 -1754385 -1834057 -1666632 -1322177 -994467
9454 -994467 -867635 -948359 -1095667 -1234578 -1358457 -1463486 -1536003 -1515948 -1290606 -900165
9444 -900165 -548012 -324080 -149718 72714 360389 687434 1060189 1397952 1547150 1510621
9434 1510621 1410786 1298928 1110432 853135 501659 66813 -272749 -512275 -786373 -1059856
$$ packed form
9506a67557M83746N25291K50275j27666k91057j27412P2488L9751j43855l55352
9496A58652n10874n27119m38691k78809p4359O5859M9704l5393N9776K11023K11255
9485a108976J62150P1769n746K0619J16418L02731N01650N05876L06740P1976
9475I45207m9813j31416k41003k48066j472K79699L70538K73509Q4933r8999l31898
9464H51219m98118m73985m10025m19550m59290l44636p9672J67425L44455L27710
9454i94467J26832q0724j47308j38911j23879j05029p2517K0055K25342L90441
9444i00165L52153K23932J74362K22432K87675L27045L72755L37763J49198l6529
9434A510621r9835j11858j88496k57297l51476m34846l39562k39526k74098k73483
$$ plain form
9424 -1059856 -1185842 -1042784 -638545 -347409 -373024 -468069 -444461 -364157 -451276 -767736
9414 -767736 -986239 -757147 -258495 71531 108394 21144 -88449 -165555 -91356 81208
9404 81208 129694 82009 1111 -103902 -225362 -456064 -779774 -1043711 -1196091 -1235909 -1224588
9393 -1224588 -1138926 -884943 -572510 -253099 121290 422354 504601 441032 389156 348861
9383 348861 240748 113592 7020 -52100 -50313 -30585 70101 293606 497319 591042 539447
9372 539447 402369 321212 378997 525568 570812 497560 420741 348889 329971 369357 337622
9361 337622 124836 -245090 -648527 -882214 -850190 -721165 -591395 -302540 181558 692499
9351 692499 1042114 1158675 1117079 1028852 929008 719612 469697 293656 119654 -104964
$$ packed form
9424a059856j25986J43058M04239K91136k5615r5045K3608Q0304q7119l16460
9414g67736k18503K29092M98652L30026L6863q7250j09593p7106P4199J72564
9404H1208M8486m7685q0898j05013j21460k30702l23710k63937j52380l9818J1321
9393a224588Q5662K53983L12433L19411L74389L01064Q2247o3569n1876m0295
9383C48861j08113j27156j06572n9120J787J9728J00686K23505K03713R3723n1595
9372E39447j37078q1157N7785J46571M5244p3252p6819p1852j8918L9386l1735
9361C37622k12786l69926m03437k33687L2024J29025J29770K88855M84098N10941
9351F92499L49615J16561m1596q8227r9844k09396k49915j76041j74002k24618
$$ plain form
9341 -104964 -304358 -392660 -387383 -372460 -351008 -252018 -109298 33465 100412 12490 -132377
9330 -132377 -177953 -132410 -103066 -91626 -6773 124917 166834 107539 42209 12772 273
9319 273 39731 73664 14832 20116 247154 567865 732814 679334 573969 664225 980078
9308 980078 1293719 1431046 1355490 1088547 707716 372203 143343 -51241 -442772 -1067731
9298 -1067731 -1582925 -1740608 -1624402 -1427071 -1177328 -894254 -521339 -36479 434347 784058
9288 784058 1003238 1211107 1436335 1518244 1396599 1174719 1038014 1060216 1170720 1283802
9278 1283802 1369115 1434043 1410027 1229472 973606 786253 677109 523129 243451 -97226
9268 -97226 -409801 -518313 -382730 -157854 -43735 -126575 -191921 -21286 380744 921338
$$ packed form
9341a04964j99394q8302N277J4923K1452R8990J42720J42763O6947q7922j44867
9330a32377m5576M5543K9344J1440Q4853J31690M1917n9295o5330k9437j2499
9319B73L9458L3933n8832N284K27038L20711J64949n3480j05365R0256L15853
9308I80078L13641J37327p5556k66943l80831l35513k28860j94584l91531o24959
9298a067731n15194j57683J16206J97331K49743K83074L72915M84860M70826L49711
9288G84058K19180K07869K25228Q1909j21645k21880j36705K2202J10504J13082
9278A283802Q5313O4928k4016j80555k55866j87353j09144j53980k79678l40677
9268i7226l12575j08512J35583K24876J14119q2840o5346J70635M02030N40594
$$ plain form
9258 921338 1614465 2324273 2777472 2935376 2918117 2760456 2454845 2059875 1644671 1248859
9248 1248859 975879 798418 542058 196305 -126838 -380875 -515728 -406395 -186804 -142213
9238 -142213 -271467 -333600 -251148 -87305 60520 95562 145130 374234 674188 811974
9228 811974 662579 421374 257039 -36919 -644835 -1388260 -1801257 -1515030 -689039 101388
9218 101388 527575 577053 302925 -153104 -575303 -812629 -815496 -597596 -283360 -74709
9208 -74709 -91962 -330370 -572747 -582387 -362093 -64264 110342 130009 138314 172745 48294
9197 48294 -401946 -1031111 -1588114 -1929831 -2053574 -2061607 -2040811 -2002302 -1925321 -1741305 -1391884
9186 -1391884 -1067995 -885849 -789663 -690980 -547845 -377584 -169088 89885 309941 414376
$$ packed form
9258I21338O93127P09808M53199J57904j7259j57661l05611l94970m15204l95812
9248A248859k72980j77461k56360l45753l23143k54037j34853J09333K19591M4591
9238a42213j29254o2133Q2452J63843J47825L5042M9568K29104K99954J37786
9228H11974j49395k41205j64335k93958o07916p43425m12997K86227Q25991P90427
9218A01388M26187M9478k74128m56029m22199k37326k867K17900L14236K08651
9208g4709j7253k38408k42377r640K20294K97829J74606J9667Q305L4431j24451
9197D8294m50240o29165n57003l41717j23743q033K0796L8509P6981J84016L49421
9186a391884L23889J82146R6186R8683J43135J70261K08496K58973K20056J04435
$$ plain form
9176 414376 457072 397968 154955 -186676 -528273 -781086 -861119 -758667 -490980 -216520
9166 -216520 -141608 -223667 -272592 -150625 49155 113876 73089 11207 -76763 -157317 -154527
9155 -154527 -109681 -198277 -444813 -694937 -805671 -688382 -407403 -99277 203851 433154
9145 433154 588042 799057 994578 1050705 1009099 909924 789616 683424 633016 619100 576589
9134 576589 489648 387368 300985 264407 281741 334714 514451 901029 1460871 2007666 2251386
9123 2251386 2118333 1759395 1367388 1077020 765849 294766 -113801 -185995 18919 319092
9113 319092 548062 598293 519108 484697 552826 609380 493315 112881 -387143 -726916 -757747
9102 -757747 -477233 -59367 225449 246898 182267 200130 281652 380221 393481 222997 -42519
$$ packed form
9176D14376M2696n9104k43013l41631l41597k52813q0033J02452K67687K74460
9166b16520P4912q2059m8925J21967J99780O4721m0787o1882q7970q0554K790
9155a54527M4846q8596k46536k50124j10734J17289K80979L08126L03128K29303
9145D33154J54888K11015J95521N6127m1606r9175j20308j06192n0408j3916m2511
9134E76589q6941j02280q6383l6578J7334N2973J79737L86578N59842N46795K43720
9123B251386j33053l58938l92007k90368l11171m71083m08567p2194K04914L00173
9113C19092K28970N0231p9185l4411O8129N6554j16065l80434n00024l39773l0831
9102g57747K80514M17866K84816K1449o4631J7863Q1522R8569J3260j70484k65516
$$ plain form
9091 -42519 -177469 -142028 3172 172705 260403 266630 188449 58944 -74274 -181881 -121869
9080 -121869 34708 57242 -31423 -56144 21316 50000 -50232 -65916 201200 522431 585820
9069 585820 464660 403512 403291 385160 288368 39041 -203384 -187121 45003 341076 619106
9058 619106 837045 1027733 1258705 1489139 1683174 1746321 1477760 937046 477149 302334
9048 302334 347761 483663 599256 626683 527535 403758 423423 575433 662131 481692 46567
9037 46567 -264335 -260089 -114280 -27315 -19599 5003 30551 16103 -27977 -82554 -102725 -119954
9025 -119954 -247582 -528101 -887217 -1248001 -1473737 -1480700 -1318126 -1085516 -896300 -768143
9015 -768143 -632295 -580929 -569252 -486173 -311657 -67876 144427 267324 180717 -174773
$$ packed form
9091d2519j34950L5441J45200J69533Q7698O227p8181j29505j33218j07607O0012
9080a21869J56577K2534q8665k4721P7460K8684j00232j5684K67116L21231O3389
9069E85820j21160o1148k21j8131r6792k49327k42425J6263K32124K96073K78030
9058F19106K17939J90688K30972K30434J94035O3147k68561n40714m59897j74815
9048C02334M5427J35902J15593K7427r9148j23777J9665J52010Q6698j80439m35125
9037D6567l10902M246J45809Q6965P716K4602K5548j4448m4080n4577k0171j7229
9025a19954j27628k80519l59116l60784k25736o963J62574K32610J89216J28157
9015g68143J35848N1366J1677Q3079J74516K43781K12303J22897q6607l55490
$$ plain form
9005 -174773 -694608 -1248835 -1750936 -2081003 -2128000 -1896054 -1457786 -937187 -507253 -225956
8995 -225956 -68764 3229 45495 129078 287318 517187 690397 633518 474582 404528 425544
8984 425544 493799 484244 373440 198925 -132848 -580521 -947024 -1159407 -1250592 -1140015
8974 -1140015 -865176 -558048 -322137 -252768 -383215 -625123 -855503 -1015127 -1089286 -1128192
8964 -1128192 -1207451 -1328359 -1395732 -1361246 -1197476 -872588 -455497 -157777 -104096 -188244
8954 -188244 -288657 -417487 -560153 -665521 -751523 -835005 -862979 -821163 -804392 -879916 -976249
8943 -976249 -942010 -691682 -296589 14381 100937 137704 295265 537947 753759 865264
8933 865264 797614 568075 272874 48308 23596 3905 -215362 -535445 -816320 -1003216
$$ packed form
9005a74773n19835n54227n02101l30067m6997K31946M38268N20599M29934K81297
8995b25956J57192P1993M2266Q3583J58240K29869J73210n6879j58936p0054K1016
8984D25544O8255r555j10804j74515l31773m47673l66503k12383r1185J10577
8974a140015K74839L07128K35911O9369j30447k41908k30380j59624p4159l8906
8964a128192p9259j20908o7373L4486J63770L24888M17091K97720N3681q4148
8954a88244j00413j28830j42666j05368q6002q3482k7974M1816J6771p5524r6333
8943i76249L4239K50328L95093L10970Q6556L6767J57561K42682K15812J11505
8933H65264o7650k29539k95201k24566k4712j9691k19267l20083k80875j86896
$$ plain form
8923 -1003216 -1096640 -1154294 -1118606 -899893 -615935 -405495 -387383 -655249 -940384 -892111
8913 -892111 -621542 -438680 -353525 -198341 40827 253031 344103 351120 342329 282482 132508
8902 132508 33946 153381 294685 301059 349549 547483 783058 913418 1032147 1148395
8892 1148395 1058150 758218 445766 147566 -102004 -168933 -116581 -84172 -111752 -183651 -323936
8881 -323936 -571010 -869403 -1070508 -1032404 -772490 -449957 -199956 33120 407900 899531
8871 899531 1298484 1460626 1381830 1147123 847668 520855 265354 130958 33060 -44573
8861 -44573 -122678 -285497 -495214 -658641 -667098 -550406 -563687 -744143 -905080 -921986 -833295
8850 -833295 -608325 -227998 183031 444984 443320 262576 120970 86570 15631 -224656
$$ packed form
8923a003216r3424n7654L5688K18713K83958K10440J8112k67866k85135M8273
8913h92111K70569J82862Q5155J55184K39168K12204R1072P017q791n9847j49974
8902A32508r8562J19435J41304O374M8490J97934K35575J30360J18729J16248
8892A148395r0245k99932l12452k98200k49570o6929N2352L2409k7580p1899j40285
8881c23936k47074k98393k01105L8104K59914L22533K50001K33076L74780M91631
8871H99531L98953J62142p8796k34707k99455l26813k55501j34396r7898p7633
8861d4573p8105j62819k09717j63427q457J16692j3281j80456j60937j6906Q8691
8850h33295K24970L80327M11029K61953j664j80744j41606l4400p0939k40287
$$ plain form
8840 -224656 -610727 -990196 -1191369 -1159068 -924353 -549547 -106399 289509 522574 602870
8830 602870 587578 530022 545975 737242 953956 929084 744407 736663 975695 1250225 1428209
8819 1428209 1491093 1409468 1258747 1151134 1038300 848309 582681 290957 96949 142898
8809 142898 327190 442866 547542 700865 778953 795797 913110 1073633 1086790 941237
8799 941237 674597 336178 25232 -263349 -536000 -659275 -606307 -476612 -317712 -158083
8789 -158083 -141615 -431764 -876655 -1258246 -1402873 -1155115 -559587 160110 707662 954325
8779 954325 969823 829268 611158 360840 49844 -267097 -434634 -330914 -5715 304483
8769 304483 409928 392612 374631 314857 153087 -106663 -353328 -426835 -340029 -232911 -119633
$$ packed form
8840b24656l86071l79469k01173L2301K34715L74806M43148L95908K33065Q0296
8830F02870j5292n7556J5953J91267K16714k4872j84677p744K39032K74530J77984
8819A428209O2884q1625j50721j07613j12834j89991k65628k91724j94008M5949
8809A42898J84292J15676J04676J53323P8088J6844J17313J60523J3157j45553
8799I41237k66640l38419l10946k88581k72651j23275N2968J29695J58900J59629
8789a58083J6468k90149m44891l81591j44627K47758N95528P19697N47552K46663
8779I54325J5498j40555k18110k50318l10996l16941j67537J03720L25199L10198
8769C04483J05445j7316j7981n9774j61770k59750k46665p3507Q6806J07118J13278
$$ plain form
8758 -119633 75546 300836 457978 501694 431383 321513 214869 44023 -186780 -292284
8748 -292284 -120886 274545 688480 1034345 1262949 1345228 1289644 1095929 909078 873353
8738 873353 930230 876692 631700 279856 -41533 -261970 -409803 -523324 -573117 -426616
8728 -426616 -160074 115065 329982 399099 305910 97052 -151641 -492664 -840970 -1016555
8718 -1016555 -1066238 -1101753 -1144162 -1261302 -1472109 -1645101 -1670074 -1559131 -1408033 -1215362
8708 -1215362 -998113 -941430 -1078730 -1217302 -1243946 -1144347 -978368 -829903 -742442 -679528
8698 -679528 -644644 -730215 -1030914 -1504588 -1923639 -2138139 -2211715 -2242547 -2245028 -2126652 -1795243
8687 -1795243 -1269935 -703382 -243049 30073 32496 -205339 -468776 -493305 -151947 366392
$$ packed form
8758a19633J95179K25290J57142M3716p0311j09870j06644j70846k30803j05504
8748b92284J71398L95431M13935L45865K28604Q2279n5584j93715j86851l5725
8738H73353N6877n3538k44992l51844l21389k20437j47833j13521m9793J46501
8728d26616K66542K75139K14917O9117r3189k08858k48693l41023l48306j75585
8718a016555m9683l5515m2409j17140k10807j72992k4973J10943J51098J92671
8708a215362K17249N6683j37300j38572k6644R9599J65979J48465Q7461O2914
8698f79528L4884q5571l00699m73674m19051k14500p3576l0832k481J18376L31409
8687a795243N25308N66553M60333K73122K423k37835k63437k4529L41358N18339
$$ plain form
8677 366392 845892 1188290 1333735 1330748 1293170 1235174 1047358 679504 258344 -30780
8667 -30780 414 358240 745667 868159 801591 728126 725016 856453 1054159 1186658 1295958
8656 1295958 1455243 1548591 1402772 1081860 794572 522569 139581 -310371 -680527 -929509
8646 -929509 -1077937 -1177853 -1184136 -960982 -566982 -86277 493742 1213679 1921426 2324661
8636 2324661 2404843 2226568 1756710 1155435 592995 86047 -285628 -367810 -215150 -207158
8626 -207158 -485663 -640044 -455596 -276497 -274541 -200211 122408 500408 726380 758368
8616 758368 614822 361034 210534 181956 106498 -14118 27408 281677 475281 514989
8606 514989 476121 376823 270540 123763 5751 -33044 -95096 -176651 -246555 -286767 -252564
$$ packed form
8677C66392M79500L42398J45445k987l7578n7996j87816l67854m21160k89124
8667c0780L1194L57826L87427J22492o6568p3465l110J31437J97706J32499J09300
8656A295958J59285R3348j45819l20912k87288k72003l82988m49952l70156k48982
8646i29509j48428r9916o283K23154L94000M80705N80019P19937P07747M03235
8636B324661Q0182j78275m69858o01275n62440n06948l71675q2182J52660P992
8626b07158k78505j54381J84448J79099J956P4330L22619L78000K25972L1988
8616G58368j43546k53788j50500k8578p5458j20616M1526K54269J93604L9708
8606E14989l8868r9298j06283j46777j18012l8795o2052q1555o9904m0212L4203
$$ plain form
8595 -252564 -162530 -165726 -451907 -981439 -1501020 -1791020 -1744436 -1572333 -1442301 -1177472
8585 -1177472 -793238 -591430 -692164 -858000 -852946 -798488 -878982 -1039599 -1248078 -1501073
8575 -1501073 -1652861 -1740590 -1999829 -2364237 -2555589 -2502027 -2207697 -1759475 -1348375 -1102040
8565 -1102040 -917692 -736234 -594043 -475060 -410712 -310228 -73105 85062 -17749 -222714
8555 -222714 -250668 -32675 248403 457043 483628 198610 -393599 -1144006 -1863491 -2379388
8545 -2379388 -2617616 -2548152 -2189745 -1721375 -1294859 -958597 -709264 -528757 -450314 -517901
8535 -517901 -743321 -1086964 -1408420 -1523616 -1316932 -893855 -375472 158398 527567 658310
8525 658310 571601 315217 10191 -159721 -125487 -113754 -426688 -858986 -1105701 -1182688
$$ packed form
8595b52564R0034l196k86181n29532n19581k90000M6584J72103J30032K64829
8585a177472L84234K01808j00734j65836N054N4458q0494j60617k08479k52995
8575a501073j51788q7729k59239l64408j91352N3562K94330M48222M11100K46335
8565a102040J84348J81458J42191J18983O4348J00484K37123J58167j02811k04965
8555b22714k7954K17993K81078K08640K6585k85018n92209p50407p19485n15897
8545b379388k38228O9464L58407M68370M26516L36262K49333J80507P8443o7587
8535e17901k25420l43643l21456j15196K06684M23077N18383N33870L69169J30743
8525F58310q6709k56384l05026j69912L4234J1733l12934m32298k46715p6987
$$ plain form
8515 -1182688 -1246179 -1412482 -1605570 -1668034 -1671315 -1781602 -1965245 -2137221 -2214107 -2061441
8505 -2061441 -1733834 -1448797 -1346193 -1451139 -1568092 -1478561 -1194756 -900701 -721023 -635012
8495 -635012 -572849 -559454 -615998 -738178 -947426 -1159020 -1296821 -1308727 -1238724 -1253237 -1330103
8484 -1330103 -1301456 -1237518 -1307924 -1523274 -1654191 -1601678 -1545285 -1498305 -1324964 -968047 -437487
8473 -437487 159620 665083 898306 777444 394591 -10185 -294362 -433183 -479542 -460639
8463 -460639 -355952 -250495 -262816 -263245 10150 502359 987856 1285457 1267644 987848 615092
8452 615092 170982 -346491 -788374 -957948 -799928 -527847 -257013 -26828 66692 -2162
8442 -2162 -198579 -455644 -720929 -875339 -826650 -662874 -531561 -397495 -221862 -156406
$$ packed form
8515a182688o3491j66303j93088o2464l281j10287j83643j71976p6886J52666
8505b061441L27607K85037J02604j04946j16953Q9531K83805K94055J79678Q6011
8495f35012O2163J3395n6544j22180k09248k11594j37801j1906P0003j4513p6866
8484a330103K8647O3938p0406k15350j30917N2513N6393M6980J73341L56917N30560
8473d37487N97107N05463K33223j20862l82853m04776k84177j38821m6359J8903
8463d60639J04687J05457j2321m29K73395M92209M85497K97601j7813k79796l72756
8452F15092m44110n17473m41883j69574J58020K72081K70834K30185R3520o8854
8442b162j96417k57065k65285j54410M8689J63776J31313J34066J75633O5456
$$ plain form
8432 -156406 -272494 -380900 -264388 55222 214531 1709 -317015 -484385 -502821 -426282
8422 -426282 -335910 -284899 -232410 -137533 -112974 -185608 -251585 -349102 -492227 -575636 -640382
8411 -640382 -847988 -1203152 -1539241 -1783333 -1909060 -1863285 -1719761 -1615547 -1472722 -1174866
8401 -1174866 -857015 -675369 -585915 -495703 -423530 -328676 -247721 -330257 -443787 -416151 -379190
8390 -379190 -499474 -726417 -903749 -903506 -712054 -521194 -438440 -329272 -92110 126600
8380 126600 140848 -64529 -407707 -735250 -884731 -877942 -845146 -777564 -684498 -554220 -344963
8369 -344963 -136034 55713 240208 392474 376616 93988 -262010 -458286 -452485 -362229
8359 -362229 -327051 -318757 -208390 -86075 -76256 -114345 -136339 -183579 -401148 -712646 -781251
$$ packed form
8432a56406j16088j08406J16512L19610J59309k12822l18724j67370j8436P6539
8422d26282R0372N1011N2489R4877K4559p2634o5977r7517j43125q3409o4746
8411f40382k07606l55164l36089k44092j25727M5775J43524J04214J42825K97856
8401a174866L17851J81646Q9454R0212P2173R4854Q0955q2536j13530K7636L6961
8390c79190j20284k26943j77332K43J91452J90860Q2754J09168K37162K18710
8380A26600J4248k05377l43178l27543j49481O789L2796O7582R3066J30278K09257
8369c44963K08929J91747J84495J52266j5858k82628l55998j96276N801R0256
8359c62229L5178Q294J10367J22315R819l8089k1994m7240k17569l11498o8605
$$ plain form
8348 -781251 -537905 -337866 -369835 -504944 -605224 -641314 -667151 -795468 -1064603 -1377269
8338 -1377269 -1572991 -1515310 -1280492 -1069561 -1019836 -1082193 -1034289 -837012 -679243 -729827
8328 -729827 -918919 -1062848 -985363 -561963 80842 770287 1356758 1641657 1518593 1078731
8318 1078731 520698 99917 -13030 85960 70752 -216836 -634890 -980493 -1092467 -935370
8308 -935370 -660241 -328617 -4223 104938 -100367 -556952 -1088681 -1432851 -1484325 -1324861
8298 -1324861 -1052261 -795942 -626995 -497781 -283242 56989 378208 647934 907155 1129026
8288 1129026 1228467 1133996 875884 606195 433619 341489 341206 457399 653261 883468 1201462
8277 1201462 1615727 1932038 1972804 1687253 1267053 1063837 1178725 1471589 1665156 1603400
$$ packed form
8348g81251K43346K00039l1969j35109j00280l6090k5837j28317k69135l12666
8338a377269j95722N7681K34818K10931M9725o2357M7904J97277J57769n0584
8328g29827j89092j43929P7485M23400O42805O89445N86471K84899j23064m39862
8318A078731n58033m20781j12947R8990j5208k87588m18054l45603j11974J57097
8308i35370K75129L31624L24394J09161k05305m56585n31729l44170n1474J59464
8298a324861K72600K56319J68947J29214K14539L40231L21219K69726K59221K21871
8288A129026R9441r4471k58112k69689j72576r2130k83J16193J95862K30207L17994
8277A201462M14265L16311M0766k85551m20200k03216J14888K92864J93567o1756
$$ plain form
8267 1603400 1459117 1474511 1671816 1879341 1893893 1627180 1165496 669095 289184 73166
8257 73166 55537 235453 440479 549182 556437 466118 304718 121731 -42251 -131191 -127117
8246 -127117 -6732 181478 342303 463040 620563 812580 1035975 1355356 1650224 1751176
8236 1751176 1762873 1862211 1974166 1930595 1729167 1518597 1363284 1272701 1150647 825008
8226 825008 255688 -394377 -806171 -786745 -386714 191556 778444 1341905 1696859 1642304
8216 1642304 1324834 1022279 913261 977746 1084031 1296404 1544486 1498190 1036856 407413
8206 407413 -7254 2906 304844 678869 956016 1036852 997846 889689 750083 594740
8196 594740 417403 232896 -812 -320429 -677916 -928100 -885043 -498483 70843 581526
$$ packed form
8267A603400j44283J5394J97305K07525J4552k66713m61684m96401l79911k16018
8257G3166j7629J79916K05026J08703P255r0319j61400j82987j63982q8940M074
8246a27117J20385J88210J60825J20737J57523J92017K23395L19381K94868J00952
8236A751176J1697R9338J11955m3571k01428k10570j55313r0583j22054l25639
8226H25008n69320o50065m11794J9426M00031N78270N86888N63461L54954n4555
8216A642304l17470l02555j09018O4485J06285K12373K48082m6296m61334o29443
8206D07413m14667J0160L01938L74025K77147Q0836l9006j08157j39606j55343
8196E94740j77337j84507k33708l19617l57487k50184M3057L86560N69326N10683
$$ plain form
8186 581526 925968 1130570 1234991 1262707 1325569 1612010 2216570 2847720 3131266 3076561
8176 3076561 2923549 2768274 2577864 2354813 2000266 1452781 937644 745930 839974 901081
8166 901081 747499 474770 297820 314567 412960 397880 244989 142820 251747 561971
8156 561971 914994 1136020 1102363 748519 288042 85493 164088 296907 346358 428539
8146 428539 710812 1203138 1848048 2490826 2910127 3037642 3036138 3129814 3255293 3158716
8136 3158716 2904216 2717159 2626312 2498576 2210662 1735852 1120374 530692 141930 105248
8126 105248 370789 663690 861899 1048249 1336215 1670948 1929582 2175420 2349123 2259411
8116 2259411 1883364 1283739 626023 197132 190042 499409 846681 1080354 1276115 1585315
$$ packed form
8186E81526L44442K04602J04421K7716O2862K86441O04560O31150K83546n4705
8176C076561j53012j55275j90410k23051l54547n47485n15137j91714R4044O1107
8166I01081j53582k72729j76950J6747R8393j5080j52891j02169J08927L10224
8156E61971L53023K21026l3657l53844m60477k02549P8595J32819M9451Q2181
8146D28539K82273M92326O44910O42778M19301J27515j504R3676J25479r6577
8136C158716k54500j87057r0847j27736k87914m74810o15478n89682l88762l6682
8126A05248K65541K92901J98209J86350K87966L34733K58634K45838J73703q9712
8116B259411l76047n99625o57716m28891p090L09367L47272K33673J95761L09200
$$ plain form
8106 1585315 2084013 2649016 3010864 2985497 2597840 2065334 1642036 1478380 1491892 1553656
8096 1553656 1754473 2194317 2673670 2953273 3048353 3065816 3096019 3194482 3286094 3189724 2841817
8085 2841817 2391105 2004280 1778963 1784539 2018882 2277250 2364176 2289994 2087771 1787879
8075 1787879 1545784 1511771 1538915 1525773 1613288 1869750 2189384 2475968 2768035 3103562
8065 3103562 3322375 3191192 2752471 2282310 1882160 1435795 1044776 974577 1281998 1795793
8055 1795793 2297329 2652771 2761549 2610497 2319476 1971166 1666437 1622553 1884463 2176581
8045 2176581 2274926 2228305 2241412 2483501 2925109 3338499 3479060 3525119 3792543 4184495
8035 4184495 4554537 4920655 5248575 5473711 5523579 5332725 5083315 4909133 4762727 4625140
$$ packed form
8106A585315M98698N65003L61848k5367l87657n32506m23298j63656J3512O1764
8096A553656K00817M39844M79353K79603R5080J7463L0203R8463R1612r6370l47907
8085B841817m50712l86825k25317N576K34343K58368Q6926p4182k02223k99892
8075A787879k42095l4013K7144j3142Q7515K56462L19634K86584K92067L35527
8065C103562K18813j31183m38721m70161m00150m46365l91019p0199L07421N13795
8055A795793N01536L55442J08778j51052k91021l48310l04729m3884K61910K92118
8045B176581R8345m6621J3107K42089M41608M13390J40561M6059K67424L91952
8035D184495L70042L66118L27920K25136M9868j90854k49410j74182j46406j37587
$$ plain form
8025 4625140 4508683 4340586 4072209 3861055 3917677 4187317 4635712 5231990 5774967 6107271
8015 6107271 6243910 6339225 6543951 6842595 7084782 7140919 6994303 6784688 6751355 7009607
8005 7009607 7615253 8475619 9273982 9958793 10581950 11239368 12153842 13472739 15214157
7996 15214157 17324665 19809230 22671865 25858095 29390478 33428131 38080931 43287495
7988 43287495 48792514 54189078 58953227 62337409 63687093 63008856 60734330 57160896
7980 57160896 52584444 47508084 42388794 37572631 33338014 29708766 26563526 23898008
7972 23898008 21695463 19909265 18641930 17853113 17361642 17044030 16873464 16880172 16990993
7963 16990993 17038586 16968052 16803660 16691194 16692949 16662663 16559402 16496809 16489062 16472866 16418817
$$ packed form
8025D625140j16457j68097k68377k11154N6622K69640M48395N96278N42977L32304
8015F107271J36639R5315K04726K98644K42187N6137j46616k09615l3333K58252
8005G009607O05646Q60366P98363O84811O23157O57418R14474J318897J741418
7996A5214157K110508K484565K862635L186230L532383M037653M652800N206564
7988D3287495N505019N396564M764149L384182J349684o78237k274526l573434
7980E7160896m576452n076360n119290m816163m234617l629248l145240k665518
7972B3898008k202545j786198j267335p88817m91471l17612j70566O708J10821
7963A6990993M7593p0534j64392j12466J755l0286j03261o2593p747j6196n4049
$$ plain form
7952 16418817 16416781 16722490 17600838 18958742 20544709 22288287 24269233 26605827 29312098
7943 29312098 32276316 35544735 39382040 44037918 49579370 56079256 63792966 73010106
7935 73010106 83961600 96670360 111006496 126785903 143441458 159700689 173781797
7928 173781797 183828674 188361809 186794411 179460937 167451804 152486704 136303756
7921 136303756 120207532 105159021 91813159 80465739 71053845 63370000 57166891
7914 57166891 52110973 47919416 44390077 41503346 39365395 38066349 37480652 37175095
7906 37175095 36782628 36159322 35353634 34522340 33846131 33352474 32989379 32799306 32808963 33114467
7896 33114467 33778860 34764198 36127165 37951480 40215769 42870983 45907142 49323181
$$ packed form
7952A6418817k036L05709Q78348J357904J585967J743578J980946K336594K706271
7943B9312098K964218L268419L837305M655878N541452O499886P713710R217140
7935G3010106J0951494J2708760J4336136J5779407J6655555J6259231J4081108
7928A73781797J0046877M533135j567398p333474j2009133j4965100j6182948
7921A36303756j6096224j5048511j3345862j1347420r411894p683845o203109
7914E7166891n055918m191557l529339k886731k137951j299046n85697l05557
7906C7175095l92467o23306q05688q31294o76209m93657l63095j90073R657L05504
7896C3114467O64393R85338J362967J824315K264289K655214L036159L416039
$$ plain form
7888 49323181 53245393 58022165 63840724 70752130 78869833 88322477 99305819 112160047
7880 112160047 127322781 145205501 166225934 190828233 219062745 250153002 282516282
7873 282516282 313847174 340994180 360173540 368181268 363687772 347587589 322374986
7866 322374986 291515651 258703557 226905183 198012305 172786264 151160873 132881717
7859 132881717 117581040 104758962 94079037 85362296 78396115 72995987 69035657 66219658
7851 66219658 63972302 61719473 59347354 57067392 55029496 53160017 51352380 49643356
7843 49643356 48147362 46991479 46271653 46072576 46432747 47353838 48819772 50750184 53021811
7834 53021811 55633103 58708308 62405536 66933288 72531706 79333114 87300526 96475939
$$ packed form
7888D9323181L922212M776772N818559O911406Q117703R452644J0983342J2854228
7880A12160047J5162734J7882720K1020433K4602299K8234512L1090257L2363280
7873B82516282L1330892K7147006J9179360Q007728m493496j6100183k5212603
7866C22374986l0859335l2812094l1798374k8892878k5226041k1625391j8279156
7859A32881717j5300677j2822078j0679925q716741o966181n400128l960330k815999
7851F6219658k247356k252829k372119k279962k037896j869479j807637j709024
7843D9643356j495994j155883p19826j99077L60171R21091J465934J930412K271627
7834E3021811K611292L075205L697228M527752N598418O801408P967412R175413
$$ plain form
7826 96475939 107099104 119632849 134574770 152319124 173239661 197823706 226565353
7819 226565353 259530435 295897209 333856256 370439260 401787219 423656970 432410620
7812 432410620 426493283 406795420 376237326 339083858 299715605 261535227 226701293
7805 226701293 196170890 170022895 147969449 129646574 114562689 102127606 91835632
7798 91835632 83404227 76595939 71132190 66924062 63825134 61354832 59110259 57007453
7790 57007453 55094097 53327535 51443797 49313771 47212254 45506800 44388565 43736215
7782 43736215 43318288 43152871 43463984 44399513 45973193 48059425 50649915 53866065 57607520
7773 57607520 61869356 66990706 73343029 81073157 90231758 101068642 114019801 129347521
$$ packed form
7826I6475939J0623165J2533745J4941921J7744354K0920537K4584045K8741647
7819B26565353L2965082L6366774L7959047L6583004L1347959K1869751Q753650
7812D32410620n917337j9697863l0558094l7153468l9368253l8180378l4833934
7805B26701293l0530403k6147995k2053446j8322875j5083885j2435083j0291974
7798I1835632q431405o808288n463749m208128l098928k470302k244573k102806
7790E7007453j913356j766562j883738k130026k101517j705454j118235o52350
7782D3736215m17927j65417L11113R35529J573680K086232K590490L216150L741455
7773E7607520M261836N121350O352323P730128R158601J0836884J2951159J5327720
$$ plain form
7765 129347521 147306595 168411272 193073068 221179629 251973659 284011315 314972020
7758 314972020 341496588 359850260 367248865 362436999 345898697 320015149 288275703
7751 288275703 254246383 220906863 190302717 163552367 140968763 122327150 107127628
7744 107127628 94699887 84340875 75563697 68073675 61722361 56357559 51653876 47437403
7736 47437403 43809303 40879413 38625678 36821858 35197959 33536279 31826189 30418391
7728 30418391 29591752 29201204 28947947 28689449 28499500 28559853 29041094 30022236 31301958
7719 31301958 32413740 33245924 34293954 36044720 38526062 41518463 44987799 49212544
7711 49212544 54391127 60525391 67739246 76332021 86703686 99060870 113219217 128665297
$$ packed form
7765A29347521J7959074K1104677K4661796K8106561L0794030L2037656L0960705
7758C14972020K6524568J8353672P398605m811866j6538302k5883548l1739446
7751B88275703l4029320l3339520l0604146k6750350k2583604j8641613j5199522
7744A07127628j2427741j0359012q777178p490022o351314n364802m703683m216473
7736D7437403l628100k929890k253735j803820j623899j661680j710090j407798
7728C0418391q26639l90548k53257k58498j89949O0353M81241R81142J279722
7719C1301958J111782Q32184J048030J750766K481342K992401L469336M224745
7711D9212544N178583O134264P213855Q592775J0371665J2357184J4158347J5446080
$$ plain form
7703 128665297 144578766 159720751 172438369 181059359 184264444 181407672 172842263 159930122
7695 159930122 144436199 127863809 111486584 96356739 82999136 71492823 61781736
7688 61781736 53681094 46897768 41201125 36503606 32651895 29367323 26540279 24298809
7680 24298809 22623031 21343318 20403535 19728189 19138593 18560795 17975035 17316711 16656576
7671 16656576 16077724 15499469 14881423 14328193 13990931 13798113 13655635 13547951 13515221 13680394
7661 13680394 14130304 14886819 15822758 16778435 17766268 18758504 19832078 21263180 23122247
7652 23122247 25370714 28203953 31872743 36221621 40873299 45598291 50318168 54812011
7644 54812011 58721030 61634170 62938307 62177607 59474683 55239876 49943492 44127302
$$ packed form
7703A28665297J5913469J5141985J2717618Q620990L205085k856772q565409j2912141
7695A59930122j5493923j6572390j6377225j5129845j3357603j1506313r711087
7688F1781736q100642o783326n696643m697519l851711l284572k827044k241470
7680B4298809j675778j279713r39783o75346n89596n77798n85760o58324o60135
7671A6656576n78852n78255o18046n53230l37262j92818j42478j07684l2730J65173
7661A3680394M49910P56515R35939R55677R87833R92236J073574J431102J859067
7652B3122247K248467K833239L668790M348878M651678M724992M719877M493843
7644E4812011L909019K913140J304137p60700k702924m234807n296384n816190
$$ plain form
7636 44127302 38419126 33330738 28839036 24836498 21527438 18947656 16824193 14952890
7628 14952890 13359764 11968100 10696553 9722433 9122092 8677290 8112020 7329515 6398173
7619 6398173 5490833 4834967 4452354 4167439 3812133 3324744 2722769 2196200 1945547 1964279
7609 1964279 2181078 2477891 2781700 3087371 3369961 3684077 3997383 4079536 3836960 3366848
7599 3366848 2808400 2360799 2241139 2535977 3077595 3501013 3548112 3274575 2907875 2573029
7589 2573029 2219598 1850696 1645616 1625977 1731576 2053373 2589525 3056403 3191262 2975540
7579 2975540 2537086 2126546 1924623 1906272 2028322 2263964 2447121 2367032 2036136 1724625
7569 1724625 1622960 1659530 1717763 1769467 1948883 2249001 2464933 2466975 2237784 1728002
$$ packed form
7636D4127302n708176n088388m491702m002538l309060k579782k123463j871303
7628A4952890j593126j391664j271547r74120o00341m44802n65270p82505r31342
7619F398173r07340o55866l82613k84915l55306m87389o01975n26569k50653J8732
7609A964279K16799K96813L03809L05671K82590L14116L13306Q2153k42576m70112
7599C366848n58448m47601j19660K94838N41618M23418M7099k73537l66700l34846
7589B573029l53431l68902k05080j9639J05599L21797N36152M66878J34859k15722
7579B975540m38454m10540k01923j8351J22050K35642J83157q0089l30896l11511
7569A724625j01665L6570N8233N1704J79416L00118K15932K042k29191n09782
$$ plain form
7559 1728002 1063016 588504 489297 743467 1061672 1257144 1189232 789278 377752 156673
7549 156673 101808 130085 110224 -112232 -635533 -1204489 -1429110 -1196788 -663964 -213543
7539 -213543 -10965 129052 261421 255903 -2819 -413648 -682018 -551432 -13416 663438
7529 663438 1203394 1467474 1367554 1079209 806788 681134 892347 1436837 2062866 2680654
7519 2680654 3284364 3752548 3920611 3698865 3372941 3220727 3155219 3006160 2818512 2679023
7509 2679023 2560730 2306011 1847616 1392813 1111571 992747 941415 795333 541643 258675
7499 258675 16829 -217798 -496208 -770533 -966766 -1015295 -804572 -233639 506502 1028001
7489 1028001 1059516 765546 470463 112913 -374040 -616063 -376568 149039 671302 1042041
$$ packed form
7559A728002o64986m74512r9207K54170L18205J95472o7912l99954m11526k21079
7549A56673n4865K8277j9861k22456n23301n68956k24621K32322N32824M50421
7539b13543K02578J40017J32369n518k58722m10829k68370J30586N38016O76854
7529F63438N39956K64080r9920k88345k72421j25654K11213N44490O26029O17788
7519B680654O03710M68184J68063k21746l25924j52214o5508j49059j87648j39489
7509B679023j18293k54719m58395m54803k81242j18824n1332j46082k53690k82968
7499B58675k41846k34627k78410k74325j96233m8529K10723N70933P40141N21499
7489A028001L1515k93970k95083l57550m86953k42023K39495N25607N22263L70739
$$ plain form
7479 1042041 1272765 1341336 1172546 784334 377302 221631 412346 748662 974670 972476
7469 972476 761016 382194 113370 239293 664278 1178413 1616940 1810720 1638876 1349198
7459 1349198 1398236 1903511 2603817 3095250 3143588 2846108 2475380 2274893 2166277 1931778
7449 1931778 1576547 1192770 718509 296429 77868 -39160 -141495 -173877 -13136 388681
7439 388681 788814 866976 684605 564223 566992 554933 497749 509823 729366 1116242 1506058
7428 1506058 1713955 1688461 1554179 1380031 1058603 603112 270385 305449 535753 686677
7418 686677 757357 756420 630355 454568 382429 486368 716926 997349 1328162 1560963 1466951
7407 1466951 1019473 478087 157422 264339 744285 1311771 1711380 1997153 2287871 2393156
$$ packed form
7479A042041K30724O8571j68790l88212m07032j55671J90715L36316K26008k194
7469I72476k11460l78822k68824J25923M24985N14135M38527J93780j71844k89678
7459A349198M9038N05275P00306M91433M8338k97480l70728k00487j08616k34499
7449A931778l55231l83777m74261m22080k18561j17028j02335l2382J60741M01817
7439C88681M00133P8162j82371j20382K769j2059n7184J2074K19543L86876L89816
7428A506058K07897k5494j34282j74148l21428m55491l32727L5064K30304J50924
7418F86677P0680r37j26065j75787p2139J03939K30558K80423L30813K32801r4012
7407A466951m47478n41386l20665J06917M79946N67486L99609K85773K90718J05285
$$ plain form
7397 2393156 2017769 1254122 570844 148074 -116212 -189602 -193641 -247837 -209504 81376
7387 81376 630099 1244908 1683263 1971266 2188676 2215662 1920716 1532350 1326147 1219528
7377 1219528 993828 531405 -15445 -348234 -377312 -215481 50357 303777 379951 245417
7367 245417 41859 -129209 -77124 354166 851748 996163 773207 350825 -125393 -383563
7357 -383563 -208023 235332 626583 792250 772612 692514 588230 368019 71324 -173091
7347 -173091 -337172 -352569 -82302 429359 959840 1277887 1332310 1202654 938666 605180
7337 605180 189622 -231918 -482492 -497925 -276513 -56745 -1101 86939 391796 808100
7327 808100 1139727 1190638 905700 441555 -49157 -542455 -1001273 -1369392 -1656595 -1786551
$$ packed form
7397B393156l75387p63647o83278m22770k64286p3390m039n4196L8333K90880
7387H1376N48723O14809M38355K88003K17410K6986k94946l88366k06203j06619
7377A219528k25700m62423n46850l32789k9078J61831K65838K53420P6174j34534
7367B45417k03558j71068N2085M31290M97582J44415k22956m22382m76218k58170
7357c83563J75540M43355L91251J65667j9638q0098j04284k20211k96695k44415
7347a73091j64081j5397K70267N11661N30481L18047N4423j29656k63988l33486
7337F05180m15558m21540k50574j5433K21412K19768N5644Q8040L04857M16304
7327H08100L31627N0911k84938m64145m90712m93298m58818l68119k87203j29956
$$ plain form
7317 -1786551 -1713538 -1582191 -1380366 -1064066 -741683 -580934 -695517 -902079 -922607 -762465
7307 -762465 -604113 -547241 -550893 -588704 -638001 -642844 -508864 -202147 203537 616405 871786
7296 871786 901327 729110 422734 154815 67893 215808 380878 274586 59807 106748
7286 106748 580497 1245461 1713294 1734877 1349836 684444 -181796 -889523 -1200959 -1401269
7276 -1401269 -1714948 -2074396 -2316015 -2299540 -2084428 -1894733 -1729312 -1415598 -1013488 -680893
7266 -680893 -625267 -970989 -1425991 -1584367 -1320642 -766301 -169241 196785 307342 408559
7256 408559 551971 599855 493616 168196 -333749 -798910 -1148781 -1438064 -1646912 -1836568
7246 -1836568 -2071917 -2250151 -2297430 -2171498 -2012351 -2034740 -2136400 -2140363 -2061182 -2084939 -2263213
$$ packed form
7317a786551P3013J31347K01825L16300L22383J60749j14583k06562k0528J60142
7307g62465J58352N6872l652l7811m9297m843J33980L06717M05684M12868K55381
7296H71786K9541j72217l06376k67919q6922J47915J65070j06292k14779M6941
7286A06748M73749O64964M67833K1583l85041o65392q66240p07727l11436k00310
7276a401269l13679l59448k41619J6475K15112J89695J65421L13714M02110L32595
7266f80893N5626l45722m55002j58376K63725N54341N97060L66026J10557J01217
7256D08559J43412M7884j06239l25420n01945m65161l49871k89283k08848j89656
7246a836568k35349j78234m7279J25932J59147k2389j01660l963P9181k3757j78274
$$ plain form
7235 -2263213 -2397681 -2426725 -2404767 -2276861 -2066158 -1877589 -1625082 -1247140 -766316 -335627
7225 -335627 -131609 -131683 -253647 -288510 24640 613654 1190736 1582861 1788242 1795437 1629424
7214 1629424 1419732 1231714 1010847 837916 940986 1224061 1470816 1693928 1824940 1721714
7204 1721714 1577921 1467065 1325377 1203495 1095345 851547 379149 -145790 -547076 -843152
7194 -843152 -1004333 -822729 -443987 -141417 147339 636508 1357245 2057494 2472025 2550501
7184 2550501 2310517 1797500 1212835 795492 526454 211738 -274189 -767195 -970947 -884181
7174 -884181 -650146 -399799 -306763 -418310 -734627 -1107814 -1183247 -917679 -537782 -211883
7164 -211883 -134700 -412266 -805090 -1034200 -1071816 -1057924 -1216125 -1590992 -1961883 -2018475
$$ packed form
7235b263213j34468k9044K1958J27906K10703J88569K52507L77942M80824M30689
7225c35627K04018p4j21964l4863L13150N89014N77082L92125K05381P195j66013
7214A629424k09692j88018k20867j72931J03070K83075K46755K23112J31012j03226
7204A721714j43793j10856j41688j21882j08150k43798m72398n24939m01286k96076
7194h43152j61181J81604L78742L02570K88756M89169P20737P00249M14531P8476
7184B550501k39984n13017n84665m17343k69038l14716m85927m93006k03752Q6766
7174h84181K34035K50347R3036j11547l16317l73187p5433K65568L79897L25899
7164b11883P7183k77566l92824k29110l7616J3892j58201l74867l70891n6592
$$ plain form
7154 -2018475 -1748558 -1434518 -1250485 -1201323 -1283472 -1406273 -1533795 -1766834 -2045205 -2183350
7144 -2183350 -2046075 -1643509 -1155007 -739837 -540965 -595027 -696034 -628178 -275897 258704
7134 258704 759907 1087110 1257488 1358320 1458457 1522318 1465598 1223890 779865 305307
7124 305307 104403 186400 194992 -62633 -354493 -523438 -528698 -363623 -160646 -130587 -349873
7113 -349873 -699881 -853045 -676269 -424899 -397782 -635179 -901388 -1027093 -1050422 -1004362
7103 -1004362 -1007448 -1119999 -1200300 -1261575 -1378565 -1481619 -1483675 -1410016 -1318413 -1331313 -1539300
7092 -1539300 -1948478 -2493431 -3020583 -3251776 -3010707 -2526967 -2053364 -1571077 -1034910 -603772
7082 -603772 -495748 -685741 -893380 -847379 -586487 -359850 -420023 -757082 -1217078 -1624815
$$ packed form
7154b018475K69917L14040J84033M9162q2149j22801j27522k33039k78371j38145
7144b183350J37275M02566M88502M15170J98872n4062j01007O7856L52281N34601
7134B58704N01203L27203J70378J00832J00137O3861n6720k41708m44025m74558
7124C05307k00904Q1997Q592k57625k91860j68945n260J65075K02977L0059k19286
7113c49873l50008j53164J76776K51370K7117k37397k66209j25705k3329M6060
7103a004362l086j12551q0301o1275j16990j03054k056P3659R1603j2900k07987
7092a539300m09178n44953n27152k31193K41069M83740M73603M82287N36167M31138
7082f03772J08024j89993k07639M6001K60892K26637o0173l37059m59996m07737
$$ plain form
7072 -1624815 -1675389 -1395040 -1118820 -1118513 -1438947 -1709513 -1635014 -1319624 -996635 -616708
7062 -616708 -60577 559932 1013266 975247 514385 59642 -257481 -398049 -216928 205619
7052 205619 548435 627713 514179 305570 78555 -62626 -81607 -29887 74788 200114
7042 200114 393966 695384 966615 1249281 1712972 2220409 2501547 2442364 2286076 2285343
7032 2285343 2370941 2478992 2593172 2620473 2505602 2187949 1604284 963208 665209 766276
7022 766276 906778 756959 414473 337314 608080 979937 1229620 1339026 1443362 1518072
7012 1518072 1548249 1512247 1238863 675982 129429 -65233 -11746 -24954 -138914 -85711
7002 -85711 334094 793893 871791 651233 362396 -25765 -513765 -908413 -1036749 -914148
$$ packed form
7072a624815n0574K80349K76220L07l20434k70566P4499L15390L22989L79927
7062f16708N56131O20509M53334l8019m60862m54743l17123j40568J81121M22547
7052B05619L42816P9278j13534k08609k27015j41181j8981N1720J04675J25326
7042B00114J93852L01418K71231K82666M63691N07437K81138n9183j56288p33
7032B285343Q5598J08051J14180K7301j14871l17653n83665o41076k97999J01067
7022G66276J40502j49819l42486p7159K70766L71857K49683J09406J04336P4710
7012A518072L0177l6002k73384n62881n46553j94662N3487j3208j13960N3203
7002h5711M19805M59799P7898k20558k88837l88161m88000l94648j28336J22601
$$ plain form
6992 -914148 -752622 -598245 -436615 -405660 -563331 -799955 -903756 -814224 -694753 -442823
6982 -442823 58156 513491 639205 405433 -30373 -409582 -632461 -825202 -923105 -988523
6972 -988523 -1163861 -1279167 -1231922 -1207199 -1311574 -1419156 -1360877 -1091094 -819619 -705925
6962 -705925 -742039 -834829 -909934 -1009345 -1174178 -1409505 -1719436 -2037567 -2208679 -2136906 -1905444
6951 -1905444 -1727082 -1732819 -2006553 -2407575 -2612563 -2555706 -2338927 -2009500 -1650156 -1333298
6941 -1333298 -1036624 -768490 -604221 -584680 -580580 -668515 -857263 -889857 -739487 -630643
6931 -630643 -697956 -822827 -888063 -841700 -658990 -566273 -759075 -1200980 -1813340 -2451055
6921 -2451055 -2878888 -3005276 -2963200 -2832359 -2606814 -2291817 -1936763 -1533660 -1084442 -613513
$$ packed form
6992i14148J61526J54377J61630L0955j57671k36624j03801Q9532J19471K51930
6982d42823N00979M55335J25714k33772m35806l79209k22879j92741r7903o5418
6972i88523j75338j15306M7245K4723j04375j07582N8279K69783K71475J13694
6962g05925l6114r2790p5105r9411j64833k35327l09931l18131j71112P1773K31462
6951a905444J78362n737k73734m01022k04988N6857K16779L29427L59344L16858
6941a333298K96674K68134J64269J9541M100q7935j88748l2594J50370J08844
6931f30643o7313j24871o5236M6363J82710R2717j92802m41905o12360o37715
6921b451055m27833j26388M2076J30841K25545L14997L55054M03103M49218M70929
$$ plain form
6911 -613513 -170474 331898 950789 1301397 1197313 992747 814461 474826 -113636 -802758
6901 -802758 -1345099 -1574969 -1423488 -1021430 -698010 -571184 -527285 -555196 -719164 -870304
6891 -870304 -876304 -884043 -959204 -964030 -728571 -137862 645613 1157336 1251750 1189679 1112105
6880 1112105 957324 713876 384313 -63800 -534245 -814368 -878156 -872411 -922423 -1029458
6870 -1029458 -1169949 -1371655 -1615937 -1883489 -1962317 -1607298 -1041793 -656420 -610058 -871580
6860 -871580 -1186618 -1269465 -1116092 -800165 -301723 348617 1009076 1531332 1806545 1807727
6850 1807727 1518402 951064 272288 -162479 -370610 -736860 -1200457 -1416661 -1335394 -1092320
6840 -1092320 -852274 -903659 -1375730 -1975160 -2276716 -2191899 -1965402 -1733631 -1405338 -989985
$$ packed form
6911f13513M43039N02372O18891L50608j04084k04566j78286l39635n88462o89122
6901h02758n42341k29870J51481M02058L23420J26826M3899k7911j63968j51140
6891h70304o000p739p5161m826K35459N90709P83475N11723R4414o2071p7574
6880A112105j54781k43448l29563m48113m70445k80123o3788N745n0012j07035
6870a029458j40491k01706k44282k67552p8828L55019N65505L85373M6362k61522
6860h71580l15038q2847J53373L15927M98442O50340O60459N22256K75213J182
6850A807727k89325n67338o78776m34767k08131l66250m63597k16204Q1267K43074
6840a092320K40046n1385m72071n99430l01556Q4817K26497K31771L28293M15353
$$ plain form
6830 -989985 -582847 -273759 -138305 72772 453985 772457 972078 1011020 927533 894567
6820 894567 898162 763968 428735 28284 -320923 -642434 -879832 -1016943 -1162579 -1324483
6810 -1324483 -1473601 -1596889 -1711537 -1781094 -1769410 -1721778 -1675747 -1672770 -1559295 -1214985 -790093
6799 -790093 -458546 -333236 -297235 -210943 -167207 -152396 38485 425592 823087 1026897
6789 1026897 945711 712486 555576 429998 233116 139005 198013 217713 86472 -144869
6779 -144869 -243484 -129767 127524 478940 767857 915038 984685 964218 811277 579635
6769 579635 372797 343745 432501 417399 416033 661746 998342 1162407 1041192 792818 757803
6758 757803 1040775 1500513 1900598 2094766 2133734 2049158 1837171 1463964 1038946 729995
$$ packed form
6830i89985M07138L09088J35454K11077L81213L18472J99621L8942q3487l2966
6820H94567L595j34194l35233m00451l49207l21511k37398j37111j45636j61904
6810a324483j49118j23288j14648o9557J1684M7632M6031K977J13475L44310M24892
6799g90093L31547J25310L6001Q6292M3736J4811J90881L87107L97495K03810
6789A026897q1186k33225j56910j25578j96882r4111N9008J9700j31241k31341
6779a44869r8615J13717K57291L51416K88917J47181O9647k0467j52941k31642
6769E79635k06838k9052Q8756j5102j366K45713L36596J64065j21215k48374l5015
6758G57803K82972M59738M00085J94168L8968q4576k11987l73207m25018l08951
$$ plain form
6748 729995 619346 776895 1069981 1201235 1165256 979802 670162 562149 830359 1272577
6738 1272577 1602211 1676400 1498401 1144456 706762 213694 -313419 -727447 -774555 -362469
6728 -362469 174851 454360 420326 327372 343093 442257 617719 785646 867187 842680 790831
6717 790831 809251 876575 866351 718714 641841 729123 742913 538000 143741 -193144 -191954
6706 -191954 71374 342315 570211 742603 666272 372628 264675 527613 929419 1238925
6696 1238925 1438811 1619960 1757509 1802641 1729597 1627283 1583126 1511180 1316266 1082686
6686 1082686 1117201 1489766 1902895 2108280 2182155 2208634 2118252 1959591 1980203 2275008
6676 2275008 2605113 2790542 2775830 2634054 2438199 2183075 1856907 1445427 1071400 839602
$$ packed form
6748G29995j10649J57549K93086J31254l5979j85454l09640j08013K68210M42218
6738A272577L29634P4189j77999l53945m37694m93068n27113m14028m7108M12086
6728c62469N37320K79509l4034r2954J5721R9164J75462J67927Q1541k4507n1849
6717G90831J8420O7324j0224j47637p6873Q7282J3790k04913l94259l36885J190
6706a91954K63328K70941K27896J72392p6331k93644j07953K62938M01806L09506
6696A238925J99886J81149J37549M5132p3044j02314m4157p1946j94914k33580
6686A082686L4515L72565M13129K05385P3875K6479r0382j58661K0612K94805
6676B275008L30105J85429j4712j41776j95855k55124l26168m11480l74027k31798
$$ plain form
6666 839602 793538 1050230 1575405 2079554 2364112 2362652 1989896 1256998 250685 -670690
6656 -670690 -1175659 -1286895 -1068463 -616903 -253986 -137237 9272 377132 795724 1197133
6646 1197133 1606690 1946621 2033850 1833513 1449687 997630 693175 683151 936441 1302174
6636 1302174 1545283 1540085 1472870 1440588 1354983 1118048 741057 364045 48538 -274961
6626 -274961 -614993 -769376 -613001 -304862 -31701 121449 185282 126957 -159648 -585706
6616 -585706 -881187 -1057050 -1154264 -1057188 -851970 -738987 -724088 -559967 -101393 262496
6606 262496 175855 -87207 -32440 292365 586006 743101 722629 647788 795832 1153233
6596 1153233 1426769 1334720 968362 766660 1003475 1519281 1980710 2301173 2416276 2149099
$$ packed form
6666H39602m6064K56692N25175N04149K84558j460l72756p32898j006313r21375
6656f70690n04969j11236K18432M51560L62917J16749J46509L67860M18592M01409
6646A197133M09557L39931Q7229k00337l83826m52057l04455j0024K53290L65733
6636A302174K43109n198o7215l2282q5605k36935l76991l77012l15507l23499
6626b74961l40032j54383J56375L08139K73161J53150O3833n8325k86605m26058
6616e85706k95481j75863r7214R7076K05218J12983J4899J64121M58574L63889
6606B62496q6641k63062N4767L24805K93641J57095k0472p4841J48044L57401
6596A153233K73536r2049l66358k01702K36815N15806M61429L20463J15103k67177
$$ plain form
6586 2149099 1574868 994741 587539 248268 -128873 -452200 -667057 -841046 -1103951 -1484865
6576 -1484865 -1742884 -1598617 -1142365 -674750 -334696 -117503 -144566 -465249 -904835 -1168808
6566 -1168808 -1242423 -1431810 -1710116 -1694339 -1247861 -703126 -463480 -479618 -538892 -813782
6556 -813782 -1299971 -1671293 -1815291 -1850324 -1771794 -1546704 -1317792 -1307424 -1540815 -1758943
6546 -1758943 -1693214 -1343381 -940357 -666828 -639152 -809639 -1150757 -1752963 -2369359 -2588635
6536 -2588635 -2467662 -2225120 -1790991 -1210725 -650014 -96495 300326 323051 63524 -335886
6526 -335886 -860375 -1371469 -1643835 -1728866 -1911127 -2319164 -2815756 -3027718 -2672782 -1981471
6516 -1981471 -1431516 -1145280 -919763 -666066 -440678 -251568 -135738 -190795 -508976 -974326
$$ packed form
6586B149099n74231n80127m07202l39271l77141l23327k14857j73989k62905l80914
6576a484865k58019J44267M56252M67615L40054K17193k7063l20683m39586k63973
6566a168808p3615j89387k78306J5777M46478N44735K39646j6138n9274k74890
6556h13782m86189l71322j43998l5033P8530K25090K28912J0368k33391k18128
6546a758943O5729L49833M03024K73529K7676j70487l41118o02206o16396k19276
6536b588635J20973K42542M34129N80266N60711N53519L96821K2725k59527l99410
6526c35886n24489n11094k72366q5031j82261m08037m96592k11962L54936O91311
6516a981471N49955K86236K25517K53697K25388J89110J15830n5057l18181m65350
$$ plain form
6506 -974326 -1465970 -1997448 -2440148 -2699181 -2729769 -2501129 -2219776 -1965731 -1569775 -912611
6496 -912611 -170138 316504 447319 329034 84984 -255376 -592607 -627434 -421645 -245698
6486 -245698 -25585 355158 776404 1101730 1249608 1249359 1039563 580245 42598 -377656
6476 -377656 -573081 -709390 -999882 -1382709 -1715665 -1952644 -2144747 -2359877 -2654345 -3016545
6466 -3016545 -3484084 -3960451 -4117949 -3898822 -3660798 -3561287 -3432153 -3092918 -2604753 -2007910
6456 -2007910 -1399462 -953263 -658112 -534101 -551579 -539886 -386181 -131913 131379 439530
6446 439530 788646 1016173 961061 747614 652206 777082 995343 1020527 804971 460032
6436 460032 -22340 -556438 -844914 -696415 -287581 -76218 -247714 -605092 -954879 -1125743
$$ packed form
6506i74326m91644n31478m42700k59033l0588K28640K81353K54045L95956O57164
6496i12611P42473M86642J30815j18285k44050l40360l37231l4827K05789J75947
6486b45698K20113L80743M21246L25326J47878k49k09796m59318n37647m20254
6476c77656j95425j36309k90492l82827l32956k36979j92103k15130k94468l62200
6466c016545m67539m76367j57498K19127K38024R9511J29134L39235M88165N96843
6456b007910O08448M46199K95151J24011j7478J1693J53705K54268K63292L08151
6446D39530L49116K27527n5112k13447r5408J24876K18261K5184k15556l44939
6436D60032m82372n34098k88476J48499M08834K11363j71496l57378l49787j70864
$$ plain form
6426 -1125743 -967750 -537189 -24043 420492 838344 1283310 1579715 1602002 1488057 1311870
6416 1311870 973325 366826 -287124 -656359 -797371 -903050 -1054929 -1305010 -1624619 -1825013
6406 -1825013 -1540307 -599757 591035 1557331 2107146 2070420 1518210 821850 457428 487449
6396 487449 630747 765044 878504 949241 999821 973070 832529 731675 778422 965931
6386 965931 1127070 1164904 1331480 1599014 1705112 1579256 1303395 1045001 740204 120926
6376 120926 -776429 -1483431 -1549897 -1104692 -575912 -167737 192883 589432 860039 853274
6366 853274 647828 471101 412480 441686 580181 855415 1123460 1248550 1207848 1078259
6356 1078259 951403 818201 688406 698800 929943 1220332 1343654 1266045 1105494 923756
$$ packed form
6426a125743J57993M30561N13146M44535M17852M44966K96405K2287j13945j76187
6416A311870l38545o06499o53950l69235j41012j05679j51879k50081l19609k00394
6406a825013K84706R40550J190792R66296N49815l6726n52210o96360l64422L0021
6396D87449J43298J34297J13460P0737N0580k6751j40541j00854M6747J87509
6386I65931J61139L7834J66576K67534J06098j25856k75861k58394l04797o19278
6376A20926q97355p07002o6466M45205N28780M08175L60620L96549K70607o765
6366H53274k05446j76727n8621K9206J38495K75234K68045J25090m0702j29589
6356A078259j26856j33202j29795J0394K31143K90389J23322p7609j60551j81738
$$ plain form
6346 923756 696749 351076 -135219 -683872 -1081495 -1186600 -1099367 -979641 -1001700 -1330931
6336 -1330931 -1775998 -2050251 -2114088 -1924247 -1486855 -1013415 -646979 -423665 -461906 -749626
6326 -749626 -1063834 -1350215 -1715176 -2021866 -2028434 -1775072 -1494991 -1355068 -1396165 -1429702
6316 -1429702 -1224147 -888729 -822444 -1183507 -1632164 -1809015 -1779669 -1821244 -1931917 -1920678
6306 -1920678 -1700523 -1258619 -693109 -173574 86106 10257 -257951 -485082 -510842 -480789
6296 -480789 -588230 -880782 -1191414 -1307903 -1227207 -1173621 -1298121 -1471975 -1507927 -1485867
6286 -1485867 -1467511 -1526208 -1705202 -1697576 -1376254 -1043293 -910204 -902497 -899101 -668509 -186810
6275 -186810 285471 557314 655119 674072 571237 350875 360449 687471 881746 682711
$$ packed form
6346I23756k27007l45673m86295n48653l97623j05105Q7233J19726k2059l29231
6336a330931m45067k74253o3837J89841M37392M73440L66436K23314l8241k87720
6326g49626l14208k86381l64961l06690o568K53362K80081J39923m1097l3537
6316a429702K05555L35418O6285l61063m48657j76851K9346m1575j10673J1239
6306a920678K20155M41904N65510N19535K59680p5849k68208k27131k5760L0053
6296d80789j07441k92552l10632j16489Q0696N3586j24500j73854l5952K2060
6286a485867J8356n8697j78994P626L21322L32961J33089P707L396K30592M81699
6275a86810M72281K71843R7805J8953j02835k20362R574L27022J94275j99035
$$ plain form
6265 682711 154821 -411841 -656905 -638320 -762747 -1305995 -2044060 -2603202 -2858506 -2738978
6255 -2738978 -2275949 -1704656 -1211570 -776053 -227120 506365 1226771 1640535 1573918 1232137
6245 1232137 850736 501415 286434 160433 -30937 -348889 -801037 -1287458 -1557499 -1512840
6235 -1512840 -1456518 -1544379 -1640002 -1837719 -2226888 -2578648 -2756245 -2827275 -2886133 -2920570 -2822180
6224 -2822180 -2598795 -2126989 -1249863 -196424 691955 1314685 1602081 1517436 1349656 1324285
6214 1324285 1183627 700078 168559 -33667 24871 62214 78913 198346 324003 376666
6204 376666 393545 359182 285181 291036 365192 395812 295198 71021 -179602 -345649 -229316
6193 -229316 286368 989200 1503417 1693404 1592849 1169663 641382 483618 922676 1835169
$$ packed form
6265F82711n27890n66662k45064J8585j24427n43248p38065n59142k55304J19528
6255b738978M63029N71293M93086M35517N48933P33485P20406M13764o6617l41781
6245A232137l81401l49321k14981j26001j91370l17952m52148m86421k70041M4659
6235a512840N6322q7861r5623j97717l89169l51760j77597p1030n8858l4437R8390
6224b822180K23385M71806Q77126J053439Q88379O22730K87396q4645j67780k5371
6214A324285j40658m83549n31519k02226N8538L7343J6699J19433J25657N2663
6204C76666J6879l4363p4001N855P4156L0620j00614k24177k50623j66047J16333
6193b29316N15684P02832N14217J89987j00555m23186n28281j57764M39058R12493
$$ plain form
6183 1835169 2815525 3478208 3823969 3920677 3789270 3509750 3061406 2586124 2402122 2445727
6173 2445727 2557754 2597577 2499333 2442556 2638355 3068936 3480801 3621357 3337184 2798914
6163 2798914 2469390 2758270 3527527 4349089 5055647 5677634 6196157 6626283 7124324 7751594
6153 7751594 8504340 9524356 11117413 13497990 16621484 20174868 24051445 28473622
6145 28473622 33831622 40575309 49072628 59563484 72186903 86887614 102402611 115013702
6137 115013702 119615822 113655396 99368435 82045567 66038198 53015725 42895382
6130 42895382 35089166 29023481 24076551 19898684 16524878 13958984 11897430 9987840
6122 9987840 8160547 6556372 5239265 4229782 3510677 3024234 2797877 2755327 2655265
$$ packed form
6183A835169R80356O62683L45761R6708j31407k79520m48344m75282j84002M3605
6173B445727J12027L9823r8244n6777J95799M30581M11865J40556k84173n38270
6163B798914l29524K88880P69257Q21562P06558O21987N18523M30126M98041O27270
6153G751594P52746J020016J593057K380577L123494L553384L876577M422177
6145B8473622N358000O743687Q497319J0490856J2623419J4700711J5514997J2611091
6137A15013702M602120n960426j4286961j7322868j6007369j3022473j0120343
6130D2895382p806216o065685m946930m177867l373806k565894k061554j909590
6122I987840j827293j604175j317107j009483p19105m86443k26357m2550j00062
$$ plain form
6113 2655265 2271789 1566279 868235 664403 913498 1203317 1340182 1280458 996841 557560
6103 557560 87514 -166148 -51592 107264 9930 -225471 -266398 -132259 -62455 -76231
6093 -76231 -56935 2047 92287 248723 334788 193437 24001 197159 701222 1185148 1420168
6082 1420168 1524375 1667600 1855973 2103930 2288662 2204097 1842135 1375061 1011636 826516
6072 826516 720798 637868 659850 854159 1001003 918236 745754 677022 834798 1162317
6062 1162317 1433754 1509591 1448837 1283075 1024101 835583 848406 956160 983281 1037167
6052 1037167 1226239 1436574 1536869 1465959 1358677 1324533 1129876 575990 -150168 -787346
6042 -787346 -1185290 -1204375 -872637 -292045 347239 663549 537606 223158 90542 285155
$$ packed form
6113B655265l83476p05510o98044k03832K49095K89819J36865n9724k83617m39281
6103E57560m70046k53662J14556J58856r7334k35401m0927J34139O9804j3776
6093g6231J9296N8982R0240J56436Q6065j41351j69436J73158N04063M83926K35020
6082A420168J04207J43225J88373K47957J84732q4565l61962m67074l63425j85120
6072H26516j05718q2930K1982J94309J46844q2767j72482o8732J57776L27519
6062A162317K71437P5837o0754j65762k58974j88518J2823J07754K7121N3886
6052A037167J89072K10335J00295p0910j07282l4144j94657n53886p26158o37178
6042g87346l97944j9085L31738N80592O39284L16310j25943l14448j32616J94613
$$ plain form
6032 285155 534101 458206 82512 -253016 -274384 -88337 -6750 -84625 -355013 -782451
6022 -782451 -1079204 -1148284 -1083401 -875012 -450235 6449 189550 123762 -51915 -276767
6012 -276767 -483812 -686550 -905774 -1077949 -1274236 -1519889 -1584241 -1339906 -990743 -812882
6002 -812882 -953519 -1327642 -1630876 -1580118 -1132345 -548323 -244815 -309044 -460012 -539467
5992 -539467 -562853 -516154 -367556 -228279 -321697 -704652 -1097073 -1167320 -876312 -397017
5982 -397017 707 19263 -435035 -1046562 -1339634 -1218542 -887608 -528339 -402852 -560336
5972 -560336 -715284 -668246 -398790 41887 581418 1086173 1419067 1497550 1324049 963119
5962 963119 531885 204921 126629 342877 799144 1310352 1703893 1952937 2120353 2296748
$$ packed form
6032B85155K48946p5895l75694l35528k1368J86047Q1587p7875k70388m27438
6022g82451k96753o9080O4883K08389M24777M56684J83101o5788j75677k24852
6012b76767k07045k02738k19224j72175j96287k45653o4352K44335L49163J77861
6002h12882j40637l74123l03234N0758M47773N84022L03508o4229j50968p9455
5992e39467k3386M6699J48598J39277r3418l82955l92421p0247K91008M79295
5982c97017L97724J8556m54298o11527k93072J21092L30934L59269J25487j57484
5972e60336j54948M7038K69456M40677N39531N04755L32894P8483j73501l60930
5962I63119m31234l26964p8292K16248M56267N11208L93541K49044J67416J76395
$$ plain form
5952 2296748 2455130 2462619 2319760 2222037 2312105 2434996 2574827 2870019 3064655 2897734
5942 2897734 2634690 2543923 2533196 2505849 2330142 1987372 1644212 1373943 1054141 434072
5932 434072 -469700 -1377127 -2103393 -2542598 -2615128 -2363474 -2013999 -1836662 -1775292 -1613016
5922 -1613016 -1414205 -1274665 -1058803 -711098 -331752 -50293 -5655 -301577 -906369 -1559172
5912 -1559172 -1901562 -1806694 -1305277 -602173 -49350 193017 198018 88920 10834 -21179
5902 -21179 -69919 -113282 -98503 -33019 45653 109356 91400 23582 17687 6878 -174024 -669416
5890 -669416 -1410046 -1988169 -2169293 -2030218 -1746298 -1461979 -1174984 -833285 -631308 -722719
5880 -722719 -867426 -858391 -757165 -630668 -495725 -344750 -110225 306210 769639 1005786
$$ packed form
5952B296748J58382P489j42859r7723R0068J22891J39831K95192J94636j66921
5942B897734k63044r0767j0727k7347j75707l42770l43160k70269l19802o20069
5932D34072r03772r07427p26266m39205p2530K51654L49475J77337O1370J62276
5922a613016J98811J39540K15862L47705L79346K81459M4638k95922o04792o52803
5912a559172l42390R4868N01417P03104N52823K42367N001j09098p8086l2013
5902b1179m8740m3363J4779O5484P8672O3703j7956o7818n895j0809j80902m95392
5890f69416p40630n78123j81124J39075K83920K84319K86995L41699K01977r1411
5880g22719j44707R035J01226J26497J34943J50975K34525M16435M63429K36147
$$ plain form
5870 1005786 943818 685603 232705 -415602 -1127203 -1854056 -2444604 -2605379 -2372730 -2070734
5860 -2070734 -1865227 -1748529 -1732808 -1839136 -2013635 -2218355 -2442014 -2499453 -2234695 -1637313
5850 -1637313 -820503 -109918 215307 58239 -349273 -600408 -580809 -412869 -65366 439496
5840 439496 735014 704572 529068 298643 26914 -259727 -516024 -606033 -460512 -231495
5830 -231495 87155 589342 1222667 1760071 1978966 1897816 1536825 891719 135165 -511648
5820 -511648 -958782 -1292585 -1593943 -1684900 -1491449 -1195493 -832083 -425882 -55116 296513
5810 296513 711670 1144803 1471422 1627622 1645237 1656235 1725296 1658783 1272051 675940
5800 675940 84321 -338816 -551976 -649893 -652612 -607373 -472538 -149710 118545 16115
$$ packed form
5870A005786o1968k58215m52898o48307p11601p26853n90548j60775K32649L01996
5860b070734K05507J16698J5721j06328j74499k04720k23659n7439K64758N97382
5850a637313Q16810P10585L25225j57068m07512k51135J9599J67940L47503N04862
5840D39496K95518l0442j75504k30425k71729k86641k56297r0009J45521K29017
5830b31495L18650N02187O33325N37404K18895q1150l60991o45106p56554o46813
5820e11648m47134l33803l01358r0957J93451K95956L63410M06201L70766L51629
5810B96513M15157M33133L26619J56200J7615J0998O9061o6513l86732n96111
5800F75940n91619m23137k13160r7917k719M5239J34835L22828K68255j02430
$$ plain form
5790 16115 -385891 -859610 -1176354 -1174286 -877304 -352505 312256 970838 1516924 1876355
5780 1876355 1946339 1850996 1876097 2146640 2543280 2942405 3216377 3162270 2920958 2873059
5770 2873059 2990971 3058889 3075751 2982403 2593222 1814774 866975 201574 -134711 -586045
5760 -586045 -1201063 -1542353 -1499307 -1349358 -1251686 -1186267 -1107840 -838470 -363317 102596
5750 102596 366326 343110 62269 -401066 -886335 -1164614 -1263331 -1311438 -1143980 -748665
5740 -748665 -423431 -190096 44286 216475 332312 430026 502841 684917 1034005 1374915
5730 1374915 1483275 1342199 1093587 749476 301555 -362729 -1181485 -1819628 -2124857 -2045461
5720 -2045461 -1567126 -865300 -160576 515282 993252 1078586 990757 984542 1092194 1203498
$$ packed form
5790A6115m02006m73719l16744K068K96982N24799O64761O58582N46086L59431
5780A876355O9984r5343K5101K70543L96640L99125K73972n4107k41312m7899
5770B873059J17912O7918J6862r3348l89181p78448r47799o65401l36285m51334
5760e86045o15018l41290M3046J49949R7672O5419P8427K69370M75153M65913
5750A02596K63730k3216k80841m63335m85269k78279r8717m8107J67458L95315
5740g48665L25234K33335K34382J72189J15837R7714P2815J82076L49088L40910
5730A374915J08360j41076k48612l44111m47921o64284q18756o38143l05229P9396
5720b045461M78335P01826P04724O75858M77970Q5334q7829o215J07652J11304
$$ plain form
5710 1203498 1166079 902095 627731 740163 1077132 1360871 1584886 1659862 1494331 1346246
5700 1346246 1456795 1674531 1844920 2067416 2384845 2639516 2651466 2251971 1571148 1037133
5690 1037133 837402 861272 907136 720631 351987 36083 -161793 -285075 -311249 -220395
5680 -220395 -61249 178459 473719 642384 510214 83332 -437220 -801260 -950988 -911074
5670 -911074 -716177 -455153 -198161 -18550 22381 -50760 -170893 -340337 -446996 -314578
5660 -314578 -30584 137101 216911 243986 141041 -34251 -172970 -145390 38363 262826
5650 262826 567692 923134 1145642 1141795 975042 782496 650713 581508 554445 494931 464386
5639 464386 613769 920315 1265554 1554107 1538376 1059717 313000 -453838 -1115274 -1699307
$$ packed form
5710A203498l7419k63984k74364J12432L36969K83739K24015P4976j65531j48085
5700A346246J10549K17736J70389K22496L17429K54671J1950l99495o80823n34015
5690A037133j99731K3870M5864j86505l68644l15904j97876j23282k6174R0854
5680b20395J59146K39708K95260J68665j32170m26882n20552l64040j49728L9914
5670i11074J94897K61024K56992J79611M0931p3141j20133j69444j06659J32418
5660c14578K83994J67685P9810K7075j02945j75292j38719K7580J83753K24463
5650B62826L04866L55442K22508l847j66753j92546j31783o9205k7063n9514l0545
5639D64386J49383L06546L45239K88553j5731m78659p46717p66838o61436n84033
$$ plain form
5629 -1699307 -2154450 -2283709 -2047307 -1638127 -1210128 -730282 -273338 63351 249331 298561
5619 298561 243881 159877 151801 52565 -354406 -858517 -1100539 -1221220 -1460518 -1685430 -1682924
5608 -1682924 -1421950 -1067110 -778941 -581129 -451662 -328306 -188417 -9070 223655 307042
5598 307042 38247 -557574 -1145184 -1258327 -860081 -462147 -386085 -510140 -582130 -474027
5588 -474027 -317058 -278265 -453568 -844227 -1286716 -1659849 -1912981 -2048448 -2231660 -2571927
5578 -2571927 -2765414 -2623788 -2441430 -2297423 -1949812 -1371035 -740849 -144918 283295 267735
5568 267735 -159331 -551822 -652192 -614026 -470726 -101005 355262 598751 561903 369437
5558 369437 104084 -275702 -686815 -926653 -933282 -754081 -481711 -161364 96982 122364
$$ packed form
5629a699307m55143j29259K36402M09180M27999M79846M56944L36689J85980M9230
5619B98561n4680q4004q076r9236m06971n04111k42022j20681k39298k24912K506
5608a682924K60974L54840K88169J97812J29467J23356J39889J79347K32725Q3387
5598C07042k68795n95821n87610j13143L98246L97934P6062j24055p1990J08103
5588d74027J56969L8793j75303l90659m42489l73133k53132j35467j83212l40267
5578b571927j93487J41626J82358J44007L47611N78777O30186N95931M28213j5560
5568B67735m27066l92491j00370L8166J43300L69721M56267K43489l6848j92466
5558C69437k65353l79786m11113k39838o629J79201K72370L20347K58346K5382
$$ plain form
5548 122364 24636 33552 213209 560097 842275 877964 744408 513952 271402 176819 261281
5537 261281 409421 539493 719361 931219 955011 752548 436969 89608 -86997 16971
5527 16971 212298 362827 431714 366686 250209 125797 56843 185732 552622 1179846
5517 1179846 1921828 2516657 2867936 2905719 2601100 2151362 1816170 1782936 2078438 2418053
5507 2418053 2577954 2574605 2576073 2657475 2666981 2357807 1700025 1031016 637713 427950 89805
5496 89805 -516562 -1151289 -1536224 -1535621 -1215197 -954414 -1052112 -1328089 -1424498 -1279322 -1061553
5485 -1061553 -896107 -850145 -954983 -1124089 -1226197 -1133981 -728947 -203232 183413 467731
5475 467731 697128 868361 1010901 1080971 1149688 1229951 1180498 1105456 1214462 1329923 1250652
$$ packed form
5548A22364r7728Q916J79657L46888K82178L5689j33556k30456k42550r4583Q4462
5537B61281J48140J30072J79868K11858K3792k02463l15579l47361j76605J03968
5527A6971J95327J50529O8887o5028j16477j24412o8954J28889L66890O27224
5517A179846P41982N94829L51279L7783l04619m49738l35192l3234K95502L39615
5507B418053J59901l349J468Q1402R506l09174o57782o69009l93303k09763l38145
5496H9805o06367o34727l84935O03L20424K60783r7698k75977r6409J45176K17769
5485a061553J65446M5962j04838j69106j02108R2216M05034N25715L86645K84318
5475D67731K29397J71233J42540P0070O8717Q0263m9453p5042J09006J15461p9271
$$ plain form
5464 1250652 1066728 779439 398262 53536 -123709 36098 389713 575402 508235 326866
5454 326866 52037 -463044 -1168404 -1874196 -2507996 -3079341 -3569111 -3910523 -4044291 -3915861
5444 -3915861 -3468219 -2831694 -2236881 -1777645 -1533805 -1458955 -1511900 -1678951 -1894253 -2029252
5434 -2029252 -1933536 -1560602 -1156174 -945754 -811190 -567408 -207040 243147 712477 982075
5424 982075 998625 878500 579133 111801 -270282 -417977 -345804 -162298 34177 238199
5414 238199 470989 625957 630902 581415 644794 854414 1118855 1300255 1345288 1257860 971681
5403 971681 542446 106061 -219476 -404145 -516110 -558496 -562550 -568107 -727187 -1136613 -1509932
5392 -1509932 -1529220 -1206170 -912012 -934203 -1246384 -1544590 -1653644 -1671722 -1557474 -1254408
$$ packed form
5464A250652j83924k87289l81177l44726j77245J59807L53615J85689o7167j81369
5454C26866k74829n15081p05360p05792o33800n71345m89770l41412j33768J28430
5444c915861M47642O36525N94813M59236K43840P4850n2945j67051k15302j34999
5434b029252R5716L72934M04428K10420J34564K43782L60368M50187M69330K69598
5424I82075J6550j20125k99367m67332l82083j47695P2173J83506J96475K04022
5414B38199K32790J54968M945m9487O3379K09620K64441J81400M5033q7428k86179
5403I71681m29235m36385l25537j84669j11965m2386m054n557j59080m09426l73319
5392a509932j9288L23050K94158k2191l12181k98206j09054j8078J14248L03066
$$ plain form
5382 -1254408 -786327 -204425 388931 767179 811779 695817 546980 355735 145632 -4652
5372 -4652 61613 317060 470039 435801 317271 60535 -273824 -441400 -390247 -284211 -91558
5361 -91558 243099 602394 839546 935924 795799 323545 -339498 -865654 -1026694 -855185
5351 -855185 -615430 -610147 -882089 -1222916 -1523457 -1793564 -2033622 -2142755 -2069923 -1884718
5341 -1884718 -1541365 -1076754 -683419 -588426 -740724 -818336 -801148 -776034 -762617 -881709
5331 -881709 -1065506 -1163466 -1137586 -1088805 -1221590 -1534658 -1812354 -1947587 -1917921 -1738025
5321 -1738025 -1609736 -1606929 -1490252 -1255243 -1177283 -1275830 -1252101 -995702 -763451 -636165
5311 -636165 -420963 -140791 36628 198986 463361 719458 687164 129516 -740170 -1512481
$$ packed form
5382a254408M68081N81902N93356L78248M4600j15962j48837j91245k10103j50284
5372d652O6265K55447J52979l4238j18530k56736l34359j67576N1153J06036J92653
5361i1558L34657L59295K37152R6378j40125m72254o63043n26156j61040J71509
5351h55185K39755N283k71942l40827l00541k70107k40058j09133P2832J85205
5341a884718L43353M64611L93335R4993j52298p7612J7188K5114J3417j19092
5331h81709j83797r7960K5880M8781j32785l13068k77696j35233K9666J79896
5321a738025J28289K807J16677K35009P7960r8547K3729K56399K32251J27286
5311f36165K15202K80172J77419J62358K64375K56097l2294n57648q69686p72311
$$ plain form
5301 -1512481 -1943193 -1935389 -1676761 -1365808 -935519 -370593 131894 432332 476528 370413
5291 370413 284372 195686 138092 250488 520199 772873 923417 1062747 1159968 999331
5281 999331 560137 25699 -345514 -428322 -431237 -569863 -725658 -675620 -364130 -22812
5271 -22812 226189 375514 362270 398044 536464 560132 395891 115366 -53042 160354
5261 160354 528099 608553 392682 181868 137582 192183 163576 -93011 -535430 -1011636
5251 -1011636 -1424268 -1661363 -1597001 -1299037 -907696 -614382 -574983 -717219 -894391 -1096133
5241 -1096133 -1263220 -1308252 -1280488 -1194416 -996870 -601363 -28571 430391 542180 415973
5231 415973 335503 373075 258730 -12431 -158935 -137325 -134908 -235687 -330191 -400576 -560494
$$ packed form
5301a512481m30712P804K58628L10953M30289N64926N02487L00438M4196j06115
5291C70413q6041q8686n7594J12396K69711K52674J50544J39330R7221j60637
5281I99331m39194n34438l71213q2808k915j38626j55795N0038L11490L41318
5271b2812K49001J49325j3244L5774J38420K3668j64241k80525j68408K13396
5261A60354L67745Q0454k15871k10814m4286N4601k8607k56587m42419m76206
5251a011636m12632k37095O4362K97964L91341K93314L9399j42236j77172k01742
5241a096133j67087m5032K7764Q6072J97546L95507N72792M58962J11789j26207
5231D15973q0470L7572j14345k71161j46504K1610K417j00779r4504p0385j59918
$$ plain form
5220 -560494 -805687 -1056899 -1245099 -1273204 -1141857 -891582 -584087 -239970 72946 236288
5210 236288 259555 176135 -35258 -232783 -237694 -180131 -264707 -547604 -1048480 -1661579 -2112047
5199 -2112047 -2347816 -2515210 -2591671 -2394115 -1908200 -1279035 -530131 294692 1079591 1681579
5189 1681579 1959871 1911423 1652143 1332476 1145442 1108519 1108902 1088318 1084776 1162152 1231630
5178 1231630 1301020 1470686 1620842 1600261 1491118 1436811 1537525 1769674 1959917 2049049
5168 2049049 2138531 2193182 2041276 1651873 1207533 876450 656131 459675 339358 359815
5158 359815 438579 532235 616936 726296 930418 1089337 1093863 1010896 832256 545504 260374
5147 260374 178587 284055 543931 1042338 1655878 2092478 2223368 2241791 2217248 2052298
$$ packed form
5220e60494k45193k51212j88200k8105J31347K50275L07495L44117L12916J63342
5210B36288K3267q3420k11393j97525m911N7563q4576k82897n00876o13099m50468
5199b112047k35769j67394p6461J97556M85915O29165P48904Q24823P84899O01988
5189A681579K78292m8448k59280l19667j87034l6923L83k0584l542P7376O9478
5178A231630O9390J69666J50156k0581j09143n4307J00714K32149J90243Q9132
5168B049049Q9482N4651j51906l89403m44340l31083k20319j96456j20317K0457
5158C59815P8764R3656Q4701J09360K04122J58919M526q2967j78640k86752k85130
5147B60374q1787J05468K59876M98407O13540M36600J30890J8423k4543j64950
$$ plain form
5137 2052298 1903421 1948986 2096263 2210822 2282809 2303622 2088338 1526073 731798 -230242
5127 -230242 -1142535 -1653020 -1640829 -1292072 -964982 -765149 -546208 -368614 -368232 -335889 -81643
5116 -81643 241765 388441 258065 -72911 -582605 -1298272 -2052109 -2513442 -2629985 -2627439
5106 -2627439 -2492831 -2096854 -1397244 -464077 433105 997702 1205706 1314826 1402654 1361555
5096 1361555 1189273 912512 636304 603774 732868 679623 348505 -75107 -450623 -720004
5086 -720004 -941645 -1289110 -1716386 -1991424 -2092233 -2088830 -1936753 -1627616 -1209016 -737309
5076 -737309 -277096 195504 592357 699578 580726 498901 598724 835251 1067341 1071898
5066 1071898 871755 720512 618392 514826 412860 376177 456338 603431 727719 914032
$$ packed form
5137B052298j48877M5565J47277J14559P1987K0813k15284n62265p94275r62040
5127b30242r12293n10485J2191L48757L27090J99833K18941J77594L82L2343K54246
5116h1643L23408J46676j30376l30976n09694p15667p53837m61333j16543K546
5106b627439J34608L95977O99610R33167Q97182N64597K08004J09120Q7828m1099
5096A361555j72282k76761k76208l2530J29094n3245l31118m23612l75516k69381
5086g20004k21641l47465m27276k75038j00809L403J52077L09137M18600M71707
5076g37309M60213M72600L96853J07221j18852q1825R9823K36527K32090M557
5066A071898k00143j51243j02120j03566j01966l6683Q0161J47093J24288J86313
$$ plain form
5056 914032 1285258 1807156 2171506 1985976 1356736 715561 251081 -108039 -342776 -376738
5046 -376738 -272191 -191120 -178745 -157388 8340 288086 526782 729657 902984 935228
5036 935228 903119 901540 830040 611269 290397 -71627 -487438 -927811 -1296014 -1520125
5026 -1520125 -1550883 -1364592 -1066762 -873065 -821760 -832684 -820750 -829330 -921456 -1089999 -1290080
5015 -1290080 -1327722 -1122743 -842902 -638314 -651179 -799833 -850844 -738430 -501968 -262550
5005 -262550 -124302 96246 582943 1179262 1460229 1195683 648339 150367 -158970 -262913
4995 -262913 -239219 -200516 -158784 -13666 286376 496974 359835 1279 -289320 -453125
4985 -453125 -572348 -619778 -585769 -502833 -337654 -97602 68493 111897 37441 -97690 -218781
$$ packed form
5056I14032L71226N21898L64350j85530o29240o41175m64480l59120k34737l3962
5046c76738J04547Q1071J2375K1357J65728K79746K38696K02875J73327L2244
5036I35228l2109j579p1500k18771l20872l62024m15811m40373l68203k24111
5026a520125l0758J86291K97830J93697N1305j0924J1934q580r2126j68543k00081
5015a290080l7642K04979K79841K04588j2865j48654n1011J12414K36462K39418
5005b62550J38248K20548M86697N96319K80967k64546n47344m97972l09337j03943
4995b62913K3694L8703M1732J45118L00042K10598j37139l58556k90599j63805
4985d53125j19223m7430L4009Q2936J65179K40052J66095M3404p4456j35131j21091
$$ plain form
4974 -218781 -340311 -359450 -182091 -19108 -43625 -77605 43567 316615 597329 761926
4964 761926 815316 757892 554097 182405 -191298 -443454 -671502 -892637 -1002275 -977634
4954 -977634 -947177 -1003731 -1342045 -1981308 -2566301 -2852245 -2894607 -2832994 -2735696 -2613125 -2462409
4943 -2462409 -2271779 -2047795 -1890349 -1773652 -1574515 -1322128 -1071480 -876139 -819500 -875709
4933 -875709 -954317 -918007 -685517 -349496 -75991 38253 57299 20797 -81623 -359761
4923 -359761 -723089 -979095 -1077780 -1068646 -1139740 -1357474 -1491477 -1304535 -847109 -281273
$$ packed form
4974b18781j21530j9139J77359J62983k4517l3980J21172K73048K80714J64597
4964G61926N3390n7424k03795l71692l73703k52156k28048k21135j09638K4641
4954i77634L0457n6554l38314o39263n84993k85944m2362O1613R7298J22571J50716
4943b462409J90630K23984J57446J16697J99137K52387K50648J95341N6639n6209
4933h75709p8608L6310K32490L36021K73505J14244J9046l6502j02420k78138
4923c59761l63328k56006r8685R134p1094k17734j34003J86942M57426N65836
$$ [...]
##END NTUPLES=NMR SPECTRUM
##END=
