##TITLE=C13_08-2025-Bay
 DMSO-d6, 22300sc

 16.1.2025
##JCAMPDX= 6.0         $$ Bruker NMR JCAMP-DX V2.0
##DATA TYPE= NMR SPECTRUM
##DATA CLASS= NTUPLES
##ORIGIN= UXNMR, Bruker Analytische Messtechnik GmbH
##OWNER= root
$$ XWIN-NMR		Version 3.5
$$ Fri Jan 17 13:44:10 2025 Russian Standard Time (UT+4h)  she@DPX200
##.OBSERVE FREQUENCY= 50.327896
##.OBSERVE NUCLEUS= ^13C
##.ACQUISITION MODE= SIMULTANEOUS
##.ACQUISITION SCHEME= undefined
##.AVERAGES= 22303
##.DIGITISER RES= 17
##SPECTROMETER/DATA SYSTEM= spect
##.PULSE SEQUENCE= zgpg30
##.SOLVENT NAME= CDCl3
##.SHIFT REFERENCE= (INTERNAL, CDCl3, 0, 222.646)
##AUDIT TRAIL= $$ (NUMBER, WHEN, WHO, WHERE, WHAT)
$$ ##TITLE= Audit trail, XWIN-NMR		Version 3.5
$$ ##JCAMPDX= 5.01
$$ ##ORIGIN= Bruker BioSpin GmbH
$$ ##OWNER= she
$$ F:/spectra/data/she/nmr/c13/1/pdata/1/auditp.txt
$$ ##AUDIT TRAIL=  $$ (NUMBER, WHEN, WHO, WHERE, WHAT)
(   1,<2025-01-17 13:43:09.87 +0400>,<she>,<DPX200>,
      <created by zg, POWCHK disabled, PULCHK disabled
       terminated by command 'halt'
       configuration hash MD5:
       00 E9 B6 7A A2 85 ED C7 34 08 36 98 17 FE 4E 26
       data hash MD5: 32K
       5E 0E CD 40 A0 DF D8 0B 37 6D 5D C3 6B 09 D9 16>)
(   2,<2025-01-17 13:43:15.29 +0400>,<she>,<DPX200>,
      <Start of raw data processing
       efp BC_mod = 2 LB = 2 FT_mod = 6 PKNL = 1 PHC0 = -403.6573 PHC1 = 19.88833 SI = 32K 
       data hash MD5: 32K
       B9 9E D3 86 43 3C 35 E3 25 3F 88 95 13 30 8C 0B>)
(   3,<2025-01-17 13:43:17.85 +0400>,<she>,<DPX200>,
      <abs ABSG = 5 
       data hash MD5: 32K
       B9 FB E2 7B 97 E0 F8 20 FD D9 D2 54 20 4D 7C 60>)
(   4,<2025-01-17 13:43:34.60 +0400>,<she>,<DPX200>,
      <pk PHC0 = 0.01735229 PHC1 = 0 
       data hash MD5: 32K
       29 79 C9 A9 1A 98 91 7B 3A AF A5 61 04 C7 60 35>)
(   5,<2025-01-17 13:43:38.10 +0400>,<she>,<DPX200>,
      <abs ABSG = 5 
       data hash MD5: 32K
       A5 8C 40 00 47 C0 C0 47 A6 E6 36 64 1E CB 83 15>)
$$ ##END=
$$ 
$$ hash MD5
$$ 0A EB 8A 5A 98 BD 5B 6C 70 10 1C 61 D8 86 63 CD
##$RELAX= 
##$RELAX= 
##$RELAX= 
##$RELAX= 
##$RELAX= 
##$RELAX= 
##$RELAX= 
##$RELAX= 
$$ Bruker specific parameters
$$ --------------------------
##$DU= <F:/spectra>
##$EXPNO= 1
##$NAME= <c13>
##$PROCNO= 1
##$TYPE= <nmr>
##$USER= <she>
##$AMP= (0..31)
100 100 100 100 100 100 100 100 100 100 100 100 100 100 100 100 100 100 
100 100 100 100 100 100 100 100 100 100 100 100 100 100 
##$AQSEQ= 0
##$AQ_mod= 1
##$AUNM= <au_zg>
##$AUTOPOS= <>
##$BF1= 50.322709
##$BF2= 200.13
##$BF3= 50.322709
##$BF4= 500.13
##$BF5= 500.13
##$BF6= 500.13
##$BF7= 500.13
##$BF8= 500.13
##$BYTORDA= 1
##$CFDGTYP= 0
##$CFRGTYP= 5
##$CHEMSTR= <none>
##$CNST= (0..31)
1 1 145 1 1 1 1 1 1 1 1 1 1 1 1 1 1 1 1 1 1 1 1 1 1 1 1 1 1 1 1 1 
##$CPDPRG= <waltz16>
##$CPDPRG1= <>
##$CPDPRG2= <waltz16>
##$CPDPRG3= <>
##$CPDPRG4= <mlev>
##$CPDPRG5= <mlev>
##$CPDPRG6= <mlev>
##$CPDPRG7= <mlev>
##$CPDPRG8= <mlev>
##$CPDPRGB= <>
##$CPDPRGT= <>
##$D= (0..31)
$$ [...]
##$SUBNAM4= <"">
##$SUBNAM5= <"">
##$SUBNAM6= <"">
##$SUBNAM7= <"">
##$SUBNAM8= <"">
##$SUBNAM9= <"">
##$SW= 239.972175391363
##$SWIBOX= (0..15)
0 1 3 0 0 0 0 0 0 0 0 0 0 0 0 0 
##$SW_h= 12077.2946859903
##$TD= 32768
##$TD0= 1
##$TE= 0
##$TE2= 300
##$TE3= 300
##$TEG= 300
##$TL= (0..7)
120 120 120 120 120 120 120 120 
##$TP= (0..7)
150 150 150 150 150 150 150 150 
##$TP07= 0
##$TPNAME0= <>
##$TPNAME1= <>
##$TPNAME2= <>
##$TPNAME3= <>
##$TPNAME4= <>
##$TPNAME5= <>
##$TPNAME6= <>
##$TPNAME7= <>
##$TPOAL= (0..7)
0.5 0.5 0.5 0.5 0.5 0.5 0.5 0.5 
##$TPOFFS= (0..7)
0 0 0 0 0 0 0 0 
##$TUNHIN= 0
##$TUNHOUT= 0
##$TUNXOUT= 0
##$USERA1= <user>
##$USERA2= <user>
##$USERA3= <user>
##$USERA4= <user>
##$USERA5= <user>
##$V9= 5
##$VALIST= <valist>
##$VCLIST= <CCCCCCCCCCCCCCC>
##$VD= 0
##$VDLIST= <DDDDDDDDDDDDDDD>
##$VPLIST= <PPPPPPPPPPPPPPP>
##$VTLIST= <TTTTTTTTTTTTTTT>
##$WBST= 1024
##$WBSW= 4
##$XGAIN= (0..3)
0 0 0 0 
##$XL= 0
##$YL= 0
##$YMAX_a= 119057378
##$YMIN_a= -59309313
##$ZGOPTNS= <>
##$ZL1= 120
##$ZL2= 120
##$ZL3= 120
##$ZL4= 120
##$ABSF1= 222.646
##$ABSF2= -17.35081
##$ABSG= 5
##$ABSL= 3
##$ALPHA= 0
##$AQORDER= 0
##$ASSFAC= 0
##$ASSFACI= 0
##$ASSFACX= 0
##$ASSWID= 0
##$AUNMP= <proc_1d>
##$AZFE= 0.1
##$AZFW= 0.5
##$BCFW= 0
##$BC_mod= 2
##$BYTORDP= 0
##$COROFFS= 0
##$CY= -3
##$DATMOD= 1
##$DC= 0
##$DFILT= <>
##$DTYPP= 0
##$F1P= 0
##$F2P= 0
##$FCOR= 0.5
##$FTSIZE= 32768
##$FT_mod= 6
##$GAMMA= 0
##$GB= 0
##$INTBC= 1
##$INTSCL= 4.134877e-10
##$ISEN= 128
##$LB= 2
##$LEV0= 0
##$LPBIN= 0
##$MAXI= 10000
##$MC2= 0
##$MEAN= 0
##$ME_mod= 0
##$MI= 0.1934396
##$NCOEF= 0
##$NC_proc= 3
##$NLEV= 6
##$NOISF1= 120.0001
##$NOISF2= 80.00006
##$NSP= 0
##$NTH_PI= 0
##$NZP= 0
##$OFFSET= 222.646
##$PC= 1.4
##$PHC0= -403.6399
##$PHC1= 19.88833
##$PH_mod= 1
##$PKNL= yes
##$PPARMOD= 0
##$PSCAL= 0
##$PSIGN= 0
##$REVERSE= no
##$SF= 50.3227304950709
##$SI= 32768
##$SIGF1= 140
##$SIGF2= 120
##$SINO= 11.81781
##$SIOLD= 32768
##$SREGLST= <13C.CDCl3>
##$SSB= 0
##$STSI= 32768
##$STSR= 0
##$SW_p= 12077.2946859903
##$SYMM= 0
##$S_DEV= 0
##$TDeff= 32768
##$TDoff= 0
##$TI= <>
##$TILT= no
##$TM1= 0
##$TM2= 0
##$TOPLEV= 0
##$USERP1= <user>
##$USERP2= <user>
##$USERP3= <user>
##$USERP4= <user>
##$USERP5= <user>
##$WDW= 1
##$XDIM= 32768
##$YMAX_p= 286313401
##$YMIN_p= -13103509
$$ End of Bruker specific parameters
$$ ---------------------------------
##NTUPLES= NMR SPECTRUM
##VAR_NAME=  FREQUENCY,     SPECTRUM/REAL,   SPECTRUM/IMAG
##SYMBOL=    X,             R,               I
##VAR_TYPE=  INDEPENDENT,   DEPENDENT,       DEPENDENT
##VAR_FORM=  AFFN,          ASDF,            ASDF
##VAR_DIM=   32768,         32768,           32768
##UNITS=     HZ,            ARBITRARY UNITS, ARBITRARY UNITS
##FACTOR=    0.368581032318806, 1,           1
##FIRST=     11204.1544572324, 0,            0
##LAST=      -873.140228757911, 0,           0
##MIN=       -873.140228757911, -13103509,   0
##MAX=       11204.1544572324, 286313401,    0
$$ Real data points
##PAGE= N=1
##DATA TABLE= (X++(R..R)), XYDATA
$$ [...]
11070B29645r5619n5734k4035l611o411k8043l3645p669J0009J5620N2605J14029
11058A67141J10424M5849J48j9123k9703k5095m77L248l6610n4258j1540M0146
11046A90150N1226J5444j3228J0330L3580j2407p8226r7407o0402j6056J0298
11035C3302K2738J7412J1550J6324o072m3133n6519n8728n7751m3391o986L0761
11023a40493L9123K160m6518m6601l2364k4081J05o453l8673n0403O73R1510J39340
11010a12675R4112J0571m1401o2508n0392n674K8694N4593P2498Q0305Q5797P4167
10998B28087M3035n000n9830q7634n2702J0041L1972l403n6450r5307q6995l0126
10986a64312K6552M0985K2824P081J0365J1075j106N359N5222J05972J03660L9832
$$ y = [229645, 134026, 78292, 54257, 50646, 44235, 16192, -17453, -25122, -15113, 507, 53112, 167141, 277565, 323414, 323562, 304439, 274736, 249641, 249164, 252412, 215802, 161544, 150004, 190150, 241376, 256820, 243592, 253922, 287502, 275095, 196869, 99462, 39060, 23004, 33302, 56040, 73452, 85002, 101326, 95254, 52121, -4398, -63126, -120877, -164268, -171254, -140493, -101370, -99210, -145728, -192329, -224693, -248774, -248669, -255122, -293795, -344198, -343525, -252015, -112675, -18563, -7992, -49393, -111901, -162293, -167967, -139273, -84680, -12182, 68123, 153920, 228087, 271122, 266122, 206292, 118658, 65956, 75997, 107969, 104566, 48116, -47191, -134186, -164312, -137760, -96775, -73951, -66870, -56505, -45430, -46536, -41177, 14045, 120017, 223677, 263509]
10974B63509l4087m5118r938J3289l19m3112q2722q4083m4138k1972k6739j1351
10962a26781L5753P7163Q4188N4354M516j3187o79J9016L2661L4630k166o1885
10950A37583r3629r8603m9601L2185O8747N2132p048r8200j46835j26323q4729
10939d14321k5939M1018Q4603Q9779O2770K2244J513P25N126J381q070K820J4007
10926a22344l77k5664n5679p5617p3244n3757k1224L012K7341N9099N0807j4676
10914c02323o1744l2608J317j2995l5433k1539K2409N8408P3773N9699K8579Q182
10902b14275j1626j2588P335K2879L2241L2282L0239K6807J3756J1481J4598k0286
10890f7157p0306p9818m3922j4987j0721N354N5624R7027J10025J21177R5547
$$ y = [263509, 229422, 184304, 174366, 187655, 187336, 144224, 61502, -22581, -66719, -88691, -115430, -126781, -91028, -13865, 70323, 124677, 129193, 116006, 115327, 134343, 167004, 201634, 199468, 137583, 43954, -54649, -104250, -72065, -3318, 48814, 41766, -56434, -203269, -329592, -414321, -440260, -399242, -314639, -224860, -162090, -139846, -138333, -137608, -132482, -131101, -139171, -136351, -122344, -122721, -148385, -204064, -279681, -352925, -406682, -427906, -424894, -397553, -338454, -287647, -302323, -364067, -396675, -395358, -408353, -443786, -465325, -442916, -384508, -310735, -251036, -222457, -214275, -225901, -238489, -231154, -208275, -176034, -143752, -113513, -86706, -72950, -61469, -46871, -67157, -137463, -217281, -261203, -276190, -286911, -281557, -225933, -128906, -18881, 102296, 197843]
10879A97843K5024k3360k6879q408j3195o2600j15343j31356q2782K486M8614
10868a89956L2959j2464l1619j4376R639n616l6465m3322k0954P326M0183O3425
10856b01240N9280N2328N1446M3210k601o5057q4037n2724M523M5320N1264M8395
10844d9893N0609N6626N7255M0541R530j2470l0924l8902k160K9224k401m2490
10832F4545j9840K8695K2597k5778q9536j36888j11080m0072l685M558R076R275
10820b88133J6456L7220M7100N7866Q5330R3646O4844M0242K8910p702o6150r1694
10808A7935o2077j9329O831K7617N4471N1348N91l4462l2880o2126j14909j19980
10796b86970q2717l9914j2779p249q295P045P0308J41081J34711N1370k8788l3820
$$ y = [197843, 222867, 199507, 172628, 164220, 151025, 88425, -26918, -158274, -241056, -238570, -189956, -156997, -169461, -201080, -215456, -205817, -211433, -247898, -291220, -312174, -304848, -264665, -201240, -141960, -89632, -38186, 5024, 2423, -62634, -146671, -199395, -194872, -149552, -98288, -49893, 716, 57342, 114597, 155138, 164668, 152198, 121274, 82372, 80212, 109436, 107035, 64545, 44705, 73400, 95997, 70219, -19317, -156205, -267285, -307357, -311042, -306484, -297408, -288133, -271677, -234457, -187357, -129491, -44161, 49485, 114329, 154571, 183481, 175779, 109629, 17935, -44142, -63471, -56640, -29023, 25448, 76796, 77387, 42925, 10045, -52081, -166990, -286970, -369687, -409601, -422380, -429629, -437924, -430879, -360571, -219490, -84779, -33409, -62197, -96017]
10784i6017O032L8726M6951K3305N326P719j0959n2318m1965L1067R4656J09922
10772A62445O6146j2424r9523j61921j65129j20107n8724k5898j6668J479M3176
10761c87148Q9608J12022J23814J14297P9358O5664Q2404R1015N4157k3758q5165
10750C16268r9940q6257m7683j7567k4525m2041m9113j4715N5424R4000O8070
10739A51921R399m6905o8702k6542M6276R0411Q0165L7091K0478R371m0873p4931
10727A87159p1324n3380k4601k244O680K4471N4480O5184P0647O5545L9278j499
10715C60396l8958m5317k5253p021j7213l9560m9535k9907J0689M1719M7925L1716
10703B39681J2251L865J8764M4949N3666P0674R2716Q6621M9608k0372o7147m4809
$$ y = [-96017, -89985, -51259, -4308, 18997, 24323, 32042, 21083, -31235, -73200, -42133, 52523, 162445, 228591, 216167, 116644, -45277, -210406, -330513, -389237, -415135, -431803, -430324, -387148, -297540, -185518, -61704, 52593, 131951, 197615, 280019, 371034, 425191, 401433, 316268, 216328, 130071, 82388, 64821, 40296, -1745, -50858, -65573, -10149, 83851, 151921, 161320, 114415, 45713, 19171, 65447, 155858, 236023, 273114, 293592, 302963, 262090, 187159, 115835, 62455, 37854, 35610, 42290, 66761, 121241, 186425, 257072, 322617, 361895, 360396, 321438, 276121, 250868, 243847, 226634, 187074, 137539, 107632, 118321, 160040, 207965, 239681, 251932, 255797, 274561, 319510, 373176, 443850, 536566, 623187, 672795, 652423, 585276, 540467]
10691E40467j5902k4653n4128n7125j2674L9947N8430M5886Q137m2848o7838o9845
10679C47854p2332o6932n1511k8891r259K938O834J29j6781l1652m9854o6814
10667c6271m0382k515P541O146o642l4857m8850l4820l2864n9382p9799o1146
10655d23841n308O1914J15013J20997R2052P0037M6247J4518j2432m7948r6360
10644f5111j00712m0374O700O566P578K4213L0153J1685Q499J7930J831j2055
10632a03097r757J3293O2535J12342J29096J04349N8585M2968K9641J465l5955
10621D05465o5762o0274m9096o7133q2561o9170l4341K528N989k6268n6211p8732
10609a75566r3677q0634n2244l3992m784O4745J18516J18697J02312Q7506N4440
$$ y = [540467, 524565, 499912, 445784, 388659, 375985, 415932, 474362, 520248, 528385, 485537, 417699, 347854, 275522, 208590, 157079, 128188, 118929, 121867, 128701, 128830, 112049, 80397, 30543, -36271, -76653, -79168, -71627, -65481, -72123, -106980, -155830, -190650, -223514, -282896, -362695, -423841, -429149, -367235, -252222, -131225, -39173, 30864, 77111, 91629, 79197, 31249, -65111, -165823, -206197, -199497, -192931, -185353, -161140, -130987, -119302, -110803, -92873, -91042, -103097, -112854, -99561, -37026, 75316, 204412, 308761, 367346, 410314, 439955, 441420, 405465, 339703, 279429, 230333, 163200, 80639, 11469, -22872, -20344, -14355, -40623, -96834, -175566, -269243, -349877, -402121, -436113, -440897, -376152, -257636, -138939, -36627, 50879, 105319]
10598A05319J0560m6537j06481j30279p8302k4161j1857j1223l3102m2854o953
10587c75870L0346O1884J15427J40741R0816L2738j3158o4406q6670n3649L431
10576a18370M5895O0357N5539N9691N9357J2452n0560p6595o5980l1478L0155
10565a9537O1307L0889p890j9188n510K2256N1253N6881K9493o128J8167Q9828
10553C01821R8383K8181m4263q1591r3287q1682l2240P913L847l8559p6014o4152
10541g1643l1217j0645J2722N3439R6965J14475R1065L3003l883M661P04l0581
10529B59065n6710o2746n1241l2304j7232l350L2155Q8211J06344N3114k0006
10518B95300o7513m8554n438n066k2718k9069m1742p7211r0306q2913p8935m8509
$$ y = [105319, 115879, 69342, -37139, -167418, -245720, -269881, -281738, -292961, -326063, -368917, -375870, -345524, -283640, -168213, -27472, 63344, 96082, 82924, 18518, -68152, -121801, -118370, -72475, -12118, 43421, 103112, 162469, 174921, 124361, 47766, -18214, -49692, -19537, 41770, 72659, 64769, 45581, 40071, 62327, 113580, 170461, 199954, 193826, 211993, 301821, 400204, 428385, 384122, 302531, 209244, 127562, 95322, 103235, 107082, 68523, -7491, -71643, -102860, -113505, -100783, -47344, 49621, 164096, 255161, 288164, 284281, 288942, 289646, 259065, 202355, 139609, 88368, 56064, 38832, 35482, 67637, 155848, 262192, 315306, 295300, 227787, 179233, 173795, 168729, 146011, 116942, 75200, -2011, -92317, -175230, -254165, -302674]
10506c02674k4188j8160J0982N4237P9373O9353M4441L6608K0368p942j1124o308
10494e5034l557P899J4308r983l3621j060N5496Q1775Q6120O7911K0634k5036
10482B05852m3822m5177m4280k3428o53K506p29j5796k9053j1658J9489K7998
10470D1249Q321J4974M0983M1509L1920N2473R7635J02519L5725m6535j13761
10459C07012j83456k09524j34298j0313P0907R2187P4959N1922N4549O9371N9629
10448B42945J5350m6629p1529n0536l6865o5357r2186p2542o826M5427O1077N8728
10436a8943O432o0637p8550o0536l6904r757K9480R1115J38029J02191K515o7232
10424C7203o7454m6564l8935m6011o8309r2952j19752j10997m2115L1773O3484
$$ y = [-302674, -326862, -345022, -334040, -279803, -200430, -131077, -86636, -50028, -29660, -37602, -48726, -55034, -58591, -50692, -36384, -46367, -79988, -81048, -25552, 56223, 142343, 210254, 230888, 205852, 162030, 116853, 72573, 49145, 48492, 50998, 50269, 34473, 5420, -6238, 13251, 41249, 49570, 64544, 105527, 147036, 178956, 231429, 329064, 431583, 467308, 420773, 307012, 123556, -85968, -220266, -230579, -159672, -67485, 7474, 59396, 113945, 183316, 242945, 258295, 211666, 140137, 89601, 52736, -12621, -104807, -177349, -184175, -138748, -77671, -18943, -12511, -73148, -151698, -212234, -249138, -258895, -229415, -138300, -271, 101920, 104435, 37203, -30251, -76815, -115750, -161761, -230070, -323022, -442774, -553771, -595886, -564113, -500629]
10413e00629M4978R154p516P27J0635J4584M430k5200m2367k3335J9830M6398
10401d48311M3387M4358N3727L5203j388k9733n4806r1570j07052o2422k57J1693
10389f07171j1779j2321L4342P7403Q7940R1082Q0025N0497L7774L3957J7567
10378a20684m534k5688j4925K8331Q2945J09643P5924K8079K2712L6489K6958
10367B45250K1299L3346J8237j8162m0445n4598l9489j1882k0657l6875j7797
10356G8227j3394m2187k8646K0994O2997P1704M9141K9142K9655J6826l6753q1185
10344A56521o9918l0410j6867k5824l6100l3125l2386m6592k2418K4809J1701
10333a20609p0531j43094j37944n4880K9179M5798K0753L1300P5043R5476Q3579
$$ y = [-500629, -455651, -446497, -454013, -453286, -442651, -428067, -423637, -448837, -491204, -514539, -494709, -448311, -404924, -360566, -306839, -271636, -273024, -302757, -357563, -449133, -556185, -618607, -618864, -607171, -618950, -631271, -596929, -519526, -431586, -340504, -260479, -209982, -172208, -138251, -120684, -125218, -150906, -165831, -137500, -54555, 55088, 131012, 159091, 181803, 218292, 245250, 266549, 299895, 318132, 299970, 259525, 204927, 165438, 153556, 132899, 96024, 78227, 64833, 22646, -6000, 14994, 77991, 149695, 198836, 227978, 257633, 274459, 237706, 156521, 86603, 56193, 39326, 13502, -22598, -55723, -88109, -134701, -157119, -132310, -120609, -191140, -334234, -472178, -527058, -497879, -452081, -431328, -400028, -324985, -229509, -145930]
10322a45930O3727M3927J3112p500P335K4825K5738R780k6031m2423k6557k4044
10310h4041j3809J9280J4427j8865k8312m556J0632j1170k9448o819M2620N5486
10298e4575K9633J7992K1474o07k3613k0087j5176k0274l6593n6174p1643o9038
10286b98681l4133N145L7429O0965P2994O3007M2265N2780P4225O8021Q493n6683
10274I5827m5238N109Q051j7029j2956q726m2856o8618n5868o769M7889L3856
10262f7328l2288p8243q9032n7187j0111P103k6641p1880o5267j2749N5284R6168
10250c52171P1072K3532J2479Q130k6464m5281j8365L3016O4828P0479M4362j0154
10238a24537j3545M0601Q5489P3086j610q2736r3872m7806k229L8696M9230J8151
$$ y = [-145930, -82203, -38276, -25164, -32664, -25329, -504, 25234, 35014, 8983, -33440, -59997, -84041, -97850, -78570, -64143, -83008, -111320, -115876, -105244, -116414, -145862, -152681, -110061, -54575, -24942, -6950, 14524, 13917, -9696, -29783, -44959, -65233, -101826, -158000, -229643, -298681, -332814, -327669, -290240, -229275, -156281, -93274, -51009, 1771, 75996, 144017, 152510, 95827, 50589, 55698, 63749, 46720, 33764, 25038, -17818, -86436, -142304, -149073, -101184, -67328, -99616, -177859, -266891, -324078, -334189, -327086, -353727, -425607, -490874, -503623, -448339, -352171, -281099, -257567, -245088, -236958, -263422, -308703, -327068, -294052, -229224, -158745, -114383, -124537, -138082, -97481, -11992, 61094, 59484, -23252, -117124, -164930, -167159, -128463, -79233, -61082]
10226f1082J198J5539J4327k9951q1894p2348J2001R9998J08385L9454m6682r7987
10214i9042o8577O520N2862O2493M3092j269k7161k1737k5271m2663m9362k7465
10202a97580k749p764m0375n0667k4527n516l637l0973l5446J8353O4131O5152
10190b51598M8687K7367J1283J908j1168j2238J2882M0713N1278N8324N7920K1007
10178E6365j1354J390J8426O049l2849o9034p6342n5220k5100j2603l7899n4937
10166b93108j4027M9637R1577R3059M7660j0215m7577o0487l0340K3453M2110
10155a08258P877p0416j04870l0309O8558J02903Q1588M2734J2577R942L1198
10144D3524L9921K4479K3424K6706j1654o8921q1489n7253j9623J1054J0679j1746
$$ y = [-61082, -59884, -44345, -30018, -59969, -141863, -214211, -202210, -102212, 6173, 45627, -1055, -99042, -167619, -161099, -108237, -45744, -2652, -3921, -31082, -52819, -78090, -120753, -170115, -197580, -200329, -208093, -248468, -299135, -323662, -329178, -332815, -363788, -399234, -380881, -316750, -251598, -202911, -175544, -164261, -162353, -173521, -185759, -172877, -132164, -80886, -22562, 35358, 56365, 45011, 46401, 64827, 70876, 38027, -31007, -107349, -162569, -187669, -200272, -238171, -293108, -307135, -257498, -165921, -72862, -25202, -35417, -82994, -143481, -173821, -150368, -108258, -100381, -170797, -275667, -305976, -237418, -134515, -52927, -10193, 2384, 12326, 43524, 83445, 107924, 131348, 158054, 146400, 77479, -4010, -61263, -80886, -69832, -59153, -70899]
10132g0899l4353l1246q941j2267k4877j1643M015K2249M9636M2250L975j3763
10120h5864J3226O5127R3067P4039J2878o8991j30166j07227k3051O2914J44340
10109E0292J87731J55997N6064m5993j04180j21612j14057r3928n6950k4699k3333
10098a34668k2259o734n913j2356J437J8594L0578M9450N8925M0253j8901r0745
10086i2339j23602q8213j9932K4841L0485J9607J389j9338k4528k901K3494M0044
10074b30993N7638P2273L2138l4798m1359j2217p405j9203j2100K9424P2723R7911
10062D032R1629M6932k3130p3459o7231m3078l8493l9091j7198K3382M8650L2702
10050e4353j6146n8131n8121n1862o0079l0035M7521J18022J47840J03920J6479
$$ y = [-70899, -105252, -136498, -145439, -157706, -182583, -194226, -190211, -167962, -118326, -76076, -72101, -85864, -72638, -7511, 85556, 159595, 172473, 103482, -26684, -133911, -156962, -94048, 50292, 238023, 394020, 450084, 404091, 299911, 178299, 64242, -29686, -86636, -111335, -134668, -156927, -163661, -169574, -181930, -180493, -161899, -131321, -81871, -22946, 17307, -1594, -92339, -215941, -304154, -324086, -299245, -268760, -249153, -247764, -267102, -291630, -294531, -271037, -230993, -173355, -101082, -68944, -103742, -145101, -157318, -164723, -183926, -196026, -166602, -93879, 4032, 95661, 142593, 119463, 46004, -21227, -64305, -102798, -141889, -159087, -135705, -87055, -54353, -70499, -128630, -186751, -238613, -298692, -328727, -281206, -163184, -15344, 88576, 105055]
10039A05055k4854k2803l0523m6096m7613l9817m5429l5010N08Q66k4429m3239
10027b53384l0728J9670N3271M9965K4536L24P533M0254Q1067J16692J19044P2745
10015C00989L857n9056o4339m4713n3958r0054j36831j42234p3376N2611J55219
10004a51885J37695O821j13878j31360p3547l0755k9741j8511J2003M0690P1062
9993b81406P7500Q2378R4962Q5173N0393J6572n87j338m815n6432j19281j26992
9981a83873p6700m021M2694N7507O1006M2422J9599J9902J7593Q816P17o106j8907
9968a9351m4668p4925j03982j14038q9501m9719k7845l4608k9539J1659N8798
9957e17719J09167J56401J56934J27736R0671L7167j1907l4178j2240M0827O0132
$$ y = [105055, 80201, 57398, 26875, -19221, -66834, -106651, -152080, -187090, -186582, -185716, -210145, -253384, -284112, -264442, -211171, -161206, -136670, -136346, -128813, -88559, -7492, 109200, 228244, 300989, 304846, 245790, 181451, 136738, 82780, -7274, -144105, -286339, -359715, -307104, -151885, -14190, -7369, -121247, -252607, -326154, -356909, -386650, -405161, -393158, -352468, -281406, -203906, -121528, -26566, 58607, 109000, 125572, 124985, 123647, 118832, 62400, -56881, -183873, -260573, -264594, -221900, -164393, -103387, -60965, -41366, -21464, -3871, 4945, 5662, -444, -19351, -64019, -138944, -242926, -356964, -446465, -496184, -524029, -558637, -588176, -576517, -517719, -408552, -252151, -95217, 32519, 123190, 160357, 148450, 114272, 102032, 142859, 202991]
9946B02991K2126l5177o4760o8487n4553R59M6555J6025k2293l5612m7426n3601
9934i3253m7555k1742N990O368k4699o0640o8378n5246m7009k2804K0821M7432
9922c60715M5024P1386J42122J80267J69324J33006Q2494K0264m7284q9570j02501
9911B43817q7890o2509o5679p5341p2583o4892m0551p256J2757O494O412L5727
9899a71494P3956Q2186P1404M6015j1836o4475n8893k3060q498k0796m6519p3170
9887b05180p9855l9411O059K9686M5392O5887R3742J10541Q5602M7564J6816j8644
9875A58199l8685l0517k5070l4373k2570j646L724L514N875K1313K2419k0348
9863D1835o7762p7243m6064K000J7080k5885p3467q7054r0880q3375m6963J3117
$$ y = [202991, 225117, 189940, 125180, 56693, 2140, 3099, 49654, 65679, 43386, 7774, -39652, -93253, -140808, -162550, -156560, -150192, -174891, -235531, -303909, -359155, -406164, -428968, -408147, -360715, -315691, -244305, -102183, 78084, 247408, 380414, 462908, 483172, 435888, 346318, 243817, 155927, 93418, 27739, -47602, -120185, -185077, -225628, -232884, -220127, -213633, -207221, -171494, -97538, -15352, 56052, 102067, 90231, 25756, -33137, -56197, -64695, -85491, -132010, -205180, -285035, -324446, -318387, -288701, -243309, -177422, -83680, 26861, 112463, 160027, 176843, 158199, 119514, 88997, 63927, 29554, 6984, 5338, 9062, 12576, 18451, 39764, 62183, 41835, -25927, -103170, -149234, -147234, -130154, -156039, -229506, -316560, -407440, -490815, -537778, -524661]
9851e24661N8770Q3562R6231P9670L4824l334J324K4616O7451J07605R6145N1982
9839A74185m902n2339m9174k6811l0384m7093m6822k9463k0570N30N2628J15852
9827C5637J46626R0911l3402j44645j73458j40783q4829k3907J3759K0877O3m4914
9815c38065p2458n4752j7317K2143O8058J04392J07152Q7240M7880l427m5938
9804i5092q1225r5685p1366m2009k0288K0325M3067K3882k110J1452N5137R8142
9792a55770J00206M6813k315l7157p0946q3390p0436k9173M0661Q0727P1445P1193
9780c8142O7277K0894k7024l5416k5504l0590l4997k1013J4745O3954J01542J17667
9768A73393J18648J08669P1711J7456k8871m5167m1339m1992o2695q7942p7788
$$ y = [-524661, -465891, -382329, -286098, -206428, -171604, -174938, -173614, -148998, -81547, 26058, 122203, 174185, 169283, 116944, 67770, 40959, 10575, -36518, -83340, -112803, -133373, -132843, -80215, 35637, 182263, 273174, 239772, 95127, -78331, -219114, -303943, -327850, -314091, -293214, -293151, -338065, -410523, -465275, -482592, -460449, -392391, -287999, -180847, -93607, -45727, -49154, -95092, -176317, -272002, -343368, -385377, -405665, -385340, -342273, -318391, -320501, -309049, -253912, -155770, -55564, -8751, -11066, -48223, -119169, -202559, -272995, -302168, -261507, -180780, -109335, -38142, 29135, 50029, 23005, -12411, -37915, -68505, -103502, -124515, -109770, -45816, 55726, 173393, 292041, 400710, 472421, 489877, 461006, 415839, 374500, 332508, 269813, 181871, 104083]
9757A04083n1160k0259J514L1173Q2229Q9462K8519m6409j02134j08026m6164
9746c7172K2683K1471j7851o310M0945L3353l1465p9198q4902p0256m8441l6068
9734b93211o5551j13575j16379o5535k3230J309O1147J41969J51602N5796k4358
9723b90016l565N1598P9060P9814N9609J4512k5122l7436j7628L2012O9376Q6098
9711I8312P6721K7239l1290n9940m8601l5001n2572o6434n3137k0798J4437L7648
9699a13416L6065L9942O4217N6976J026o5328p9517m1438K426k078l8795n2228
9687a92148l2283m290L0515N4598L2004j9235m9521j3367P2919J41459J47883
9676A68534R0039R239m6639o0347n2172l1680j1504K967n570l0905l0837l78M6708
$$ y = [104083, 52923, 32664, 34178, 65351, 147580, 237042, 265561, 219152, 117018, 8992, -37172, -14489, 6982, -10869, -17179, 23766, 57119, 25654, -53544, -138446, -208702, -257143, -293211, -358762, -472337, -588716, -654251, -677481, -676172, -615025, -473056, -321454, -265658, -290016, -293581, -241983, -162923, -83109, -23500, -8988, -34110, -71546, -89174, -57162, 12214, 98312, 175033, 202272, 170982, 111042, 62441, 27440, -25132, -91566, -144703, -165501, -151064, -113416, -77351, -37409, 26808, 83784, 84810, 19482, -60035, -101473, -99047, -101125, -139920, -192148, -224431, -228721, -198206, -143608, -111604, -130839, -180360, -193727, -120808, 20651, 168534, 258573, 267812, 221173, 160826, 108654, 76974, 65470, 68437, 62867, 31962, 1125, 747, 47455]
9663D7455Q2946P7668N7200N4664N3274M6735J8078j8159j8806l338j8346m3400
9651C35971l8213j5844l3986p5008o1652J203M5796N1109L7128J7753K5069M7981
9639C37307O7282P3770L3850k7633m1187J0652N1229K5809k7237o7577q9593q1235
9627B65437o4798n2857m2721n4959k6824M5163P8003O4175J7705l2148n3166l9756
9615A03254o047K7613M8774P6190J24605J57297J24886L5699o6571j51253j92697
9604B81750j88491j43666p1937R325O9813Q1737O5876L3195R339J260J1015K6337
9592A85553L840l0064l7846j9962K3293O8542Q6240O3294J6749j3113j7097j3916
9580C15513j9391m4244p7150q0436p1889p8411o8900n2168m5518r469J9900O942
$$ y = [47455, 130401, 208069, 265269, 319933, 373207, 419942, 438020, 419861, 401055, 397717, 379371, 335971, 297758, 281914, 247928, 172920, 111268, 112471, 158267, 209376, 246504, 264257, 289326, 337307, 404589, 478359, 512209, 484576, 443389, 454041, 505270, 531079, 503842, 436265, 346672, 265437, 200639, 147782, 105061, 50102, 23278, 68441, 146444, 210619, 228324, 196176, 143010, 103254, 97207, 124820, 173594, 249784, 374389, 531686, 656572, 692271, 625700, 474447, 281750, 93259, -50407, -122344, -113019, -43206, 38531, 104407, 137602, 146941, 148201, 159216, 185553, 189393, 159329, 121483, 101521, 124814, 193356, 279596, 342890, 359639, 346526, 329429, 315513, 296122, 251878, 174728, 94292, 22403, -56008, -124908, -177076, -222594, -232063, -212163, -205221]
9568b05221m898J6733O6579J06073P3577j4272p1456p9844n1517M950K7170l1020
9556a63146r3873q8204l4461L8278R4757J09404Q0293M7516M8734N7485M2773
9545A39556N621m0572q1162j07324j06116o5042l926K4276L0024M7335N9214N7641
9533d0475L6299j6299n1120n7021n2179j9895J7420L6135O1645P7681N3162J3529
9521E8882j2090l3357n8223o8893o6135m2986J908K5425n508o6561q9173m5624
9509d02335J0004L1858K3609L3656Q7988J43020J39939P6937J4379k7671p1898
9498E9486j03535j14964o1587L4914O4907J8650j6648j145J413l8732o2636l2492
9486b52369K3521N1685N8187R0636J28712J30074Q0659k2932j08773j20054r5377
$$ y = [-205221, -210119, -193386, -126807, -20734, 52843, 38571, -32885, -112729, -164246, -159296, -132126, -163146, -257019, -345223, -379684, -341406, -246649, -137245, -56952, -9436, 39298, 96783, 139556, 145177, 104605, 23443, -83881, -189997, -255039, -258965, -234689, -204665, -157330, -98116, -40475, -4176, -20475, -71595, -128616, -180795, -200690, -183270, -147135, -85490, -7809, 45353, 58882, 46792, 13435, -44788, -113681, -179816, -222802, -220894, -195469, -200977, -267538, -356711, -402335, -392331, -360473, -336864, -303208, -215220, -72200, 67739, 144676, 159055, 131384, 59486, -44049, -159013, -220600, -185686, -120779, -102129, -118777, -119922, -118509, -157241, -219877, -252369, -228848, -177163, -118976, -28340, 100372, 230446, 311105, 288173, 179400, 59346, -36031]
9475c6031p7747n6834n6805n1498l4456m4306m2300L263L6495L0570R010m123
9463c24762M391L1878P8276J14043J14695Q9581M5902L644k3545k7552l377M0058
9451A43232P7857O6379K1609j5428l9557n0196l5854L001M8284P5313N0028j1147
9439C33521o2712q4447q0221n3638k0946k1968l8178k7371k2687l0804r327M7586
9427g1192J05377J11068P7932K7972k6886l5759L1753J22411J48706P1435l7010
9416E25807j09134j25980j03225m0562K8326K1217l4814o9037m4259K7636R8762
9405A74737J32594J17239M7463k4912n9268n5927q964L2635M2994L2530J8138
9394D49259j2773n6893q5172j10224j26287j02655o1512m7520l1473K7157P9675
$$ y = [-36031, -113778, -170612, -227417, -278915, -313371, -357677, -399977, -396714, -360219, -329649, -320639, -324762, -320371, -288493, -210217, -96174, 18521, 108102, 154004, 157648, 134103, 106551, 103174, 143232, 221089, 287468, 309077, 293649, 254092, 203896, 168042, 171043, 219327, 294640, 344668, 333521, 270809, 186362, 106141, 52503, 31557, 9589, -28589, -55960, -78647, -109451, -118778, -71192, 34185, 145253, 223185, 251157, 224271, 188512, 220265, 342676, 491382, 562817, 525807, 416673, 290693, 187468, 146906, 175232, 196449, 161635, 92598, 48339, 75975, 174737, 307331, 424570, 472033, 447121, 387853, 331926, 322962, 355597, 398591, 431121, 449259, 436486, 379593, 294421, 184197, 57910, -44745, -106257, -153777, -185250, -158093, -78418]
9383g8418P4995L1105j8907m6287k4551M978J2450K9682O5017Q0816O9144N1015
9371B51039J1430n0084o3882j5719K8366M2897N1199M2887J0378m7851j13457
9360A47203j17509m2210L6532M9249Q058l5440l8512N071M1761O0896L9769n8482
9348I6386j25881r0814K1255J14112J20162N9553m924r180L0500L8504j5921o7736
9336A66016o9813m6755j8538J880K3593N6852M7753l974k0533j012p613j8554
9324A09302p492J3953L9555N4132N2627K5625k2183n3404n2346l5207k4405P80
9312A00937L1809M1393M0053J2075l8694n2864k7568j9543l6606n8086m7067P536
9300d6625M9677N5601J2799n8352p5784l2437O319K5759M2230M7607P0366J01305
$$ y = [-78418, -3423, 27682, 8775, -37512, -62063, -57085, -44635, -14953, 50064, 130880, 200024, 251039, 262469, 212385, 148503, 132784, 161150, 204047, 255246, 298133, 308511, 260660, 147203, 29694, -12516, 24016, 73265, 81323, 45883, 7371, 12442, 54203, 115099, 154868, 96386, -29495, -120309, -99054, 15058, 135220, 194773, 189849, 180669, 211169, 249673, 233752, 166016, 96203, 49448, 30910, 32790, 56383, 113235, 160988, 157014, 136481, 135469, 127856, 109302, 101810, 115763, 155318, 209450, 262077, 287702, 265519, 212115, 159769, 124562, 100157, 100937, 132746, 174139, 214192, 226267, 187573, 134709, 107141, 87598, 50992, -7094, -54161, -46625, 3052, 58653, 71452, 13100, -62684, -95121, -88802, -63043, -20813, 26794, 97160, 198465]
9288A98465P9544J2919o8988j29936j30720p9856k6764m761N828K0452J5980j1484
9276a19321n8063o6420q972K8032K3268J8723J7728K6507L1540J3908J1878K5528
9264e5664K0526J3897K1625P276q152j1525k3220l7914l5074q023J7350J2199
9252h6699l913r387k672L1841P7886R4845P0706R380o1899j08437j06338n9174
9240a53861R043M4297M0832L4559J3358p34J2820K1108K0428K1489K3029L8099
9228A24467N1506M6403L7304p119o9716p1171l4060j9709l6528m1299k8805k4189
9216g2916k0857l2139n9490o9871n8636m0279l6950l3837L296L9666M7396N0120
9204b84497O3962Q7791J09072R6337N2993J2143j0984l8532n4658n7171n6315
$$ y = [198465, 278009, 290928, 221940, 92004, -38716, -118572, -145336, -150097, -144269, -123817, -107837, -119321, -177384, -243804, -252776, -224744, -201476, -182753, -165025, -138518, -106978, -93070, -81192, -55664, -35138, -21241, 384, 7660, -492, -12017, -35237, -73151, -108225, -116248, -98898, -86699, -90612, -99999, -102671, -70830, 7056, 101901, 172607, 181987, 120088, 11651, -94687, -153861, -144818, -100521, -59689, -25130, -11772, -12506, 314, 21422, 41850, 63339, 86368, 124467, 175973, 222376, 259680, 252561, 182845, 111674, 77614, 57905, 21377, -19922, -48727, -72916, -93773, -125912, -185402, -255273, -313909, -354188, -391138, -424975, -421679, -382013, -334617, -284497, -220535, -132744, -23672, 72665, 125658, 137801, 126817, 88285, 33627, -23544, -79859]
9193g9859l3491J9602P4776P2606K5117p581r531p82K1051L7881J1312n7576j26758
9180e3233j51817j28319q3074j4635P2637J24360Q1842q443n9997n1660n570L3311
9168b44598N1960N0074L3772J4742N189J3699L4725O1504P5522O7664M1794q826
9156A97221p0278r3272o6567m1738j8479L5647Q8767R0955M0478P88j1593L02
9144A52231K6994L8941L6145M8643Q5572J21909J05873K4356m5963p8896r8161
9133D17644q2345k0616K2621K4082K1023K5975K3383j4615o4428q2096m7800K4931
9121B47759O7793M2825N950J265l783l3390o1836q3579j14530j16646o4550R93
9109a11729O4458J11582Q2432L01o6294p5627l0032J5175K5867J5638p043k8986
$$ y = [-79859, -113350, -93748, -18972, 53634, 78751, 71170, 61639, 60857, 81908, 119789, 131101, 73525, -53233, -205050, -333369, -416443, -431078, -358441, -234081, -152239, -160682, -220679, -272339, -277909, -244598, -192638, -142564, -108792, -94050, -88861, -75162, -40437, 21067, 96589, 164253, 206047, 197221, 126943, 33671, -32896, -74634, -93113, -57466, 31301, 122256, 162734, 163522, 151929, 152231, 179225, 218166, 254311, 302954, 388526, 510435, 616308, 640664, 594701, 515805, 417644, 335299, 314683, 337304, 361386, 382409, 408384, 431767, 417152, 352724, 270628, 222828, 247759, 315552, 358377, 364327, 365592, 361809, 328419, 266583, 183004, 68474, -48172, -112722, -111729, -47271, 64311, 146743, 147044, 80750, 5123, -24909, -9734, 16133, 31771, 24728, -4258]
9097d258l3727j7233l676j6135l7318n8164n4173k683M9483O4377O9848N7437
9085A3778J5152k9196l0923J786R697L791L265p217J428M9562P4664N0015K4423
9072A80225N060l1627n6065n8714n6914o1123p5067p8585m3344J1270M8897N5997
9060a59990L1629M551O022J7555J9793K3792L2364M3442O7482J00061P8643O993
9048B72337o3540j10302q8239o723O9157J04580R6632M5571k5184n0020k4479
9037B19790K316M036j1033l7607o7302o9607l2642k0002m3070l8053J2956O8639
9025a1579J00648J13033Q2493J4828n2699r3859r0711n3324j3168J219k3066p3558
9013i9743j08309j03938o5768k5253l7216p6851p2567j2306L8002M3754M5305
$$ y = [-4258, -37985, -55218, -58894, -75029, -112347, -170511, -224684, -227367, -177884, -113507, -43659, 13778, 28930, -266, -31189, -29403, -19706, -15915, -12650, -19867, -18439, 31123, 105787, 155802, 180225, 185285, 153658, 97593, 38879, -18035, -79158, -154225, -232810, -276154, -264884, -215987, -159990, -128361, -123810, -117788, -100233, -80440, -56648, -24284, 19158, 86640, 186701, 265344, 272337, 208797, 98495, 10256, 3533, 72690, 177270, 273902, 319473, 294289, 244269, 219790, 222106, 226142, 215109, 177502, 110200, 40593, 7951, -12051, -55121, -93174, -80218, -11579, 89069, 202102, 284595, 299423, 246724, 152865, 62154, 8830, -4338, -3119, -26185, -99743, -208052, -311990, -377758, -403011, -440227, -517078, -589645, -601951, -563949, -520195, -474890]
9002d74890L4522J5951K0467L4342N0319O1033N2653M1927L9517N3232Q5881Q3754
8990I8708K8001m5215q1449o5112l6878j405N3994P2923J6777o3210r7259p7663
8978a97788l1087J8660N9085J01607J26958J04391N6223L165m2268l6334M238
8967A66850J2967J7483L5099K3972j1777l6971o0174j01279j19089r2783m7021
8956b12723q229J5163K3078J3010J3270L8025L8047O271k6606m4457k5770K2809
8944a48112N5915N4466L9072K2367J0570l729l8285m7163L477N7148P1739O2357
8932A39822K2286k1919j4111P179J055l5684o2000m3272j9237J306K9241M1645
8920D6311J7049k6842n3087n0580m5336l6608j3211L956r808j3151K5088N2182
$$ y = [-474890, -440368, -424417, -403950, -369608, -319289, -258256, -205603, -163676, -124159, -70927, 14954, 98708, 126709, 81494, 45, -65067, -101945, -103350, -49356, 23567, 40344, -22866, -120125, -197788, -228875, -210215, -151130, -49523, 77435, 181826, 238049, 241214, 198946, 162612, 166850, 179817, 197300, 232399, 256371, 244594, 207623, 147449, 46170, -72919, -165702, -212723, -220952, -205789, -182711, -169701, -156431, -118406, -80359, -74088, -100694, -145151, -170921, -148112, -92197, -37731, 1341, 23708, 34278, 30549, -7736, -54899, -51422, 5726, 77465, 139822, 162108, 140189, 126078, 133257, 134312, 98628, 36628, -6644, -25881, -24575, 4666, 46311, 63360, 36518, -16569, -67149, -112485, -149093, -162304, -158348, -168156, -181307, -156219, -104037]
8908a04037M0253J4193j0116L467O5469J09898Q1561N354m7680l8756J1713M8001
8896A79320N7139N3255J5499m9756q5218o5823k9312j6859m111J5988O072k9459
8884D6735m4816k6283j0067j2395k8984k2333P070k0080q2619r5488m0234L5307
8872b94187P8669O4906m101q2085r8754p5317p4331p6158o2161l1725Q113Q2693
8860e64438J57771J55290Q3611j3614j02433j25173o9075k4027l0232n3358p8996
8849f64674r9949j02716n2939L3675Q5068J00665J40518J74599J55770R2978K5231
8838a11774j4668l3098l8494l1363j5634l839j919q476o836o231J2703N5120O7868
8825a36641M4733J9080j2026k1131k4171l8764k7411J3933M5153M1195J2232k4628
$$ y = [-104037, -63784, -49591, -59707, -56240, 9229, 119127, 200688, 206042, 158362, 119606, 131319, 179320, 236459, 289714, 305213, 255457, 170239, 104416, 75104, 58245, 54134, 70122, 76194, 46735, 1919, -24364, -34431, -46826, -75810, -98143, -91073, -111153, -193772, -289260, -329494, -294187, -215518, -150612, -154713, -236798, -335552, -410869, -485200, -561358, -623519, -655244, -647131, -564438, -406667, -251377, -167766, -181380, -283813, -408986, -478061, -502088, -532320, -585678, -664674, -764623, -867339, -920278, -886603, -801535, -700870, -560352, -385753, -229983, -137005, -111774, -126442, -159540, -198034, -229397, -245031, -248870, -250789, -259265, -266101, -272332, -259629, -204509, -136641, -91908, -72828, -84854, -105985, -130156, -168920, -196331, -182398, -137245, -96050, -83818, -108446]
8813a08446l1740j1068N662L49l1834n2157l6849j9145j9630k9286j8388K7604
8801c24928M7989J8726k3508n3855m3313Q355M8148N4610L8050K2789K3477J5695
8789a67765o125j9451n0006j17794j43448q3917O06N1662O2486L7717O251n922
8777d35706Q787K9552L7285L2932K6882K7870L1027K8667N5615R8945J15902J01586
8765A59344N4672J713j7121K004K9027O6531Q2994M9271j1702o9946j08177j28182
8753A10428j21068r2000o3873m4079k9329Q243M9650M4168j0052m9328m8721l7475
8741b83436l9790l7275k9737n0032n0429q139K5894N8635J08748J35255J20880
8730d9426P9698K3405k8733o3818o9494l4425J3160J1749k4315j3382K1737K2929
$$ y = [-108446, -140186, -151254, -145592, -145243, -177077, -229234, -266083, -285228, -304858, -334144, -352532, -324928, -276939, -258213, -281721, -335576, -378889, -370534, -322386, -267776, -229726, -206937, -183460, -167765, -173890, -193341, -243347, -361141, -504589, -588506, -587900, -536238, -473752, -436035, -429784, -435706, -426919, -397367, -360082, -327150, -300268, -272398, -241371, -212704, -157089, -58144, 57758, 159344, 214016, 215729, 198608, 200612, 229639, 296170, 379164, 428435, 416733, 346787, 238610, 110428, -10640, -102640, -166513, -210592, -239921, -231678, -182028, -137860, -147912, -197240, -245961, -283436, -323226, -360501, -390238, -440270, -490699, -498838, -472944, -414309, -305561, -170306, -49426, 30272, 53677, 24944, -38874, -108368, -142793, -129633, -117884, -142199, -155581, -133844, -110915]
8718a10915O401J3341J9117k261q560K6716N0499K6521J2129M7652O0022J0562
8706A51224j2542O752J6825k680l6761l8861j64M2719M5323k084m2244n0202k8375
8693D8930K847J5362J1021J6122J9246Q902N129J1515J8202K73k7173j0936J0496
8680A29936o665k2843l2663l7956p518M6642O8379M5042J9241R940K197p01j0848
8667B02183k7887n7551o5394k1361J0571k0740p5248r1022q0749r4623j37162
8656d58983j60337j06972j076Q1599R4262O3596L6659L9317P6311J00516O2869
8645a72239Q09o920O0443J21414R0568K7830J7941K2610k3073p5217p1703l5024
8633d2561j221K5669K9169j0574n6537n9513k7473k724m85k3422m6925l8135j6380
$$ y = [-110915, -104514, -91173, -72056, -74317, -82877, -56161, -5662, 20859, 32988, 80640, 140662, 151224, 138682, 145434, 162259, 159579, 122818, 83957, 83793, 126512, 171835, 169751, 127507, 77305, 48930, 51777, 67139, 78160, 94282, 113528, 122430, 127559, 139074, 157276, 157549, 130376, 119440, 129936, 123271, 100428, 67765, 29809, 22291, 68933, 137312, 182354, 201595, 211535, 213732, 213031, 202183, 174296, 116745, 51351, 29990, 40561, 19821, -55427, -146449, -227198, -321821, -458983, -619320, -726292, -727368, -645769, -551507, -487911, -451252, -411935, -335624, -235108, -172239, -171430, -178350, -117907, 3507, 94075, 121905, 139846, 162456, 139383, 64166, -7537, -42561, -43782, -18113, 11056, 482, -56055, -115568, -143041, -145765, -146250, -169672, -216597, -254732, -271112]
8620b71112R218L0543L4260J7324k0390m9108l5268j9825k2956L644K8769J7973
8608b76928N604q980k8980j2442O295q973m71M3514O5707N7607L9522J5809r916
8595a12632l2226l0313J519K6363J4665M220N1041J03762R4360M9707J2676j62
8583A82980N440N169j1101j0781J8580O1272R3668R8589P9982M7335J6628j8079
8571E69682p0635r5577o3767j9516J6709L5153L1678K2418J4178J0839K0076L536
8559D74774l0057k4978j3613l2187m0239K112Q1172J30071J24097Q2245J9969
8548G73366k1592m5998p2278q5455q1115o8120m7004k4353k8731p0337j13544
8537A14839r6878l1984J5127J8327j2613o3511r2631o6071j1222L4719O4570P8458
$$ y = [-271112, -261894, -231351, -197091, -179767, -200157, -249265, -284533, -304358, -327314, -323670, -294901, -276928, -271324, -280304, -309284, -321726, -315431, -324404, -324875, -281361, -215654, -158047, -118525, -102716, -112632, -144858, -175171, -173652, -147289, -132624, -128404, -77363, 26399, 120759, 170466, 183142, 182980, 188420, 193589, 182488, 171707, 190287, 251559, 345227, 443816, 523798, 571133, 587761, 569682, 499047, 403470, 339703, 320187, 336896, 372049, 403727, 426145, 440323, 451162, 471238, 474774, 444717, 419739, 406126, 373939, 333700, 335812, 416984, 547055, 671152, 753397, 773366, 751774, 705776, 633498, 548043, 466928, 398808, 351804, 327451, 298720, 228383, 114839, 17961, -14023, 1104, 19431, 6818, -56693, -149324, -215395, -226617, -191898, -127328, -48870]
8525d8870O4209N1839M5708L9162K5586J2701L3628M7214K0991n486l2525p2449
8513A81708q8292l6185M0638O2112J9937j8270k4558q913n641m1141p8346o1243
8501e8194j4567J9789K2792J629q561j0059j8438j2325R003L0515K7088q729l4612
8488e4669k7377k74M7032P4716J7630n6775o8962m3501l3163j1894J8204L3161
8476a05872M8803M6372L5508K6735J4261L388j7136m3306m9059l3513k5266j3073
8464a12158m646k826K9373O4850O1560N0650N4509N0838J2070l7944o8305n2779
8452D5192J3411N6317K6541l7435p1682p0992k8420L1467P1071Q8926O8471J1331
8440B04198l9199l5625j0493L237K2891N0361O3375M8331N393l9785o2509o1432
$$ y = [-48870, 15339, 67178, 112886, 152048, 177634, 190335, 223963, 271177, 292168, 286682, 254157, 181708, 93416, 57231, 97869, 159981, 179918, 161648, 137090, 128177, 122536, 81395, 3049, -58194, -72761, -52972, -30180, -28551, -37112, -47171, -65609, -77934, -68931, -38416, -11328, -20057, -54669, -82046, -82320, -35288, 39428, 57058, 283, -68679, -112180, -145343, -157237, -139033, -105872, -57069, -10697, 24811, 51546, 65807, 69195, 52059, 8753, -40306, -73819, -99085, -112158, -116804, -119630, -90257, -25407, 36153, 86803, 141312, 192150, 204220, 166276, 97971, 45192, 58603, 114920, 141461, 104026, 32344, -38648, -67068, -35601, 35470, 124396, 192867, 204198, 164999, 129374, 118881, 122118, 145009, 195370, 258745, 307076, 312469, 272684, 210175, 148743]
8428A48743m6452k9624m3224q4748j11936p1006N900M7479O1682Q5197J03386
8417F5397O6837j3093n2780j0241M1161L6482R666K3567O4414P5278M2898q802
8405C40784p6017j32176j40451j10727p1347k6164L6537Q4118J04218R0271M5826
8394A44872K2201K8294L0647K2321K3121J4612k1440m4672m5324m4427n7174q6405
8382a3374j03560o0760K8538Q6492J06676J12911R3737O1030L7035K6p4035j41329
8370A33387j55623j20871n6127j274k852n0215p3724n9524k4189J9178M1585M0704
8358c09545L3316K7339J2615j0011l5331l8304K44K4821J0891J1809N9266J05859
8346a07031R6743N9511M3833N2983O0003O6829P2721O4201N6433K7684l5558r3060
$$ y = [148743, 102291, 72667, 29443, -55305, -167241, -238247, -232347, -184868, -123186, -37989, 65397, 132234, 119141, 66361, 56120, 97281, 133763, 143429, 166996, 231410, 306688, 349586, 340784, 264767, 132591, -7860, -118587, -189934, -216098, -179561, -95443, 8775, 99046, 144872, 167073, 195367, 226014, 248335, 271456, 286068, 264628, 219956, 174632, 130205, 73031, -13374, -116934, -177694, -149156, -62664, 44012, 156923, 250660, 311690, 348725, 348751, 274716, 133387, -22236, -143107, -199234, -200508, -203360, -253575, -327299, -386823, -411012, -391834, -350249, -309545, -276229, -248890, -236275, -246286, -281617, -319921, -319677, -294856, -283965, -272156, -212890, -107031, -10288, 49223, 93056, 146039, 206042, 272871, 345592, 409793, 466226, 493910, 458352, 365292]
8334C65292j03169p3519n4337o8177q0725m6281k493k5752p7846p4935l0981J2521
8322b60402M7830O3753M4036J8307K6200M2382N4494O8130M0997k3237m9474q944
8310F4072L3112K6389M0098P7245P3576O0265M9593j3957p5866n0232M506J4496
8298C03297j0620o1882j27806j01495J6247N8408J4990k15K7221M5844N2365O2094
8286B78448O0610M5508L4874L5058J5492l1151n3935m0832Q889P9819J04373L7830
8274E74983m9635q1061o9750p3029r9314j36208j24305o074J13798J26489P3829
8263B49723L3284K803k2974k8054l9850l7876P292L5527K7214K0871K9288K0544
8251B97792j3011j2198L9772O4288L3323j5316m1551m0862k9272Q3K2521j4015
$$ y = [365292, 262123, 188604, 134267, 66090, -14635, -60916, -63409, -89161, -167007, -241942, -272923, -260402, -212572, -148819, -104783, -86476, -60276, -17894, 36600, 104730, 145727, 122490, 73016, 64072, 97184, 123573, 163671, 240916, 314492, 374757, 424350, 410393, 334527, 284295, 288801, 303297, 292677, 230795, 102989, 1494, 17741, 76149, 91139, 90924, 118145, 163989, 216354, 278448, 339058, 384566, 419440, 454498, 469990, 438839, 384904, 344072, 352961, 432780, 537153, 574983, 525348, 444287, 374537, 301508, 202194, 65986, -58319, -64393, 49405, 175894, 249723, 283007, 285810, 262836, 234782, 194932, 157056, 164348, 199875, 227089, 247960, 277248, 297792, 284781, 272583, 312355, 376643, 409966, 394650, 353099, 312237, 282965, 283048, 305569, 291554]
8239B91554o7983o4777j2306M0138O4026N7601L3540K3976L4340N4574O2044L8304
8227E55031n776j6448k964j970O364J5940J9319K5445M103n9466r9881o8751N634
8214C76580N3144N7963P6013J05411R7037N8018L3561L9241M4751K4988k2799
8203I43908m9511n5907o5387l8319R206K1955J1135m342j4623J929K8096K7821
8191H15961K2457K6565J6401j8865o4500j07005r6122j8013P5645J18639R6722
8180H67885N2782K5973L0398P0393J11695J05631O9085M4943L1797k2247r5323
8169A293012j10431p4510m9422m0427q396M1239O1211L0027k8421p0572n9065
8158I84245j5703M773L436J1449M3951P8662Q2401N5822L1251J9608r20l1659
$$ y = [291554, 223571, 158794, 146488, 186626, 250652, 308253, 341793, 365769, 400109, 454683, 516727, 555031, 549255, 532807, 529843, 527873, 534237, 550177, 569496, 594941, 599044, 539578, 439697, 370946, 376580, 429724, 487687, 563700, 669111, 766148, 824166, 857727, 896968, 941719, 966707, 943908, 894397, 838490, 773103, 734784, 743990, 765945, 777080, 772738, 758115, 760044, 788140, 815961, 838418, 864983, 881384, 862519, 798019, 691014, 594892, 576879, 652524, 771163, 867885, 920667, 946640, 977038, 1047431, 1159126, 1264757, 1333842, 1378785, 1410582, 1388335, 1293012, 1182581, 1108071, 1058649, 1018222, 1009826, 1051065, 1112276, 1142303, 1113882, 1043310, 984245, 968542, 973315, 976751, 988200, 1032151, 1110813, 1193214, 1249036, 1280287, 1299895, 1298975, 1267316]
8146A267316n6339o5411m8025k5781q229O477n560k0462l5915n2860k6779L2722
8134I61154O0905L5044j576m344J0624k15m0651p8983p8884n4551k0230J8856
8122H07149N9194Q9757Q4811N7681K3147j7004m0773l2258O651L6857K0427O191
8110A101830M6832Q9750P2027J1530k3634j5080J900J6448L3008M4735M1436L0011
8098A450793L8388L8536k1239q3650o1697p729k009l3593o3394o4685n7619m8708
8086A083394j2741N8517J29194J53605J18908M8049j2990l5901l0779L082L5748
8075A538086M5877M0093L0954M6611M5633J1526j189K9435M1337M630l5930j6585
8063A780478N1702J03257O6609r840k2089K064j531j9730j0784L3130P6150N5398
$$ y = [1267316, 1210977, 1145566, 1097541, 1071760, 1063531, 1070008, 1064448, 1043986, 1008071, 955211, 928432, 961154, 1022059, 1057103, 1055527, 1051183, 1061807, 1061592, 1020941, 941958, 863074, 808523, 788293, 807149, 866343, 956100, 1040911, 1098592, 1121739, 1104735, 1063962, 1031704, 1038355, 1075212, 1095639, 1101830, 1148662, 1238412, 1310439, 1321969, 1298335, 1283255, 1285155, 1301603, 1334611, 1379346, 1420782, 1450793, 1489181, 1527717, 1506478, 1422828, 1361131, 1353402, 1351393, 1317800, 1254406, 1189721, 1132102, 1083394, 1070653, 1129170, 1258364, 1411969, 1530877, 1578926, 1565936, 1530035, 1499256, 1502338, 1538086, 1583963, 1624056, 1655010, 1701621, 1747254, 1758780, 1757591, 1787026, 1828363, 1832993, 1797063, 1780478, 1832180, 1935437, 2002046, 1992206, 1970117, 1972181, 1970650, 1950920, 1940136, 1973266, 2049416, 2104814]
8051B104814j9900o9648m8363J4147P2240R9783J06447R1316L5905q733j5858
8040B362150o125m901k3888k6766k5768o1623r5283j02980r8523m8754M1086J21896
8028B030521J48469J41656J37532J29949J20852J07252O3375k221n3828m2161
8018B781396K4745P3331R1716R7364Q8097P1167Q5581J39189J56236J21152Q2301
8007C812275O6146O4902O3821O7128N3511K1788K0168O1201J24022J78898K21542
7996D755402K61227K91201L25170L59076L71797M08634N00650O07013P08471Q31603
7986I420244R86823J155857J344023J596260J954414K366048K754733L111426
7978B4689828L407894L595565L598826L267542K535133J452123J16204j237721
$$ y = [2104814, 2084914, 2015266, 1966903, 1981050, 2053290, 2153073, 2259520, 2350836, 2386741, 2378008, 2362150, 2356025, 2351124, 2327236, 2300470, 2274702, 2213079, 2117796, 2014816, 1916293, 1867539, 1908625, 2030521, 2178990, 2320646, 2458178, 2588127, 2708979, 2816231, 2879606, 2877385, 2823557, 2781396, 2806141, 2879472, 2971188, 3068552, 3156649, 3227816, 3313397, 3452586, 3608822, 3729974, 3812275, 3878421, 3943323, 4007144, 4074272, 4127783, 4149571, 4169739, 4230940, 4354962, 4533860, 4755402, 5016629, 5307830, 5633000, 5992076, 6363873, 6772507, 7273157, 7880170, 8588641, 9420244, 10407067, 11562924, 12906947, 14503207, 16457621, 18823669, 21578402, 24689828, 28097722, 31693287, 35292113, 38559655, 41094788, 42546911, 42663115, 41425394]
7970D1425394k362448l125546l481015l450323l164800k781749k381508j981034
7962A8696971j607568j289585j045422q64270o88891n03615l24461j44855N082
7953A2233386P5396O9814J9409p1021j71789k18125j84815j08858m6285j0549
7943A1586563L1730J34309K65944L88203M85158N41603O02474P25101R15050J163501
7933A6839636J434139J693296J969958K359675K882460L453637M069862M832274
7925C9534937N764148O833905Q029802R298649J0454994J1208029J1219953J0162178
7917A12506595P838829M368186K36041l879478p319499r644292j0759803j0821457
7909H2525122j0112188q964737p660434o397600n300462m382145l557205k819149
$$ y = [41425394, 39062946, 35937400, 32456385, 29006062, 25841262, 23059513, 20678005, 18696971, 17089403, 15799818, 14754396, 13890126, 13201235, 12697620, 12373159, 12228304, 12233386, 12308782, 12378596, 12398005, 12326984, 12155195, 11937070, 11752255, 11643397, 11597112, 11586563, 11618293, 11752602, 12018546, 12406749, 12891907, 13433510, 14035984, 14761085, 15676135, 16839636, 18273775, 19967071, 21937029, 24296704, 27179164, 30632801, 34702663, 39534937, 45299085, 52132990, 60162792, 69461441, 79916435, 91124464, 102344417, 112506595, 120345424, 124713610, 124949651, 121070173, 113750674, 104106382, 93346579, 82525122, 72412934, 63448197, 55787763, 49390163, 44089701, 39707556, 36150351, 33331202]
7901C3331202k202359j686356j276585r61424p05696n37017m81593m98885n28067
7892B4453220n47972n51198n18844m23711k57820n4818J40485L27599N19207P06181
7882B3792329Q76451J048200J249965J496016J803476K206698K703402L280207
7874C8456744L941636M690204N567101O632301P914965R443888J1276874J3443199
7866A01366912J5875322J8398673K0697877K2206131K2166775J9952327J5259496
7859B35923513Q317389M2564q219753j5145333j9815401k1925177k1812907k0232588
7851A37132307j7917011j5360194j2874771j0637792q725465p127709n815264
7844E8674101m750825l860161l101535k464031j935474j544613j314345j226077
$$ y = [33331202, 31128843, 29442487, 28165902, 27204478, 26498782, 25961765, 25480172, 24981287, 24453220, 23905248, 23354050, 22835206, 22411495, 22153675, 22098857, 22239342, 22566941, 23086148, 23792329, 24668780, 25716980, 26966945, 28462961, 30266437, 32473135, 35176537, 38456744, 42398380, 47088584, 52655685, 59287986, 67202951, 76646839, 87923713, 101366912, 117242234, 135640907, 156338784, 178544915, 200711690, 220664017, 235923513, 244240902, 244283466, 236063713, 220918380, 201102979, 179177802, 157364895, 137132307, 119215296, 103855102, 90980331, 80342539, 71617074, 64489365, 58674101, 53923276, 50063115, 46961580, 44497549, 42562075, 41017462, 39703117, 38477040]
7836C8477040j252315j314858j336457j284709j132244r19249o76448m04650j21901
7827C0034209J33970L73419O57503R87214J311602J630602K008063K471989L018975
7818D2627546L668626M465224N422476O505609P726831R160826J0909338J3061796
7810A03548272J5611421J8476765K1480383K4209868K5985630K5983098K3427110
7803B58722547J7901450R689404j23396r924932j8127342k3666125k6222777k6168078
7795A82080751k4292079k1435056j8300217j5357913j2781859j0564638q687900
7788G0661089p119993n803875m719357l860188l179152k628267k174869j834159
7780C9341229j653987j582471j526479j429782j267802j066049q69452o69528
$$ y = [38477040, 37224725, 35909867, 34573410, 33288701, 32156457, 31237208, 30560760, 30156110, 30034209, 30168179, 30541598, 31199101, 32186315, 33497917, 35128519, 37136582, 39608571, 42627546, 46296172, 50761396, 56183872, 62689481, 70416312, 79577138, 90486476, 103548272, 119159693, 137636458, 159116841, 183326709, 209312339, 235295437, 258722547, 276623997, 286313401, 286190005, 276265073, 258137731, 234471606, 208248829, 182080751, 157788672, 136353616, 118053399, 102695486, 89913627, 79348989, 70661089, 63541096, 57737221, 53017864, 49157676, 45978524, 43350257, 41175388, 39341229, 37687242, 36104771, 34578292, 33148510, 31880708, 30814659, 29945207, 29275679]
7772B9275679m60830k43008J381K71415N33022P91238J080393J385919J697433
7763C4332642K070053K532669L063058L658874M368836N259527O359622P706109
7755F9351390R308200J1170140J3320226J5713391J8158894K0306010K1663059
7748A78991310K1586057J9443977J4873695Q037448j94319q482945j5482516k0260247
7740A98512460k2506555k2521717k0965695j8540995j5833931j3249525j0982431
7733G3911611r063180p455283o139338n088341m252410l572620k998782k492600
7725C2849057k077544j764492j534398j366973j242968j156320j075200r79367
7717B1651795q55109o92771n40272m16790l08888k16324j10811N0415K40526M21980
$$ y = [29275679, 28814849, 28571841, 28573222, 28844637, 29377659, 30168897, 31249290, 32635209, 34332642, 36402695, 38935364, 41998422, 45657296, 50026132, 55285659, 61645281, 69351390, 78659590, 89829730, 103149956, 118863347, 137022241, 157328251, 178991310, 200577367, 220021344, 234895039, 242932487, 242738168, 234255223, 218772707, 198512460, 176005905, 153484188, 132518493, 113977498, 98143567, 84894042, 73911611, 64848431, 57393148, 51253810, 46165469, 41913059, 38340439, 35341657, 32849057, 30771513, 29007021, 27472623, 26105650, 24862682, 23706362, 22631162, 21651795, 20796686, 20103915, 19563643, 19146853, 18837965, 18621641, 18510830, 18561245, 18801771, 19223751]
7707A9223751O55127R68637J266339J500219J748205K113439K612328L188221
7699C3276266L851027M630656N541837O589731P763577Q968745J0024943J0702752
7691I1349534J0682004R600712P259350L806735l01945m404589p853224j0215273
7683I9923304j1329244j1340147j0575516r379362q027265o730359n599645m638059
7675C2303707l837969l191268k680281k285516j956210j670734j456218j287577
7667A3937934j104196r09810p57305o47542n61947m96071m04821k91299k21822
7658H543121k21863k04796j22971n2211k7995j6954K3623J01314J96601L02242
7648H520111M06132N01121N83644O82866Q07172R65776J193898J487322J787548
$$ y = [19223751, 19878878, 20847515, 22113854, 23614073, 25362278, 27475717, 30088045, 33276266, 37127293, 41757949, 47299786, 53889517, 61653094, 70621839, 80646782, 91349534, 102031538, 111632250, 118891600, 122698335, 122396390, 117991801, 110138577, 99923304, 88594060, 77253913, 66678397, 57299035, 49271770, 42541411, 36941766, 32303707, 28465738, 25274470, 22594189, 20308673, 18352463, 16681729, 15225511, 13937934, 12833738, 11923928, 11166623, 10519081, 9957134, 9461063, 9056242, 8764943, 8543121, 8321258, 8116462, 7993491, 7941280, 7913285, 7896331, 7919954, 8021268, 8217869, 8520111, 8926243, 9427364, 10011008, 10693874, 11501046, 12466822, 13660720, 15148042, 16935590]
7639A6935590K079151K413119K803671L186475L448761L427652L002199K214487
7631C9511105J143989j56314j488488k574011l283316l632504l670748l446707
7623B2403006l081160k698529k318010j934194j563192j239684r81885q11560
7615G774792p29219o86044o11063n18437m62683m30757l78243k88131j99006j41696
7605C329513j32342j70702j97125j67837j20648q7728p0856p7012j22330j90827
7595A992106k09742j71545j34490j41380j56250j40245j02730m0071K9552P3239
7585I98444O0575R577l499P912k8373q2579p6721l180L7211k5513r1878o9212
7573G32764j6137p842k5981k4307j250K1957L4010L5646M0277K9546K2987N0513
$$ y = [16935590, 19014741, 21427860, 24231531, 27418006, 30866767, 34294419, 37296618, 39511105, 40655094, 40498780, 39010292, 36436281, 33152965, 29520461, 25849713, 22403006, 19321846, 16623317, 14305307, 12371113, 10807921, 9568237, 8586352, 7774792, 7045573, 6359529, 5748466, 5230029, 4767346, 4336589, 3958346, 3670215, 3471209, 3329513, 3197171, 3026469, 2829344, 2661507, 2540859, 2453131, 2382275, 2305263, 2182933, 1992106, 1782364, 1610819, 1476329, 1334949, 1178699, 1038454, 935724, 895653, 925205, 998444, 1059019, 1068596, 1065097, 1073009, 1044636, 962057, 885336, 882156, 919367, 893854, 801976, 732764, 716627, 708785, 682804, 658497, 657247, 679204, 713214, 748860, 789137, 818683, 841670, 892183]
7561H92183N9908J1998l9766m9833k7496L432K0159J1667J2355K7690K3830J5762
7549I61889M207k2973o0756j00261r2484k0779M9979O0873L6590J3258o310k4297
7537G98936m9583o3059m9727l1422l3015m0793l8795k7361L133K1497J0019k4389
7525D75441q5294j16478r1795n1005j9557K2258M0416K943l6864m3174l8758l1728
7513B6405J429M4583P3198Q3041O4006J3990n8872p7511m3037l6454l5346j5989
7501C9443J374L1427Q4168J09063P8429J9377k7469n2824n9303k2381L4157N5020
7489B90481L2677j5341m3581k988N9066O4295J6483k1068p949K6172M4106M5180
7477D87533L6312M2368K7851l7716r5808r9777q0847p5538o5014l8264L647L4947
$$ y = [892183, 952091, 964089, 924323, 874490, 846994, 850426, 870585, 882252, 894607, 922297, 946127, 961889, 966096, 943123, 882367, 782106, 689622, 668843, 718822, 779695, 816285, 829543, 823233, 798936, 749353, 686294, 636567, 605145, 572130, 531337, 492542, 465181, 468314, 489811, 499830, 475441, 390147, 273669, 181874, 130869, 111312, 133570, 173986, 176929, 140065, 96891, 58133, 26405, 27834, 72417, 145615, 228656, 292662, 306652, 247780, 170269, 127232, 90778, 55432, 39443, 40817, 72244, 156412, 265475, 343904, 363281, 335812, 282988, 223685, 201304, 235461, 290481, 323158, 307817, 264236, 261248, 320314, 384609, 401092, 380024, 372075, 398247, 442353, 487533, 523845, 566213, 594064, 556348, 460540, 360763, 279916, 204378, 139364, 101100, 104747, 139694]
7465A39694M1779L1446K546j4411k0640l1923m2235k3409J5089M2462L1966k4127
7453A48237r7528j34099j17062o6834k4729J9032P2400Q1452N0143K2035O981
7442c9972j3096l5027l0141j2770J8222N5039M9153N966k7704k4055J6210N1790
7430A3615N0339Q666j2007J5349K3261n497m2096o4903o9155n2579k9108k627
7418a66742L1592M9418K859n5627l7852L3551O7191N5878M7834M0248L6588M5076
7406A50014M1489L9726L8848J9085l411k9921l9817j7118N759J7054L1645N7424
7394C10777O6070M4981L7487J0944m6551r3070q1114m0218k9026q427K9606L6997
7382B38456L3922L5441K2141n336k9896k1920r7M773J6091K8553P110o0077j18578
$$ y = [139694, 181473, 212919, 215465, 201054, 180414, 148491, 106256, 82847, 97936, 140398, 172364, 148237, 50709, -83390, -200452, -267286, -292015, -272983, -200583, -119131, -68988, -46953, -39972, -53068, -88095, -118236, -131006, -112784, -57745, -8592, -2626, -30330, -54385, -38175, 13615, 63954, 72620, 60613, 75962, 99223, 93726, 51630, -13273, -82428, -135007, -164115, -166742, -135150, -85732, -82873, -138500, -176352, -142801, -75610, -19732, 28102, 68350, 104938, 150014, 191503, 231229, 270077, 289162, 285751, 255830, 216013, 198895, 204654, 221708, 253353, 310777, 376847, 421828, 459315, 470259, 423708, 330638, 249524, 209306, 180280, 171853, 201459, 238456, 272378, 307819, 329960, 324624, 294728, 272808, 272711, 277484, 293575, 322128, 329238, 269161, 150583]
7369A50583j27596j08871o3603p431J7435J1156k415j4772j9847K863L7125Q0284
7357d5089R9688M5919o831K8959J01522J06252N6562L2321R872l2420o8282j00277
7345B28196j09952p4835m3385l2985k8265n3100r0246o7793K3946R3590R7091
7334e7738M6567j1957l8875k0819M4291J30257J73827J16695j4020j09512j18774
7323A39942o1232j3243j3810k8318J801L9887J7323p731R635M3456P2094O4221
7311B64025K4588k0648l4783R296O5674O3630L1356k4934q4549q1473j9013L4791
7299B27960M0446K2555R578J5244L9394M4157J4812k8707q4907j11217j02601
7288H6714r2538q4378q4675o5835k5110K694J6836K2269L8497N9806P3056J09612
$$ y = [150583, 22987, -85884, -149487, -156918, -139483, -128327, -130742, -145514, -165361, -162498, -125373, -45089, 54599, 100518, 93687, 122646, 224168, 330420, 386982, 419303, 429175, 396755, 328473, 228196, 118244, 43409, 24, -32961, -61226, -114326, -204572, -272365, -248419, -154829, -57738, -11171, -23128, -62003, -82822, -38531, 91726, 265553, 382248, 368228, 258716, 139942, 78710, 65467, 51657, 23339, 25140, 65027, 82350, 74619, 84254, 127710, 199804, 264025, 288613, 267965, 233182, 242478, 308152, 371782, 403138, 378204, 293655, 212182, 193169, 227960, 268406, 290961, 300539, 315783, 355177, 399334, 414146, 385439, 300532, 189315, 86714, -5824, -90202, -174877, -240712, -265822, -263128, -246292, -224023, -185526, -125720, -52664, 56948]
7276E6948J27959R3537M9215N392l4452m2605n4441p9426p7446n4630k5587J8436
7264a7100O9421Q9212P2659M7150K6554j6973q7890j11290m4033M3833M4714l4743
7252H1514q8035q9334p4131m2010J4445O1643Q0172P5779O4358P1331M1294k9994
7240A67032p8494q0464n0159l9692o6794o0355n106K3163K6055J8376q422m2697
7228a97557l6685j8058k6256k1388k43n47j7572m3622n9270n7567k5403M6901
7216d57267R3747R1327P7938N6089J1472j1746l779M638J0634L0981M5454L5097
7204a5415K8068L9108N9435O9906P3148P7353O2040L0647K400k9593o4618r2504
7192B39975r2268n5601r950J9800L3229L1322J586j0751L8699J01786J04699N5246
$$ y = [56948, 184907, 278444, 327659, 333051, 298599, 255994, 201553, 122127, 44681, -9949, -35536, -17100, 52321, 141533, 214192, 261342, 287896, 270923, 183033, 71743, 27710, 71543, 116257, 81514, -6521, -95855, -169986, -211996, -197551, -135908, -55736, 20043, 84401, 155732, 197026, 167032, 88538, 8074, -42085, -81777, -148571, -208926, -214032, -190869, -164814, -146438, -154860, -197557, -234242, -252300, -278556, -299944, -300187, -300734, -318306, -361928, -421198, -478765, -504168, -457267, -363520, -272193, -194255, -138166, -126694, -138440, -142219, -137581, -126947, -95966, -50512, -15415, 12653, 51761, 111196, 181102, 254250, 331603, 393643, 424290, 426690, 397097, 332479, 239975, 147707, 92106, 82156, 101956, 135185, 166507, 168093, 157342, 196041, 297827, 402526, 457772]
7180D57772R704k9813p1628q6858p1165l8564l9832r2616j38043j05574l0577
7169b37194M575L2843R3259J27374J11143Q1903P2128O5943K4110n1375j08577
7158B16132r8769l5449L5009O4225L8220r416m5587o1264o1823m7379m2889k3787
7146g2777L2003P3910Q3630O5476N4444P3255Q1427M6288r651n6891p0749o1317
7134B39048m6370l4326l2630m3231o4624q6402p5394m7548l3433k1974J926K9996
7122b14962N8752R2286J13481R0043L7630M492j3468j1339r61p109j4503l817
7110A30525J9891M1469N4435N2012K7328l0139q1390r2598q4423p7037n6759l9349
7098a36035k4213l064k714j5191j5243QJ0968K5662M7481O4276O5383K8028k1348
$$ y = [457772, 467476, 437663, 366035, 279177, 208012, 169448, 129616, 37000, -101043, -206617, -237194, -232619, -199776, -106517, 20857, 132000, 213903, 286031, 351974, 376084, 324709, 216132, 117363, 81914, 116923, 181148, 219368, 209952, 164365, 103101, 41278, -6101, -48990, -72777, -40774, 33136, 116766, 182242, 236686, 309941, 391368, 437656, 428005, 371114, 300365, 239048, 192678, 158352, 125722, 82491, 17867, -68535, -143929, -191477, -224910, -246884, -244958, -214962, -156210, -63924, 49557, 139600, 177230, 181722, 168254, 156915, 155954, 148845, 134342, 130525, 150416, 191885, 246320, 298332, 325660, 295521, 214131, 121533, 37110, -39927, -96686, -136035, -160248, -163312, -166026, -181217, -196460, -196452, -185484, -159822, -112341, -48065, 17318, 45346, 23998]
7085B3998l4541l1047o096L4470N9432O1808M8549M1502K9719j7866q2671q9348
7073C7909m3426j2308p419J7375O9217P8439K0264n2011p3983j1044O1301N3254
7061A37568o420n6968p9941o7821k2462K7852P4332R7921Q7467O1453L8787K9630
7049C21398J5424N25J1197M2896M9868M7727M0590J0796l0386n2089l9653k5953
7037C92340l6275n7652r8845j43434j38591r1813n6116m9973l8722m466N3984
7026b69563J09153J21824R3307N9973K5613k7740o3575o9340q8267j13771j10344
7015c32730p4167k2756K7614N2847L3962J0043P05K541M732J1507L6145N8405
7003a91152N3065O246l5273n026M0658L7967L3594L0235K2983J7409N80j7082
$$ y = [23998, -10543, -41590, -47686, -13216, 46216, 108024, 156573, 198075, 227794, 209928, 127257, 37909, -5517, -17825, -25244, -7869, 61348, 139787, 160051, 108040, 34057, 23013, 84314, 137568, 131148, 74180, -5761, -73582, -96044, -68192, 6140, 104061, 191528, 252981, 291768, 321398, 336822, 337347, 348544, 391440, 441308, 489035, 529625, 540421, 510035, 457946, 418293, 392340, 356065, 298413, 199568, 56134, -82457, -174270, -230386, -280359, -319081, -323547, -269563, -160410, -38586, 54721, 114694, 140307, 112567, 48992, -20348, -108615, -222386, -332730, -406897, -429653, -402039, -349192, -315230, -305187, -304482, -301941, -297209, -285702, -249557, -191152, -138087, -131841, -167114, -172140, -131482, -93515, -59921, -29686, -6703, 10706, 11286, -5796]
6991e796k6993m4360n5891n9859q3748j17450r3054j1958N8931P9613N0538K6195
6979b83832K5367J5826j1890m4827m3213m65M6266P6897J00392J27927J27028
6968A35476Q7987K6598k3931l8358j0581J9358P117k6748k1141J7002L2344K4845
6956B29968K0896R222r846p209J7769M3872M4919p772q0343r7771n2826J2982
6944A23861L7653j323n4347n6551k1528J7081M6194L7544M826k5608o2301q3201
6932c7700p7164p6827p6846p3437o5180l6522o940K5135O3753P9134M4955j7619
6920b55258l9492K216M8257P5745O9459K3942j6309j1818m20j8787n1257o2867
6908b36589m7227j5901K8875P2318P6222M2536K7168M9716J05012J41700Q1240
$$ y = [-5796, -32789, -77149, -133040, -192899, -276647, -394097, -487151, -499109, -440178, -360565, -310027, -283832, -258465, -242639, -254529, -299356, -342569, -343034, -296768, -219871, -119479, 8448, 135476, 223463, 250061, 226130, 187772, 177191, 196549, 203666, 176918, 155777, 172779, 205123, 229968, 250864, 260086, 250240, 243031, 260800, 304672, 349591, 341819, 261476, 163705, 110879, 123861, 161514, 160191, 105844, 49293, 27765, 44846, 91040, 128584, 133410, 107802, 45501, -37700, -114864, -191691, -268537, -341974, -407154, -443676, -450616, -425481, -361728, -282594, -237639, -255258, -294750, -292534, -244277, -168532, -99073, -75131, -91440, -103258, -103678, -122465, -173722, -236589, -283816, -299717, -270842, -198524, -122302, -79766, -52598, -2882, 102130, 243830, 325070]
6897C25070k2281p6701r0926p4782k8220J857L00J1147M3109M1684n018m5989
6885G9250n4788k9947M909K8411M4018N6868L8298M84p674j3320j4658j6619m6867
6872F8365o6520n4626m5652n5955m6012L202O0149Q6713O4657M7027O2933R2855
6860B17136J02811N3771m803l1797k8964k6N9807J14050R5182K2155m4105p1523
6848D83694n5719l9602o3937r9825j01972o6732q680M5163O2840L3502k4184q0547
6836H4001q2856l0931J2924L3929O1868Q3561O6282K5066l937k2335n8250j12086
6824E7236j52633j53539j13063k8869N4322P3887M0322K0376M0201N3156L6712
6813g1892P616M356L8475O6361M3092j0034q1249j57059j45947l7727N8513J01901
$$ y = [325070, 302789, 226088, 135162, 60380, 32160, 34017, 34317, 45464, 88573, 130257, 125239, 79250, 24462, -5485, -576, 27835, 71853, 128721, 167019, 167503, 159829, 146509, 131851, 115232, 68365, 1845, -52781, -98433, -154388, -200400, -197198, -137049, -50336, 14321, 61348, 124281, 217136, 319947, 373718, 368915, 337118, 308154, 308128, 367935, 481985, 577167, 599322, 555217, 483694, 427975, 388373, 324436, 224611, 122639, 55907, 47227, 92390, 155230, 188732, 164548, 84001, 1145, -29786, -16862, 17067, 78935, 162496, 228778, 253844, 249907, 227572, 169322, 57236, -95397, -248936, -361999, -390868, -336546, -262659, -222337, -201961, -161760, -108604, -71892, -64276, -59920, -21445, 44916, 88008, 77974, -3275, -160334, -306281, -344008, -285495, -183594]
6801a83594J09252R4790O5580L2677M517j5068l3896m3884l7302j0327K7757O3963
6789G4465Q0264N5116L9512M6160K4995k4916o0647n6481k6448J9019K6350j1260
6777A86129l5076j9666P615K3990M9076O5164L2070l3387o5431n7549l9945j3305
6765I9685R921M472l2461o6401p3637o4864m2376l3173m2070n9711o7032l5982
6753d03629L3286Q7525Q5264N4937J3384k4369l3387r074Q652k407j7049J2820
6741a94047P1387J01697Q9440M2674k6591p0310n0011j1275j9375p1858p8965
6730b17234k2119L0621M1967L7204M6143O5126O8024M661r0695j07078m3440K9106
6718a57714O3691O4147P0932Q1492O4254K1361k6820m5445q305L3840L0689J6889
$$ y = [-183594, -74342, 20448, 86028, 118705, 123222, 108154, 74258, 30374, -6928, -17255, 10502, 74465, 154729, 209845, 249357, 295517, 320512, 295596, 234949, 178468, 152020, 171039, 197389, 186129, 151053, 131387, 139002, 162992, 212068, 277232, 309302, 275915, 210484, 152935, 112990, 99685, 109606, 114078, 81617, 15216, -58421, -123285, -165661, -198834, -240904, -300615, -367647, -403629, -370343, -282818, -197554, -142617, -129233, -153602, -186989, -196063, -187411, -189818, -206867, -194047, -122660, -20963, 68477, 111151, 84560, 14250, -35761, -47036, -66411, -138269, -217234, -239353, -208732, -166765, -129561, -83418, -18292, 49732, 54393, -36302, -143380, -186820, -157714, -94023, -29876, 41056, 122548, 186802, 208163, 181343, 135898, 127593, 161433, 192122, 209011]
6706B09011L177k109N754p760J598O4967J17159J15936M1111m8781p0310m7116
6694C82637l5758n2429q3012q7943p2639m7463j4596J9757L7166O035n5815r0135
6682i4195r2050q3371k9158M9096Q5124R5998J15255J03073O0014K0302j5278
6671B14810m8055q1029r2906p5334m0573k6396l0267p858L2395Q4473J16808R3985
6659A40053M0069J090Q030L8354N1061M2084J2268j1298j5227n519K0655L1490
6647C53110P178k2820l1799l2711m9342p8399r5315q0904n2275n7171o8956l9103
6635b48507K774K0542K2414N988k3255j6569J1971R319k971j990n202l8879o8098
6622c32463m5451j3918J3653N1650R0495J19594J19792P9174K5528j2440m7397
$$ y = [209011, 212188, 210079, 215833, 208073, 209671, 274638, 391797, 507733, 548844, 500063, 429753, 382637, 346879, 294450, 211438, 123495, 50856, 3393, -11203, 8554, 45720, 51755, -4060, -94195, -186245, -269616, -298774, -249678, -164554, -68556, 46699, 149772, 209786, 230088, 214810, 166755, 85726, -7180, -82514, -123087, -149483, -179750, -187608, -155213, -70740, 46068, 140053, 180122, 181212, 189242, 227596, 278657, 320741, 333009, 321711, 306484, 300965, 321620, 353110, 360288, 337468, 305669, 272958, 223616, 145217, 49902, -31002, -83277, -140448, -209404, -248507, -245733, -225191, -202777, -196789, -220044, -236613, -224642, -215323, -218294, -220284, -225486, -264365, -332463, -377914, -391832, -378179, -326529, -236034, -116440, 3352, 82526, 108054, 95614, 48217]
6611D8217p2382p8035o1154k3175K3501N4531O2264O4003L8343k4072n5574j7445
6599d0978M1422N6945K1707k845J4511L6199K2400r576k2270r770N969n678l3399
6586G4637l1992Q862N3817Q1525R2397N3723k3885p4708o8867l1803N000K1975
6574A60681j3123r1256j27631r0888m5109n4446q7759p3185k2970L6442P5893
6563c33351Q2440Q6978R3343P1245J7781l1698k1505L8800R8839J19928Q3983
6552C06783K8067j3338m5368m3404j9099k1289m7678n6951l0370j8835l5651l4481
6540c1614k6643m4995l9766J9505Q6440J05844J09605J30496J31909J06080Q2211
6529F29072P3694P0192M3796p307n8936q6965r6990j15273j37642j33335r4855
$$ y = [48217, -24165, -102200, -163354, -186529, -163028, -108497, -46233, 17770, 56113, 32041, -23533, -40978, 444, 57389, 79096, 76251, 90762, 126961, 149361, 139785, 117515, 107745, 113714, 108036, 74637, 42645, 51507, 105324, 186849, 279246, 332969, 309084, 234376, 165509, 133706, 138706, 160681, 147558, 56302, -71329, -162217, -207326, -261772, -349531, -422716, -445686, -409244, -333351, -250911, -163933, -70590, 655, 18436, -13262, -34767, 4033, 102872, 222800, 306783, 334850, 321512, 276144, 232740, 213641, 192352, 144674, 87723, 57353, 38518, 2867, -31614, -58257, -103252, -143018, -123513, -37073, 68771, 178376, 308872, 440781, 546861, 629072, 702766, 772958, 816754, 809447, 750511, 663546, 566556, 451283, 313641, 180306, 85451]
6518H5451m3612k463J7282J8657K0892K3071m127m7073p9515q0303m3372m021
6506a39133J0450K442j1375k4916l5028j5082L6559R7575J40972J29676P6500
6495B68640K8267J0250l636m7680q6125o5848j3312L1667K5919m0750q6319n0974
6483b9901L6329Q8975Q0952L7073k5595p7582p2216M114P1287P2323N6399O3641
6471C05799N5862K9941J2276r004n3895j04656q8561k3913K3314N2589O2427L6158
6459B98337p026l2864l3925k7114k823L3507N3092L6260o824m6490m2327M733
6447B26536K9797J8662n204k3896k1990j5222j9861m1289n5691m8358k9828j7036
6435c380k3439j9454J6577K3355o405Q533K9085O096k3565l3206l8650l4146j1947
$$ y = [85451, 41839, 39376, 56658, 75315, 96207, 119278, 115151, 68078, -11437, -91740, -135112, -139133, -128683, -126241, -137616, -162532, -197560, -212642, -176083, -78508, 62464, 192140, 268640, 296907, 307157, 303521, 255841, 169716, 103868, 90556, 122223, 148142, 107392, 21073, -29901, 6428, 95403, 176355, 213428, 187833, 110251, 38035, 42149, 113436, 185759, 242158, 305799, 361661, 391602, 403878, 394874, 340979, 236323, 147762, 123849, 147163, 199752, 262179, 298337, 291311, 258447, 224522, 197408, 194585, 228092, 281184, 317444, 310620, 264130, 221803, 226536, 256333, 274995, 269791, 245895, 223905, 208683, 188822, 147533, 91842, 43484, 13656, -3380, -26819, -46273, -29696, -6341, -12746, -4213, 24872, 30968, 7403, -25803, -64453, -98599, -110546]
6422a10546J1252J1863K772K91q314j5647k461M133J962J1290M0405N4525L0004
6409C1529L681j1962j061J7222J2313M415M377m231M692M9580O6125L9145J1662
6396B27487q515m8646q7119r0491n9138j6427m589l0411n1491n2474p1982q9454
6384c83250m7659O181J6792J7r562j699O835K527j1866M428O3619J19592J28027
6371a06018P5253J6259O652L2364N5530Q8184J06279O3262j0312l6863r106J7686
6359B99170P596l6517n4372m8686n8589n3227k0133r117j6204j2265k9189n8416
6347h9949m7529k7097k0984j9549j3089p589j0873j7429j5466n991r47K0786M4285
6334b11421M2739L2197K4798K6754M3952P6896R7867J03816J10231Q1212Q061
$$ y = [-110546, -99294, -87431, -84659, -84368, -92682, -108329, -110790, -106657, -104695, -93405, -53000, 1525, 31529, 35210, 23248, 22187, 39409, 51722, 56137, 60514, 56283, 60975, 110555, 176680, 215825, 227487, 218972, 170326, 83207, -7284, -66422, -82849, -87438, -117849, -169340, -221814, -293796, -383250, -430909, -424728, -407936, -407919, -417481, -419180, -412345, -409818, -421684, -417256, -353637, -234045, -106018, -30765, -14506, -7854, 24510, 80040, 168224, 274503, 337765, 327453, 290590, 281484, 299170, 306766, 270249, 215877, 167191, 108602, 55375, 35242, 26125, 9921, -2344, -31533, -89949, -137478, -164575, -185559, -205108, -218197, -225786, -236659, -254088, -269554, -275545, -276492, -255706, -211421, -168682, -136485, -111687, -84933, -40981, 35915, 133782, 237598, 347829, 429041, 437102]
6323D37102n6519o0115j3546J3450k5279q3071p7777m1750k3232l999J6050P422
6311H8736l4953m2564m05M11k3054J880O3919J07739J14054P6435N104p3246j26861
6298A57195j06229m6508j5384k6895k5034J3037K3850L171J4374L0141L3476M2345
6286I7539K8690J553N381L3290N9710N0982R234P347K2929k2210q1882j00711
6274A11852j00964j00467q7962o1876l1168N328N8490Q5360P4537N2841J4302
6263B0273k4787m1729k2659J907J215J076M4492J14079J23157N9898J931j9169
6251B59684r280m80k1637l6152j2171Q997J5767N4613Q9208P1696K7196j4479
6239D32962m9649p3653o7369l8795O018M5276M1403Q06l9731o6710j06672j44122
$$ y = [437102, 380583, 320468, 306922, 320372, 295093, 212022, 134245, 92495, 69263, 65264, 81314, 88736, 53783, 11219, 10814, 11225, -11829, -9949, 53970, 161709, 275763, 352198, 357302, 284056, 157195, 50966, 4458, -10926, -37821, -62855, -49818, -25968, -22797, -8423, 21718, 55194, 97539, 126229, 127782, 133163, 166453, 226163, 277145, 286379, 293726, 316655, 294445, 212563, 111852, 10888, -89579, -177541, -239417, -270585, -265257, -206767, -121407, -46870, 5971, 20273, -4514, -46243, -68902, -66995, -65780, -64704, -20212, 93867, 217024, 276922, 278853, 259684, 250404, 249924, 228287, 192135, 179964, 188961, 204728, 259341, 348549, 420245, 447441, 432962, 383313, 309660, 242291, 203496, 209514, 254790, 296193, 296999, 257268, 190558, 83886, -60236]
6227f0236j30328o5965L097N5005P6180K4853k0292Q52N1881N9182J1861j1458
6215e368m093k237J0371L4444L9625M256k5781j8986k3881n4369n3304J623P5847
6202b1853J22322J19635O0689k2272n8426k0266K6551J7654j9171k0127K1959
6191B06695O4302P2897N9167M7212M1132K0152k8456p6116q8519o1953l1676j2391
6179B12446k570k0057o2314p6231m8635k9999m1766m5865k3489J2262O1596R4077
6167B9455J05518R5530N6816J0677k0198l669L8467O3152O4373M2799R686k6589
6155D66017l8728p020K2806j3602q4990j30542j46331j13233o2264l9204k3892
6144a70983o404n324O955J6094l1843p4450m5192J1315N3194N8239N2931M7471
$$ y = [-60236, -190564, -256529, -253432, -198427, -122247, -97394, -117686, -116834, -64953, -5771, 6090, -5368, -9461, -11698, -1327, 33117, 72742, 76998, 51217, 32231, 8350, -46019, -99323, -97700, -21853, 100469, 220104, 280793, 258521, 200095, 179829, 206380, 224034, 204863, 184736, 206695, 270997, 343894, 403061, 450273, 491405, 511557, 483101, 406985, 318466, 256513, 224837, 212446, 209876, 189819, 127505, 51274, 2639, -27360, -69126, -114991, -138480, -126218, -64622, 29455, 134973, 230503, 287319, 297996, 277798, 274129, 312596, 375748, 440121, 482920, 492606, 466017, 427289, 420269, 443075, 429473, 344483, 213941, 67610, -45623, -107887, -147091, -170983, -177387, -182711, -175756, -159662, -191505, -265955, -311147, -299832, -246638, -188399, -135468, -87997]
6132h7997J6292j218K2299K2003j5091k8142O845M2779M5264J7831j3586k0434
6120F845j3176j9647n0212p0682q6559r9305o3625r46K7523K6798K1261K9202
6108b92523M7154L9179P106j5003k3465m1544l7770J9437N2679J8790j2299l788
6096b42047K1396M0064O5823Q1945M2584j0662k9289m2349n2286o5549q2473n4953
6084c27796p760P743O054K7760O7967J01738J02678P6764Q0674J02948R1400L3337
6072C63507j7541l2923o7317j20280j25189j13435j00198o2020j0777L3574O1789
6061a90810R8931J28302J37866J46256J25548O9879K0730N553M081l8797r2103
6050D15436j24433j40626j33617j13800r2851q3448o9027k8384L2138P2985J04102
$$ y = [-87997, -71705, -72923, -50624, -28621, -43712, -71854, -65009, -22230, 23034, 40865, 27279, 6845, -6331, -25978, -76190, -146872, -233431, -332736, -396361, -397307, -369784, -342986, -321725, -292523, -245369, -206190, -199084, -214087, -237552, -279096, -316866, -297429, -244750, -225960, -238259, -242047, -220651, -180587, -114764, -32819, 9765, -897, -30186, -72535, -124821, -190370, -272843, -327796, -335556, -327813, -321759, -293999, -226032, -124294, -21616, 55148, 135822, 238770, 330170, 363507, 345966, 313043, 245726, 125446, 257, -113178, -213376, -275396, -286173, -252599, -190810, -91879, 36423, 174289, 320545, 446093, 515972, 536702, 542255, 546336, 507539, 415436, 291003, 150377, 16760, -97040, -189891, -273339, -342366, -370750, -338612, -265627, -161525]
6039a61525J18862Q2332J5991m4173r0648j07012p8742k6067K9069M6098M7588
6028a68227M6882K0344j1062k0032k5588l8920l3052j6580k1112j33N9189R2937
6016a15354R4282Q7961O0522L6862L9125K1162l5270o3666m0580j6937j9983j5678
6004C2446K9443N5248L7338L0993J9760j447o174j3247k5169m0768n0173m5504
5992B2746j8304J5253M1307L7429q416m2213n5318o6847m4709j5871J9640O8950
5980d6353R7139Q2917K3873l8609m1267j0863j3708m1668o5707r7007j18428q6928
5968c56609k4834L3161O6079O2957L4863R856K0665N9835Q7372R6701R4217M9976
5956B34239n4944j46728j53378q2526J1454N9399N8148M8005M4473J7069l0096
$$ y = [-161525, -42663, 39669, 55660, 11487, -79161, -186173, -264915, -290982, -261913, -215815, -168227, -121345, -101001, -112063, -132095, -157683, -196603, -229655, -246235, -267347, -267480, -208291, -115354, -21072, 66889, 127411, 164273, 203398, 224560, 189290, 125624, 85044, 68107, 48124, 32446, 61889, 117137, 154475, 185468, 205228, 203781, 197607, 184360, 159191, 118423, 68250, 22746, 4442, 19695, 61002, 98431, 90015, 47802, -7516, -74363, -119072, -134943, -115303, -46353, 50786, 133703, 157576, 118967, 77700, 66837, 53129, 11461, -54246, -151253, -269681, -356609, -381443, -348282, -282203, -219246, -184383, -174527, -153862, -94027, -6655, 90046, 184263, 234239, 179295, 32567, -120811, -203337, -191883, -132484, -74336, -26331, 18142, 35211, 5115]
5945E115m1300j8993l951q457j5928P947O9417J07604J10499J06618P2856J6806
5933D08233k3981m6629n2048n3827n4092q0028j13682r7166p4072p9866o6392
5922c33550n2314l2618M883L2725P2854J26135J54202J36717P0832o569m4317
5911A28980k9934J7549N2917J0653p6569j14659p7237J7401R4289J03262Q0802
5900B07454N8259M8966M6639K2978r933k3711k3466l8615p4898r1904n0577Q835
5888H0027N6528P2739O2210K9589k5130q1479j12269q1724l052N1378N6897M7787
5876A53501M6005L7854J9443J5898J1883J12K8676O9952O0361J4848k6573l8008
5864C93952l7380o9162j00392r3248p8664k8089P0944J10146N7353j6665p5955
$$ y = [5115, -36185, -55178, -59129, -67586, -83514, -75567, -6150, 101454, 211953, 318571, 391427, 408233, 384252, 337623, 285575, 231748, 177656, 97628, -16054, -113220, -187292, -267158, -333550, -385864, -418482, -413599, -380874, -308020, -181885, -27683, 109034, 179866, 173297, 128980, 99046, 116595, 169512, 180165, 103596, -11063, -88300, -70899, 23390, 126652, 207454, 265713, 314679, 361318, 384296, 374363, 350652, 327186, 288571, 213673, 121769, 71192, 80027, 136555, 209294, 271504, 301093, 275963, 194484, 82215, 491, -2561, 48817, 105714, 153501, 199506, 237360, 256803, 272701, 284584, 284696, 313372, 383324, 443685, 458533, 431960, 393952, 356572, 287410, 187018, 93770, 15106, -12983, 57961, 168107, 225460, 208795, 132840]
5853A32840j22942j43417j17018m8092K5319P0884Q0519M7849O598k6306m1362
5842a35128l9413m6537k2982M6333P1740M7250L9111N8415P3366M4994k0261q7463
5830B9425j16937o6530K0616P5191O7755K6699j0116m9574q4068p0154l6204o4704
5818b78601j15103j03571n5455K915N9962J04148J49397J89726J89525J29604
5808B72547M5235q810k7767l1967o251K7054J9323j5149k7414j7292K9498N7489
5796C16496P752m2246o1833q2244p3988l4942k0019l8877m0962J5240Q0966P1489
5784I6832J5362k8667n6659n7250k0431J8294R897k6661n4551o6255n4699k3296
5772b48084L844J5261J4680K5234L8163K4756p19m1752r2886q7645k779Q5352
$$ y = [132840, 9898, -133519, -250537, -298629, -273310, -202426, -121907, -74058, -67460, -93766, -135128, -174541, -221078, -244060, -197727, -125987, -78737, -39626, 18789, 92155, 137149, 116888, 29425, -87512, -154042, -133426, -58235, 9520, 36219, 26103, -23471, -107539, -177693, -213897, -278601, -393704, -497275, -552730, -549815, -489853, -385705, -236308, -46582, 142943, 272547, 317782, 308972, 281205, 249238, 242987, 270041, 289364, 274215, 246801, 229509, 259007, 316496, 324248, 282002, 220169, 137925, 63937, 28995, 8976, -29901, -70863, -55623, 25343, 96832, 112194, 83527, 26868, -30382, -50813, -32519, -22622, -49283, -103834, -170089, -224788, -248084, -244240, -228979, -214299, -189065, -150902, -126146, -126865, -168617, -261503, -349148, -351927, -266575]
5760b66575J21765J16362Q5988M3428L288j8938k169M9401P0271L1550k7591p6185
5748A30595r5226p3002m6342n2428o5299l4487J1321J7486J6436K9427O7747J01114
5736G342P8402M3580L0247J7246p101m1254p9339j04680j07177p9451m3561j5255
5724c01001J0406K2039K4519J6364R673Q687n698k5173j9623K2615O2084M8649
5712a26459j5254n5923l2094L2100P5027O8815N3353L2282l758m3560o5337l3247
5700a14055J4800K7660J1202j4944n3650j03930j07045k9429R9429J79452J43706
5689E3196N8144J197j8556k2688k9291k7613j345J8155J1482J9784N0062O1148
5677A73675K4102k8697m2682k2330k641k1992o9351q8873m5299K2249O5792O0793
$$ y = [-266575, -144810, -28448, 57540, 100968, 104256, 85318, 83149, 132550, 202821, 234371, 206780, 130595, 35369, -37633, -83975, -136403, -201702, -236189, -224868, -207382, -190946, -161519, -93772, 7342, 85744, 129324, 159571, 176817, 169716, 128462, 49123, -55557, -162734, -242185, -285746, -301001, -290595, -268556, -244037, -227673, -218000, -209313, -215011, -240184, -259807, -237192, -175108, -126459, -141713, -197636, -229730, -197630, -122603, -53788, -435, 31847, 28089, -15471, -80808, -114055, -99255, -71595, -60393, -75337, -128987, -232917, -339962, -369391, -269962, -90510, 53196, 111340, 112537, 93981, 71293, 42002, 14389, 13044, 31199, 42681, 62465, 112527, 173675, 197777, 169080, 126398, 104068, 101427, 79435, 10084, -78789, -124088, -101839, -36047, 24746]
5665B4746K3494k07K16P136K3766O0751M6045j3174l7994l6265l6714l9024l6870
5652a4094j5259O711l315j6700j5651j9783m6309p8081p4619l7297m25R998M457
5639c00367Q178L0112M4279P777m9638n7901O336Q1849J01352P3239O0397N5837
5627F1450K6489M084N733M225J0996L4666L8929K2534M351R508K4453K6890J4154
5614B88462j2288n6769r7850r4281o1296m7537n9058p7161n8991K709O1424R1838
5602a20798R6358R0497P2530M4820m538m2331k8358k790p477m3152n9304k0814
5590b5357L5032N6440L1986K522r526j7354k5674j4918J0932J3905J2604K7115
5578I7707J8305j4311p753J5665j7575o5464n9089j4459J3040J0568k527j357
$$ y = [24746, 48240, 48033, 48249, 55385, 79151, 139902, 185947, 172773, 134779, 98514, 61800, 22776, -14094, -29353, -22642, -25957, -42657, -58308, -78091, -124400, -202481, -277100, -314397, -314822, -304824, -300367, -292189, -262077, -217798, -210021, -259659, -317560, -311224, -229375, -128023, -54784, 5613, 61450, 87939, 92023, 97756, 101981, 112977, 147643, 186572, 209106, 213457, 222965, 247418, 274308, 288462, 276174, 219405, 121555, 27274, -34022, -81559, -140617, -217778, -276769, -274060, -212636, -120798, -24440, 66057, 138587, 183407, 178869, 136538, 108180, 105390, 97913, 54761, -4543, -25357, 9675, 66115, 98101, 100623, 91097, 73743, 48069, 33151, 44083, 57988, 70592, 97707, 116012, 101701, 93948, 109613, 92038, 26574, -32515, -46974, -33934, -23366, -25893, -27250]
5566b7250L614j848n919J540J5236L5075O8063J05539J31556J26940Q6242K656
5554E41444q4720r7484m4527R79k625m5211o9713l8140J3622O1959R6745R3674
5542D26003L5592n4833j01879r7924r1392p9111n2190j6703J5563L6755Q9658
5531A09539J81821K33644J84055P2323j5091o6217q9473o6412m007N6853O4310
5520F61345M0586J5144j0729j2199J463J850N651K2736L1321K3640q749n9929
5508G12130j02594r1630j8366M3207M4570L7066L4437n746m2530m0000j3923J2850
5496E69471J488j9923J5636J00460J40904R8340O3910R4626J34538J61768J96916
5485A558134K47395L13906L69378M03958M47726N58963P32060R06072J072813
$$ y = [-27250, -23636, -25484, -31403, -29863, -14627, 20448, 88511, 194050, 325606, 452546, 538788, 541444, 456724, 359240, 314713, 315692, 313067, 267856, 198143, 160003, 173625, 235584, 332329, 426003, 461595, 406762, 304883, 206959, 115567, 36456, -15734, -32437, -16874, 19881, 109539, 291360, 525004, 709059, 781382, 766291, 700074, 610601, 544189, 540182, 597035, 661345, 701931, 717075, 706346, 694147, 695610, 697460, 703111, 725847, 757168, 780808, 772059, 712130, 609536, 517906, 499540, 542747, 587317, 624383, 658820, 653074, 610544, 570544, 556621, 569471, 570959, 551036, 566672, 667132, 808036, 906376, 970286, 1064912, 1199450, 1361218, 1558134, 1805529, 2119435, 2488813, 2892771, 3340497, 3899460, 4631520, 5537592, 6610405]
5476F610405J291694J601690K007728K543874L303791M305926N274881N571852
5468C2511841M375522J556276j825536m446846n518819n215132m309318l357932
5460A3770056k595871k041076j602310j228341r31355p03453n36982m50115m29427
5451C251126m10467l58084k83247k07432j61654j76632k04813k10055j91506j28176
5441I19060l8152K6612K0555l2895p8747o9170Q432O6866L0206o0967j31518j44161
5429E16121j03872o4303n3059m1669j4025J236j1702l1309m6151n5341m8008l8321
5417I597m3123k1427M4497J02171J07157P8165L9910n803o5425j02761j00041
5406D2917r5204p1075j5893l076j4135P600N3183J07965J43020J31277Q6015J5384
$$ y = [6610405, 7902099, 9503789, 11511517, 14055391, 17359182, 21665108, 26939989, 32511841, 36887363, 38443639, 36618103, 32171257, 26652438, 21437306, 17127988, 13770056, 11174185, 9133109, 7530799, 6302458, 5371103, 4667650, 4130668, 3680553, 3251126, 2840659, 2482575, 2199328, 1991896, 1830242, 1653610, 1448797, 1238742, 1047236, 919060, 880908, 907520, 928075, 895180, 816433, 747263, 755695, 822561, 852767, 791800, 660282, 516121, 412249, 347946, 294887, 253218, 239193, 240429, 228727, 197418, 151267, 95926, 47918, 9597, -33526, -54953, -10456, 91715, 198872, 277037, 316947, 311144, 245719, 142958, 42917, -52287, -123362, -139255, -142331, -156466, -148866, -95683, 12282, 155302, 286579, 372594, 387978]
5394C87978l0624k7256q168j498m512l7948r4311j00933m5534L7257Q5059M4950
5382B04460m4412p8237l0665J2357J4761K8015N4728K8518m1850n8670j4848J1678
5370H5835O814K8414P9557R7808P0194K9883l5792q8187o6859k8139l4345m9275
5358I5908n0299p4415j02130q1876m1691j6496R006K3964J7284J9357J2262j2011
5346b01137j2094j883r362l235L9369O3711M1443R093k1360l6971k8744l932M5397
5333a19705Q7817N4380m2544j02905o4985j1468k8435r1497j04252n4606M503
5322d73697N1185P5772P9219N0513j4582p2963n3707K9286J05308J25603Q7263
5311a0800O7563R3169R3971L4956n5300j24163j19423p8329k8214L9363P3498
$$ y = [387978, 357354, 330098, 321930, 320432, 315920, 277972, 183661, 82728, 37194, 74451, 159510, 204460, 160048, 81811, 51146, 63503, 78264, 106279, 161007, 189525, 147675, 89005, 74157, 85835, 92649, 121063, 200620, 298428, 368622, 398505, 362713, 274526, 207667, 179528, 145183, 95908, 45609, -28806, -130936, -212812, -254503, -270999, -261993, -238029, -220745, -201388, -189126, -201137, -213231, -215114, -224476, -227711, -188342, -124631, -83188, -74095, -95455, -132426, -161170, -165102, -119705, -31888, 22492, -20052, -122957, -187942, -199410, -227845, -319342, -423594, -478200, -473697, -422512, -346740, -267521, -217008, -231590, -304553, -358260, -328974, -223666, -98063, -10800, 56763, 149932, 243903, 278859, 223559, 99396, -20027, -98356, -126570, -87207, -13709]
5300a3709N9951M8904L8041O469l4070o2211p1965p2193o5209n0169o480N4762
5288a67879J01881R6519M2686k0779o7643p5588m8198o577L5530R1028J22037
5277A03017P9500p757n1550k2009L2545O5215M9107j136m5328n9716n3985m1658
5265D6245l3205n0414m1125P866K8622K6344K2807l306m1488k1731L7827Q0663
5253E9105P4953L2776M974K0340O9191R0034M5113j3399m1845l1352j3679j9953
5241B76258n5113q2347n2108k0489j4998k1048k4240j5756k5168p626P1073J40901
5229A69339J58979J18706M3066k4116q4943j27572j25993q0191j5492K4094P366
5218F3243n2949q4774l7030L4307O0772M2088K60j6106k671K2113N6373O3064
$$ y = [-13709, 46242, 95146, 133187, 139656, 105586, 43375, -28590, -100783, -165992, -216161, -222641, -167879, -65998, 30521, 73207, 52428, -15215, -90803, -139001, -145578, -110048, -19020, 103017, 182517, 174760, 123210, 101201, 133746, 198961, 248068, 246932, 201604, 141888, 87903, 46245, 13040, -37374, -78499, -70633, -42011, -15667, 7140, 3834, -37654, -59385, -21558, 59105, 134058, 166834, 171808, 192148, 261339, 351373, 396486, 383087, 341242, 309890, 296211, 276258, 221145, 138798, 86690, 66201, 51203, 30155, 5915, -9841, -35009, -42635, 28438, 169339, 328318, 447024, 490090, 465974, 381031, 253459, 127466, 47275, 31783, 55877, 63243, 10294, -74480, -111510, -77203, -16431, 25657, 25917, 9811, 7140, 29253, 85626, 148690]
5206A48690N0015L4054j4624o1804n4980l0313j4789j8913n9065j05629j13225
5195b40583r1548p2162m5759m94K7359K4577K7801N9850J00247J13338J11681
5184A4307J19878J28682J11215N1897m4178j34638j70462j71014j49844q2942
5174c27099R821J01914J57350J47766Q9560L646o3056p4863o8108o4805l3957
5163a21831K3622O0229N9272M5228K4857J1793K0482K4690J1698m330r262j888
5151A44560P965r071n1061q3144p3088k3756K0121J8175j0294r945K3347N6292
5139A0101O8028M7121J3152m543M267M7683Q2367N2133j3710l4395J5878N9972
5127C48054K9305m6495r2010r0564o8517j4953M8918R2192J02675P1246J5663
$$ y = [148690, 198705, 232759, 218135, 156331, 101351, 71038, 56249, 37336, -21729, -127358, -240583, -332131, -404293, -450052, -450546, -423187, -398610, -370809, -310959, -210712, -97374, 14307, 134185, 262867, 374082, 425979, 381801, 247163, 76701, -94313, -244157, -327099, -317278, -215364, -58014, 89752, 179312, 182958, 119902, 45039, -23069, -87874, -121831, -98209, -37980, 21292, 66520, 91377, 103170, 123652, 148342, 160040, 155710, 146448, 144560, 152525, 143454, 92393, 9249, -63839, -87595, -67474, -49299, -59593, -69538, -46191, 10101, 78129, 125250, 138402, 133859, 138126, 185809, 268176, 320309, 306599, 272204, 288082, 348054, 377359, 330864, 238854, 148290, 79773, 64820, 113738, 205930, 308605, 379851, 395514]
5116C95514l2438p0843r6595r5334q1642o6969m0804j2329K550K094J0721L9222
5104d6853O7932M3107p1078j90207k21940j40875k7139L0780M1831K4552J753
5093d88137J8847N7131O3385O3408P3970P1882O5795M5864K0183j852m9148r6563
5081a55235q3837j0236P5775J03504M7668k4015k0377N3686Q6903K5361o1251
5070C7946r2497q4018q0789o5464k3387L7288J02723J28151J00168L4479j4066
5059H0534k3586l1133k7755M971M5530L9506j5267m7442m9067n1229l1821J703
5047a05056J6485J8526p010m5549m9127m4110p1530j13969j40888j34740p7371
5036g54339K1058J07049J11272N7980K9590L7534O9780J09608J20272Q6065J4154
$$ y = [395514, 363076, 292233, 195638, 100304, 18662, -48307, -89111, -101440, -98890, -96796, -86075, -46853, 21079, 64186, -6892, -197099, -419039, -559914, -587053, -556273, -514442, -489890, -488137, -469290, -412159, -348774, -285366, -211396, -139514, -73719, -27855, -7672, -9524, -58672, -155235, -239072, -249308, -173533, -70029, -22361, -46376, -66753, -13067, 73836, 99197, 37946, -54551, -138569, -219358, -284822, -308209, -270921, -168198, -40047, 60121, 94600, 80534, 56948, 25815, -1940, 3031, 48561, 88067, 72800, 25358, -23709, -74938, -106759, -105056, -88571, -70045, -77055, -122604, -171731, -215841, -287371, -401340, -542228, -676968, -754339, -733281, -626232, -514960, -456980, -427390, -389856, -320076, -210468, -90196, -4131, 10023]
5025A0023q1540j50045j49734r9911l7834R181J9339p224m422L5879P0081Q5061
5013c01146Q7966R0199Q1471N8512L8316K5134K1968M6980Q8280R7982O6074K8624
5001D30360J4255N820q770j971J4972q022n4632r0130j22757j13572m9846Q386
4989B4093J3348L644K2155O8423J17630J08318N9688L3393r8n0730o6093l5298
4977B98473k1738l1010j0846L4590P1107P5560N2923L3753k328p4629j22552r5442
4965B07861n0679m5112m4750l7939m7691m4098k9280k1041j6965j9432q334Q050
4953a49410J2931J4458J9143K2130J0359p628j1879J4058M4753L9789Q619k2728
4941e405j2487O7740J27484R2627L699o3557p1464n2745k2032J4596O4082R9228
$$ y = [10023, -71517, -221562, -371296, -471207, -509041, -499860, -480521, -487745, -492167, -456288, -386207, -301146, -213180, -122981, -41510, 17002, 55318, 80452, 102420, 149400, 237680, 335662, 401736, 430360, 444615, 450435, 441665, 439694, 454666, 446644, 392012, 301882, 179125, 65553, 15707, 24093, 37441, 41085, 63240, 131663, 249293, 357611, 417299, 450692, 450594, 399864, 333771, 298473, 276735, 245725, 234879, 269469, 340576, 416136, 469059, 502812, 500484, 425855, 303303, 207861, 157182, 112070, 67320, 29381, -18310, -62408, -91688, -112729, -129694, -149126, -157460, -149410, -136479, -122021, -102878, -80748, -70389, -78017, -89896, -75838, -31085, 8704, 17323, -5405, -17892, 49848, 177332, 269959, 273658, 210101, 138637, 85892, 63860, 78456, 142538, 241766]
4929B41766O0676j2429n3058m9939r440K6916L0107L2614L9020K4195m958l8300
4917B87170k3029K9067L1182j5195o4478o9585l7206k9295k9037r978K5807O2806
4905A58229R5986R0080M5030m137o2920r7504o8172j8407m389j9476l0657k3026
4893F0637k078R527n972l8055m8156l5318m3730o0778m6979j838K0672J3823J5737
4880a62508K7422O6540J16537J20447P7699R992n3555r3758q9533k7352L0007
4869B1938L2945K1315O171k9770n4217l1803N746j5050n2483l1861K4096P1666
4857c1307J01482J00539N7737J4636k7711q1272j01993q2543m0655m276p405k218
4845a04986K9653M0422K1708K5293N1950K0501m4085p1262m9246k7692n8392o6848
$$ y = [241766, 302442, 290013, 236955, 187016, 177576, 204492, 234599, 267213, 306233, 330428, 325470, 287170, 264141, 293208, 324390, 309195, 244717, 175132, 137926, 108631, 79594, 69616, 95423, 158229, 254215, 344295, 389325, 385188, 322268, 224764, 156592, 138185, 133796, 114320, 83663, 60637, 58559, 68086, 62114, 24059, -24097, -59415, -103145, -163923, -210902, -212740, -192068, -178245, -162508, -135086, -68546, 47991, 168438, 246137, 256129, 202574, 108816, 19283, -8069, 21938, 54883, 76198, 82369, 52599, -1618, -33421, -27675, -42725, -95208, -127069, -102973, -31307, 70175, 170714, 228451, 243087, 215376, 134104, 32111, -50432, -91087, -95363, -102768, -104986, -75333, -34911, -13203, 12090, 64040, 84541, 40456, -30806, -80052, -107744, -166136, -232984]
4833b32984j7271L164l3364m7012O091O7519P5392L7015j2920m0959j1712N7869
4821a49172J04815J16306R6968N9719L9295N8045J00205J10466M5513o3537j57084
4810C61539j85243j18569j2978M3781M0326R140k3050m5349p4676j32519j66409
4799c04007r9282J5059O5474M6686J8476K0616K5842J9904K2644K0515R376K2022
4787a16675O2147O2672J1971k3838k8965K16N9711R1623N6212j5069o5648p5054
4775A9303p5850p9430o4040l0179N654K0052J2606q772j9437J3945P4314J13736
4763a8098R3456L2477r962j5542P838L1165O350m1204o2402p4448r5727j01042
4751b47139o6372j9219Q156K6630N2158M6624m948l9593k5413K8950Q7448R1397
$$ y = [-232984, -250255, -247091, -280455, -327467, -321376, -253857, -178465, -141450, -154370, -195329, -207041, -149172, -44357, 71949, 168917, 228636, 267931, 325976, 426181, 536647, 582160, 518623, 361539, 176296, 57727, 44749, 88530, 128856, 137996, 114946, 69597, -5079, -137598, -304007, -403289, -388230, -322756, -276070, -257594, -236978, -211136, -191232, -168588, -148073, -138697, -116675, -54528, 8144, 20115, -3723, -32688, -32472, 27239, 118862, 175074, 160005, 94357, 19303, -56547, -135977, -200017, -230196, -224542, -204490, -191884, -200656, -220093, -206148, -131834, -18098, 75358, 107835, 97873, 82331, 90169, 121334, 127684, 86480, 24078, -50370, -146097, -247139, -313511, -332730, -324574, -297944, -245786, -199162, -204110, -243703, -269116, -240166, -152718, -61321]
4739f1321N8692L5993L5649M9199O3873O8436N1261K3722j5442o5757o4166n844
4727A74295K5385n232p4655j20145r8832m0550J4969r07o1975o5628k8000J8290
4715b62985O2617O3068L7626L8734O8637Q5266Q3718R0655P9929J7386p1833j24596
4703A68222j05103l7798J6160K8009K7263L1716K6561L9090L7606m894k5341q258
4691A93233k059k2234l7625m7674o1080o1035n1266m534N3408O1577N2022M0285
4679A13018K4043M824l9075r7464j25976r5223l1853J4238J7366m0405q5977m4672
4667c87156K3899P0924J04658J13163R9250Q1588O0872L4150l361n5452r4738
4656D7797r1795o6508o7247m4383J7484N9612N9614J2271m0422n6984n0243j4953
$$ y = [-61321, -2629, 33364, 69013, 118212, 182085, 250521, 301782, 325504, 310062, 244305, 180139, 174295, 199680, 194448, 119793, -352, -99184, -139734, -124765, -125672, -187647, -253275, -281275, -262985, -200368, -137300, -99674, -60940, 7697, 92963, 176681, 267336, 347265, 364651, 292818, 168222, 63119, 25321, 41481, 69490, 96753, 128469, 155030, 194120, 231726, 226832, 201491, 193233, 191174, 168940, 131315, 83641, 22561, -38474, -89740, -94274, -40866, 20711, 72733, 113018, 137061, 141885, 102810, 5346, -120630, -215853, -247706, -233468, -216102, -256507, -342484, -387156, -363257, -292333, -187675, -74512, 24738, 106326, 167198, 201348, 197987, 142535, 47797, -43998, -110506, -177753, -222136, -204652, -145040, -85426, -73155, -113577, -170561, -220804, -235757]
4644b35757J1754L699k5930o2631p5821n4975l856O7541J00544N2655k7691m2475
4632b92943J7304Q0597J09193Q4318L5524q926m2591l7439j4522j3772k3185j9135
4620a25577j0525j1196p51K3327L5621L6446L6405L9484L9796K3543k2476n8512
4608E585m8984k6958o410K0798K3503J5108L4190P9132J07797O9651J3703K434
4596B89549l915k6584n3118p9001q2436m7440M250K6059J3198k2203l4085n443
4584b1169K6429N1384P2917O9456L1530j1071l4042m7491n6943n7181k0059L8399
4572D2159O1838L9952j1949p1888r5463p8530q593P0000P5832K4887j5685j2370
4560B0190j2082j2519K9022R2208Q7708j439q0276j22174j51488j34692p3421
$$ y = [-235757, -224003, -220304, -246234, -308865, -384686, -439661, -443517, -375976, -275432, -222777, -250468, -292943, -275639, -195042, -85849, -1531, 33993, 25067, -17524, -54963, -69485, -83257, -106442, -125577, -136102, -147298, -148049, -124722, -89101, -52655, -16250, 23234, 63030, 86573, 64097, 5585, -43399, -70357, -76767, -55969, -32466, -17358, 16832, 95964, 203761, 273412, 287115, 289549, 285634, 259050, 205932, 126931, 44495, -2945, 1305, 27364, 40562, 18359, -15726, -21169, 5260, 56644, 129561, 199017, 230547, 219476, 185434, 137943, 81000, 23819, 3760, 42159, 103997, 143949, 132000, 60112, -35351, -113881, -122474, -52474, 23358, 48245, 32560, 20190, 8108, -4411, 24611, 116819, 204527, 203088, 122812, 638, -150850, -285542, -358963]
4549c58963k0314j0944l6813l4496k417K6917K5668J191q50k837N332N5128Q4872
4536b68526Q0665Q6009O4767j5523p9638o4037J748M7627M5172J1973m3340p4249
$$ y = [-358963, -379277, -390221, -427034, -461530, -463947, -437030, -411362, -410171, -411021, -413858, -408526, -353398, -268526, -187861, -101852, -37085, -52608, -132246, -196283, -194535, -146908, -101736, -89763, -133103, -207352]
$$ [...]
##END NTUPLES=NMR SPECTRUM
##END=
