##TITLE=1H_51-2024
 CDCl3
 8 sc, 
 8.7.2024
##JCAMPDX= 6.0         $$ Bruker NMR JCAMP-DX V2.0
##DATA TYPE= NMR FID
##DATA CLASS= NTUPLES
##ORIGIN= UXNMR, Bruker Analytische Messtechnik GmbH
##OWNER= root
$$ XWIN-NMR		Version 3.5
$$ Mon Jul  8 13:58:46 2024 Russian Standard Time (UT+4h)  she@DPX200
##.OBSERVE FREQUENCY= 200.1314
##.OBSERVE NUCLEUS= ^1H
##.DELAY= (6, 6)
##.ACQUISITION MODE= SIMULTANEOUS
##.ACQUISITION SCHEME= undefined
##.AVERAGES= 8
##.DIGITISER RES= 18
##SPECTROMETER/DATA SYSTEM= spect
##.PULSE SEQUENCE= zg30
##.SOLVENT NAME= DMSO
##.SHIFT REFERENCE= (INTERNAL, DMSO, 0, 15.7039)
##AUDIT TRAIL= $$ (NUMBER, WHEN, WHO, WHERE, WHAT)
$$ ##TITLE= Audit trail, XWIN-NMR		Version 3.5
$$ ##JCAMPDX= 5.01
$$ ##ORIGIN= Bruker BioSpin GmbH
$$ ##OWNER= she
$$ F:/spectra/data/she/nmr/H-F/1/audita.txt
$$ ##AUDIT TRAIL=  $$ (NUMBER, WHEN, WHO, WHERE, WHAT)
(   1,<2024-07-08 13:57:43.98 +0400>,<she>,<DPX200>,
      <created by zg, POWCHK disabled, PULCHK disabled
       configuration hash MD5:
       00 E9 B6 7A A2 85 ED C7 34 08 36 98 17 FE 4E 26
       data hash MD5: 16K
       E5 DE CF 7C 57 EC 5D 3F 28 0E D7 B9 BE 92 FD 80>)
$$ ##END=
$$ 
$$ hash MD5
$$ 44 78 57 DA BC CE 6E 64 D5 24 50 B4 85 D6 C0 A4
##$RELAX= 
##$RELAX= 
##$RELAX= 
##$RELAX= 
##$RELAX= 
##$RELAX= 
$$ Bruker specific parameters
$$ --------------------------
##$DU= <F:/spectra>
##$EXPNO= 1
##$NAME= <H-F>
##$PROCNO= 1
##$TYPE= <nmr>
##$USER= <she>
##$AMP= (0..31)
100 100 100 100 100 100 100 100 100 100 100 100 100 100 100 100 100 100 
100 100 100 100 100 100 100 100 100 100 100 100 100 100 
##$AQSEQ= 0
##$AQ_mod= 1
##$AUNM= <au_zg>
##$AUTOPOS= <>
##$BF1= 200.13
##$BF2= 200.13
##$BF3= 200.13
##$BF4= 200.13
##$BF5= 200.13
##$BF6= 200.13
##$BF7= 200.13
##$BF8= 200.13
##$BYTORDA= 1
##$CFDGTYP= 0
##$CFRGTYP= 5
##$CHEMSTR= <none>
##$CNST= (0..31)
1 1 145 1 1 1 1 1 1 1 1 1 1 1 1 1 1 1 1 1 1 1 1 1 1 1 1 1 1 1 1 1 
##$CPDPRG= <>
##$CPDPRG1= <>
##$CPDPRG2= <>
##$CPDPRG3= <>
##$CPDPRG4= <mlev>
##$CPDPRG5= <mlev>
##$CPDPRG6= <mlev>
##$CPDPRG7= <mlev>
##$CPDPRG8= <mlev>
##$CPDPRGB= <>
##$CPDPRGT= <>
##$D= (0..31)
0 1.2 0 0 0 0 0 0 0 0.06 0 0.03 0 0 0 0 0.0002 0 0 0 0 0 0 0 0 0 0 0 0 
0 0 0 
##$DATE= 1720432663
##$DBL= (0..7)
120 120 120 120 120 120 120 120 
##$DBP= (0..7)
150 150 150 150 150 150 150 150 
##$DBP07= 0
##$DBPNAM0= <>
##$DBPNAM1= <>
##$DBPNAM2= <>
##$DBPNAM3= <>
##$DBPNAM4= <>
##$DBPNAM5= <>
##$DBPNAM6= <>
##$DBPNAM7= <>
##$DBPOAL= (0..7)
0.5 0.5 0.5 0.5 0.5 0.5 0.5 0.5 
##$DBPOFFS= (0..7)
0 0 0 0 0 0 0 0 
##$DE= 6
##$DECBNUC= <off>
##$DECIM= 24
##$DECNUC= <off>
##$DECSTAT= 4
##$DIGMOD= 1
##$DIGTYP= 9
##$DL= (0..7)
0 120 120 120 120 120 120 120 
##$DP= (0..7)
150 150 150 150 150 150 150 150 
##$DP07= 0
##$DPNAME0= <>
##$DPNAME1= <>
##$DPNAME2= <>
##$DPNAME3= <>
##$DPNAME4= <>
##$DPNAME5= <>
##$DPNAME6= <>
##$DPNAME7= <>
##$DPOAL= (0..7)
0.5 0.5 0.5 0.5 0.5 0.5 0.5 0.5 
##$DPOFFS= (0..7)
0 0 0 0 0 0 0 0 
##$DQDMODE= 0
##$DR= 18
##$DS= 0
##$DSLIST= <SSSSSSSSSSSSSSS>
##$DSPFIRM= 0
$$ [...]
##$SUBNAM2= <"">
##$SUBNAM3= <"">
##$SUBNAM4= <"">
##$SUBNAM5= <"">
##$SUBNAM6= <"">
##$SUBNAM7= <"">
##$SUBNAM8= <"">
##$SUBNAM9= <"">
##$SW= 24.0689651099613
##$SWIBOX= (0..15)
0 0 2 0 0 0 0 0 0 0 0 0 0 0 0 0 
##$SW_h= 4816.95568400771
##$TD= 16384
##$TD0= 1
##$TE= 0
##$TE2= 300
##$TE3= 300
##$TEG= 300
##$TL= (0..7)
0 120 120 120 120 120 120 120 
##$TP= (0..7)
150 150 150 150 150 150 150 150 
##$TP07= 0
##$TPNAME0= <>
##$TPNAME1= <>
##$TPNAME2= <>
##$TPNAME3= <>
##$TPNAME4= <>
##$TPNAME5= <>
##$TPNAME6= <>
##$TPNAME7= <>
##$TPOAL= (0..7)
0.5 0.5 0.5 0.5 0.5 0.5 0.5 0.5 
##$TPOFFS= (0..7)
0 0 0 0 0 0 0 0 
##$TUNHIN= 0
##$TUNHOUT= 0
##$TUNXOUT= 0
##$USERA1= <user>
##$USERA2= <user>
##$USERA3= <user>
##$USERA4= <user>
##$USERA5= <user>
##$V9= 5
##$VALIST= <valist>
##$VCLIST= <CCCCCCCCCCCCCCC>
##$VD= 0
##$VDLIST= <DDDDDDDDDDDDDDD>
##$VPLIST= <PPPPPPPPPPPPPPP>
##$VTLIST= <TTTTTTTTTTTTTTT>
##$WBST= 1024
##$WBSW= 4
##$XGAIN= (0..3)
0 0 0 0 
##$XL= 0
##$YL= 0
##$YMAX_a= 835157
##$YMIN_a= -935230
##$ZGOPTNS= <>
##$ZL1= 120
##$ZL2= 120
##$ZL3= 120
##$ZL4= 120
##$ABSF1= 10
##$ABSF2= 0
##$ABSG= 5
##$ABSL= 3
##$ALPHA= 0
##$AQORDER= 0
##$ASSFAC= 0
##$ASSFACI= 0
##$ASSFACX= 0
##$ASSWID= 0
##$AUNMP= <proc_1d>
##$AZFE= 0.1
##$AZFW= 0.1
##$BCFW= 1
##$BC_mod= 2
##$BYTORDP= 1
##$COROFFS= 0
##$CY= 11.3945322036743
##$DATMOD= 1
##$DC= 2
##$DFILT= <>
##$DTYPP= 0
##$F1P= 15.6554695791079
##$F2P= 12.8336369535428
##$FCOR= 0.5
##$FTSIZE= 0
##$FT_mod= 4
##$GAMMA= 1
##$GB= 0.15
##$INTBC= 1
##$INTSCL= 1
##$ISEN= 128
##$LB= 0.24
##$LEV0= 0
##$LPBIN= 0
##$MAXI= 10000
##$MC2= 0
##$MEAN= 0
##$ME_mod= 0
##$MI= 1.114404
##$NCOEF= 0
##$NC_proc= 0
##$NLEV= 6
##$NOISF1= 3.799351
##$NOISF2= 2.8
##$NSP= 1
##$NTH_PI= 0
##$NZP= 0
##$OFFSET= 15.70392
##$PC= 1
##$PHC0= -25654.36
##$PHC1= 16.98748
##$PH_mod= 1
##$PKNL= yes
##$PPARMOD= 0
##$PSCAL= 0
##$PSIGN= 0
##$REVERSE= no
##$SF= 200.130013532006
##$SI= 16384
##$SIGF1= 3
##$SIGF2= 2
##$SINO= 400
##$SIOLD= 16384
##$SREGLST= <1H.CDCl3>
##$SSB= 0
##$STSI= 0
##$STSR= 0
##$SW_p= 3612.71676300578
##$SYMM= 0
##$S_DEV= 0
##$TDeff= 0
##$TDoff= 0
##$TI= <>
##$TILT= no
##$TM1= 0
##$TM2= 0
##$TOPLEV= 0
##$USERP1= <user>
##$USERP2= <user>
##$USERP3= <user>
##$USERP4= <user>
##$USERP5= <user>
##$WDW= 1
##$XDIM= 8192
##$YMAX_p= 0
##$YMIN_p= 0
$$ End of Bruker specific parameters
$$ ---------------------------------
##NTUPLES= NMR FID
##VAR_NAME=  TIME,          FID/REAL,        FID/IMAG
##SYMBOL=    X,             R,               I
##VAR_TYPE=  INDEPENDENT,   DEPENDENT,       DEPENDENT
##VAR_FORM=  AFFN,          ASDF,            ASDF
##VAR_DIM=   8192,          8192,            8192
##UNITS=     SECONDS,       ARBITRARY UNITS, ARBITRARY UNITS
##FACTOR=    0.0002076,     1,               1
##FIRST=     0,             0,               0
##LAST=      1.7004516,     0,               0
##MIN=       0,             -935230,         0
##MAX=       1.7004516,     835157,          0
$$ Real data points
##PAGE= N=1
##DATA TABLE= (X++(R..R)), XYDATA
$$ [...]
$$ plain form
2239 -240 1214 -471 -1232 1080 1189 341 694 348 -838 588 1780 681 -486 1350 1492 -835 -387
2256 -387 1569 772 -434 233 -528 -1306 524 1235 -1212 -1011 1874 230 -2820 -133 3012 687 -1943
2273 -1943 238 1659 -449 -879 333 675 86 -313 -1000 -1015 731 53 -1853 -317 898 -1023 -2112
2290 -2112 933 1899 -1250 -866 1450 289 -845 898 1412 -829 -278 776 -455 -836 1438 805
2306 805 -1197 -335 1009 -782 -1733 673 1332 -812 -1179 996 434 438 776 424 737 1714 687 -1199
2324 -1199 1269 3127 424 -1788 964 2106 -723 -1433 1203 1126 -630 -687 -351 -359 1127 1211 -1009 -987
2342 -987 1745 616 -2446 -728 2698 464 -3147 -1146 1072 -122 -1437 -1270 -383 30 -987 -2298
2358 -2298 -663 1988 35 -3069 -902 2367 -665 -2649 1028 2449 -859 -1996 1176 917 -743
$$ packed form
2239b40J454j685p61K312J09q48L53l46j186J426J192j099j167J836J42k327M48
2256c87J956p97j206O67p61p78J830P11k447K01K885j644l050K687L145k325k630
2273a943K181J421k108m30J212L42n89l99o87j5J746o78j906J536J215j921j089
2290b112L045R66l149L84K316j161j134J743N14k241N51J054j231l81K274o33
2306H05k002Q62J344j791r51K406O59k144l67K175n62ML38l52L13R77j027j886
2324a199K468J858k703k212K752J142k829p10K636p7j756n7L36qJ486Q4k220K2
2342i87K732j129l062J718L426k234l611K001K218j194j315J67Q87M13j017j311
2358b298J635K651j953l104K167L269l032j984L677J421l308j137L172k59j660
$$ plain form
2373 -743 139 772 -666 -906 298 -808 -1244 662 574 -1735 -1402 1022 440 -1076 -158 1078 133 -504
2391 -504 -337 552 1382 869 -1406 -820 2348 970 -2548 -81 3193 133 -3187 500 3175 -119
2407 -119 -1874 910 1877 -251 -347 330 985 1348 834 -905 -555 1968 821 -1820 -333 1855 -130
2424 -130 -2045 -730 970 -414 -1341 -506 -626 -943 -298 -1011 -650 731 262 -1743 -691 1772 299
2441 299 -1630 237 1263 -627 -1020 511 646 -568 -63 -93 -730 72 831 -1196 -777 1788 588
2458 588 -2036 -519 2677 686 -1914 475 2133 -277 -1514 190 1535 246 -779 -556 189 1126
2474 1126 333 -1312 329 1825 -296 -1865 1017 2065 -50 -526 975 734 -316 668 776 -311
2490 -311 460 1063 -560 -1139 1455 1196 -1280 -760 569 -57 -1377 71 644 -315 -551 34 -283 -455
$$ packed form
2373g43Q82O33j438k40J204j106m36J906q8k309L33K424n82j516R18J236r45o37
2391e04J67Q89Q30n13k275N86L168j378l518K467L274l060l320L687K675l294
2407a19j755K784R67k128r6O77O55L63n14j739L50K523j147k641J487K188j985
2424a30j915J315J700j384r27Q35j20l17O45p13L61J381m69k005J052K463j473
2441B99j929J867J026j890l93J531J35j214N05l0o37Q02P59k027M19K565j200
2458E88k624J517L196j991k600K389J658k410j237J704J345j289j025K23P45R37
2474A126p93j645J641J496k121j569K882J048k115m76J501k41j050R84J08j087
2490c11P71O03j623n79K594k59k476N20J329o26j320J448N73r59k36N85l17j72
$$ plain form
2508 -455 565 257 -502 289 70 -1349 -630 869 -64 -1147 274 231 -1630 -1336 867 38 -1502 -172
2526 -172 399 -646 -848 463 142 -596 109 373 -756 -38 1248 -156 -864 664 625 -751 83 1357
2544 1357 -324 -353 761 529 -736 409 1781 -356 -857 847 1178 -523 -9 1569 597 -508 269
2561 269 685 40 772 833 -485 103 860 -220 -720 1102 1049 -524 -72 925 -382 -572 1384 350
2579 350 -1056 46 1339 -290 -1222 872 1485 -1055 -1212 769 588 -783 -237 -46 -507 -336 -358 -1190
2597 -1190 50 914 -749 -1597 -80 746 -802 -635 934 93 -1182 11 236 -822 -486 838 -264
2614 -264 -1114 295 752 -929 -187 1077 -376 -811 528 689 -897 72 1377 29 -715 624 880
2631 880 -140 123 731 -421 -141 669 -312 -514 947 1061 -1277 -1238 1133 410 -745 -15 864 -331
$$ packed form
2508d55J020l08p59P91k19j419P19J499r33j083J421m3j861K94K203q29j540J330
2526a72N71j045k02J311l21p38P05K64j129P18J286j404p08J528l9j376Q34J274
2544A357j681k9J114k32j265J145J372k137n01J704L31j701N14J578r72j105P77
2561B69M16o45P32O1j318N88P57j080n00J822n3j573M52R97j307j90J956j034
2579C50j406J102J293j629r32K094O13k540j57J981j81j371N46J91m61J71k2q32
2597a190J240Q64j663q48J517Q26j548J67J569q41j275J193K25j058L36J324j102
2614b64q50J409M57j681P42J264j453m35J339J61j586R69J305j348p44J339K56
2631H80j020K63O08j152K80Q10r81k02J461J14k338L9K371p23j155P30Q79j195
$$ plain form
2649 -331 -281 457 -478 -290 932 318 -1322 -76 1620 -506 -1540 566 698 -1209 -1234 184 -207 -593
2667 -593 -76 -632 -1244 -87 153 -1312 -616 457 -315 -1760 -145 549 -606 -1088 575 -425 -1659
2684 -1659 26 367 -1018 -625 714 -445 -1605 396 998 -900 -516 747 -39 -989 480 1000 -238
2701 -238 -206 404 461 193 41 12 147 714 0 -659 510 1832 -386 -1035 1179 1466 -1366 -781 1820
2720 1820 962 -916 676 1413 -316 -187 1770 359 -1292 968 1788 -581 -804 1637 1663 -994 -620
2737 -620 1141 628 -613 -757 650 927 40 -914 -420 1332 307 -1522 19 1532 -563 -1788 711
2754 711 1789 -1294 -1225 1091 151 -1476 98 1348 -749 -586 1062 372 -854 734 1094 -554 -680
2771 -680 1096 503 -1050 53 1354 -133 -799 144 362 44 5 153 204 1159 58 -337 181 1581
$$ packed form
2649c31N0P38r35J88J222o14j640J246J696k126j034K106J32j907k5J418l91l86
2667e93N17n56o12J157K40j465O96J073p72j445J615O94j155m82J663j000j234
2684a659J685L41j385L93J339j159j160K001O02j898L84J263p86r50J469N20j238
2701b38L2O10N7k68j52k9J35N67p14o59J169J322k218o49K214K87k832N85K601
2720A820q58j878J592P37j729J29J957j411j651K260Q20k369k23K441K6k657L74
2737f20J761n13j241j44J407K77q87r54M94J752j025j829J541J513k095j225K499
2754G11J078l083O9K316r40j627J574J250k097J63J648o90j226J588L60j648j26
2771f80J776n93j553J103J301j487o66R43K18l18l9J48N1R55j101l95N18J400
$$ plain form
2789 1581 72 -1469 641 1129 -574 -497 843 184 -594 593 682 -423 93 1625 -351 -1512 921
2806 921 1643 -1406 -1042 2144 959 -1890 -707 1687 374 -1258 -121 728 -269 -766 -378 76 70 -854
2824 -854 -1067 -80 240 -1129 -985 843 243 -1696 -713 1092 -553 -1920 72 815 -1645 -1484 590
2841 590 119 -1513 32 776 -1176 -1336 556 267 -1052 -358 632 -411 -1030 173 343 -30 -461 -342
2859 -342 -247 434 307 -607 -159 1249 -49 -1376 226 928 -518 -593 1143 377 -1044 309 1180 -354
2877 -354 -279 1191 99 -1079 389 1198 -363 -331 888 151 -1073 25 804 -678 -318 531 -52 -518
2895 -518 254 629 -79 -105 301 -66 -121 188 173 -451 456 274 -800 -292 832 154 -1319 166 679 -858
2915 -858 -812 832 -28 -856 310 262 -664 -538 630 113 -650 -8 481 -512 -777 679 356 -253 371
$$ packed form
2789A581j509j541K110M88j703P7J340o59p78J187Q9j105N16J532j976j161K433
2806I21P22l049L64L186j185k849J183K394j313j632J137Q49r97m97L88M54or24
2824h54k13R87L20j369J44J828o00j939R83J805j645j367J992P43k460J61K074
2841E90m71j632J545P44j952j60J892k89j319O94R90j043o19J203J70l73m31J19
2859c42R5O81j27r14M48J408j298j327J602P02j446p5J736p66j421J353Q71j534
2877c54P5J470j092j178J468Q09j561L2J219p37j224J098P79j482L60Q49n83m66
2895e18P72L75p08k6M06l67n5L09j5o24R07j82j074N08J124o78j473J485N13j537
2915h58M6J644q60q28J166m8r26J26J168n17p63O42M89r93k65J456l23o09O24
$$ plain form
2934 371 512 -550 196 711 6 -607 467 496 -106 -72 630 89 111 906 260 -299 821 867 -152 153
2954 153 914 93 -848 608 1375 -193 -92 1157 280 -451 674 995 -609 -775 779 149 -817 398
2972 398 805 -13 -903 235 -183 -361 178 44 -374 110 147 -766 -626 643 290 -1186 -416 693 -632
2991 -632 -356 582 -303 -1082 147 267 -947 -241 730 57 -1049 -147 259 -497 -312 372 -137 -519 -6
3010 -6 -231 -564 -87 806 -265 -853 721 524 -790 -515 1078 -7 -638 515 656 -370 131 1074
3028 1074 61 -488 492 485 30 412 673 132 -125 591 73 -390 384 3 -740 -45 698 22 -494 348
3048 348 542 -421 -66 318 -428 -244 438 156 -973 -153 937 -431 -781 332 569 -1159 -651 823
3066 823 47 -886 2 -254 -670 -390 54 -462 -301 544 -376 -988 -207 450 -441 -372 212 -396 -758 437
$$ packed form
2934C71J41j062P46N15p05o13J074K9o02L4P02n41K2P95o46n59J120M6j019L05
2954A53P61q21r41J456P67j568J01J249q77p31J125L21j604j66J554o30r66J215
2972C98M07q18q90J138m18j78N39j34m18M84L7r13J40J269l53j476P70J109j325
2991f32K76R38q85p79J229J20j214P06R71o73j106R02M06p56J85O84n09l82N13
3010fk25l33M77Q93j071n88J574j97j314K75J593j085o31J153J41j026N01R43
3028A074j013n49R80pm55L82K61n41k57P16n18m63P74l81p43O95P43o76n16Q42
3048C48J94r63L55L84p46J84O82k82j129Q20J090j368l50J113K37j728N08J474
3066H23p76r33Q88k56m16K80M44n16J61Q45r20o12P81O57q91O9N84o08l62J195
$$ plain form
3086 437 3 -612 164 824 -645 -820 705 723 -954 -8 1302 -449 -911 779 992 -656 -969 1035
3104 1035 617 -934 262 730 439 -207 354 127 -109 314 -453 3 621 21 -1077 -389 1163 247
3122 247 -670 382 654 -463 -614 690 458 -407 91 425 -565 3 728 -102 -800 377 199 -848
3140 -848 -374 800 57 -472 -85 103 -803 -9 593 -707 -645 363 -216 -1240 -54 510 -552 -818
3158 -818 504 -83 -813 467 682 -467 -308 337 64 -849 -7 397 -517 233 395 -583 -274 850 595
3177 595 -576 211 1253 -193 -509 619 968 -396 -251 449 290 -47 573 57 18 695 896 -571
3195 -571 57 1311 631 -721 114 674 -562 -170 549 216 -335 402 739 0 74 677 424 -363 349
3214 349 306 -230 431 583 -160 -506 799 153 -858 97 789 -10 -795 291 39 -394 147 415 -552
$$ packed form
3086D37m34o15P76O60j469j75J525J8j677R46J310j751m62J690K13j648l13K004
3104A035m18j551J196M68k91o46N61k27k36M23p67M56O18o00j098O88J552r16
3122B47r17J052K72j117j51J304k32q65M98L34r90N68P25q30o98J177j78j047
3140h48M74J174p43n29L87J88r06P94O02j300O2J008n79j024J186N64j062k66
3158h18J322n87p30J280K15j149J59O45k73r13Q42M04r14P50J62r78L09J124k55
3177E95j171P87J042j446l16J128L49j364J45P00j59l37O20n16l9O77K01j467
3195e71O28J254o80j352Q35N60j236L92P19l33n51P37L37p39P4O03k53p87P12
3214C49m3n36O61J52p43l46J305o46j011R55O92p99p85J086k52m33N41K68r67
$$ plain form
3233 -552 -342 599 -256 -716 458 673 -740 -855 367 162 -631 316 659 -31 -828 -47 -301 -188 654
3252 654 463 -408 7 763 -48 -109 1001 246 -580 14 489 -152 -442 567 -37 -799 70 334 -164 -97
3272 -97 647 46 -532 -113 839 -287 -261 785 213 -608 69 552 -125 -385 526 -115 -485 -70 -161 -348
3292 -348 -103 159 -806 -189 -7 -115 -829 4 321 -569 -886 58 -150 -726 -122 521 -711 -1016 97
3311 97 -386 -810 -81 117 -524 -1009 289 -57 -170 -189 -35 -303 33 484 -537 -288 640 315 -823 -253
3331 -253 543 86 -470 98 456 -437 -416 131 12 -479 83 -341 -448 493 458 -329 -433 1031 482 -654
3351 -654 272 585 45 -386 553 485 -695 210 443 64 -187 243 -211 -259 648 349 -186 -211 721 -130 -638
3372 -638 361 1092 -171 115 230 -32 -100 148 -8 -453 -33 237 -994 -701 874 261 -1001 -165 842
$$ packed form
3233e52K10R41q55m60J174K15j413j15J222k05p93R47L43o90p97P81k54J13Q42
3252F54j91q71M15P56q11o1J110p55q26N94M75o41k90J009o04p62Q69K64m98O7
3272i7P44o01n78M19R52j126K6J046n72q21O77M83o77k60R11o41l70M15r1j87
3292c48K45K62r65O17J82j08p14Q33L17q90l17R44k08n76O04O43j232l05J113
3311I7m83m24P29J98o41m85J298l46j13j9J54k68L36M51j021K49R28l25j138N70
3331b53P96m57n56N68L58q93K1N47j19m91N62m24j07R41l5p87j04J464n49j136
3351f54R26L13n40m31R39o8j180R05K33l79k51M30m54m8R07k99n35k5R32q51n08
3372f38R99P31j263K86J15k62o8K48j56m45M20K70j231K93J575o13j262Q36J007
$$ plain form
3391 842 196 -710 241 636 -114 136 23 150 451 780 153 -507 347 561 -592 73 1150 -31 -852
3410 -852 -14 658 -376 -207 575 363 -117 147 22 -7 361 574 -189 -62 795 278 -644 155 1122 -103
3430 -103 -563 182 1014 -100 -122 391 255 -72 236 -62 123 326 132 -318 198 435 -119 -744 259 678
3450 678 -857 -522 213 -241 -286 166 28 -467 -213 270 -1133 -917 671 68 -1326 -509 863 -163
3468 -163 -782 60 546 -313 -809 -232 -168 -18 35 -503 -129 263 -180 -373 -5 485 -280 -607 210 439 -574
3489 -574 -325 423 -216 -484 188 194 -341 42 639 58 -113 282 53 -637 222 717 -598 -477 664 377
3509 377 -341 -92 664 -32 -310 306 3 -49 582 -15 -365 -122 455 -230 -548 774 743 -409 -346 700
3529 700 305 -639 -24 95 -420 -210 178 -106 -304 -85 73 -399 -322 303 -121 -301 373 80 -746 -167
$$ packed form
3391H42o46r06R51L95p50K50j13J27L01L29o27o60Q54K14j153O65J077j181q21
3410h52Q38O72j034J69P82k12m80K64j25k9L68K13p63J27Q57n17r22P99R67j225
3430a03m60P45Q32j114k2N13j36l27L08k98J85K03j94m50N16K37n54o25J003M19
3450F78j535L35P35m54m5M52j38m95K54M83j403K16J588o03j394Q17J372j026
3468a63o19Q42M86q59m96N77O4J50N3n38L74L92m43j93L68M90p65l27Q17K29j013
3489e74K49P48o39k68O72On35L83N97n81j71L95k29o90Q59M95j315J21J141k87
3509C77p18K49P56o96k78O16l03n2O31n97l50K43N77o85l18J322l1j152O3J046
3529G00l95r44O15J19n15K10L88k84j98K19J58m72P7O25m24j80O74k93q26N79
$$ plain form
3549 -167 159 -359 -22 707 132 -723 -225 329 -77 -105 253 -141 -501 -20 401 -353 30 655 0 -423
3569 -423 253 429 -153 151 685 217 -493 498 692 -244 401 364 -372 -159 716 18 -438 33 464 -33
3589 -33 -526 330 366 -314 -54 277 -137 -96 414 513 -137 79 -74 -314 -63 59 -152 -12 355 130 -907
3610 -907 -172 482 -167 -942 183 519 -663 -561 351 -183 -106 -55 -171 -567 188 288 -339 -574 202 -137
3630 -137 -641 -256 439 -172 -124 173 -278 -601 -16 647 -471 -140 428 180 -547 131 642 -237 -194 680
3650 680 -21 -43 426 252 -11 45 164 -92 -155 450 78 -454 369 624 -292 -315 409 227 -736 310 642
3671 642 129 -149 649 579 -521 205 319 -21 -365 375 37 -316 -132 233 -451 -415 444 -95 -525 173
3691 173 5 -368 75 184 -109 -271 459 341 -432 103 327 -339 -483 297 109 -555 291 425 -273 -492
$$ packed form
3549a67L26n18L37P29n75q55M98N54m06k8L58l94l60M81M21p54L83O25o55m23
3569d23O76J76n82L04N34m68p10R91J94r36O45l7p36K13Q75o98m56M71M31m97
3589c3m93Q56L6o80K60L31m14M1N10R9o50K16j53k40K51J22k11J40L67k25j037
3610i07P35O54o49p75J125L36j182J02R12n34P7N1j16l96P55J00o27k35P76l39
3630a37n04L85O95o11M8K97m51l23N85O63j118L31N68k48p27O78N11q79M3Q74
3650F80p01k2M69j74k63N6J19k56o3O05l72n32Q23K55r16k3P24j82r63J046L32
3671F42n13k78P98p0j100P26J14l40l44P40l38l53J84L65o84L6Q59n39m30O98
3691A73j68l73M43J09k93j62P30j18p73N35K24o66j44P80j88o64Q46J34o98k19
$$ plain form
3711 -492 303 -90 -403 239 631 -828 -381 683 459 -291 108 684 234 -269 133 338 252 369 -15 -716
3731 -716 164 479 -502 -337 187 503 -380 -119 311 -17 -147 425 526 -157 148 609 -78 -258 694 120
3751 120 -587 202 243 -312 -252 426 -53 -1069 18 472 -236 -662 297 261 -430 -36 -22 -340 -29 330 -394
3772 -394 -811 587 137 -744 -380 453 17 -780 -398 228 -253 -230 -49 -559 119 -6 -722 -447 439 282
3792 282 -731 -391 870 333 -556 -148 477 -138 -340 361 238 -201 -55 -45 -185 115 591 -111 -295 174
3812 174 424 -484 -268 619 264 82 149 285 -175 -129 179 -229 28 232 -392 -358 343 177 -411 -286 133
3833 133 -12 -786 -102 658 -53 -325 356 255 -575 -129 413 -59 -113 404 -235 -317 300 171 -504 86 208
3854 208 53 -404 49 57 -363 -49 36 20 -94 586 170 -333 162 127 -501 -149 606 96 -594 -393 243 -68
$$ packed form
3711d92P95l93l13O42L92j459M47J064k24p50L99N76m50n03M02K05q6J17l84p01
3731g16Q80L15r81J65N24L16q83K61M30l28j30N72J01o83L05M61o87j80R52n74
3751A20p07P89M1n55O0O78m79j016J087M54p08m26R59l6o91L94J4l18L11L59p24
3772c94m17J398m50q81L64Q33m36p97L82O26m81K3J81n10O78j25p16K75Q86j57
3792B82j013L40J261n37q89M08O25o15k02P01j23m39J46J0j40L00M76p02j84M69
3812A74K50r08K16Q87l55j82O7J36m60M6L08m08K57K04o24L4P01j66n88J25M19
3833A33j45p74O84P60p11k72O81j01q30M46N42m72n4N17o39q2O17j29o75N90J22
3854B08j55m57M53Qm20L14Q5j6j14O80m16n03M95l5o28L52P55n10o90K01O36l11
$$ plain form
3876 -68 -419 360 266 -320 -109 471 252 -130 351 264 -22 505 384 -286 466 424 -156 -331 422 395 -317 -213
3898 -213 859 411 -410 207 232 105 -54 307 -203 -11 276 85 -114 118 227 -170 -139 -178 -79 -116 317
3919 317 356 -211 3 334 -345 -479 417 283 -512 -298 579 -74 -140 70 478 -488 -611 478 -7 -721
3939 -721 -97 307 -199 -324 -116 -246 -266 206 -463 -422 82 157 -737 -296 689 4 -748 129 436 -240 -535
3960 -535 204 124 -398 -189 463 -146 -276 490 40 60 90 -21 -46 171 477 265 -131 292 -186 54 -79
3981 -79 613 -272 -342 -23 -9 -235 -133 265 -391 -210 303 4 -567 322 57 -19 -448 313 111 -372 -146
4002 -146 439 -10 -558 99 -374 -32 220 -88 -446 -180 262 -340 -544 475 265 -294 -373 175 300 -270
4022 -270 269 89 -170 -74 272 -307 -283 542 -45 -521 -261 577 4 -333 501 240 -214 -64 499 89 -278
$$ packed form
3876f8l51P79r4n86K11N80k19l82M81q7k86N27j21o70P52m2n80j75P53k7p12J04
3898b13J072m48q21O17K5j27j59L61n10J92K87j91j99K32J09l97L1l9R9l7M33
3919C17L9n67K14L31o79j34Q96j34p95K14Q77o53o6K10M08r66j23J089m85p14
3939g21O24M04n06j25K08j30k0M72o69M1N04P5q94M41R85o85p52Q77L07o76k95
3960e35P39q0n22K09O52o09j30P66m50K0L0j11k5K17L06k12l96M23m78K40j33
3981g9O92q85p0L19J4k26J02L98o56J81N13k99n71Q89k65p6m29P61k02m83K26
4002a46N85m49n48O57m73L42K52l08l58K66M42o02k04J019k10n59p9N48J25n70
4022b70N39j80k59R6L46n79K4Q25n87m76K60Q38n73l37Q34k61m54J50N63m10l67
$$ plain form
4043 -278 381 -18 -204 313 596 121 -42 436 273 -185 371 173 -176 254 337 -13 -251 177 183 -117 18
4064 18 483 -221 -168 144 234 19 193 435 -53 -256 363 -147 -295 -82 362 -273 -341 -6 -101 -479 -166 -62
4086 -62 -237 -267 22 -287 -441 459 253 -636 -284 297 -337 -486 281 171 -583 74 520 -364 -605 326 8
4107 8 -465 -555 387 77 -32 -19 -55 -370 -38 225 131 149 300 98 -348 88 330 -95 -260 553 -131 -383
4129 -383 149 217 -84 267 363 -170 -390 364 78 -164 -17 280 205 -353 219 283 -234 -70 383 -155 -65 185
4151 185 189 -229 -186 182 -226 -116 276 78 -342 166 350 -300 -396 211 334 -446 84 153 -161 -78 19 70 -286
4174 -286 174 -237 -493 -295 94 -95 -331 198 -183 -402 -156 27 -192 -107 206 -112 -260 156 127 -137 -122
4195 -122 466 186 -219 -107 440 -287 -411 271 31 -259 51 250 -297 157 389 239 73 234 157 -189
$$ packed form
4043b78O59l99j86N17K83m75j63M78j63m58N56j98l49M30Q3l50k38M28Ol00J35
4064A8M65p04N3L12R0k15J74K42m88k03O19n10j48K13M44o35o8L35r5l78L13J04
4086f2j75l0K89l09j54R00k06q89L52N81o34j49P67j10p54O57M46q84k41R31l18
4107Hm73r0R42l10j09J3l6l15L32K63r4J8J51k02m46M36K42m25j65Q13o84k52
4129c83N32O8l01L51R6n33k20P54k86k42J47K97p5n58N72O4n17J64M53n38R0K50
4151A85Mm18M3L68m08J10L92j98m20N08J84o50r6O07J23p80N30O9l14Q3R7N1l56
4174b86M60m11k56J98L89j89k36N29l81k19K46J83k19Q5L13l18j48M16k9k64J5
4195a22N88k80m05J12N47p27j24O82k40k90L10J99n47M54K32j50j66J61p7l46
$$ plain form
4215 -189 -47 485 -95 -198 233 73 -334 -47 394 -162 -229 310 245 -452 -224 214 -86 -443 -179 -61 -382
4236 -382 101 408 -55 -59 173 225 -614 -238 217 -516 79 508 -97 -396 -7 134 -243 -198 296 -240 -227 -289
4258 -289 -177 -18 225 197 14 -142 -103 104 -356 2 189 -77 -316 172 184 -466 63 284 -125 -145 177
4279 177 -372 -374 242 363 -127 -250 217 78 -181 -102 442 510 134 59 241 227 -137 167 -28 440 388 -101
4301 -101 -275 257 115 -560 -39 416 -188 -152 273 13 -355 197 263 -483 -204 78 139 -512 70 259 -53
4322 -53 -523 66 -130 -363 -18 633 -351 -241 -11 83 -139 -88 64 -105 175 65 -15 -377 -67 155 124 150
4344 150 701 181 -172 386 300 -31 -277 319 48 -288 309 163 -653 261 465 -357 -182 488 192 178 -163
4365 -163 296 139 -60 462 -267 -333 416 233 -288 309 265 322 -282 222 457 -385 155 460 285 -153 90
$$ packed form
4215a89J42N32n80j03M31j60m07K87M41n56o7N39o5o97K28M38l00l57K64J18l21
4236c82M83L07m63mK32N2q39L76M55p33N95M29o05k99L89J41l77M5M94n36J3o2
4258b89J12J59K43k8j83j56L9K07m60L58J87k66k39M88J2o50N29K21m09k0L22
4279A77n49kO16J21m90j23M67j39k59P9N44O8l76p5J82j4l64L04j95M68n2m89
4301a01j74N32j42o75N21M55o04L6M25k60l68N52O6p46K79K82O1o51N82J89l12
4322e3m70N89j96k33L45O51r84J10K30R4k22N1J52j69K80j10q0l62L10K22l1K6
4344A50N51n20l53N58q6l31k46N96k71l36N97j46q16R14K04q22J75O70k96j4l41
4365a63M59j57j99N22p29o6P49j83n21N97m4N7o04N04K35q42N40L05j75m38K43
$$ plain form
4386 90 59 -252 313 396 271 -192 314 93 -200 71 -75 -304 -347 113 -282 -527 -140 185 -179 -360 30
4407 30 -139 -596 -94 -15 -144 -393 197 -51 -349 164 -3 -386 21 399 -21 -221 61 37 -217 -210 -106 -351
4429 -351 -130 475 1 -395 -281 369 -209 -59 -2 228 -155 -65 312 -221 -59 342 -199 -158 309 160 -36
4450 -36 -10 572 -159 -422 42 231 -327 -12 327 -221 -266 10 -1 -655 -85 -138 109 -268 234 138 -302 -208
4472 -208 -197 -318 32 54 -103 -96 -258 25 -219 -83 315 -73 -203 132 179 -100 -69 288 -344 -174 312 209
4494 209 -543 -354 371 275 -401 -197 332 -70 -40 -16 22 -189 174 351 -9 -34 -209 -180 -37 279 -182 -98
4516 -98 121 410 -134 214 667 1 -168 111 381 -17 -111 574 150 -89 94 37 -169 -14 491 -120 -50
4537 -50 23 91 -365 43 399 -261 51 106 387 82 -289 -16 -115 24 125 226 -138 22 -191 36 41 371
$$ packed form
4386I0l1l11N65Q3j25m63N06k21k93K71j46k29m3M60l95k45L87L25l64j81L90
4407C0j69m57N02P9j29k49N90k48k98N13j67l83M07L78m20k00K82k4k54PJ04k45
4429c51K21O05m74l96J14O50n78J50N7K30l83R0L77n33J62M01n41M1M67j49j96
4450c6K6N82p31k63M64J89n58L15L39n48m5K76j1o54N70n3K47l77N02r6m40R4
4472b08J1j21L50K2j57Pj62K83k44J36L98l88j30L35M7k79L1L57o32J70M86j03
4494B09p52J89P25r6o76K04N29m02L0K4L8k11L63J77l60k5j75K9J43L16m61Q4
4516i8K19K89n44L48M53o66j69K79K70l98r4O85m24k39J83n7k06J55N05o11P0
4537e0P3O8m56M08L56o60L12N5K81l05l71K73r9J39J01J01l64J60k13K27NL30
$$ plain form
4559 371 73 -182 -59 133 -515 70 -83 -143 -331 -78 -29 -456 -729 130 2 -365 104 124 -322 -359 267
4580 267 -57 -374 -179 404 -59 -110 280 -329 -208 208 -181 -355 281 266 26 -109 82 187 -241 279 167
4601 167 -15 -67 105 168 -126 61 26 -252 159 325 262 -374 213 5 -347 -137 -50 -47 -136 -38 36 -65 -63 101
4625 101 298 -276 354 -35 -398 -190 471 -10 -288 -257 130 -371 -221 213 -134 -197 174 -92 33 -166 -37
4646 -37 -418 -238 435 -489 -164 87 267 -267 -15 460 -45 -56 13 117 -152 124 64 -156 -100 340 98 -108
4668 -108 270 167 435 -37 207 293 -403 -162 151 275 78 12 96 329 99 -24 120 85 287 111 89 311
4690 311 26 -170 -71 208 -142 -150 356 190 21 315 -92 -181 -121 295 -48 -150 43 -53 -174 -44 132 314
4712 314 209 139 238 -86 -26 249 150 -19 -212 285 -79 -62 290 -86 -225 70 339 -240 -33 82 -59 -310
$$ packed form
4559C71k98k55J23J92o48N85j53o0j88K53M9m27k73Q59j28l67M69K0m46l7O26
4580B67l24l17J95N83m63n1L90o09J21M16l89j74O36j5k40j35J91J05m28N20j12
4601A67j82n2J72O3k94J87l5k78M11J66o3o36N87k08l52K10Q7Lq9R8P4j01KJ64
4625A01J97n74O30l89l63K08O61m81k78L1L87n01J50M34l47o3L71k66J25j99J29
4646c7l81J80O73r24L25K51J80n34K52M75n05j1O9J04k69K76o0k20N6M40k42k06
4668a08L78j03K68m72K44Q6o96K41L13J24j97o6Q4K33k30j23J44l5K02j76k2K22
4690C11k85j96R9K79l50qN06j66j69K94m07q9O0M16l43j02J93r6j21J30J76J82
4712C14j05p0R9l24O0K75r9j69j93M97l64J7L52l76j39K95K69n79K07J15j41k51
$$ plain form
4734 -310 35 36 68 -105 2 -172 -174 112 202 -82 73 107 -121 -129 75 237 -306 252 438 -72 -108 30 292
4757 292 -181 125 46 -87 328 496 33 -405 234 426 -176 -125 385 143 -193 237 -117 -121 -60 124 -22 -320
4779 -320 496 180 -691 -441 -28 202 -529 -185 -158 -528 48 429 42 -200 255 190 -106 -100 81 -226 78
4800 78 -25 49 -254 76 117 -310 -486 132 207 -431 -189 317 176 -367 -268 136 -286 68 276 -155 -64 65
4822 65 -292 -272 464 193 -248 -266 207 -45 -239 51 -145 110 37 318 -140 -400 403 389 -12 109 465 -71
4844 -71 -227 115 61 -371 -24 9 61 132 449 201 -104 249 58 -39 101 108 -273 -340 -43 397 -238 -25 394
4867 394 113 -21 -57 80 -200 -250 107 -204 -187 -44 -116 -67 -253 -132 -73 110 -34 -18 -37 -122 32 213 -50
4890 -50 185 -61 77 2 100 -101 -169 214 80 -212 15 366 -87 -340 30 244 167 -48 -9 -196 7 173
$$ packed form
4734c10L45JL2j73J07j74kK86R0k84J55L4k28qK04J62n43N58J86n10l6J38K62
4757B92m73L06p9j33M15J68m63m38O39J92o02N1N10k42l36M30l54mO1J84j46k98
4779c20Q16l16q71K50M13K30p31L44K7l70N76L81l87k42M55o5k96OJ81l07L04
4800G8j03P4l03L30M1m27j76O18P5o38K42N06j41n43R9M04m22L54K08m31R1J29
4822F5l57K0P36k71m41j8M73k52j94K90j96K55p3K81m58k60Q03j4m01J21L56n36
4844g1j56L42n4m32L47L3N2P1L17k48l05L53j91r7J40Pl81o7K97M40o35K13M19
4867C94k81j34l6J37k80n0L57l11J7J43p2M9j86J21N9J83j44J6j9q5J54J81k63
4890e0K35k46J38p5R8k01o8L83j34k92K27L51m53k53L70K14p7k15L9j87K03J66
$$ plain form
4912 173 91 -268 317 98 -278 59 9 -90 -51 413 105 -179 153 361 -518 -163 282 -167 -485 240 131
4933 131 72 -39 234 177 15 4 -95 -80 86 312 -182 -183 -54 26 -102 9 255 -138 -9 130 -215 -379 -28
4956 -28 277 9 34 197 108 -20 -147 56 -48 50 -18 107 -43 139 167 -316 -93 194 -36 -231 364 167
4978 167 55 1 364 -34 -103 -161 -72 -176 62 -191 332 10 59 9 158 141 192 88 -1 -63 152 4 102 352
5002 352 -264 -236 67 -7 162 -296 100 -125 126 164 143 -238 109 185 -196 -153 199 194 150 -42 167 42 -252
5025 -252 132 -109 -260 214 183 -573 -194 -27 -167 0 35 58 30 -169 333 -111 134 140 -131 -328 94 41
5047 41 -195 -42 292 -120 -61 34 -11 14 -127 137 -252 212 259 140 -141 -375 347 -97 -350 87 518 111
5069 111 340 288 15 -181 328 339 -296 107 172 -125 49 14 323 107 -160 184 -111 109 131 131 173 138 4
$$ packed form
4912A73q2l59N85k19l76L37n0r9L9M64l08k84L32K08q79L55M45m49l18P25j09
4933A31n9j11K73n7j62j1r9J5J66K26m94jJ29Q0j28J11K46l93J29J39l45j64L51
4956b8L05k68K5J63q9j28j27K03j04R8o8J25j50J82K8m83K23K87k30j95N95j97
4978A67j12n4L63l98o9n8Q9j04K38k53N23l22M9n0J49j7N1j04q9o2K15j48R8K50
5002C52o16K8L03p4J69m58L96k25K51L8k1l81L47P6l81M3L52nm4j92K09j25k94
5025b52L84k41j51M74l1p56L79J67j40J67L5K3k8j99N02m44K45Ok71j97M22n3
5047D1k36J53L34m12N9R5m5K5j41K64l89M64M7j19k81k34P22m44k53M37M31m07
5069A11K29n2k73j96N09J1o35M03O5k97J74l5L09k16k67L44k95K20K2%M2l5j34
$$ plain form
5092 4 -242 -49 28 -313 -142 273 43 -78 -60 -141 -55 -113 104 172 -186 -54 71 -58 -145 101 -147 -76 32
5115 32 327 -41 180 274 13 -84 -19 100 -103 -168 140 87 -269 -57 109 -3 209 191 38 34 241 -4 25
5138 25 -269 406 -58 153 -110 -67 100 284 150 -38 -242 -231 248 -109 -412 89 203 -297 127 113 -134
5159 -134 -234 166 -176 -44 -120 326 -133 -300 482 -28 93 305 -134 -72 205 -105 -73 -192 246 67 -321
5180 -321 181 -138 -211 -48 158 119 -188 -239 58 164 60 84 -72 49 245 19 -87 -345 -44 -261 -34
5201 -34 -191 71 -78 -168 -33 -199 -144 -10 -71 174 65 133 -332 -250 13 -69 104 239 -82 -134 181 184 -55
5224 -55 -374 126 -93 128 283 489 14 -289 54 68 -252 150 420 281 26 338 243 -143 -80 154 -20
5245 -20 171 26 253 109 150 269 -180 205 109 133 133 37 32 92 454 80 90 191 191 161 -140 180 38 -289 -425
$$ packed form
5092Dk46J93P7l41J71M15k30j21J8q1Q6n8K17O8l58J32J25j29q7K46k48P1J08
5115C2K95l68K21R4k61r7O5J19k03o5L08n3l56K12J66j12K12j8j53mK07k45K9
5138B5k94O75m64K11k63M3J67J84j34j88k04J1M79l57l03N01J14n00M24j4k47
5159a34j00M00l42J32p6M46m59j67P82n10J21K12m39O2K77l10L2j19M38j79l88
5180c21N02l19p3J63K06l9l07n1K97J06j04K4j56J21J96k26j06k58L01k17K27
5201c4j57K62j49r0J35j66N5J34o1K45j09O8m65Q2K63q2J73J35l21n2L15Lk39
5224e5l19N00k19K21J55K06m75l03L43J4l20M02K70j39k55L12r5l86O3K34j74
5245b0J91j45K27j44M1J19m49L85r6K4%r6nO0L62l74J0J01%l0l01L20j42l27j36
$$ plain form
5270 -425 153 -191 -138 18 21 96 -17 97 257 -221 133 182 -42 160 37 -141 -273 -140 -43 -59 35 -17 84
5293 84 16 -77 187 -73 147 119 -206 -86 55 106 106 -30 -94 278 225 -72 -74 -19 128 113 -109 65 5 104 -52
5318 -52 95 36 89 -193 187 90 12 7 200 238 124 325 314 156 99 -70 -213 -198 6 91 32 287 -182 -138 -82
5343 -82 -69 226 -159 -43 265 -329 -22 180 -34 -197 334 106 -451 110 169 -225 27 26 -65 -279 -59 -146
5365 -146 -27 110 9 -102 41 -39 156 207 -157 -149 -73 -127 233 63 -162 142 -3 275 145 -88 210 127
5387 127 99 295 99 -126 122 172 178 -65 -81 178 199 130 -234 -126 -141 4 -141 108 131 -129 -197 -3 2 -291
5411 -291 -126 44 78 -315 -98 23 49 -128 28 -104 -32 110 -281 90 -247 263 -327 27 -8 -197 -35
5432 -35 19 -220 113 128 24 -84 66 -200 209 26 -126 -22 273 124 49 76 36 113 71 -325 -122 74 -33
$$ packed form
5270d25N78l44N3J56LP5j13J14J60m78L54M9k24K02j23j78j32J33R7j6R4n2J01
5293H4o8r3K64k60K20k8l25J20J41N1%j36o4L72n3k97kN5J47j5k22J74o0R9j56
5318e2J47n9N3k82L80r7p8nJ93L8j14K01j1j58n7j69j43J5K04Q5n9K55m69M4N6
5343h2J3K95l85J16L08n94L07K02k14j63N31k28n57N61N9l94K52jr1k14K20q7
5365a46J19J37j01j11J43q0J95N1l64QP6n4L60j70k25L04j45K78j30k33K98q3
5387A27k8J96j96k25K48N0Ok43j6K59K1o9l64J08j5J45j45K49K3k60o8J94Nk93
5411b91J65J70L4l93K17J21K6j77J56j32P2J42l91L71l37N10n90L54l5j89J62
5432c5N4k39L33J5j04j08J50k66M09j83j52J04K95j49p5K7m0P7m2l96K03J96j07
$$ plain form
5455 -33 78 10 -16 -105 -35 114 192 33 103 -93 -2 -172 11 -246 -4 -141 327 632 -106 99 95 39 -32 -119
5479 -119 -19 -25 154 -81 -10 169 -152 16 -160 -66 285 -455 -37 184 34 -75 322 48 -212 18 352
5500 352 148 -104 50 -175 67 15 -74 -232 -403 89 96 -39 -141 -6 -225 46 289 -112 191 -196 96
5521 96 -170 -128 208 -164 -238 -81 -92 149 119 93 29 11 -22 -3 -221 99 8 -146 10 172 -148 -434 -76 -200
5545 -200 -132 -101 188 154 214 -104 31 -38 41 315 185 136 182 348 -137 47 167 256 189 344 48 57 -61 60
5569 60 -141 -295 242 210 43 -326 108 -53 42 -136 172 234 147 -335 -92 52 275 -25 -345 -106 244 -468
5591 -468 -182 306 -147 -161 -102 6 75 -54 -46 62 140 203 -207 -68 -127 278 -159 50 130 8 25 297 58
5614 58 -180 -167 318 392 -95 128 287 -40 -62 473 135 -184 30 205 66 -30 212 -119 -126 61 499 -197
$$ packed form
5455c3J11o8k6q9P0J49P8j59P0j96R1j70J83k57K42j37M68L05p38K05mn6p1q7
5479a19J00oJ79k35P1J79l21J68j76R4L51p40M18K21j50j09L97k74k60K30L34
5500C52k04k52J54k25K42n2q9j58j71M92Pj35j02J35k19K71K43m01L03l87K92
5521I6k66M2L36l72p4J57j1K41l0k6o4j8l3J9k18L20r1j54J56J62l20k86L58j24
5545b00O8L1K89l4O0l18J35o9P9K74j30m9M6J66m85J84J20Q9o7J55k96Rj18J21
5569F0k01j54N37l2j67l69M34j61R5j78L08O2q7m82K43J44K23l00l20K39L50p12
5591d68K86M88m53j4N9J08O9j29QJ08P8O3m10J39n9M05m37K09Q0j22J7K72k39
5614E8k38J3M85P4m87K23J59l27k2N35l38l19K14J75j39r6K42l31pJ87M38o96
$$ plain form
5636 -197 -310 -58 215 136 -127 261 -24 -85 155 104 139 136 271 381 -41 74 275 72 25 7 -241 1 156
5659 156 -309 -114 95 83 -77 -158 329 -87 95 -79 -46 -216 45 46 -15 -50 111 -22 189 27 48 -10 151
5682 151 330 259 -9 141 49 -18 47 197 224 -91 26 48 120 269 325 331 -283 218 -154 -214 1 -318 254 -152
5706 -152 -116 -82 -168 -437 -75 -29 151 143 89 -331 51 225 -166 -76 68 127 6 128 160 -214 -303 264 -36 126
5730 126 -32 83 -97 60 21 52 -189 -71 -55 -36 127 109 189 -141 -194 -158 -79 357 89 73 -526 -174 -35
5753 -35 -280 85 54 -99 133 -36 78 -255 5 193 3 50 112 -167 -8 -61 162 -66 -99 -149 35 -77
5775 -77 167 118 251 168 531 -128 -92 178 49 -290 -175 -88 -139 91 34 -58 0 267 50 -40 160 -6 -47 91
5799 91 71 -43 -73 -244 145 164 28 154 46 -2 -200 -62 -40 102 72 -96 269 185 84 -164 -65 200 202 -69
$$ packed form
5636a97j13K52K73p9k63L88k85o1K40n1L5lJ35J10m22J15K01k03m7j8k48K42J55
5659A56m65J95K09j2j60q1M87m16J82j74L3j70K61Jo1l5J61j33K11j62K1n8J61
5682A51J79p1k68J50r2o7O5J50K7l15J17K2P2J49N6Oo14N01l72o0K15l19N72m06
5706a52L6L4q6k69L62M6J80qn4m20L82J74l91R0J44N9j21J22L2l74q9N67l00J62
5730A26j58J15j80J57l9L1k41J18J6J9J63j8Q0l30n3L6P9M36k68j6n99L52J39
5753c5k45L65l1j53K32j69J14l33K60J88j90M7O2k79J59n3K23k28l3n0J84j12
5775g7K44m9J33q3L63o59L6K70j29l39J15Q7n1K30n7r2N8K67k17r0K00j66m1J38
5799I1k0j14l0j71L89J9j36J26j08m8j98J38K2J42l0j68L65q4j01k48R9K65Kk71
$$ plain form
5823 -69 215 100 31 -94 -178 103 -80 -29 26 -25 -69 29 -1 -124 315 146 12 -177 83 -87 -50 20 89 109
5847 109 -52 184 -110 -199 197 -6 -23 -111 -75 -87 -36 33 -107 87 -317 73 298 86 -12 5 136 6 169
5870 169 -125 -275 7 222 -247 55 41 98 175 186 -178 -270 94 -4 -109 -162 140 7 -137 -16 96 -30
5892 -30 227 -150 -187 -82 6 0 65 17 256 399 -99 19 -129 54 39 -164 -88 -257 177 116 75 167 -99 -200
5916 -200 -65 -27 97 -44 -196 -47 -74 -286 365 158 -123 -69 15 -122 -38 326 -96 181 -159 163 29 222
5938 222 369 -108 -238 47 -96 -226 -47 123 -304 -393 154 -53 50 175 224 34 -21 339 242 -87 -108 -14
5960 -14 -23 -74 75 262 16 -84 10 -130 189 -234 -201 -223 -98 -18 -359 59 -17 -24 133 -11 -117 54 -8 62
5984 62 89 -181 118 -7 -89 -176 68 -61 18 -80 -42 -209 216 110 91 -226 -11 -60 77 38 248 20 -103
$$ packed form
5823f9K84j15o9j25q4K81j83N1N5n1m4R8l0j23M39j69j34j89K60j70L7P0O9K0
5847A09j61K36k94q9L96k03j7q8L6j2N1O9j40J94m04L90K25k12r8J7J31j30J63
5870A69k94j50K82K15m69L02j4N7P7J1l64r2L64r8j05n3L02j33j44J21J12j26
5892c0K57l77l7J05Q8oO5m8K39J43m98J18j48J83j5k03P6j69M34o1m1R2k66j01
5916b00J35L8J24j41j52J49k7k12O51k07k81N4Q4j37Q4L64m22K77l40L22j34J93
5938B22J47m77j30K85j43j30J79J70m27q9N47k07J03J25M9j90n5L60r7l29k1R4
5960a4rn1J49J87k46j00R4j40L19m23L3k2J25Q0l41M18p6pJ57j44j06J71o2P0
5984F2K7k70K99j25q2q7K44j29P9r8L8j67M25j06j9l17K15m9J37l9K10k28j23
$$ plain form
6007 -103 90 101 -8 -42 190 -471 -144 -84 44 -56 67 211 102 -245 162 225 152 -43 -217 60 45 -37
6029 -37 132 172 -227 -260 -334 -75 251 10 -129 -115 -479 88 201 -97 230 -84 -178 271 -316 -55 -175 83
6051 83 79 109 184 -101 276 -95 96 254 189 -66 64 123 26 91 -350 62 -41 153 -140 -39 286 -33 208
6074 208 -380 165 -134 94 -293 142 115 -99 86 -77 222 -29 148 250 -128 42 115 367 25 -106 -169
6095 -169 -35 95 251 52 -144 279 162 -35 -15 93 -9 93 129 -4 -197 91 -24 -151 187 -35 -155
6116 -155 157 52 -21 30 105 89 -117 -48 323 241 -124 -1 223 -75 182 -60 -85 -51 -30 224 -134 -89 160
6139 160 250 80 140 122 180 104 259 -78 212 -147 -214 -64 -39 92 59 280 143 -207 103 -280 -71 83 32
6162 32 314 221 -482 6 -202 25 -57 190 -90 -206 -185 -57 158 -142 -60 -12 160 -12 -11 7 71 18 85 131
$$ packed form
6007a03J93J1j09l4K32o61L27O0J28j00J23J44j09l47M07O3p3j95j74K77j5q2
6029c7J69M0l99l3p4K59L26k41j39J4l64N67J13k98L27l14r4M49n87K61j20K58
6051H3mL0P5k85L77l71J91J58o5k55J30N9r7O5m41M12j03J94k93J01L25l19K41
6074B08n88N45k99K28l87M35k7k14J85j63K99k51J77J02l78J70P3K52l42j31o3
6095a69J34J30J56j99j96M23j17j97K0J08j02J02L6j33j93K88j15j27L38k22j20
6116a55L12j05p3N1P5j6k06O9L71q2l65J23K24k98K57k42k5L4K1K54l58M5K49
6139A60R0j70O0j8N8p6J55l37K90l59o7J50K5J31l3K21j37l50L10l83K09J54n1
6162C2K82r3p03M88k08K27q2K47k80j16K1J28K15l00Q2M8J72j72JJ8O4n3O7M6
$$ plain form
6186 131 214 -280 177 -76 193 -48 168 35 99 169 114 380 299 0 -44 160 58 -279 -9 -63 -210 264
6208 264 -60 169 -55 87 322 -74 81 404 -104 -123 -146 174 109 -94 -265 -159 -221 167 -217 -363 103
6229 103 145 -261 16 -80 206 -211 -416 193 134 15 57 101 274 -85 50 -224 -219 91 -70 -204 -71 65
6251 65 -74 249 14 244 -180 118 -36 -167 -127 290 297 -97 322 22 -18 191 144 -299 -221 76 140 -86 136
6274 136 -32 -18 63 73 146 -215 53 35 -46 -355 9 -88 149 -4 -47 -245 -129 14 214 65 -36 45 138
6297 138 3 27 -260 -106 -20 -126 -108 -287 -120 -163 -222 41 4 32 219 -49 166 324 168 -91 121 -11
6319 -11 -52 8 -107 -49 -81 225 75 189 -37 342 -125 -231 -16 112 -53 -213 -65 -167 159 -112 42 -98
6341 -98 -202 -8 100 -281 350 293 -36 -231 31 174 -24 -105 79 -296 -308 78 -135 -230 -129 -140 -150 -11
$$ packed form
6186A31Q3m94M57k53K69k41K16j33O4P0n5K66q1k99m4K04j02l37K70n4j47M74
6208B64l24K29k24J42K35l96J55L23n08j9k3L20o5k03j71J06o2L88l84j46M66
6229A03M2m06K77r6K86m17k05O09n9j19M2M4J73l59J35k74NL10j61j34J33J36
6251F5j39L23k35K30m24K98j54j31M0M17Pl94M19l00m0K09m7m43P8K97O4k26K22
6274A36j68J4Q1J0P3l61K68j8q1l09L64r7K37j53m3j98J16J43K00j49j01Q1R3
6297A38j35K4k87J54Q6j06J8j79J67m3n9K63l7K8J87k68K15J58j56k59K12j32
6319a1m1O0j15N8l2L06j50J14k26L79m67j06K15J28j65j60J48j02L26k71J54j40
6341i8j04J94J08l81O31n7l29j95K62J43j98q1J84l75j2L86k13r5J01j1j0J39
$$ plain form
6363 -11 -316 433 -27 -76 163 -167 214 155 13 54 52 126 -84 -161 158 247 -283 -576 261 -135 -79 -163 -155 32
6387 32 -20 43 -65 275 -117 125 111 194 -149 123 -106 165 93 -343 25 157 -81 177 194 -38 -385 71
6409 71 96 -132 260 11 193 -433 276 -288 -57 37 90 15 -29 453 -85 -56 -29 20 -10 124 99 125 -242 71
6433 71 116 -18 10 -76 45 -94 -5 -3 -157 -50 360 -170 -110 240 285 61 -1 99 32 -159 340 -61 24 -134
6457 -134 30 113 133 103 48 -3 -25 400 126 -36 -242 -265 -92 210 -59 57 -61 45 245 -237 -40 90
6479 90 -15 114 181 117 -130 -16 145 -312 79 220 217 -59 177 43 109 173 178 188 26 -12 231 106 -318 104
6503 104 -71 158 19 -5 -139 169 82 -200 -134 -138 -47 41 82 -143 13 46 239 141 -49 -30 -5 -326 -65 -267
6527 -267 162 -37 -83 84 -322 -344 119 -41 60 -189 47 109 -168 305 -59 -253 -117 -42 148 0 3 166
$$ packed form
6363a1l05P49m60m9K39l30L81n9j42M1kP4k10p7L19Q9n30k93Q37l96N6q4QJ87
6387C2n2O3j08L40l92K42j4Q3l43K72k29K71p2m36L68J32k38K58J7k32l47M56
6409G1K5k28L92k49J82o26P09n64K31R4N3p5m4M82n38K9K7M9l0J34k5K6l67L13
6433G1M5j34K8q6J21j39Q9Kj54J07M10n30O0L50M5k24o2J00o7j91M99m01Q5j58
6457a34J64Q3K0l0n5n1k2M25k74j62k06k3J73L02k69J16j18J06K00m82J97J30
6479I0j05J29O7o4k47J14J61m57L91J41lk76K36j34O6O4NJ0j62l8K43j25m24M22
6503A04j75K29j39k4j34L08q7k82O6mR1Q8M1k25J56L3J93r8j90J9K5l21K61k02
6527b67M29j99m6J67m06k2M63j60J01k49K36O2k77M73l64j94J36P5J90j48LJ63
$$ plain form
6549 166 158 -109 19 -260 154 -45 -83 128 80 4 -31 142 285 62 134 23 132 -195 175 -89 82 160 52
6572 52 146 -181 126 -32 -38 158 -20 44 9 -38 -267 48 80 165 -21 -191 305 52 -26 -44 238 110 -93 47
6596 47 -205 40 53 -95 140 95 4 52 67 414 -7 4 46 31 -78 -246 1 -98 18 32 54 -218 -92 -397
6620 -397 -209 96 18 160 94 -79 140 35 -261 -49 171 -168 120 100 14 -181 302 113 -102 -5 -132 356
6642 356 -33 170 -113 14 -75 218 -330 -227 229 116 147 -13 81 -49 -127 62 208 -85 176 228 206 -65
6664 -65 167 271 -132 63 58 -121 -98 172 93 105 125 -137 -14 -5 -15 -144 -155 37 -289 -205 -144 183 -114 -3
6688 -3 81 53 9 -247 73 -195 118 -126 311 -26 -178 -178 19 -402 -179 78 -223 -74 -114 189 287 288 -61 -11
6712 -11 58 157 -162 -7 101 -13 336 220 -178 -107 -310 425 55 -107 182 35 -123 -151 -206 -120 -334 19
$$ packed form
6549A66qk67J28k79M14j99l8K11m8p6l5J73J43k23P2j11J09l27L70k64J71P8j08
6572E2R4l27L07j58oJ96j78O4l5m7k29L15L2Q5j86j70M96k53p8j8K82j28k03J40
6596D7k52K45J3j48K35m5r1M8J5L47m21J1M2j5j09j68K47r9J16J4K2k72J26l05
6620c97J88L05p8J42o6j73K19j05k96K12K20l39K88k0q6j95M83j89k15R7j27M88
6642C56l89K03k83J27q9K93n48J03M56j13L1j60R4j30p8J89J46k93K61N2k2k71
6664f5K32J04m03J95nj79K3K70p9J2K0k62J23Rj0j29j1J92l26Q4O1L27k97J11
6688cQ4k8m4k56L20k68L13k44M37l37j52%J97m21K23K57l01J49m0L03R8Jl49N0
6712a1O9R9l19J55J08j14L49j16l98P1k03P35l70j62K89j47j58k8n5Q6k14L53
$$ plain form
6734 19 -18 78 191 -149 -265 192 -44 69 187 -106 55 -156 -53 191 -31 -7 -23 117 27 -105 185 -92
6756 -92 203 60 -49 175 44 48 -65 211 14 -58 -22 -159 -110 126 -22 -17 268 -42 -100 58 63 -130 91 296
6780 296 95 -62 80 -79 352 209 -102 -152 -291 30 12 -99 74 -178 -11 37 251 118 -172 68 -221
6801 -221 -64 98 25 -54 -33 154 102 -200 -53 -30 74 -46 271 -327 -72 325 87 87 54 243 -123 -294 14
6824 14 129 -205 118 152 -220 138 175 -99 -292 -401 25 -168 -110 395 -50 -255 -105 158 -206 235 86
6845 86 -125 -83 225 30 -271 -199 247 23 11 298 259 -35 -70 9 10 -178 151 -105 -282 -156 -3 -107 -241
6868 -241 449 -49 132 21 -106 -99 -22 16 196 35 173 -278 60 78 -40 -243 37 275 -90 -314 93 115
6890 115 16 58 174 -178 12 -93 90 22 115 161 -36 85 130 68 151 2 -152 -88 -177 -109 70 85 -193 210
$$ packed form
6734A9l7R6J13l40j16M57k36J13J18k93J61k11J03K44k22K4j6J40r0j32K90k77
6756i2K95j43j09K24j31Mj13K76j97p2L6j37M9K36j48NK85l10n8J58Nj93K21K05
6780B96k01j57J42j59M31j43l11n0j39L21j8j11J73k52J67M8K14j33k90K40k89
6801b21J57J62p3p9K1J87n2l02J47K3J04j20L17n98K55L97k38%l3J89l66j71L08
6824A4J15l34L23L4l72L58L7k74j93j09M26j93N8N05m45k05J50K63l64M41j49
6845H6k11M2L08j95l01P2M46k24j2K87l9k94l5P9Jj88L29k56j77J26J53j04j34
6868b41O90m98J81j11j27PP7L8J80j61J38m51L38J8j18k03K80K38l65k24M07K2
6890A15r9M2J16l52J90j05J83o8R3M6j97J21M5o2Q3j49j54O4q9O8J79J5k78M03
$$ plain form
6914 210 32 -198 -11 112 -270 -106 196 0 -35 361 -42 15 127 -270 -148 -193 -9 -83 15 161 132 12
6936 12 -127 -34 -215 126 45 16 187 55 177 209 32 215 -56 -84 94 -67 170 -264 312 -136 39 55
6958 55 195 -163 -127 496 171 -450 -190 91 -302 -120 65 129 -107 -158 69 -188 -4 -8 -51 -59 172 437 -371
6981 -371 -228 239 -164 -143 360 -86 52 -77 -141 -374 -211 261 -72 -538 -135 138 -55 -58 421 90 -129
7002 -129 100 -159 -291 -110 363 64 -192 -56 240 -50 25 195 145 -13 -133 -47 -72 -264 85 -338 -13
7023 -13 1 -44 -262 185 253 -218 -228 184 -122 -144 -122 275 61 -111 53 -42 89 -152 227 -183 -106 -20 21 -75
7047 -75 -27 173 55 -406 -184 26 -312 -87 135 288 65 293 -239 -340 29 369 -126 -134 -8 27 -68 233
7069 233 -99 -115 -261 -107 200 244 74 268 -68 62 -220 42 -168 271 329 -346 430 151 -116 -85 159
$$ packed form
6914B10j78k30J87J23l82J64L02j96l5L96m03N7J12l97J22m5J84p4R8J46k9j20
6936A2j39R3j81L41q1k9J71j32J22L2j77J83k71k8J78j61K37m34N76m48J75J6
6958E5J40l58L6O23l25o21K60K81l93J82J85O4k36n1K27k57J84mm3qK31K65q08
6981c71J43M67m03K1N03m46J38j29o4k33J63M72l33m66M03K73j93lM79l31k19
7002a29K29k59j32J81M73k99k56J36K96k90P5J70n0j58j20Q6k5j92L49m23L25
7023a3J4m5k18M47O8m71j0M12l06k2K2L97k14j72J64r5J31k41L79m10P7Q6M1r6
7047g5M8K00j18m61K22K10l38K25K22J53k23K28n32j01L69L40m95qJ26L5r5L01
7069B33l32j6j46J54L07M4j70J94l36J30k82K62k10M39N8o75P76k79k67L1K44
$$ plain form
7090 159 13 -293 -116 318 -92 24 23 146 125 -114 226 72 54 127 58 98 76 170 -46 -108 -61 186 -326 181
7114 181 56 -3 52 352 172 -4 2 118 -19 -38 290 -171 -34 25 -46 -188 38 218 220 282 296 -57 -254 -126
7138 -126 -315 39 103 -90 113 1 148 -129 -3 -217 80 -112 -204 -30 208 91 374 414 21 142 83
7159 83 11 -280 -76 112 -120 116 103 147 -219 10 139 126 104 15 198 -88 50 486 1 100 -38 -65 167
7182 167 135 21 -223 -119 -148 -99 126 -129 34 -62 0 24 42 -215 243 42 66 -277 -188 -87 -34 -50 61 -25
7206 -25 8 297 -27 256 57 105 -176 135 129 69 15 -85 -142 92 20 -19 47 -161 19 -20 -11 -144 4 -138 139
7231 139 -275 -124 190 -247 182 -363 -196 331 -1 -288 -120 38 -87 157 135 134 -26 273 30 -64 65
7252 65 -130 -169 56 192 -210 264 236 -15 -34 129 106 -329 -331 -141 90 -112 31 82 86 -193 182 341 38
$$ packed form
7090A59j46l06J77M34m10J16jJ23k1k39L40j54j8P3o9M0k2R4k16o2M7K47n12N07
7114A81j25n9N5L00j80j76OJ16j37j9L28m61J37N9p1j42K26J80KO2J4l53j97J28
7138a26j89L54O4j93K03j12J47k77J26k14K97j92r2J74K38j17K83M0l93J21n9
7159H3p2k91K04J88k32K36j3M4l66K29J29j3k2q9J83k86J38M36m85R9j38k7K32
7182A67l2j14k44J04k9M9K25k55J63r6O2K4J8k57M58k01K4l43Q9J01N3j6J11q6
7206b5L3K89l24K83j99M8k81L11oo0n4j00n7K34p2l9O6k08J80l9Rj33J48j42K77
7231A39m14J51L14m37M29n45J67N27l32k87J68J58j25K44k2jj60K99k43r4J29
7252F5j95l9K25J36m02M74k8k51j9J63k3m35kJ90K31k02J43N1Mk79L75J59l03
$$ plain form
7275 38 -32 84 -215 126 108 22 170 62 188 -176 20 158 -234 -400 -193 129 -4 -219 15 -134 -240
7296 -240 268 -95 29 -36 -32 -34 357 221 -111 -112 62 277 -80 64 43 -59 -319 -21 -215 -42 -227 76 317
7319 317 -326 31 586 -32 -150 -15 -262 35 -88 449 54 -2 41 60 89 -40 -7 -51 172 14 104 136 167
7342 167 -115 -150 107 342 -39 1 85 419 -15 208 45 -60 -16 -24 -91 201 -73 219 138 167 78 -62 -207
7365 -207 86 -163 32 -235 -23 77 80 332 71 315 108 377 170 63 -12 165 -266 263 105 92 -94
7386 -94 -80 -291 -29 -61 11 -168 -393 353 90 -180 137 -1 326 4 28 -117 -232 208 -163 1 -306 157
7408 157 -159 -208 37 267 100 78 -6 224 -85 11 -75 -229 -24 105 56 -232 -116 164 -14 25 198 87
7430 87 132 269 20 11 -79 219 -82 136 208 -59 -96 -99 -35 198 -125 -220 89 158 -203 87 -432 -242 -21 -128
$$ packed form
7275C8p0J16k99L41j8q6J48j08J26l64J96J38l92j66K07L22j33k15K34j49j06
7296b40N08l63J24o5MkL91j36l32jJ74K15l57J44k1j02k60K98j94J73j85L03K41
7319C17o43L57N55o18j18J35k47K97j23N37l95n6M3J9K9j29L3m4K23j58R0L2L1
7342A67k82l5K57K35l81M0Q4L34m34K23j63j05M4qo7K92k74K92q1K9q9j40j45
7365b07K93k49J95k67K12J00LK52k61K44k07K69k07j07p5J77m31N29j58j3j86
7386i4J4k11K62l2P2j79k25P46k63k70L17j38L27l22K4j45j15M40l71J64l07M63
7408A57l16m9K45K30j67k2q4K30l09R6q6j54K05J29m9k88J16K80j78L9J73j11
7430H7M5J37k49rr0K98l01K18P2k67l7lO4K33l23r5L09O9l61K90n19J90K21j07
$$ plain form
7454 -128 89 -267 235 28 111 58 -90 -203 -100 -106 -44 -114 -73 135 -37 144 6 -223 -211 103 -56 24 -129
7477 -129 -85 -102 5 -247 -71 125 20 32 -246 -49 217 40 66 157 -183 -11 262 10 50 19 102 -78 -152
7500 -152 -15 137 71 -18 60 159 11 379 48 -131 -13 -47 -13 -231 165 339 -374 -22 -48 -176 30 284
7522 284 -84 -344 96 256 44 -6 55 157 116 -103 235 -433 -66 229 87 -456 -78 -59 81 -51 190
7543 190 91 65 16 -186 45 178 162 10 93 167 29 -162 -268 122 -22 2 -244 71 -114 -131 211 -292 -291
7566 -291 281 78 -36 13 -93 -55 126 -30 -154 -484 -121 55 114 -21 387 215 -152 0 53 43 -353 141
7588 141 -88 193 236 129 -139 82 17 -169 67 -109 112 -77 32 44 -174 14 -93 -123 40 -177 85
7609 85 -35 -2 209 178 -207 -18 19 -30 -166 -297 28 -306 91 160 216 68 -208 -4 130 100 -16 -276 -90
$$ packed form
7454a28K17l56N02k07Q3n3j48j13J03oO2p0M1K08j72J81j38k29J2L14j59Q0j53
7477a29M4j7J07k52J76J96j05J2k78J97K66j77K6R1l40J72K73k52M0l1Q3j80p4
7500a52J37J52o6q9P8R9j48L68l31j79J18l4L4k18L96J74p13L52k6j28K06K54
7522B84l68k60M40J60k12n0O1J02m1k19L38o68L67K95j42n43L78J9J40j32K41
7543A90r9k6m9k02K31J33j6j52Q3P4j38j91j06L90j44K4k46L15j85j7L42n03J
7566b91N72k03j14M9j06L8J81j56j24l30L63J76N9j35M08j72l67J52N3j0l96M94
7588A41k29K81M3j07k68K21o5j86K36j76K21j89J09J2k18J88j07l0J63k17K62
7609H5j20L3K11l1l85J89L7m9j36j31L25l34L97O9N6j48k76K04J34l0j16k60J86
$$ plain form
7632 -90 -8 188 -24 175 107 -24 -155 15 -136 -145 192 219 451 107 -95 -39 -111 -70 80 -152 175 -110 113
7655 113 97 103 -197 3 10 315 17 -53 175 130 -100 -217 -39 -142 -68 317 85 325 -142 -63 -136 -45 436 59
7679 59 -278 253 -79 -166 -64 36 -88 97 268 43 -140 -228 149 -239 35 166 236 -93 -20 69 -210 85
7701 85 128 65 -357 123 -36 -170 -141 -106 -133 -248 -76 210 -20 -5 65 98 -55 -180 176 -75 -200 0 128
7724 128 -183 354 122 115 -35 114 -207 0 49 62 49 82 304 -59 80 -16 -160 -335 -244 -228 -124 189 14
7747 14 477 -46 65 -38 -91 -205 218 -174 -39 179 -37 -82 255 20 -202 75 -215 -396 80 174 51
7768 51 64 -24 -123 -41 50 78 22 -25 -93 132 -16 -83 296 -101 -298 -313 -274 166 -123 224 -90 -293 -399 -128
7792 -128 -94 -478 281 -27 123 68 235 -4 59 83 128 -107 -30 9 -56 -165 66 68 -253 215 224 -33 75 291
$$ packed form
7632i0Q2J96k12J99o8j31j31J70j51rL37K7K32l44k02N6p2M1J50k32L27k85K23
7655A13j6Ol00K00PL05k98p0K28m5k30j17J78j03P4L85k32K40m67P9p3R1M81l77
7679E9l37N31l32q7J02J00j24J85J71k25j83q8L77l88K74J31P0l29P3Q9k79K95
7701H5M3o3m22M80j59j34K9L5k7j15J72K86k30J5P0L3j53j25L56k51j25K00J28
7724A28l11N37k32pj50J49l21K07M9J3j3L3K22l63J39r6j44j75R1J6J04L13j75
7747A4M63n23J11j03n3j14M23l92J35K18k16m5L37k35k22K77k90j81M76R4j23
7768E1J3q8r9Q2R1K8n6m7o8K25j48o7L79l97j97j5L9M40k89L47l14k03j06K71
7792a28L4l84P59l08J50n5J67k39O3K4M5k35P7L9o5j09K31Kl21M68Rk57J08K16
$$ plain form
7816 291 -231 -242 -411 130 -55 26 266 339 51 230 87 -121 -26 82 127 3 55 38 146 193 190 -128 226
7839 226 -2 166 -9 116 76 48 67 -29 28 -59 113 216 -133 -159 283 183 3 -41 72 92 -129 -167 165
7862 165 93 -40 -152 -232 51 73 -180 -73 -121 43 49 -207 304 80 -116 -22 -154 -59 -132 206 55 -26 261
7885 261 -102 -12 7 147 -265 -93 221 126 54 -123 28 -50 36 204 131 -357 79 -252 -157 -238 -114 -87 -19 145
7909 145 247 -114 -319 303 -60 -107 48 -270 161 -228 110 -13 -140 53 -197 -190 77 210 -97 66 69 56
7931 56 -2 -168 -5 262 93 133 -195 -115 244 -55 10 20 -31 138 -57 -89 -157 -92 -456 146 -155 -185 88 -167
7955 -167 -266 -291 527 -272 37 89 60 -123 -420 184 -34 78 -87 -149 -377 135 377 237 57 193 240 99
7977 99 167 -103 75 -158 16 -53 148 55 376 334 206 59 132 -49 97 -151 155 -132 108 277 1 325
$$ packed form
7816B91n22j1j69N41j85Q1K40P3k88J79j43k08R5J08M5j24N2j7J08M7ll18L54
7839B26k28J68j75J25m0k8J9r6N7q7J72J03l49k6M42j00j80m4J13K0k21l8L32
7862A65p2j33j12q0K83K2k53J07m8J64Ok56N11k24j96R4j32R5p3L38j51q1K87
7885B61l63R0J9J40m12J72L14r5p2j77J51p8Q6J68p3m88M36l31R5q1J24K7O8J64
7909A45J02l61k05O22l63m7J55l18M31l89L38j23j27J93k50PK67J33l07J63Lj3
7931E6n8j66J63K67j69M0l28Q0L59k99O5J0n1J69j95l2o8O5l64O02l01l0K73k55
7955a67r9k5Q18p99L09N2k9j83k97O04k18J12j65o2k28N12K42j40j80J36M7j41
7977I9O8k70J78k33J74o9K01r3L21m2j28j47P3j81J46k48L06k87K40J69k76L24
$$ plain form
7999 325 -2 -56 -93 -279 45 -222 55 110 -153 187 50 -57 -288 429 -1 203 -71 -8 -152 134 184 171
8021 171 45 -243 13 -84 -30 129 -85 -217 34 -21 -38 12 -128 71 -127 131 259 -204 -207 186 -163 -93 36
8044 36 4 -108 -10 178 -94 -170 24 177 -81 -43 -45 83 -143 51 -180 -344 -129 -81 129 116 294 131 318
8067 318 407 -133 -50 229 93 100 -165 177 49 -289 -82 156 -218 -72 179 8 328 135 41 -220 -296 146
8089 146 80 -167 -300 280 -193 -108 71 -267 -418 203 176 -171 -205 107 19 -219 -108 293 -183 -253 204 -397
8111 -397 -39 173 -94 32 93 253 -66 54 220 164 11 24 143 77 135 242 86 -163 -205 92 46 100 133
8134 133 -157 130 -32 76 9 -97 -33 78 298 -227 189 66 1 249 -146 -32 152 -25 -155 -93 237
8155 237 -116 -291 7 278 117 99 -78 -470 -64 75 39 -13 86 35 -112 -32 318 61 26 224 335 -150
$$ packed form
7999C25l27n4l7j86L24k67K77N5k63L40j37j07k31P17m30K04k74O3j44K86N0j3
8021A71j26k88K56r7N4J59k14j32K51n5j7N0j40J99j98K58J28m63lL93l49P0J29
8044C6l2j12R8J88k72p6J94J53k58L8kJ28k26J94k31j64K15M8K10j3J78j63J87
8067C18Q9n40Q3K79j36Pk65L42j28l38K07K38l74J46K51j71L20j93r4k61p6M42
8089A46o6k47j33N80m73Q5J79l38j51O21k7l47l4L12q8k38J11M01m76p0M57o01
8111c97L58K12k67J26O1J60l19J20J66n6j53J3J19o6N8J07j56k49m2K97m6N4L3
8134A33k90K87j62J08o7j06O4J11K20n25M16j23o5K48l95J14J84j77j30O2L30
8155B37l53j75K98K71j61j8j77l92M06J39l6n2R9n1j47Q0L50k57l5J98J11m85
$$ plain form
8177 -150 57 423 -49 142 84 89 -29 -4 -229 -128 -53 202 -377 -116
$$ packed form
8177a50K07L66m72J91n8Nj18K5k25J01P5K55n79K61
8191a16
$$ Imaginary data points
##PAGE= N=2
##DATA TABLE= (X++(I..I)), XYDATA
$$ plain form
0 0 0 0 0 -8 16 -16 16 -24 40 -40 48 -72 88 -104 128 -156 188 -221 260 -309 362 -420 485 -563 645 -739
26 -739 842 -956 1085 -1226 1381 -1550 1737 -1944 2168 -2416 2685 -2986 3311 -3670 4063 -4499
42 -4499 4981 -5514 6108 -6779 7534 -8391 9377 -10527 11884 -13512 15514 -18041 21349
55 21349 -25877 32500 -43120 62908 -112162 476280 500889 -815083 -164745 835157 402252
66 402252 -640564 -198667 637307 287103 -560392 -287766 380883 238635 -307683 -178935
76 -178935 185122 73779 -199779 -34106 173681 53818 -73476 55093 62520 -84261
86 -84261 -13815 191105 73992 -145811 -41014 123865 -34839 -142714 75265 161607 -96237
97 -96237 -165997 88396 134484 -87000 -48730 206359 142982 -148964 -103973 205637 211911
$$ packed form
0@%%%qK4l2L2m0O4q0Q8j20J60j92K32k84L44m09M81n69O71p82R05j048J208j384
26g39J581j798K041k311K607k931L287l681M112m584N101n671O297o981P733q562
42d499R480j0495J1622j2887J4313j5925J7768j9904K2411k5396K9026l3555L9390
55B1349m7226N8377p5620J06028j75070N88442K4609j315972O50338R99902m32905
66D02252j042816M41897Q35974l50204q47495K72626O68649j42248n46318J28748
76a78935L64057j11343k73558J65673K07787j19863j27294J28569P427j46781
86h4261P0446K04920j17113k19803J04797J64879j58704j07875K17979Q6342k57844
97i6237o9760K54393M6088k21484L8270K55089o3377k91946M4991L09610O274
$$ plain form
108 211911 -80219 -131239 117174 150207 -140875 -228591 67757 198156 -114029 -327655
118 -327655 -81197 137044 -63977 -257415 -63980 135955 -26867 -231923 -103159 133673
128 133673 106265 -81553 -95530 54261 80118 -49790 -69652 71365 101098 -47758 -114032
139 -114032 -18444 27887 -22183 -23357 2352 -41389 -69065 -22455 -9901 -30097 19373 50937
151 50937 -44113 -100276 2295 66111 -18815 -55760 20361 11159 -101232 -102867 14302 35322
163 35322 -66974 -106496 -38072 -17171 -84229 -84848 22655 52918 -59400 -106763 1236 59371
175 59371 -13442 -22823 65474 48292 -58061 -40107 58351 45939 -13932 11373 24345 -46210
187 -46210 -58229 22471 41319 -18143 -26014 6666 -16806 -47119 -2742 55288 38691 -15307
$$ packed form
108B11911k92130n1020K48413L3033k91082q7716K96348J30399l12185k13626
118c27655K46458K18241k01021j93438J93435J99935j62822k05056J28764K36832
128A33673k7408j87818j3977J49791K5857j29908j9862J41017K9733j48856o6274
139a14032R5588M6331n0070j174K5709m3741k7676M6610J2554k0196M9470L1564
151E0937r5050n6163J02571O3816q4926l6945P6121r202j12391j635J17169K1020
163C5322j02296l9522O8424K0901o7058o19J07503L0263j12318m7363J07999N8135
175E9371p2813r381Q8297j7182j06353J7954R8458j2412n9871K5305J2972p0555
187d6210j2019Q0700J8848n9462p871L2680k3472l0313M4377N8030j6597n3998
$$ plain form
199 -15307 -26442 7835 24972 9798 15697 49351 32357 -32566 -33572 31979 41791 -69 10048
212 10048 32489 -15339 -43995 19829 58348 14921 1503 35046 12452 -30000 15304 80109
224 80109 51490 -5256 5669 33587 15886 -2761 27743 65910 40219 -30413 -41607 30289
236 30289 60734 -1964 -23072 42199 39407 -54912 -52139 62548 78473 -23393 -46061 25847
248 25847 29897 -30455 -18235 51730 51796 -22071 -53544 -2279 41962 12336 -21040 12882 35800
261 35800 -25533 -62259 10553 63979 5203 -39467 946 12527 -32135 -19194 39067 29597
273 29597 -18008 -16347 -1717 -14142 815 39556 26609 -18889 -18737 9043 4551 -7137 14513
286 14513 35439 7686 -41369 -39077 17806 38653 -11122 -33769 11762 15844 -49479 -47109 41673
$$ packed form
199a5307j1135L4277J7137j5174N899L3654j6994o4923j006O5551R812m1860J0117
212A0048K2441m7828k8656O3824L8519m3427j3418L3543k2594m2452M5304O4805
224H0109k8619n6746J0925K7918j7701j8647L0504L8167k5691p0632j1194P1896
236C0289L0445o2698k1108O5271k792r4319K773J14687J5925j01866k2668P1908
248B5847M050o0352J2220O9965O6p3867l1473N1265M4241k9626l3376L3922K2918
261C5800o1333l6726P2812N3426n8776m4670M0413J1581m4662J2941N8261r470
273B9597m7605J661J4630j2425J4957L8741j2947m5498J52K7780m492j1688K1650
286A4513K0926k7753m9055K292N6883K0847m9775k2647M5531M082o5323K370Q8782
$$ plain form
299 41673 54004 -28118 -47192 10753 16808 -19408 -1402 36513 18087 -20354 -24986 -10344
311 -10344 8527 22781 8598 -19712 -20137 -9298 -17176 -13751 12721 14995 -12223 -25234 -19622
324 -19622 -9211 14132 28928 4896 -18071 -2630 7518 -9843 -1017 32942 24360 -20968
336 -20968 -33712 -8015 10447 7742 -3252 -10415 -4083 -7506 -31797 -22196 32806 40729 -20951
349 -20951 -37563 16217 26916 -14421 -617 50662 30545 -31073 -28578 19759 31636 7735
361 7735 -7129 -1783 3434 -10758 -28586 -3627 41781 25465 -35673 -34412 22446 29282 -7287
374 -7287 1075 39486 27457 -19350 -24858 19406 51766 27034 -23281 -21397 22510 14843 -36951
387 -36951 -19845 46872 27138 -58410 -56750 21266 33918 -18309 -26363 11377 14874 -21859 -35345
$$ packed form
299D1673J2331q2122j9074N7945O055l6216J8006L7915j8426l8441m632J4642
311a0344J8871J4254j4183k8310m25J0839p878L425K6472K274k7218j3011N612
324a9622J0411K3343J4796k4032k2967J5441J0148j7361Q826L3959q582m5328
336b0968j2744K5697J8462k705j0994p163O332l423k4291R601N5002P923o1680
349b0951j6612N3780J0699m1337J3804N1279k0117o1618K495M8337J1877k3901
361G735j4864N346N217j4192j7828K4959M5408j6316o1138J261N6858O836l6569
374g287Q362L8411j2029m6807n508M4264L2360k4732n0315J884M3907p667n1794
387c6951J7106O6717j9734q5548J660P8016J2652n2227q054L7740L497l6733j3486
$$ plain form
400 -35345 1877 44161 23912 -38626 -43413 13909 23442 -29356 -29995 25184 15796 -54079 -58305
413 -58305 6962 30154 -11517 -38640 -16320 6739 -10164 -34405 -6775 42416 20549 -48898
425 -48898 -42766 29449 31760 -29192 -23962 30631 11769 -54123 -44635 21419 33101 -18586 -47525
438 -47525 -18149 12286 -9278 -39523 -6585 43238 8743 -62282 -37764 42079 35029 -30337
450 -30337 -23325 28127 13151 -38215 -28341 25957 37795 -6306 -42698 -21287 21996 14596 -25158
463 -25158 -11376 36196 15449 -46318 -29011 41980 43257 -13176 -21395 15882 20335 -9806 -12857
476 -12857 21601 39677 4837 -38505 -17634 32639 23016 -21687 -7741 31013 2275 -43390
488 -43390 -10278 43374 24082 -19331 -11560 12366 6263 -4457 7238 24008 22516 -874 -19357
$$ packed form
400c5345L7222M2284k0249o2538m787N7322R533n2798o39N5179r388o9875m226
413e8305O5267K3192m1671k7123K2320K3059j6903k4241K7630M9191k1867o9447
425d8898O132P2215K311o0952N230N4593j8862o5892R488O6054J1682n1687k8939
438d7525K9376L0435k1564l0245L2938M9823l4495p1025K4518P9843p050o5366
450c0337P012N1452j4976n1366R874N4298J1838m4101l6392K1411M3283p400l9754
463b5158J3782M7572k0747o1767J7307P0991J277n6433q219L7277M453l0141l051
476a2857L4458J8076l4840m3342K0871N0273r623m4703J3946L8754k8738m5665
488d3390L3112N3652j9292m3413P771K3926o103j0720J1695J6770j492k3390j8483
$$ plain form
501 -19357 -59 33781 26409 -2310 4571 24385 6708 -13151 12612 42198 27736 -476
513 -476 -4405 11405 24257 21511 10665 18237 32013 10846 -19047 5469 48630 32129 -10259
526 -10259 -529 25458 7799 -10684 12664 34005 15287 -10060 -11236 2807 16846 15712 2309
539 2309 2382 10555 -2587 -17119 7504 33113 12466 -12038 1146 11222 -3454 -478 24670
552 24670 21744 -4424 -11500 1309 8621 7527 5265 4828 5994 -6371 -23168 -11263 19289 12433
566 12433 -22736 -22255 2270 -9116 -29160 -7195 15250 -6239 -31381 -22966 -10463 -8561 -4537
579 -4537 -5074 -16045 -18247 -14572 -19734 -16495 2550 2734 -18895 -25142 -13855 -10194 -7416 1603 -574
594 -574 -13979 -14371 -8334 -10334 -3763 9831 2170 -16266 -14278 -6167 -9945 -5292 6985 -2673 -23600
$$ packed form
501a9357J9298L3840p372k8719O881J9814j7677j9859K5763K9586j4462k8212
513d76l929J5810J2852k746j0846P572J3776k1167k9893K4516M3161j6501m2388
526a0259R730K5987j7659j8483K3348K1341j8718k5347j176J4043J4039j134j3403
539B309P3Q173j3142j4532K4623K5609k0647k4504J3184J0076j4676K976K5148
552B4670k926k6168p076J2809P312j094k262m37J166j2365j6797J1905L0552o856
566A2433l5169M81K4525j1386k0044K1965K2445k1489k5142Q415J2503J902M024
579d537n37j0971k202L675n162L239J9045J84k1629o247J1287L661K778R019k177
594e74j3405l92O037k000O571J3594p661j8436J988Q111l778M653J2277r658k0927
$$ plain form
609 -23600 -21258 -8118 -9176 -12059 -6284 -6519 -15204 -22511 -23715 -10927 9850 2839 -27984 -24593
623 -24593 5975 -1112 -28026 -7813 26650 1692 -38664 -20402 15717 7784 -13289 -6717 3950
636 3950 -5413 -16027 -11363 4785 14279 2347 -15931 -11340 3716 1153 -3107 8593 10585 -8600
650 -8600 -13542 437 4736 1401 7077 5445 -9509 -11400 -459 3314 4051 9383 2428 -10705
664 -10705 -5373 7069 5681 6422 15658 7817 -6498 1281 13883 9112 11998 23616 8984 -11940
678 -11940 5176 28396 12791 -2782 18440 25851 -4579 -14330 18343 34424 11341 -4948
690 -4948 7405 18365 6554 -2633 14403 32045 13854 -13300 -1784 23957 14458 -2877 12919
703 12919 22870 -4312 -15112 11181 20341 1174 1582 12782 -1960 -14178 5928 17713 2391
$$ packed form
609b3600K342J3140j058k883N775k35q685p307j204J2788K0777p011l0823L391
623b4593L0568p087k6914K0213L4463k4958m0356J8262L6119p933k1073O572J0667
636C950r363j0614M664J6148R494j1932j8278M591J5056k563m260J1700J992j9185
650h600m942J3979M299l335N676j632j4954j891J0941L773P37N332o955j3133
664a0705N332J2442j388P41R236p841j4315P779J2602m771K886J1618j4632k0924
678a1940J7116K3220j5605j5573K1222P411l0430r751L2673J6081k3083j6289
690d948J2353J0960j1811r187J7036J7642j8191k7154J1516K5741r499j7335J5796
703A2919R951k7182j0800K6293R160j9167M08J1200j4742j2218K0106J1785j5322
$$ plain form
716 2391 -1978 8605 426 -12531 371 17109 9777 -3109 -3436 -611 225 1025 2277 6163 8219
731 8219 -3717 -16141 -4194 13182 5005 -7898 -49 4280 -9386 -13211 2931 11458 2596
744 2596 -8069 -11048 -5041 2624 -1044 -6987 4021 8666 -15088 -25730 5134 19522 -9650
757 -9650 -20838 6646 7323 -22956 -18056 16024 14602 -14727 -16786 914 1931 -6331 -2911 5704
771 5704 4843 -5978 -13769 -6344 7675 6669 -4254 -4268 -1497 -9058 -8600 2983 3118 -5754 -3553
786 -3553 -2941 -15704 -13143 8821 7785 -13945 -13013 2022 -4802 -16070 -1974 10988 -870 -14853
800 -14853 -10821 -3197 -175 -664 -3675 -2578 -540 -8435 -15027 -61 13309 -1014 -12925 -616
814 -616 4038 -9592 -6099 13445 10218 -8849 -7677 3612 2001 -591 5762 6036 -44 -2937 -5014
$$ packed form
716B391m369J0583q179j2957J2902J6738p332j2886l27K825Q36Q00J252L886K056
731H219j1936j2424J1947J7376q177j2903P849M329j3666l825J6142Q527q862
744B596j0665k979O007P665l668n943J1008M645k3754j0642L0864J4388k9172
757i650j1188K7484O77l0279M900L4080j422k9329k059J7700J017q262L420Q615
771E704q61j0821p791P425J4019j006j0923j4K771p561M58J1583J35q872K201
786c553O12j2763K561K1964j036k1730R32J5035o824j1268J4096J2962j1858j3983
800a4853M032P624L022m89l011J097K038p895o592J4966J3370j4323j1911J2309
814f16M654j3630L493J9544l227j9067J172J1289j611k592O353K74o080k893k077
$$ plain form
829 -5014 -3958 7420 11514 -1804 -8630 2073 4119 -5092 -459 12974 8085 -6690 -5628 3743
843 3743 7201 5868 4358 3503 3375 -413 -5186 3348 14921 5862 -8425 564 8377 -5853 -7558
858 -7558 15561 15112 -12660 -11516 12507 6608 -11910 2083 19888 894 -17904 -2831 12761
871 12761 3084 -5918 2091 5040 -5324 -11292 -1702 8575 3759 -7590 -5757 754 -4646 -8895
885 -8895 5073 9873 -7820 -12994 4677 3813 -13231 -2076 17737 692 -22436 -4686 14642
898 14642 -1729 -14342 4546 11987 -9443 -17063 1018 11072 1903 -6334 -2849 2838 -143
911 -143 -6150 -478 11908 7098 -9407 -7170 7653 4432 -4920 3331 10307 -2736 -10582 1354
925 1354 7048 1230 1120 2740 -2617 -3817 2031 1523 526 7165 5605 -7503 -6578 7011 7553 -1692
$$ packed form
829e014J056J1378M094j3318o826J0703K046r211M633J3433m889j4775J062R371
843C743L458j333j510q55j28l788m773Q534J1573r059j4287Q989P813j4230j705
858g558K3119m49k7772J144K4023n899j8518J3993J7805j8994j8798J5073J5592
871A2761r677r002Q009K949j0364n968R590J0277m816j1349J833O511n400m249
885h895J3968M800j7693n174J7671q64j7044J1155J9813j7045k3128J7750J9328
898A4642j6371j2613J8888P441k1430p620J8081J0054r169q237L485N687k981
911a43o007N672J2386m810j6505K237J4823l221r352Q251O976j3043p846J1936
925A354N694n818j10J620n357j200N848n08r97O639j560j3108R25J3589N42r245
$$ plain form
941 -1692 107 5672 377 -4340 -2171 2624 7232 6279 -4962 -9779 3922 9815 -3178 -5082 10287
956 10287 8248 -9917 -8096 9277 10447 166 -1325 808 -8 1593 2080 71 4431 8521 -1807
971 -1807 -10437 709 11861 3848 -3202 2164 4409 -116 -844 2104 6321 9223 3114 -6753 -1199
986 -1199 11832 6706 -4321 4034 12693 -1277 -10125 5900 14923 1956 -3397 4805 4444 -2843
1000 -2843 505 7723 6509 2815 -871 -2093 2406 6340 1987 314 5773 2593 -6733 -3317 8129
1015 8129 4644 -3134 -141 525 -5008 -2199 4563 -53 -3863 2597 272 -11413 -5937 8722 3152
1030 3152 -10741 -6423 3514 -2403 -10337 -4060 4161 1822 -8395 -13543 -4279 6189 -1893 -13791
1044 -13791 -4402 6841 -6604 -19388 -2942 10664 -3573 -15121 -5225 1308 -6029 -7901 -1743
$$ packed form
941a692J799N565n295m717K169M795M608r53j1241m817J3701N893j2993j904J5369
956A0287k039j8165J821J7373J170j0281j491K133q16J601M87k009M360M090j0328
971a807q630J1146J1152q013p050N366K245m525p28K948M217K902o109r867N554
986a199J3031n126j1027Q355Q659j3970q848J6025R023j2967n353Q202l61p287
1000b843L348P218j214l694l686j222M499L934m353j673N459l180r326L416J1446
1015H129l485p778K993O66n533K809O762m616l810O460k325j1685N476J4659n570
1030C152j3893M318R937n917p934O277Q221k339j0217n148R264J0468q082j1898
1044a3791R389J1243j3445j2784J6446J3606j4237j1548R896O533p337j872O158
$$ plain form
1057 -1743 -549 -2727 -5952 -9866 -5982 3562 516 -9401 -6070 2045 -4077 -10320 -1391 4790 -1982
1072 -1982 -7675 -4943 -2790 -1393 490 -2695 -3548 1387 -764 -9559 -4494 9289 3819 -10078 -4820
1087 -4820 5827 -560 -7872 145 7193 811 -6595 -5790 145 5501 1577 -6413 -2431 6769 -453
1102 -453 -11659 -748 13320 1931 -11912 -2600 7425 561 -4748 2034 4918 551 -2223 -3179
1116 -3179 -579 6525 5942 -3729 -4148 5212 3720 -4523 792 8698 3523 -3167 -217 3149 3125 5111
1132 5111 4827 398 2218 5704 869 -429 8223 9053 -1568 -1902 6496 4928 51 4872 8078
1147 8078 2026 -450 3686 4564 4799 7155 4447 1385 5802 6731 618 3176 12953 7500 -3773
1162 -3773 2068 11046 4989 -1085 6636 8793 1137 -875 3133 4281 4754 5558 796 -1541 3667
$$ packed form
1057a743J194k178l225l914L884R544l046r917L331Q115o122o243Q929O181o772
1072a982n693K732K153J397J883l185q53M935k151q795N065J3783n470j3897N258
1087d820J0647o387p312Q017P048o382p406Q05N935N356l924p990L982R200p222
1102d53j1206J0911J4068j1389j3843R312J0025o864n309O782K884m367k774r56
1116c179K600P104n83r671m19R360j492q243N315P906n175o690K950L366k4J986
1132E111k84m429J820L486m835j298Q652Q30j0621l34Q398j568m877M821L206
1147H078o052k476M136Q78K35K356k708l062M417R29o113K558R777n453j1273
1162c773N841Q978o057o074P721K157p656k012M008J148M73Q04m762k337N208
$$ plain form
1177 3667 4405 -1068 769 6715 2885 -4296 -1200 2517 1102 1819 1862 -3140 -2844 2550 -314 -5855
1193 -5855 541 5940 -3251 -8663 -492 3640 -1623 -2401 350 -1631 -2569 -603 -2410 -2562 3396 2094
1209 2094 -7983 -6147 3713 170 -7472 -1922 3648 -4472 -8555 -729 1071 -3571 -2480 -181 -3950
1224 -3950 -5578 -1111 -400 -2327 -1272 -1485 -3885 -3114 -1610 -2409 -805 526 -4352 -5348 736 362
1240 362 -5676 -959 5415 -3703 -10066 2031 6597 -6129 -7347 7296 3996 -11940 -6344 8879
1254 8879 3083 -9296 -3846 5123 -747 -8094 -3290 3949 2152 -4883 -6589 -1183 1690 -3317 -4607
1269 -4607 504 780 -5789 -4725 1349 -1925 -3768 2541 396 -8603 -3527 7129 -575 -9421 1955
1284 1955 8719 -5360 -9879 5708 8612 -5190 -5272 6189 2899 -6137 -802 6447 2036 -2504
$$ packed form
1177C667P38n473J837N946l830p181L096L717j415P17M3n002K96N394k864n541
1193e855O396N399r191n412Q171M132n263p78K751j981r38J966j807j52N958j302
1209B094j0077J836R860l543p642N550N570q120m083P826J800m642J091K299l769
1224c950j628M467P11j927J055k13k400P71J504p99J604J331m878r96O084l74
1240C62o038M717O374r118o363J2097M566j2726j218J4643l300j5936N596J5223
1254H879n796j2379N450Q969n870p347M804P239j797p035j706N406K873n007j290
1269d607N111K76o569J064O074l274j843O309k145q999N076J0656p704q846J1376
1284A955O764j4079m519J5587K904j3802q2J1461l290r036N335P249m411m540
$$ plain form
1298 -2504 446 2389 -122 -215 2145 3726 1432 -1329 285 4168 1997 -835 3721 5846 -2038
1313 -2038 -3698 6734 6230 -4083 -467 9883 1755 -8512 2505 11723 -717 -6813 5790
1326 5790 8542 -3558 -3407 8024 6926 -1827 -562 4184 2548 1299 2538 1617 1526 2261 -177 -1885
1342 -1885 1566 3490 173 -1304 -347 -1207 -559 1230 -693 -1575 2646 1125 -4956 -2439 5369 1370
1358 1370 -5323 -208 3442 -2729 -3991 2445 1143 -3160 -11 424 -5138 -1164 5680 -1221 -7381
1373 -7381 2622 6949 -5745 -7904 7590 9253 -6272 -7114 6854 6906 -4913 -4908 5935 6691 -3855
1388 -3855 -7295 2394 7503 -1442 -7079 1891 6931 -3453 -7557 4496 7305 -4365 -3945 5530
1402 5530 2022 -5314 1633 7483 -1514 -4568 4149 2872 -5349 -647 6376 -328 -6860 309 3843
$$ packed form
1298b504K950J943k511r3K360J581k294k761J614L883k171k832M556K125p884
1313b038j660J0432n04j0313L616J0350q128j0267J1017R218j2440o096J2603
1326E790K752j2100J51J1431j098q753J265M746j636j249J239r21r1P35k438j708
1342a885L451J924l317j477R57q60O48J789j923q82M221j521o081K517P808l999
1358A370o693N115L650o171j262O436j302m303L149M35n562L974O844o901o160
1373g381J0003M327j2694k159J5494J663j5525q42J3968N2j1819NJ0843P56j0546
1388c855l440R689N109q945n637Q970N040j0384m104J2053K809j1670M20R475
1402E530l508p336O947N850q997l054Q717j277q221M702P023o704o532P169L534
$$ plain form
1417 3843 -3282 -4731 2479 3518 -2694 -4553 -6 4437 1393 -4632 -1641 6263 2333 -7986 -3014
1432 -3014 9826 3881 -10615 -4779 8177 1964 -9715 -3458 7145 2647 -7003 -5503 2277 5116
1446 5116 -551 -5786 -273 7437 1024 -7650 96 9480 1404 -7115 360 5080 -1111 -2101 2570
1461 2570 555 -2677 1376 1187 -4243 -148 7160 950 -6368 747 7696 58 -4379 3866 7071
1476 7071 -547 -4422 1817 6535 1081 -4003 61 5674 -195 -7592 -540 9114 314 -10516 -948
1491 -948 9567 -1161 -10031 2776 9741 -2703 -7821 2216 4757 -2167 -1736 1711 -1662 -1942
1505 -1942 1037 -1922 -5436 673 4015 -4697 -8467 -415 3601 -2374 -6616 -1576 3415 32 -6863
1520 -6863 -3743 5806 4045 -7055 -5942 5911 4022 -7695 -4057 6956 1091 -8973 -2574 4938
$$ packed form
1417C843p125j449P210J039o212j859M547M443l044o025K991P904l930j0319M972
1432c014J2840n945j4496N836J2956o213j1679O257J0603m498r650J500P780K839
1446E116n667n235N513P710o413q674P746R384q076q519P475M720o191r90M671
1461B570k015l232M053j89n430M095P308o210p318P115O949p638m437Q245L205
1476G071p618l875O239M718n454n084M064N613n869p397P052R654q800j0830R568
1491i48J0515j0728q870J2807O965j2444n118J0037K541o924M31L447l373k80
1505a942K979k959l514O109L342q712l770Q052M016n975m242N040M991l383o895
1520f863L120R549j761j1100J113J1853j889j1717L638J1013n865j0064O399P512
$$ plain form
1534 4938 -1291 -4920 1280 1729 -3533 -2018 1980 260 -991 1751 1038 -1553 308 1953 -537
1549 -537 -85 1855 -636 -2340 -107 523 -823 -275 -7 -2439 -923 1139 -1291 -2383 3163 3351
1565 3351 -3571 -2402 5039 3410 -2424 675 4588 954 -1543 1019 1549 1002 2602 -52 -3761
1580 -3761 782 4427 -1586 -4379 3243 4552 -5000 -5075 4174 4393 -3160 -2377 2942 1150 -3122 -1622
1596 -1622 1571 1723 -1239 -2881 -592 1632 -1034 -3320 1859 3748 -2969 -4009 4356 4050 -2802
1611 -2802 473 7349 1515 -3434 3716 7787 114 -880 6315 3908 -3397 1219 7084 949 -3413
1626 -3413 2279 4451 -1674 -2965 1818 3866 155 -3221 -618 3300 1487 -2763 -557 5331 1843
1641 1843 -5406 -629 5972 1222 -4427 1775 4495 -2506 -3287 3526 2852 -2352 111 3532 -918
$$ packed form
1534D938o229l629O200M49n262J515L998j720j251K742p13k591J861J645k490
1549e37M52J940k491j704K233O30j346N48K68k432J516K062k430j092N546J88
1565C351o922J169P441j629n834L099L913l634k497K562N30n47J600k654l709
1580c761M543L645o013k793P622J309r552p5R249K19p553P83N319j792m272J500
1596a622L193J52k962j642K289K224k666k286N179J889o717j040Q365l06o852
1611b802L275O876n834m949P150M071p673r94P195k407p305M616N865o135m362
1626c413N692K172o125j291M783K048l711l376K603L918j813m250K206N888l488
1641A843p249M777O601m750n649O202K720p001p81O813o74n204K463L421m450
$$ plain form
1656 -918 -1883 3403 2774 -823 559 2558 -233 -915 2275 1085 -2112 -591 -55 -3038 -2791 52
1672 52 -1113 -3238 -2800 -2921 -3754 -1797 -1744 -3611 -1610 777 -3059 -4947 1201 3204 -2851 -3034 2574
1689 2574 813 -3456 -590 3273 118 -1390 701 -490 -1762 1442 1933 -2187 -876 2804 -181
1704 -181 -3100 1206 3747 -692 -2107 813 603 -1335 -20 24 -1221 -771 -963 -3560 -2088 1661
1720 1661 -1124 -4114 -512 1534 -3430 -3203 3036 2028 -2765 -1265 2597 605 -1304 1419 2426
1735 2426 539 100 -664 -1236 1641 2429 -1996 -3440 1425 1316 -4173 -2562 2726 778 -4110 -2533
1751 -2533 584 155 -404 -320 -1210 383 1549 -2313 -3869 2569 4250 -2992 -4542 2310 2647 -3222
1767 -3222 -2013 2979 1590 -2012 -806 1302 1365 2148 1336 -589 1307 3245 241 -777 3441 3809
$$ packed form
1656i18r65N286o29l597J382J999k791o82L190j190l197J521N36k983K47K843
1672E2j165k125M38j21q33J957N3j867K001K387l836j888O148K003o055j83N608
1689B574j761m269K866L863l155j508K091j191j272L204M91m120J311L680k985
1704a81k919M306K541m439j415K920k10j938J315M4j245M50j92k597J472L749
1720A661k785k990L602K046m964K27O239j008m793J500L862j992j909K723J007
1735B426j887m39p64n72K877P88m425j444M865j09n489J611N288j948m888J577
1751b533L117m29n59Q4q90J593J166l862j556O438J681p242j550O852L37n869
1767c222J209M992j389l602J206K108O3P83q12j925J896J938l004j018M218L68
$$ plain form
1783 3809 -955 -1329 2061 1626 -861 894 1321 -259 -95 523 -1222 696 3723 422 -2640 1897
1799 1897 4410 -1320 -2092 5123 4232 -2797 -1724 4292 2636 -1771 -168 2297 769 -1357 -1241 -76
1815 -76 2393 860 -3014 -2248 2479 1344 -3781 -919 4360 -213 -4153 -492 2403 -254 -1378 72
1831 72 -783 -1514 171 -960 -2212 554 1746 -2849 -3445 1511 1786 -2222 -751 2691 305 -1888
1847 -1888 218 1529 835 972 -29 -1774 129 1778 -1361 -1924 2198 1494 -3909 -2765 2822 1178
1863 1178 -2706 -127 2650 -459 -1981 968 2110 886 772 -32 -751 1846 1577 -1046 -395 3347
1879 3347 417 -3627 -563 3386 67 -2218 732 1197 -1184 -769 653 370 565 1523 -1520 -2465
1895 -2465 1390 2118 -2379 -1967 1925 211 -4423 -2606 1280 -150 -2632 -2089 -1153 -1015 -217 -1506
$$ packed form
1783C809m764l74L390m35k487J755M27j580J64O18j745J918L027l301l062M537
1799A897K513n730p72P215q91p029J073O016j656m407J603K465j528k126J16J165
1815g6K469j533l874P66M727j135n125K862N279m573l940L661K895k657j124J450
1831G2q55p31J685j131j252K766J192m595n96M956K75m008J471L442k386k193
1847a888K106J311o94J37j001j745J903J649l139n63M122p04n403J144N587j644
1863A178l884K579K777l109j522K949J142j224j14q04p19K597k69k623O51L742
1879C347k930m044L064L949l319k285K950M65k381M15J422k83J95R58l043r45
1895b465L855P28m497M12L892j714m634J817L886j430k482N43R36J38P98j289
$$ plain form
1911 -1506 -1562 1495 1659 -3240 -2375 3486 1815 -2689 -504 2988 -405 -2858 254 1845 -211 -1095
1927 -1095 -255 -941 -85 921 -590 -532 1946 978 -2369 -470 3763 1461 -2015 1129 3084 -361
1943 -361 -1807 1857 2085 -144 -484 -643 -1010 810 1423 -1191 -1082 2105 556 -2720 -110 4027 1553
1960 1553 -1274 41 1822 572 624 562 -39 1566 866 -2399 -2579 2509 2119 -3617 -2894 2466 453
1977 453 -4006 -995 3383 524 -2701 -169 1089 246 -41 -150 195 788 -164 -2643 -939 2100 -288
1994 -288 -3667 -895 1342 -1955 -3664 682 1936 -1523 -2228 333 638 -50 732 78 519 1712 216
2011 216 -2429 501 4075 564 -2949 -59 2275 -767 -1979 910 1518 -429 -758 -483 5 2293
2027 2293 2471 -1434 -780 3315 2342 -2482 -609 4620 1594 -3406 -1024 2201 751 -1702 -855 238
$$ packed form
1911a506n6L057J64m899Q65N861j671m504K185L492l393k453L112J591k056q84
1927a095Q40o86Q56J006j511N8K478r68l347J899M233k302l476L144J955l445
1943c61j446L664K28k229l40j59l67J820O13k614J09L187j549l276K610M137k474
1960A553k827J315J781j250N2o2o01J605p00l265j80N088l90n736P23N360k013
1977D53m459L011M378k859l225K532J258q43k87j09L45N93r52k479J704L039k388
1994b88l379K772K237l297j709M346J254l459p05K561L05o88P82o54M41J193j496
2011B16k645K930L574l511l513K890K334l042j212K889O08j947l29K75M88K288
2027B293J78l905O54M095r73m824J873N229l026n000K382L225j450k453Q47J093
$$ plain form
2043 238 258 -1184 -2645 -277 2383 185 -3378 -262 3028 -614 -3098 1654 3207 -1596 -2662 1429
2059 1429 1451 -1427 -775 890 -269 -1301 -717 -1500 -84 1612 -305 -3330 -222 2513 -669 -2261
2075 -2261 1502 2662 -1202 -1794 594 1352 541 -163 -988 -463 1276 159 -3010 -78 3680 18
2091 18 -4528 -467 3680 342 -2399 501 2559 699 -1060 -313 1855 3048 987 -1861 243 3262
2107 3262 628 -2393 1526 3791 -1089 -2868 1621 2825 -1126 -169 2413 428 -1543 742 1592
2122 1592 -409 501 1590 -665 -1742 1139 1285 -1153 -374 1192 -824 -2580 71 802 -535 -1477
2138 -1477 -950 -109 -212 -1325 -1424 591 2292 -1523 -3401 1176 2922 -1939 -2419 2547 1989 -2875 -2013
2155 -2013 2733 894 -1715 -102 888 -1170 -428 1205 37 -564 956 179 -1724 -82 1502 241
$$ packed form
2043B38K0j442j461K368K660k198l563L116L290l642k484M752J553m803j066M091
2059A429K2k878O52J665j159j032N84p83J416J696j917l025L108K735l182j592
2075b261L763J160l864n92K388P58q11p04q25N25J739j117l169K932L758l662
2091A8m546M061M147l338k741K900K058j860j759P47K168J193k061k848K104L019
2107C262k634l021L919K265m880j779M489J204l951R57K582j985j971K285Q50
2122A592k001R10J089k255j077K881J46k438P79J566k016j756K651P31j337r42
2138a477N27Q41j03j113r9K015J701l815j878M577J746m861m80M966n58m864Q62
2155b013M746j839k609J613R90k058P42J633j168o01J520p77j903J642J584j261
$$ plain form
2171 241 -789 448 236 -963 6 955 54 -115 285 -747 -687 1174 718 -550 909 1500 -998 -1176
2189 -1176 2595 1498 -1008 58 2269 -47 -1422 1031 1891 -140 -763 283 -355 -582 866 200
2205 200 -1183 1034 920 -2065 -1521 1587 1029 -2295 -984 846 -1010 -1832 -72 -81 -868 -946 -1324 -1618
2223 -1618 -373 163 -1377 -1229 581 -188 -2242 -108 2202 -313 -1899 873 885 -1777 -471 1625
2239 1625 507 -1677 -79 83 -819 -261 536 -569 -480 406 -216 -1152 1232 1860 -563 -792 1210 977
2257 977 -951 825 1268 -255 245 687 -865 -540 2206 1352 -2181 -1042 2277 225 -1992 445
2273 445 2391 -332 -1302 534 1160 488 659 -91 245 927 318 -1511 155 1925 -378 -2002 -205
2290 -205 813 -1378 -1032 1486 363 -1729 -320 764 -585 -251 1502 214 -901 771 793 -756
$$ packed form
2171B41j030J237k12j199R69R49r01j69M00j032O0J861m56j268J459N91k498j78
2189a176L771j097k506J066K211k316j375K453Q60k031o23J046o38k27J448o66
2205B00j383K217j14k985N44L108n58l324J311J830j856q22J760rp87p8l78k94
2223a618J245N36j540J48J810p69k054K134K310k515j586K772J2k662J306K096
2239A625j118k184J598J62r02N58P97j105Q9Q86o22r36K384O28k423k29K002k33
2257I77j928J776M43j523N00M42j552L25K746q54l533J139L319k052k217K437
2273D45J946k723r70J836O26o72J71p50L36O82o09j829J666J770k303j624J797
2290b05J018k191L46K518j123k092J409J084j349L34J753j288j115J672K2j549
$$ plain form
2306 -756 -56 1760 -252 -2115 -331 833 -1281 -1122 423 -4 -1207 -893 -353 -126 974 155 -1321
2323 -1321 57 2290 186 -1449 1390 2718 -448 -1773 1269 2110 16 -51 820 290 568 709 -673
2340 -673 -195 2355 1272 -2408 -410 2645 1653 -1516 354 2490 865 -1375 -159 1328 1540 137
2356 137 -1757 -270 1310 -210 -2752 -364 2464 -622 -3656 -66 2160 -747 -1513 1444 1158 -1356
2372 -1356 -750 1345 336 -324 876 12 -1039 195 1110 -1110 -730 1017 79 -2175 -1065 598
2388 598 -140 -928 -705 -432 97 -125 -1212 -771 1620 399 -3075 -569 2872 103 -2995 -41 2605
2405 2605 -785 -3158 230 2175 -389 -1345 23 199 625 721 -277 164 2135 1053 -1251 -143 2932
2422 2932 1252 -986 408 1743 11 -965 423 835 -60 -304 -1001 -853 324 638 -1421 -794 1216
$$ packed form
2306g56P00J816k012j863J784J164k114J59J545m27j203L14N40K27J100q19j476
2323a321J378K233k104j635K839J328l166j325L042Q41k094o7Q71n30K78J41j382
2340f73M78K550j083l680J998L055r92l169J870K136j625k240J216J487K12j403
2356A37j894J487J580j520k542K388K828l086l034L590K226k907p66K957k86k514
2372a356O06K095j009o60J200q64j051J234R15k220L80J747r38k254J110J663
2388E98p38p88K23K73N29k22j087M41K391j221l474K506L441k769l098K954K646
2405B605l390k373L388J945k564r56J368J76M26R6r98M41J971j082k304J108L075
2422B932j680k238J394J335j732r76J388M12q95k44o97J48J177L14k059O27K010
$$ plain form
2439 1216 -332 -1720 79 1767 -29 -1345 610 762 -571 -236 486 -329 -358 364 -1387 -1176 1228
2456 1228 996 -2194 -906 2101 -147 -2784 7 2089 -244 -2242 -336 1285 149 -701 159 156
2472 156 812 -584 -1309 -110 1856 -303 -2281 -69 1627 -809 -1503 568 629 -595 -253 299 -379
2489 -379 344 1644 214 -660 1186 1601 -735 -432 2253 1204 -1017 17 1085 67 -168 1053
2505 1053 507 -298 228 154 -381 812 1221 -248 -451 969 210 -963 554 1732 -501 -1182 1062
2522 1062 529 -1524 -224 1179 -767 -1245 173 -234 -986 -210 367 -1146 -741 449 -462 -1038 538
2539 538 808 -1165 -883 676 -42 -533 661 159 -1150 -565 1092 -816 -1282 960 762 -1319 -1331 791
2557 791 528 -1084 243 580 -357 279 320 -354 113 1125 120 -635 551 877 -815 13 1254 -161
$$ packed form
2439A216j548j388J799J688j796j316J955J52j333L35P22q15k9P22j751K11K404
2456A228k32l190J288L007k248k637K791K082k333j998J906J621j136q50Q60l
2472A56O56j396p25J199J966k159j978K212J696k436o94K071O1j224L42N52o78
2489c79P23J300j430q74J846M15k336L03K685j049k221J034J068j018k35J221
2505A053n46q05N26p4n35J193M09j469k03J420p59j173J517J178k233o81K244
2522A062n33k053J300J403j946m78J418m07p52P76N77j513M05J190r11n76J576
2539E38K70j973K82J559p18m91J194n02j309N85J657j908m66K242j98k081j2K122
2557G91k63j612J327L37r37O36M1o74M67J012j005p55J186L26j692Q28J241j415
$$ plain form
2575 -161 -857 659 885 -694 -76 1658 -54 -1717 891 1584 -471 -571 1395 1069 -695 33 884
2592 884 574 891 467 -613 -144 852 -160 -1096 482 1173 -1116 -1003 703 525 -870 221 583 -739
2610 -739 -755 813 326 -1021 380 634 -539 -247 353 -41 -1088 66 403 -1236 -607 954 -148
2627 -148 -954 551 359 -634 -463 705 202 -89 936 -22 -804 636 1396 -231 -543 1459 501 -1209
2645 -1209 -105 1071 122 -451 597 -248 -475 994 944 -741 356 1676 237 -1106 906 1817 -374
2662 -374 -358 695 608 -66 419 260 -337 492 270 -646 -572 963 206 -1343 -224 866 -739 -874 662
2681 662 277 -1195 -101 471 -1117 -1082 936 8 -1608 -134 480 -1112 -1190 826 220 -1207 -492 256
2699 256 -662 -1321 180 334 -618 -776 -325 -14 551 -139 -893 -310 1046 -986 -1608 606 1516 -1496
$$ packed form
2575a61o96J516K26j579O18J734j712j663K608O93k055j00J966l26j764P28Q51
2592H84l10L17m24j080M69R96j012r36J578O91k289J13J706j78j395J091L62j322
2610g39j6J568m87j347J401K54j173K92O00l94j047J154L37j639O29J561j102
2627a48q06J505j92r93J71J168n03k91J025r58p82J440P60j627l12K002r58j710
2645a209J104J176r49n73J048q45k27J469n0j685J097J320j439j343K012R11k191
2662c74J6J053q7o74M85j59n97Q29k22r16P4J535p57j549J119J090j605j35J536
2681F62l85j472J094N72j588L5K018r28j616J474O14j592p8K016o06j427P15P48
2699B56r18o59J501J54r52j58M51L11N65o90p54N83J356k032o22K214R10l012
$$ plain form
2717 -1496 -1836 764 516 -1275 -316 1095 -666 -1044 771 158 -1509 398 1605 -527 -1457 1071
2733 1071 1172 -1026 -482 1417 785 -837 -461 926 1268 145 -766 56 1242 106 -1322 -24 1896
2750 1896 120 -1910 1013 1887 -498 -1232 1358 900 -1711 -386 1128 -444 -908 693 589 -902
2766 -902 72 913 -602 -1092 913 642 -1198 -553 1178 260 -696 524 454 -130 -474 52 366 671 189
2785 189 -831 -7 1226 -156 -757 902 1211 -512 -755 1193 522 -572 518 919 -38 -218 1300
2802 1300 210 -1011 1399 2002 -1110 -1134 1876 1666 -1167 -427 1938 567 -1217 403 1785 622
2818 622 -176 427 796 889 135 -15 705 1044 -204 -1012 622 829 -1004 -375 1653 -76 -1759 203
2836 203 1528 -920 -1330 1014 531 -1512 -385 702 -453 -1216 418 382 -1221 -786 579 -257 -1275
$$ packed form
2717a496l40K600k48j791R59J411j761l78J815o13j667J907J207k132r30K528
2733A071J01k198N44J899o32j622L76J387L42j123r11Q22J186j136j428J298J920
2750A896j776k030K923Q74k385p34K590m58k611J325J514j572m64J601j04j491
2766i02R74Q41j515m90K005k71j840O45J731r18r56J220p0n84l44N26L14L05m82
2785A89j020Q24J233j382o01J659L09j723k43J948o71j094J090M01r57j80J518
2802A300j090j221K410O03l112k4L010k10k833P40K365j371j784J620J382j163
2818F22p98O03L69R3p54j50P20L39j248q08J634K07j833O29K028j729j683J962
2836B03J325k448m10K344m83k043J127J087j155p63J634l6j603M35J365q36j018
$$ plain form
2853 -1275 -385 16 -305 -496 -207 -458 -308 -94 -1041 -676 822 -50 -1486 -68 535 -632 -1204 542
2871 542 357 -962 -209 716 -763 -581 619 31 -1000 -158 731 -762 -737 834 332 -846 11 786
2889 786 -158 -588 597 583 -680 110 383 -515 -489 314 251 -476 490 -54 -377 377 800 -877 -226 1058
2909 1058 313 -1082 47 895 -256 -1262 592 246 -1114 -4 747 -277 -935 262 -157 -884 -78
2926 -78 823 -594 -860 72 58 -1089 -234 741 -675 -461 182 -506 -707 153 654 -857 -310 334 -314
2945 -314 -449 6 261 -508 47 376 -498 -546 989 426 -745 486 766 -450 6 1195 1014 -701
2963 -701 123 1199 -454 -142 1212 731 -977 330 1240 132 -591 628 841 -210 177 434 223
2980 223 671 942 -364 -313 621 499 -548 164 1014 -178 -628 338 412 -281 244 637 -669 -525 811
$$ packed form
2853a275Q90M01l21j91K89k51J50K14r47L65J498q72j436J418O03j167n72J746
2871E42j85j319P53R25j479J82J200n88j031Q42Q89j493K5J571n02j178Q57P75
2889G86r44m30J185j4j263P90K73q98K6Q03o3p27R66n44l23P54M23j677O51J284
2909A058p45j395J129Q48j151j006J854l46j360J110P51j024o58J197m19p27Q06
2926g8R01j417k66R32j4j147Q55R75j416K14O43o88k01Q60N01j511N47O44o48
2945c14j35M55K55p69N55L29q74m8J535n63j171J231K80j216M56J189j81j715
2963g01Q24J076j653L12J354m81j708J307R10j108p23J219K13j051L87K57k11
2980B23M48K71j306N1R34j22j047P12Q50j192m50R66P4o93N25L93j306J44J336
$$ plain form
2999 811 348 -1126 252 884 -383 -998 405 328 -364 3 174 -633 -339 540 -660 -656 515 198 -1176
3018 -1176 -995 754 -114 -1200 207 443 -921 -717 429 158 -323 357 439 -716 -80 460 265 -180
3036 -180 184 18 -550 578 325 -349 -74 617 41 -933 484 768 -95 -215 800 95 -343 369 573
3055 573 -696 123 1309 120 -769 534 1282 -553 -363 1000 523 -885 -7 644 -165 -78 296 -269
3073 -269 -424 480 87 -517 66 288 -342 -427 340 124 -399 62 -3 -873 -49 724 -317 -891 607 330
3093 330 -1313 -572 1015 -125 -1237 106 513 -733 -698 1152 217 -867 40 511 -206 -275 165 304
3111 304 226 -89 -233 -61 487 408 -892 -356 1000 -59 -1244 441 1224 -303 -358 420 561 -304 395
3130 395 470 -237 33 422 145 -485 146 810 -71 -363 651 364 -91 120 531 -468 -23 390 -263 -475
$$ packed form
2999H11m63j474J378O32j267o15J403p7o92L67J71q07K94Q79j200MJ171l17j374
3018a176J81J749q68j086J407K36j364K04J146k71m81O80Q2j155O36N40j95m45
3036a80L64j66n68J128k53o74K75O91n76r74J417K84q63j20J015p05m38P12K04
3055E73j269Q19J186j189q89J303P48j835J90J363m77j408Q78O51q09Q7L74n65
3073b69j55R04l93o04N83K22o30q5P67k16n23M61o5q70Q24P73j041n74J498k77
3093C30j643P41J587j140j112J343M07j246L5J850r35j084R07M71p17o9M40J39
3111C04p8l15j44J72N48p9j300N36J356j059j185J685P83j527n5P78J41q65O99
3130C95P5p07K70L89k77o30O31O64q81k92J014k87m55K11M11r99M45M13o53k12
$$ plain form
3150 -475 402 -69 -914 -367 180 -622 -794 396 -45 -1078 -429 209 -593 -841 490 82 -1122 -460 179
3169 179 -453 -216 227 -515 -443 177 -17 -1232 -316 1170 3 -1221 26 269 -536 -589 278 -129 -639
3188 -639 17 -98 -614 173 701 -411 -729 469 146 -734 173 755 -167 -270 380 294 -662 115 534 -328
3208 -328 -315 848 166 -156 249 890 -183 57 410 227 -141 612 475 -856 -365 591 167 -391 540
3227 540 430 -247 -363 492 -141 -234 488 -49 -905 107 797 -500 -671 611 439 -651 -338 635 158
3246 158 -394 -79 254 -533 -99 125 -317 -67 607 -245 -767 398 693 -308 58 937 109 -323 398
3265 398 689 -62 210 392 153 -389 586 86 -432 -106 583 -620 -504 635 676 -324 18 738 163
3284 163 -295 595 607 425 558 295 183 352 505 323 -204 686 101 -772 235 953 -103 -259 395 444
$$ packed form
3150d75Q77m71q45N47N47q02j72J190m41j033O49O38q02k48J331m08j204O62O39
3169A79o32K37M43p42P2O20j94j215R16J486j167j224J247K43q05n3Q67m07n10
3188f39O56j15n16P87N28j112l18J198l23q80R07N82r22j03O50q6r56P77M19q62
3208c28J3J163o82l22M05O41j073K40L53j83l68P53j37j331M91R56m24n58R31
3227E40j10o77j16Q55o33r3P22n37q56J012O90j297j71J282j72j090L13R73m77
3246A58n52L15L33p87M34K24m42K50O74q52n22J165K95j001L66Q79q28m32P21
3265C98K91p51K72J82k39n42R75n00n18L26O89j203J16J139M1j000L42P20n75
3284A63m58Q90J2j82J33k63j12J69J53j82n27Q90n85q73J007P18j056j56O54M9
$$ plain form
3304 444 -478 -13 943 129 -343 633 495 -1057 -138 692 -187 -833 136 108 -590 -768 273 -457 -434 -134
3324 -134 -517 -1050 260 378 -868 -454 498 -201 -1032 31 536 -197 -428 184 -285 -868 117 -5 -707
3343 -707 -399 205 -858 -744 130 183 -821 -183 90 -652 -722 268 426 -484 41 241 54 -231 401 290
3363 290 -297 225 143 -299 -132 931 -53 -812 80 537 -161 -406 277 524 -440 285 -312 -382 160 672
3383 672 -532 -409 491 72 -1088 -240 1071 -87 -1293 -361 481 -356 -521 -158 -281 -218 45 -109 -301
3402 -301 706 652 -681 -219 549 244 -652 325 746 -256 -377 372 -4 -461 367 117 -604 83 19 -382
3422 -382 -224 448 690 -989 -306 891 173 -771 429 716 -378 -289 428 285 -24 110 55 245 361
3441 361 212 -104 16 1057 205 -369 528 994 206 -244 688 664 -59 364 462 -263 206 652 -275 -462
$$ packed form
3304D44r22M65R56q14m72R76j38j552R19Q30q79o46R69k8o98j78J041p30K3L00
3324a34l83n33J310J18j246M14R52o99q31J063N05p33k31O12m69n83R85j22p02
3343g07L08O04j063J14Q74N3j004O38K73p42p0R90J58r10N25K00j87k85O32j11
3363B90n87N22q2m42J67J063r84p59Q92M57o98k45O83K47r64P25n97p0N42N12
3383F72j204J23R00m19j160Q48J311j158j206R32Q42q37j65L63j23O3K63j54j92
3402c01J007n4j333M62P68l05q96R77M21j002j21P49l76m57Q28k50p21O87o4m01
3422c82J58O72K42j679O83J197p18r44J200K87j094Q9P17j43l09J34n5J90J16
3441C61j49l16J20J041q52n74Q97M66p88m50R32k4p23M23R8p25M69M46r27j87
$$ plain form
3461 -462 602 372 -793 -143 1056 -304 -1333 84 639 -278 -690 138 8 -342 -127 -35 -113 467 141
3480 141 -857 -244 329 -113 -686 285 468 -701 -645 244 59 -396 89 494 -362 -564 360 87 -363 251
3500 251 -4 -789 -415 693 -208 -592 380 440 -741 -253 486 355 -363 -117 137 -41 76 397 -185 37
3520 37 666 -127 -650 282 818 -330 -647 601 316 -537 108 570 173 -151 229 -101 -48 208 251 -238
3540 -238 -201 389 -383 -636 320 194 -458 -158 127 -450 -507 399 183 -540 -261 291 -204 -594 101 256 -249
3561 -249 -364 192 -501 -387 467 44 -606 -480 312 -517 -349 658 150 -725 -70 294 -172 -259 284 -168
3581 -168 -487 417 167 -583 -181 756 -166 -363 252 478 -345 -185 684 38 -269 305 32 -181 444 341
3601 341 -26 -31 477 394 -64 708 530 -135 7 763 112 -606 263 627 -10 -400 124 -169 -208 -8 -237
$$ packed form
3461d62J064k30j165O50J199j360j029J417N55r17m12Q28j30l50K15R2p8N80l26
3480A41r98O13N73m42n73R71J83j169N6Q89j85m55M85M05q56k02R24k73m50O14
3500B51k55p85L74J108r01l84R72O0j181M88P39j31p18K46K54j78J17L21n82K22
3520C7O29p93n23R32N36j148l17J248k85q53O45M62l97l24L80l30N3K56M3m89
3540b38L7N90p72k53R56j26o52L00K85n77n7R06k16p23K79N52m95l90O95J55n05
3561b49j15N56o93J14Q54m23o50J26P92q29J68J007n08q75O55L64m66q7N43m52
3581a68l19R04k50p50M02R37r22j97O15K26q23J60Q69o46l07N74k73k13O25j03
3601C41l67nN08q3m58P72j78o65J42P56o51p18Q69L64o37l90N24k93l9K00k29
$$ plain form
3622 -237 -323 -33 539 -53 -112 352 299 -418 -341 424 -70 -483 290 90 -541 -233 289 -385 -389 228 -165 -784
3644 -784 -152 293 -338 -773 474 70 -565 -180 -52 -297 -38 508 4 -386 -8 152 -593 7 537 -360
3664 -360 -561 377 -58 -488 101 752 -241 -602 241 325 -148 -187 733 239 -145 483 342 -240 368 595 -73
3685 -73 -203 118 501 -92 32 -1 -88 -60 188 194 -96 88 268 -306 129 504 66 -468 445 245 -498 -235
3707 -235 187 -221 -255 703 40 -413 -18 553 -320 -588 387 65 -766 -452 183 -265 -202 -15 346 64 405
3728 405 48 40 122 -22 -391 -302 -43 415 -149 -64 226 -142 -516 -13 250 -171 -265 249 -346 -305 657 387
3750 387 -25 -24 536 -164 -197 281 444 -351 24 752 112 -314 477 545 -298 39 143 -185 313 357 99 -18
3772 -18 738 675 -99 -145 458 582 -519 -141 369 -87 -499 47 -189 -28 -79 -448 -560 262 222 -850 -580
$$ packed form
3622b37q6K90N72n92n9M64n3p17P7P65m94m13P73k00o31L08N22o74mO17l93o19
3644g84O32M45o31m35J247m04o35L85J28k45K59N46n04l90L78J60p45O00N30q97
3664c60k01R38m35m30N89O51r93l61Q43Q4m73l9R20m94l84O28j41n82O08K27o68
3685g3j30L21L83n93J24l3q7K8K48Ok90J84J80n74M35L75m38n34R13k00p43K63
3707b35M22m08l4R58o63m53L95N71q73k68R75l22q31L14O35m48O3J87L61k82L41
3728D05l57qQ2j44l69Q9K59M58n64Q5K90l68l74N03K63m21r4N14n95M1R62k70
3750C87m12JN60p00l3M78J63p95L75P28o40m26P91O8q43L37J04l28M98M4k58j17
3772a8P56o3p74m6O03J24j101L78N10m56m12N46k36J61n1l69j12Q22m0j072K70
$$ plain form
3793 -580 598 106 -1197 -377 597 52 -685 440 237 -509 -500 157 -514 -372 136 -70 -863 -228 152 -480
3813 -480 -747 62 71 -342 70 205 -288 95 20 -372 6 52 -163 -469 -96 350 -203 -365 619 5 -824
3834 -824 -92 500 -294 -541 145 245 -523 -348 463 -36 -233 243 -233 -245 474 131 -478 -78 589 202
3854 202 -504 87 212 -208 2 41 147 -77 84 20 -486 286 437 -114 -430 368 123 -431 158 576 -463
3875 -463 -677 62 403 -638 -415 -29 -224 -357 39 279 -546 48 32 -115 0 368 -131 -432 435 353
3895 353 -68 -273 509 221 -121 253 602 233 -164 183 144 323 317 240 -292 245 570 -337 -17 1032 536
3916 536 -30 340 328 12 -280 389 306 -259 4 336 -127 -296 745 255 -272 32 763 -81 -40 424 210
3937 210 -583 -63 303 -25 97 283 -205 -120 27 -20 -192 24 320 -497 -371 518 106 -827 -130 352 -389
$$ packed form
3793e80J178m92j303Q20R74n45p37J125k03p46RO57o71J42N08k06p93O35L80o32
3813d80k67Q09Rm13M12J35m93L83p5l92L78M6k15l06L73M46n53j62R84o14q29
3834h24P32N92p94k47O86J00p68J75Q11m99j97M76m76j2P19l43o09M00O67l87
3854B02p06N91J25m20K10L9J06k24J61o4n06P72J51n51l16P98k45n54N89M18j039
3875d63k14P39L41j041K23L86j95j33L96K40q25N94j6j47J15L68m99l01Q67q2
3895C53m21k05P82k88l42L74L49l69l97L47l9J79op7n32N37L25r07L20J049m96
3916E36n66L70j2l16k92O69q3n65K63L32m63j69J041m90n27L04P31q44M1M64k14
3937B10p93N20L66l28J22J86m88Q5J47m7j72K16K96q17J26Q89m12r33O97M82p41
$$ plain form
3958 -389 -513 88 317 -311 -95 -42 -172 -358 -142 81 -109 178 -79 -512 -324 -18 -221 -54 195 197 -241
3979 -241 -4 297 113 -85 475 151 -30 -59 585 93 -381 41 231 -108 -71 637 21 -275 147 376 -193
4000 -193 -288 500 -137 -102 321 319 74 -20 153 -295 92 415 -140 -743 395 693 -472 -195 279 43 -477
4021 -477 -77 432 -353 -167 -12 -212 -252 39 207 -299 -123 594 -325 -509 -292 256 -405 -136 -330 -467
4041 -467 -298 21 48 -412 26 -168 -340 -336 149 12 -332 33 627 -247 155 573 -86 88 378 435 -572
4062 -572 -389 430 122 -144 158 41 -481 -31 404 57 -49 329 130 -42 225 562 111 -353 42 68
4082 68 -2 177 358 46 1 460 205 -332 382 455 95 -149 506 -37 -43 256 314 -128 82 221 -70 -351
4104 -351 311 141 -526 -423 383 -240 -395 211 45 100 -234 254 -120 -113 -65 183 -677 -108 408 -274 -341 140
$$ packed form
3958c89j24O01K29o28K16N3j30j86K16K23j90K87k57m33J88L06k03J67K49Km38
3979b41K37L01j84j98N60l24j81k9O44m92m74M22J90l39L7P08o16k96M22K29n69
4000a93r5P88o37L5M23kk45r4J73m48L87L23n55o03J138K98j165K77M74k36n20
4021d77M00N09p85J86J55k00m0K91J68n06J76P17r19j84K17N48o61K69j94j37
4041d67J69L19K7m60M38j94j72MM85j37l44L65N94q74M02M18o59J74K90N7j007
4062e72J83Q19l08k66L02j17n22M50M35l47j06L78j99j72K67L37m51m64L95K6
4082F8p0J79J81l12m5M59k55n37P14P3l60k44O55n43oK99N8m42K10J39k91k81
4104c51O62j70o67J03Q06o23j55O06j66N5l34M88l74PM8K48q60N69N16o82o7M81
$$ plain form
4126 140 -25 -361 222 151 58 -80 401 -37 -601 241 88 -549 132 458 178 -86 -38 142 -66 119 333
4147 333 56 -6 212 160 -316 138 426 62 -131 102 -72 -354 118 103 -227 -558 320 715 -439 125 244
4168 244 -101 26 455 319 -60 -244 116 -149 86 312 -123 -271 356 147 -511 -242 73 -136 -439 344
4188 344 144 -394 44 355 -233 -522 536 97 -535 -150 -59 -194 -112 132 136 -166 -75 364 0 -259 329
4209 329 -63 -3 242 174 -191 99 226 -102 -41 162 478 -135 318 414 432 -500 541 307 -285 245 476
4230 476 266 -171 134 432 118 33 393 -203 13 496 301 -605 272 396 58 -209 339 77 -160 397
4250 397 164 -268 -346 244 -250 -127 215 162 -185 -11 -46 -10 -499 91 -14 -454 43 228 -160 -215 69 178
4272 178 -556 -93 -85 -89 -242 532 97 -664 11 339 -461 -523 312 125 -272 -124 176 -245 -90 130 4 160
$$ packed form
4126A40j65l36N83p1r3j38M81m38n64Q42j53o37O81L26k80k64M8J80k08J85K14
4147C33k77o2K18n2m76M54K88l64j93K33j74k82M72j5l30l31Q78L95j154N64J19
4168B44l45J27M29j36l79j84L60k65K35K26m35j48O27k09o58K69L15k09l03P83
4188C44k00n38M38L11n88k89J058m39o32L85R1j35Q2K44Ml02R1M39l64k59N88
4209C29l92O0K45o8l65K90J27l28O1K03L16o13M53R6J8r32J041k34n92N30K31
4230D76k10m37L05K98l14q5L60n96K16M83j95r06Q77J24l38k67N48k62k37N57
4250C97k33m32p8N90m94J23L42n3l47J74l5L6m89N90j05m40M97J85l88n5K84J09
4272A78p34M63Qmj53P74m35p61O75L28q00o2Q35j87l97J48L00m21J55K20j26J56
$$ plain form
4294 160 127 255 -47 -48 86 -46 -290 300 220 -501 58 19 67 -325 386 310 -381 -45 412 -674 -147 297
4316 297 89 -2 -134 569 10 -132 278 43 -138 7 398 -248 -469 -99 215 -142 -185 446 -178 204 -25
4337 -25 -63 228 -96 256 -410 44 473 232 -463 307 284 -14 -69 294 243 -52 306 -156 -36 232 535 -200
4359 -200 -193 -10 240 -293 229 183 148 -169 184 55 -349 275 47 106 -52 279 287 -215 41 370 -337 -173
4381 -173 211 -24 -459 144 423 162 223 573 462 47 61 267 47 133 350 -8 -76 519 487 -281 -73 704
4403 704 79 -299 414 448 -228 67 246 -173 -243 223 205 -338 151 290 -409 -234 123 -4 -481 -69 212
4424 212 -567 156 -37 -136 -581 82 64 -449 -163 29 -316 -489 82 235 -364 -50 274 -403 -284 244 33
4445 33 -180 -65 112 -17 85 444 398 -383 -280 -100 -171 -141 288 129 -301 349 241 -321 -247 200 47 -219
$$ packed form
4294A60l3J28l02jJ34j32k44N90q0p21N59l9M8l92P11p6o91L36M57j086N27M44
4316B97k08r1j32P03n59j42M10k35j81J45L91o46k21L70L14l57m3O31o24L82k29
4337b5l8K91l24L52o66M54M29k41o95P70k3k98n5L63n1k95L58m62J20K68L03p35
4359b00PJ83K50n33N22m6l5l17L53j29m04O24k28N9j58L31Qn02K56L29p07J64
4381a73L84k35m35O03K79k61O1L50j11m15J4K06k20Q6K17l58o8N95l2p68K08P77
4403G04o25l78P13L4o76K95J79m19p0M66j8n43M89J39o99J75L57j27m77M12K81
4424B12p79P23j93r9m45O63j8n13K86J92l45j73N71J53n99L14L24o77J19N28k11
4445C3k13J15J77j29J02L59m6p81J03J80p1L0M29j59m30O50j08n62P4M47j53k66
$$ plain form
4467 -219 -235 151 -29 -164 66 46 -152 9 163 -296 65 -193 -288 58 279 -325 -384 107 324 1 -130
4488 -130 547 -156 -239 -44 536 -181 -121 411 345 -242 -196 119 -189 -2 3 -69 -497 149 -102 -420 95 255
4510 255 92 -212 -10 335 -208 -152 431 -157 -308 266 -248 201 -100 310 -155 -130 165 350 -107 96 385
4531 385 177 -37 375 11 -241 135 100 147 -185 239 28 -367 115 358 89 122 550 241 -21 -27 -168 -159
4553 -159 50 77 -187 -52 72 283 -169 157 316 -90 -53 134 18 -566 156 16 -331 -49 150 43 -307
4574 -307 236 296 -93 -199 285 288 -356 89 362 -394 17 85 122 -41 325 -116 -62 -43 4 -139 -2 -88 -211
4597 -211 -34 35 123 51 -426 206 -7 -83 73 67 -261 -306 28 -30 -451 160 88 11 -76 257 258 -223 172 -43
4621 -43 54 -59 548 136 -219 176 358 64 -298 68 1 -100 0 104 -170 9 465 -96 -10 57 -164 -179
$$ packed form
4467b19j6L86j80j35K30k0j98J61J54m59L61k58r5L46K21o04n9M91K17l23j31
4488a30O77p03q3J95N80p17O0N32o6n87M6L15l08J87Np2m28O46k51l18N15J60
4510B55j63l04K02L45n43N6N83n88j51N74n14M49l01M10m65K5K95J85m57K03K89
4531C85k08k14M12l64k52L76l5M7l32M24k11l95M82K43k69L3M28l09k62oj41R
4553a59K09K7k64J35J24K11m52L26J59m06L7J87j16n84P22j40l47K82J99j07l50
4574c07N43O0l89j06M84Lo44M45K73p56M11O8L7j63L66m41N4J9M7j43J37q6j23
4597b11J77O9Q8p2m77O32k13p6J56ol28m5L34n8m21O11p2p7q7L33Jm81L95k15
4621d3R7j13O07m12l55L95J82k94l62L66o7j01J00J04k74J79M56n61Q6O7k21j5
$$ plain form
4643 -179 220 58 -159 -139 55 -132 -276 26 87 -337 -223 222 -84 -312 -3 163 -144 28 207 -49 -488
4664 -488 -49 248 -151 162 123 -181 -317 -92 -3 -286 -205 421 50 7 162 133 10 -6 308 -31 26 214
4686 214 15 37 -58 386 -110 -159 222 33 -127 -73 166 82 -9 277 187 -288 88 337 -192 144 125 91 -202
4709 -202 213 279 33 105 207 -64 -597 152 448 -46 66 189 -42 -293 351 -9 -154 58 81 19 -205
4730 -205 116 76 -342 37 163 -65 -164 79 184 45 37 -271 14 -207 48 -289 -204 -25 353 -83 -289 49
4752 49 63 -368 209 -12 -205 248 161 -4 -397 166 115 -423 88 203 -101 81 113 2 -303 176 344 302
4774 302 39 323 -63 -107 261 319 14 235 239 -14 -485 158 403 -187 170 177 14 212 200 145 -203 12 250
4797 250 -96 104 259 100 61 104 140 -98 -347 -91 323 -34 -134 122 105 -248 -141 -205 -39 154 -8 -214
$$ packed form
4643a79L99j62k17K0J94j87j44L02O1m24J14M45l06k28L09J66l07J72J79k56m39
4664d88M39K97l99L13l9l04j36K25Q9k83Q1O26l71m3J55k9j23j6L14l39N7J88
4686B14j99K2r5M44m96m9L81j89j60N4K39q4r1K86r0m75L76K49n29L36j9l4k93
4709b02M15O6k46P2J02k71n33P49K96m94J12J23k31k51O44l60j45K12K3o2k24
4730b05L21m0m18L79J26k28r9K43J05j39ql08K85k21K55l37Q5J79L78m36k06L38
4752D9J4m31N77k21j93M53q7j65l93N63n1n38N11J15l04J82L2j11l05M79J68m2
4774C02k63K84l86m4L68N8l05K21Mk53m71O43K45n90L57Pj63J98j2n5l48K15K38
4797B50l46K00J55j59l9M3L6k38k49K56M14l57j00K56j7l53J07o4J66J93j62k06
$$ plain form
4819 -214 -73 209 79 -345 -167 47 -352 -89 -291 -6 -111 52 121 -392 -247 296 324 -629 417 227
4839 227 -118 -51 169 -41 -8 345 276 183 12 151 48 431 138 108 -62 -30 41 100 -107 398 136 -276 378
4862 378 -50 -22 171 15 226 -298 -68 -89 -289 -132 -44 27 -149 239 136 -261 219 315 -80 5 61 266
4884 266 -81 13 -63 -170 25 300 -122 -47 -43 -14 -465 -58 416 61 -474 -259 86 -7 -262 11 -149 -278
4906 -278 -81 -130 -320 -170 247 307 -9 5 -174 -146 7 234 -189 -76 -73 34 95 -270 -135 -151 -68 237 116
4929 116 -146 329 185 -175 164 -98 -114 -37 28 71 -296 -144 -86 112 -219 0 363 -54 -73 -200 125 12
4951 12 236 215 -67 -144 -35 246 -65 278 97 -246 -213 265 -440 -195 482 168 -217 153 349 -262 -232 245
$$ packed form
4819b14J41K82j30m24J78K14l99K63k02K85j05J63O9n13J45N43K8r53J046j90
4839B27l45O7K20k10L3L53o9r3j71J39j03L83k93l0j70L2P1N9k07N05k62m12O54
4862C78m28K8J93j56K11n24K30k1k00J57Q8P1j76L88j03l97M80R6l95Q5N6K05
4884B66l47R4p6j07J95K75m22P5MK9m51M07M74l55n35K15L45r3k55K73j60j29
4906b78J97m9j90J50M17O0l16J4j79K8J53K27m23J13LJ07O1l65J35j6Q3L05j21
4929A16k62M75j44l60L39k62j6P7O5M3l67J52N8J98l31K19L63m17j9j27L25j13
4951A2K24k1k82p7J09K81l11L43j81l43L3M78p05K45O77l14l85L70J96o11L0M77
$$ [...]
8191a13
##END NTUPLES=NMR FID
##END=
