##TITLE=1H_DE-80H_X3
 200.13MHz, d2o
 8 sc
 
 19ns.26.2.2025
##JCAMPDX= 6.0         $$ Bruker NMR JCAMP-DX V2.0
##DATA TYPE= NMR FID
##DATA CLASS= NTUPLES
##ORIGIN= UXNMR, Bruker Analytische Messtechnik GmbH
##OWNER= pz
$$ XWIN-NMR		Version 3.5
$$ Wed Mar 19 14:49:59 2025 Russian Standard Time (UT+4h)  Yarkov@DPX200
##.OBSERVE FREQUENCY= 200.1313
##.OBSERVE NUCLEUS= ^1H
##.DELAY= (6, 6)
##.ACQUISITION MODE= SIMULTANEOUS
##.ACQUISITION SCHEME= undefined
##.AVERAGES= 8
##.DIGITISER RES= 18
##SPECTROMETER/DATA SYSTEM= spect
##.PULSE SEQUENCE= zg30
##.SOLVENT NAME= CDCl3
##.SHIFT REFERENCE= (INTERNAL, CDCl3, 0, 14.3821)
##AUDIT TRAIL= $$ (NUMBER, WHEN, WHO, WHERE, WHAT)
$$ ##TITLE= Audit trail, XWIN-NMR		Version 3.5
$$ ##JCAMPDX= 5.01
$$ ##ORIGIN= Bruker BioSpin GmbH
$$ ##OWNER= Yarkov
$$ C:/Bruker/XWIN-NMR/data/yarkov2/nmr/H-C/1/audita.txt
$$ ##AUDIT TRAIL=  $$ (NUMBER, WHEN, WHO, WHERE, WHAT)
(   1,<2025-03-19 14:48:18.73 +0400>,<Yarkov>,<DPX200>,
      <created by zg, POWCHK disabled, PULCHK disabled
       configuration hash MD5:
       00 E9 B6 7A A2 85 ED C7 34 08 36 98 17 FE 4E 26
       data hash MD5: 16K
       81 1F FC 32 D2 A3 88 51 6C 12 68 ED 28 02 5F FA>)
$$ ##END=
$$ 
$$ hash MD5
$$ 43 78 3D 2E 82 16 52 33 D9 79 4B 35 14 CC BE 04
##$RELAX= 
##$RELAX= 
##$RELAX= 
##$RELAX= 
##$RELAX= 
##$RELAX= 
$$ Bruker specific parameters
$$ --------------------------
##$DU= <C:/Bruker/XWIN-NMR>
##$EXPNO= 1
##$NAME= <H-C>
##$PROCNO= 1
##$TYPE= <nmr>
##$USER= <yarkov2>
##$AMP= (0..31)
100 100 100 100 100 100 100 100 100 100 100 100 100 100 100 100 100 100 
100 100 100 100 100 100 100 100 100 100 100 100 100 100 
##$AQSEQ= 0
##$AQ_mod= 1
##$AUNM= <au_zg>
##$AUTOPOS= <>
##$BF1= 200.13
##$BF2= 200.13
##$BF3= 200.13
##$BF4= 200.13
##$BF5= 200.13
##$BF6= 200.13
##$BF7= 200.13
##$BF8= 200.13
##$BYTORDA= 1
##$CFDGTYP= 0
##$CFRGTYP= 5
##$CHEMSTR= <none>
##$CNST= (0..31)
1 1 145 1 1 1 1 1 1 1 1 1 1 1 1 1 1 1 1 1 1 1 1 1 1 1 1 1 1 1 1 1 
##$CPDPRG= <>
##$CPDPRG1= <>
##$CPDPRG2= <>
##$CPDPRG3= <>
##$CPDPRG4= <mlev>
##$CPDPRG5= <mlev>
##$CPDPRG6= <mlev>
##$CPDPRG7= <mlev>
##$CPDPRG8= <mlev>
##$CPDPRGB= <>
##$CPDPRGT= <>
##$D= (0..31)
0 0.7 0 0 0 0 0 0 0 0 0 0.03 0 0 0 0 0 0 0 0 0 0 0 0 0 0 0 0 0 0 0 0 
##$DATE= 1742381298
##$DBL= (0..7)
120 120 120 120 120 120 120 120 
##$DBP= (0..7)
150 150 150 150 150 150 150 150 
##$DBP07= 0
##$DBPNAM0= <>
##$DBPNAM1= <>
##$DBPNAM2= <>
##$DBPNAM3= <>
##$DBPNAM4= <>
##$DBPNAM5= <>
##$DBPNAM6= <>
##$DBPNAM7= <>
##$DBPOAL= (0..7)
0.5 0.5 0.5 0.5 0.5 0.5 0.5 0.5 
##$DBPOFFS= (0..7)
0 0 0 0 0 0 0 0 
##$DE= 6
##$DECBNUC= <off>
##$DECIM= 32
##$DECNUC= <off>
##$DECSTAT= 4
##$DIGMOD= 1
##$DIGTYP= 9
##$DL= (0..7)
0 120 120 120 120 120 120 120 
##$DP= (0..7)
150 150 150 150 150 150 150 150 
##$DP07= 0
##$DPNAME0= <>
##$DPNAME1= <>
##$DPNAME2= <>
##$DPNAME3= <>
##$DPNAME4= <>
##$DPNAME5= <>
##$DPNAME6= <>
##$DPNAME7= <>
##$DPOAL= (0..7)
0.5 0.5 0.5 0.5 0.5 0.5 0.5 0.5 
##$DPOFFS= (0..7)
0 0 0 0 0 0 0 0 
##$DQDMODE= 0
##$DR= 18
##$DS= 0
$$ [...]
##$SUBNAM0= <"">
##$SUBNAM1= <"">
##$SUBNAM2= <"">
##$SUBNAM3= <"">
##$SUBNAM4= <"">
##$SUBNAM5= <"">
##$SUBNAM6= <"">
##$SUBNAM7= <"">
##$SUBNAM8= <"">
##$SUBNAM9= <"">
##$SW= 18.0517328524113
##$SWIBOX= (0..15)
0 0 2 0 0 0 0 0 0 0 0 0 0 0 0 0 
##$SW_h= 3612.71676300578
##$TD= 16384
##$TD0= 1
##$TE= 0
##$TE2= 300
##$TE3= 300
##$TEG= 300
##$TL= (0..7)
0 120 120 120 120 120 120 120 
##$TP= (0..7)
150 150 150 150 150 150 150 150 
##$TP07= 0
##$TPNAME0= <>
##$TPNAME1= <>
##$TPNAME2= <>
##$TPNAME3= <>
##$TPNAME4= <>
##$TPNAME5= <>
##$TPNAME6= <>
##$TPNAME7= <>
##$TPOAL= (0..7)
0.5 0.5 0.5 0.5 0.5 0.5 0.5 0.5 
##$TPOFFS= (0..7)
0 0 0 0 0 0 0 0 
##$TUNHIN= 0
##$TUNHOUT= 0
##$TUNXOUT= 0
##$USERA1= <user>
##$USERA2= <user>
##$USERA3= <user>
##$USERA4= <user>
##$USERA5= <user>
##$V9= 5
##$VALIST= <valist>
##$VCLIST= <CCCCCCCCCCCCCCC>
##$VD= 0
##$VDLIST= <DDDDDDDDDDDDDDD>
##$VPLIST= <PPPPPPPPPPPPPPP>
##$VTLIST= <TTTTTTTTTTTTTTT>
##$WBST= 1024
##$WBSW= 4
##$XGAIN= (0..3)
0 0 0 0 
##$XL= 0
##$YL= 0
##$YMAX_a= 248399
##$YMIN_a= -212360
##$ZGOPTNS= <>
##$ZL1= 120
##$ZL2= 120
##$ZL3= 120
##$ZL4= 120
##$ABSF1= 10
##$ABSF2= 0
##$ABSG= 5
##$ABSL= 3
##$ALPHA= 0
##$AQORDER= 0
##$ASSFAC= 0
##$ASSFACI= 0
##$ASSFACX= 0
##$ASSWID= 0
##$AUNMP= <proc_1d>
##$AZFE= 0.1
##$AZFW= 0.1
##$BCFW= 1
##$BC_mod= 2
##$BYTORDP= 1
##$COROFFS= 0
##$CY= -3
##$DATMOD= 1
##$DC= 2
##$DFILT= <>
##$DTYPP= 0
##$F1P= 0
##$F2P= 0
##$FCOR= 0.5
##$FTSIZE= 0
##$FT_mod= 4
##$GAMMA= 1
##$GB= 0.15
##$INTBC= 1
##$INTSCL= 1
##$ISEN= 128
##$LB= 0.25
##$LEV0= 0
##$LPBIN= 0
##$MAXI= 10000
##$MC2= 0
##$MEAN= 0
##$ME_mod= 0
##$MI= 1.114404
##$NCOEF= 0
##$NC_proc= 0
##$NLEV= 6
##$NOISF1= 3.799351
##$NOISF2= 2.8
##$NSP= 1
##$NTH_PI= 0
##$NZP= 0
##$OFFSET= 14.38212
##$PC= 1
##$PHC0= -1187.973
##$PHC1= 12.99223
##$PH_mod= 1
##$PKNL= yes
##$PPARMOD= 0
##$PSCAL= 0
##$PSIGN= 0
##$REVERSE= no
##$SF= 200.129724274929
##$SI= 16384
##$SIGF1= 3
##$SIGF2= 2
##$SINO= 400
##$SIOLD= 16384
##$SREGLST= <1H.CDCl3>
##$SSB= 0
##$STSI= 0
##$STSR= 0
##$SW_p= 3205.1282051282
##$SYMM= 0
##$S_DEV= 0
##$TDeff= 0
##$TDoff= 0
##$TI= <>
##$TILT= no
##$TM1= 0
##$TM2= 0
##$TOPLEV= 0
##$USERP1= <user>
##$USERP2= <user>
##$USERP3= <user>
##$USERP4= <user>
##$USERP5= <user>
##$WDW= 1
##$XDIM= 8192
##$YMAX_p= 0
##$YMIN_p= 0
$$ End of Bruker specific parameters
$$ ---------------------------------
##NTUPLES= NMR FID
##VAR_NAME=  TIME,          FID/REAL,        FID/IMAG
##SYMBOL=    X,             R,               I
##VAR_TYPE=  INDEPENDENT,   DEPENDENT,       DEPENDENT
##VAR_FORM=  AFFN,          ASDF,            ASDF
##VAR_DIM=   8192,          8192,            8192
##UNITS=     SECONDS,       ARBITRARY UNITS, ARBITRARY UNITS
##FACTOR=    0.0002768,     1,               1
##FIRST=     0,             0,               0
##LAST=      2.2672688,     0,               0
##MIN=       0,             -212360,         0
##MAX=       2.2672688,     248399,          0
$$ Real data points
##PAGE= N=1
##DATA TABLE= (X++(R..R)), XYDATA
0@%%%%%%%%%%%%%%%%%%%qJ6j6J6j6J8k4L0l2L5m1M6n3O1o9P6q4R5j05J18j33J46
$$ 0 0 0 0 0 0 0 0 0 0 0 0 0 0 0 0 0 0 0 0 -8 8 -8 8 -8 10 -14 16 -16 19 -22 24 -29 32 -37 39 -45 50 -55 63 -70 76
41G6j61J78j97K20k41K63k92L23l54L89m30M75n25N82o46P19q04R06j028J176
$$ 76 -85 93 -104 116 -125 138 -154 169 -185 204 -226 249 -276 306 -340 379 -425 481 -547 629
61F29j365J609j935K402l111M297o629J2717n5607j14884J94194M5606j25434
$$ 629 -736 873 -1062 1340 -1771 2526 -4103 8614 -46993 -161877 32317 77923 -47511
74d7511J05561J34097j71364j66965J25847P0776j46113R5924K48147j35734k20576
$$ -47511 58050 192147 20783 -146182 -20335 50441 -95672 252 248399 112665 -107911
85a07911J01636J4227j98901M9084K62229N903j68398O5670P5673k27294q4278
$$ -107911 -6275 7952 -190949 -141865 120364 126267 -42131 23539 99212 -128082 -212360
96b12360K34301L6857j24038J07505J01766j53779j00986J24434M2432j17315
$$ -212360 21941 58798 -65240 42265 144031 -9748 -110734 13700 56132 -61183
106f1183N5907J35082j21518r4286J38316P541j13536P4894Q8904j18486r3047
$$ -61183 -5276 129806 8288 -85998 52318 59859 -53677 21217 110121 -8365 -101412
117a01412R8896K9222j19457O8608J65072j13354j26339J15064M62j56893N2347
$$ -101412 -2516 26706 -92751 -24143 140929 27575 -98764 16300 16762 -140131 -87784
128h7784J75039l2525j09694R3646O8660j75346m7431J74485j6774j14878J05056
$$ -87784 87255 54730 -54964 38682 107342 -68004 -115435 59050 42276 -72602 32454
139C2454R0823j15098o2524R6831Q609j17224K9723J09623p7497o2362J06128
$$ 32454 123277 8179 -54345 42486 51095 -66129 -36406 73217 -4280 -66642 39486
150C9486J944r5324L4264N3789o3412m1400P0990K5732p3924L2656R0881p4314
$$ 39486 41430 -53894 -19630 34159 -29253 -70653 337 26069 -47855 -15199 75682 1368
162A368n8383R4049l249r4517M2809Q5634m7805o0852P5887M2147j13441j5574
$$ 1368 -57015 37034 33785 -60732 -17923 67711 19906 -40946 34941 77088 -36353 -51927
174e1927J11089m6576q9933Q3522N5221q1710k1703P7276k850r0036K0072P9202
$$ -51927 59162 12586 -77347 6175 61396 -20314 -42017 35259 32409 -57627 -37555 41647
186D1647n5809m1512Q5831P809o6166K1723L5785l4361k7538L5789K1252m1572
$$ 41647 -14162 -55674 30157 37966 -28200 -6477 29308 -5053 -32591 3198 24450 -17122
198a7122Q990N1309l8630k8954N3190j1616m9358K8330K9167l1978j9144M3854
$$ -17122 -8132 43177 4547 -24407 28783 17167 -32191 -3861 25306 -6672 -25816 18038
210A8038J7399n8849K724N8947m4404m8009N9210J8844m8258O728M7300p510n0831
$$ 18038 35437 -23412 -20688 38259 -6145 -54154 5056 23900 -24358 -17630 29670 22160 -28671
223b8671J4130M3563m1198k5677N8148N145l7315J7394K0231j9006k0795P990
$$ -28671 -14541 29022 -12176 -37853 20295 25440 -11875 5519 25750 6744 -14051 -6061
235f061J5341j9521l676L1713j0759j4182K1509j2654j8976J2938q03q533P160
$$ -6061 9280 -10241 -13917 17796 7037 -7145 14364 1710 -17266 -4328 -5131 -13664 -6504
248f504J5201O342j8774M299K0586l1058j5603L4704l781j9759J8304J7152r525
$$ -6504 8697 15039 -3735 564 21150 -9908 -25511 9193 5412 -14347 3957 21109 11584
261A1584k0827M334J6773k6133j2162L5288O70j7645J4500P666r043j2274m341
$$ 11584 -9243 -4909 11864 -14269 -26431 8857 9527 -8118 6382 14048 5005 -7269 -11610
274a1610J4142n341r126K1096M398r430L692p253l366L87j2339P735J2594n919
$$ -11610 2532 -2809 -11935 9161 13559 4129 7821 568 -2798 -2411 -14750 -7015 5579 -340
288c40L583L055l064l22j4613O83J5223j1408O03J8787k616n735k424k034M123
$$ -340 3243 6298 3234 2912 -11701 -11018 4205 -7203 -6600 12187 9571 3836 1412 -622 3501
303C501j2547l265K0572l790q315J1547p03o099n852n403J1692k599r630J7130
$$ 3501 -9046 -12311 8261 4471 -3844 7703 7000 901 -4951 -10354 1338 -1261 -10891 6239
317F239M548j1256K102j028m84k521r177J2396P976j3686O535P024q762k531l867
$$ 6239 10787 -469 1633 605 121 -2400 -11577 819 8795 -4891 1644 8668 -94 -2625 -6492
332f492L625O278j0505M712J3589r940l663M775k286P98o452J773J3838r170o497
$$ -6492 -2867 3411 -7094 -2382 11207 1267 -2396 2379 93 891 -5561 -3788 10050 880 -5617
347e617J3110l985q410J430J350N271n893l825J4535m830j1500J0283L55n470
$$ -5617 7493 3508 -4902 -3472 -2122 3149 -2744 -6569 7966 3136 -8364 1919 2274 -3196
361c196K787k63N279m35q046O875p9p585N714j984q03P404q805j369R320p419
$$ -3196 -409 -672 4607 4172 -3874 3001 2922 -4663 1051 -933 -1736 5668 -3137 -4506 4814 -2605
377b605m157M869K706J612p821M546J3617j4995o932J8943n098j3653Q629R283
$$ -2605 -6762 -1893 813 2425 -5396 -850 12767 -2228 -9160 9783 4685 -8968 -339 8944
391H944l267j0215N740J1741j8865r269K0771m755j3092J4476O936r439n810L334
$$ 8944 5677 -4538 1202 12943 -5922 -15191 5580 825 -12267 2209 9145 -294 -6104 -2770
405b770L497j1134K321J8204p590n415J5842q688j3317J0680K333q331K238J1043
$$ -2770 727 -10407 -8086 10118 2528 -2887 12955 4267 -9050 1630 3963 -4368 -2130 8913
419H913Q48j6594N537J6490k1609r150K6518o008k2346J4223J6113j2748j3117
$$ 8913 9761 -6833 -1296 15194 -6415 -15565 10953 4945 -17401 -3178 12935 187 -12930
432a2930J7802J0149l0480l065L1920j3377j8862K8164J0638k4609m314J6675
$$ -12930 4872 15021 -15459 -18524 13396 19 -18843 9321 19959 -4650 -8964 7711
444G711l930k1646J3714K5262j9999q014K7507j1441k5546J5800J0468j8157k063
$$ 7711 3781 -17865 -4151 21111 1112 -6902 20605 9164 -16382 -582 9886 -8271 -10334
457a0334K2421k91k5386J0453K1049l0616j2321L5242o520k7302K2470K3066k4000
$$ -10334 12087 11796 -13590 -3137 17912 -12704 -25025 10217 3697 -23605 -1135 21931 -2069
470b069j6153K7420N840l7582R526M2073k3276k4015L6607N450l8970L320L1682
$$ -2069 -18222 9198 15038 -22544 -13018 29055 5779 -18236 18371 23821 -15149 -11829 19853
483A9853j1639k8529K2730K1425l7736p558M0404j2386l0154K5764J3042l2584
$$ 19853 8214 -20315 2415 23840 -13896 -21454 18950 6564 -23590 2174 15216 -17368
495a7368n923L1884K86k5706K1237K5898l9457j6394L8413q749k8020L2963K7265
$$ -17368 -23291 8593 8879 -16827 4410 30308 -9149 -25543 12870 4121 -23899 9064 36329
508C6329l2801j9252K8262l386m1451K1476M7232l0638k4676L9227n493m9026
$$ 36329 3528 -15724 12538 9152 -32299 -10823 36409 5771 -18905 20322 14829 -34197
520c4197J4213M1731j6828k5670L2787J3211n1330k982M8940j5597k7520L7825
$$ -34197 -19984 21747 4919 -20751 12036 25247 -26083 -29065 19875 4278 -23242 14583
532A4583J3006m4471o795L5623n456k5999L0780K7109m4170j6270L7708j4816
$$ 14583 27589 -16882 -23677 11946 6490 -19509 11271 38380 -5790 -22060 15648 832
544H32k9822L7584K6621l4861j4992K8164j0392m0788K5938M3229l2770j8138
$$ 832 -28990 8594 35215 354 -14638 13526 3134 -37654 -11716 31513 -1257 -19395
556a9395M1692j2032m8203K0847L8937k1222j8519L7775P457n2324L222M6043
$$ -19395 22297 10265 -37938 -17091 21846 624 -17895 19880 27337 -24987 -21765 24278
568B4278k2290k4038M3116R657m6122k194L3160j3765k6725L3020K4411m2769
$$ 24278 1988 -22050 21066 30723 -15399 -17593 15567 1802 -24923 8097 32508 -10261
580a0261j0025L7449j9490k9669L5676K2091l2457o476L0064j1735l6105K5189
$$ -10261 -20286 17163 -2327 -31996 3680 25771 -6686 -13162 16902 5167 -30938 -5749
592e749L3798l2958j0434M0526j3774m1042K2441K8678k5446j2595L5825K348
$$ -5749 28049 -4909 -15343 25183 11409 -29633 -7192 21486 -3960 -16555 19270 21618
604B1618m5048Q014L7382k5774j9327M1270N369l9810L736K7967j6480k2971L0646
$$ 21618 -23430 -15416 21966 -3808 -23135 18135 23504 -16306 -12570 15397 -1083 -24054 6592
617F592J9555l6002m029L2947j9834k6209L1065J5588k7817q71K5747j1438k8938
$$ 6592 26147 -9855 -13884 19063 -771 -26980 4085 19673 -8144 -9015 16732 5294 -23644
630b3644K0590K3772k8647m782L4484j3962l1292K1225J8808k3537o110K9836
$$ -23644 -3054 20718 -7929 -12711 21773 7811 -23481 -2256 16552 -6985 -13095 16741
642A6741j852l4429J0264K7705k4916j2270L5445J78l1087P540K0772j6922j6165
$$ 16741 14889 -19540 -9276 18429 -6487 -18757 16688 16866 -14221 -6681 14091 -2831 -18996
655a8996K5555J3358k8470k95K5519j7802j9919K4452Q563k0121J621J8442q614
$$ -18996 6559 19917 -8553 -8848 16671 -1131 -21050 3402 11965 -8156 -6535 11907 3293
668C293k0130J4791J5034k0976j244K5015j1265j8953J7352R286j6823j841J9218
$$ 3293 -16837 -2046 12988 -7988 -9232 15783 4518 -14435 2917 12203 -4620 -6461 12757
681A2757k994k1959R501J7281k0351o779K4890m268k0920Q946J2137j3448r148
$$ 12757 9763 -12196 -2695 14586 -5765 -12544 12346 8078 -12842 -3896 8241 -5207 -14355
694a4355J7152P190j9420K973J8660j3675j1839J7824L337j3494L628J1758n024
$$ -14355 2797 9987 -9433 -6460 12200 -1475 -13314 4510 7847 -5647 -2019 9739 4715
707D715j1190Q189Q655j4515j219J5380q053r795J1736K091j0349K8Q053k395
$$ 4715 -6475 1714 10369 -4146 -5365 10015 1962 -7833 3903 5994 -4355 -4327 3726 1331
721A331j0644O678R455j2086k776J4615m921j0402Q149N188p331k983R041L458
$$ 1331 -9313 -2635 6820 -5266 -8042 6573 1652 -8750 -601 4587 -2744 -5727 3314 6772
735F772j0756K211J1418q750o546J0677m71p286L104M900j727o010K567M527q179
$$ 6772 -3984 -1773 9645 895 -5651 5026 4555 -2731 373 5273 3546 -2464 103 4630 -3549
750c549j859Q406m633l970O559p38l951Q54J712k92k938K413N627n377J34P673
$$ -3549 -5408 2998 -1635 -5605 954 216 -3735 -2881 -1169 -1461 -4399 -1986 3641 -1736 -1602 6071
766F071m546l117N381o81k738l3K677J676n020L34M955n723l650N506k070k696
$$ 6071 1525 -1592 3789 3108 370 337 3014 4690 -330 4 4959 -764 -4414 1092 -978 -3674
782c674K053J077M18k364n08L486l022j457M912j348n55L228j392M82N70k051
$$ -3674 -1621 -544 -126 -2490 -2998 488 -2534 -3991 921 -427 -982 2246 854 1336 1906 -145
798a45J481j87j335K964j611k09K643l546o68K235l407M12J397r47J425j248n13
$$ -145 1336 1149 -186 2778 1167 958 3601 55 -613 1622 -1785 -1373 24 -923 502 -746 -1259
815a259K490l474j052L420k191J43K343r05J327l59j708K862j634j483L302q72
$$ -1259 1231 -2243 -3295 125 -2066 -1923 420 -485 842 483 -1225 1637 3 -1480 1822 950
831I50q0J634j751J315l88k781J870n9k513K298n47n21J302k520N09J191l051
$$ 950 870 2504 753 2068 1680 -1101 769 710 -1803 495 -52 -573 729 -1791 -1282 -91 -3142
848c142J447J701j800J996m31jK087k551J93K986k559l4K411j384M79l90j013
$$ -3142 -1695 6 -1794 202 -229 -230 1857 -694 -501 2485 -74 -108 2303 919 1398 1008 -5
865eJ884k444j184L264k319j157K737j301n47R69j354J473q94n75K622j714j76
$$ -5 1879 -565 -1749 1515 -804 -1961 776 -525 -1072 -103 -1457 16 -878 -1453 1169 -545 -721
882g21K804k319l37K611k410m0J513q39L17j286O10K270l844N52L844l204k052
$$ -721 2083 -236 -573 2038 -372 -412 1101 262 579 -707 -97 2173 -1671 -1119 2725 -479 -2531
899b531L729j003j883P02K071J035l672Q07L824m831j633N531j272k574K634J033
$$ -2531 1198 195 -1688 -986 1085 2120 -1552 -745 3079 -1752 -3385 2146 874 -1700 934 1967
915A967j707k286J899K387m410P27N510m282k559N261j566l024J833J851j479
$$ 1967 260 -2026 -127 2260 -2150 -1423 4087 -195 -2754 2507 941 -2083 -250 1601 122
930A22l433L083L344n963Q15O633n068l807N837k05m349R58N529n01n669L499
$$ 122 -3311 -228 3116 -2847 -2032 4601 -467 -4274 1563 1358 -2991 -2033 3496 2995 -2674 825
946H25M338q351j488Q994k728m978N253K692n731l198N421J135p371K978P597
$$ 825 5163 -3188 -4676 4318 1590 -3388 1865 4557 -1174 -4372 1049 2184 -5187 -2209 5388
961E388o912l480Q076j366o366L583N089l947m263O193K842q683K381R024p107
$$ 5388 -1524 -5004 3072 1706 -4660 -1077 4012 65 -4198 1995 4837 -3846 -1465 7559 452
976D52n595Q179k35p595K263P999k873p261N872M409j1822j14J1404m398o020
$$ 452 -5143 3036 2801 -4794 -2531 5468 2595 -4666 1206 5615 -6207 -6321 5083 685 -5335
991e335Q319L393r070k653P770k11q695N845R301j0044l896R988k692q455N772
$$ -5335 2984 6377 -2693 -5346 2424 2213 -6482 -637 8664 -1380 -5276 4712 2020 -6435 -663
1006f63O542n776m768P847J724j1111L700J0586q528n590J0372q01r842L558Q865
$$ -663 5879 103 -4665 3182 4906 -6205 -2505 8081 -447 -6037 4335 3534 -6308 -2750 6115
1021F115m815p044Q488L342j3258Q21J2644o072p056J0646L027j1103r42R323
$$ 6115 1300 -5744 2744 6086 -7172 -6351 6293 221 -6835 3811 6838 -4265 -5207 4116
1035D116j985r622Q330Q822j1999l072J2051m347r952P552O958q053l778R318
$$ 4116 2131 -7491 839 9661 -2338 -5410 6641 2294 -7658 -106 6852 -1201 -4979 4339
1049D339M07j1907M315J0314j0032m693J2311p55j0371M350P819o583o871R577
$$ 4339 4746 -7161 -2846 7468 -2564 -7257 5054 4299 -6072 -1722 6097 -486 -7357 2220
1063B220L697j1847K739J1840q686p483J0270K173j0296J775J0362l764r915P821
$$ 2220 5917 -5930 -3191 8649 -37 -7520 2750 4923 -5373 -3598 6764 3000 -6915 906
1077I06O354j2293n14J3150m574r585P869M673r527k223J0527l09j0950M977Q387
$$ 906 7260 -5033 -5547 7603 3029 -6556 1313 5986 -3541 -5764 4763 4454 -6496 -1519 6868
1092F868j1252l788J2851j307q581N362N849q092n921R623L297r371M339J0637
$$ 6868 -4384 -8172 4679 3372 -5209 153 6002 -2090 -8011 1612 4909 -4462 -123 10514
1106A0514r852p428R197M38q318L635R820m458q492O183L393j1835Q62J2326m524
$$ 10514 662 -6766 2431 2869 -5449 -1814 8006 3548 -4944 1239 4632 -7203 -6341 5985 1461
1121A461o927P528K929r302j437R006p45q647O089O972r909k293J0647k237p529
$$ 1461 -5466 2062 4991 -4311 -5748 3258 2513 -6134 -45 6927 -2982 -5275 5372 3135 -4394
1136d394N431M479p091l886Q121J664q257M346P697q994n087Q074p32o957M192
$$ -4394 1037 5516 -1575 -5461 2660 4324 -3933 413 8110 -884 -5971 2103 1371 -5586 -1394
1151a394P029m049n990N581K029r744J382R295m300m239P596J447p293k20N930
$$ -1394 5635 1586 -4404 1177 3206 -6538 -5156 4139 -161 -4400 3196 4643 -2650 -2870 3060
1166C060j984n934N347N901p458q13P883l650o201L874K732m842j154N938O47
$$ 3060 1076 -4858 489 6390 -1068 -1881 6002 2352 -3849 25 2757 -2085 -3239 2699 3346
1181C346p056K592M932p044k641P019q46m255L600M082l584l143M558J488o536
$$ 3346 -3710 -1118 3814 -3230 -5871 1148 302 -3953 -353 3729 145 -2998 1560 3048 -3488
1196c488J582O543m053k718N947J69n156K97L172k164m206M153L709n435rN335
$$ -3488 -1906 4637 584 -2134 3813 3982 -1174 -877 2295 131 -4075 78 3787 -1648 -1657 3678
1212C678l741m090L054J273k405j0L951M72m104J246L274m729q88M859j041j861
$$ 3678 -63 -4153 -1099 174 -2231 -2241 1710 2182 -1922 -676 2598 -2131 -3019 1840 799 -1062
1228a062K168J733j902j904J980Q63l891J064L958l014j199L674r95l175O80J103
$$ -1062 1106 2839 937 -967 1013 1876 -2015 -951 3007 -7 -1206 2468 1473 -1702 -1022 81
1244H1q85k054K487K350l637M30L120k749j602K311L95p76L66J645O29k218M12
$$ 81 -804 -2858 -371 1979 -1658 -1228 1892 -857 -2459 -148 247 -529 -163 1482 2111 -107 305
1261C05K008k881m69K768j109p34J158k06p50r49K28P82k178M79K409j836j82
$$ 305 2313 -568 -1037 1731 622 -112 1046 840 90 -859 -631 151 -2027 -1548 861 -975 -1157
1278a157J926j121q24P67J75L81q83J019J281j514O4J697j648m40R80n49M1R3
$$ -1157 769 -352 -1176 -409 -234 147 -736 283 1564 50 114 1811 163 -277 703 154 195 288
1296B88q1O44j320j35J180j594j19J803j150j2O11n75N40m51j50Q83q13K14R27
$$ 288 207 851 -469 -604 576 -1018 -1137 666 -484 -496 115 -460 80 -371 -521 362 -451 -237 690
1315F90j001M35Q54j248P10J84r20P22K8q27J215q25j55J037j345J76O29j051
$$ 690 -311 124 978 -270 440 624 -296 426 454 -373 842 17 -138 899 -446 -270 359 -692
1333f92L40K04q19J104l24k07O72o76j15Q11q84L99N74n63R78l8n83P53p42n98
$$ -692 -352 -148 -967 137 -187 -394 278 -398 -513 298 -586 -187 387 -176 802 764 181 934 192 -406
1353d06Q26o09L60O24r43M01Kj146O17k43o14R62j32j65J336j177P7O85r62M40
$$ -406 420 -189 171 795 -148 253 255 -891 -274 -517 -1131 -169 -301 -466 870 -307 -230 455 -507 -67
1373f7J48k27Q94p7l70R73j125l25N94j096K82Q33m83M75l70k83J98j005j43J100
$$ -67 81 -146 748 671 301 1274 149 -176 418 -678 -396 437 -46 429 59 -224 -26 -1031 -1174 -74
1393g4o18J32J319n69j18K14o73p5k66K59J001n75N59J063j264l08M94j191j54
$$ -74 -692 -560 759 190 72 286 -387 -462 -728 -469 532 -43 516 1579 315 7 501 -690 -844
1412h44Q66K67M76o71N37M68k452r8J606j286K58J725k22m51m61J90m51j128J088
$$ -844 22 289 765 94 631 1099 -1353 -1451 155 -1131 -873 852 630 179 -282 -92 -543 -1671 -583
1431e83J631j328J31J846j337p89J235n04o00l89J158M66j681J136J616k043q71
$$ -583 1048 -280 -149 1697 360 -429 806 302 -298 -687 471 937 -744 392 2008 -35 -906
1448i06J445j389j360J409J263j5p24J516j89l043j17K364j335K32L087O0j891
$$ -906 539 -850 -2210 -801 462 447 -277 1239 1050 -1993 -2110 254 -1081 -849 2238 2298 407
1465D07j23K35j281j489K326K059j992K36J979k323j909J697L45j158J20K009
$$ 407 284 519 -762 -2251 75 2134 142 378 2357 34 -1875 -178 167 -991 -871 1138
1481A138k73k495J652K034k960j56K541j735k049J778J669r19m36K088k00l767
$$ 1138 865 -1630 22 2056 -904 -1060 1481 -254 -2303 -525 1144 225 -211 1877 1677 -2090
1497b090K17K587k083J11L858J66k811P4O28j972j660K963K254k444M53K573k933
$$ -2090 -1873 714 -1369 -1258 2600 2766 -45 29 657 -1315 -2975 -12 2242 -202 251 2824 -109
1514a09k462K444M27j986O60K812q49k790J762K001l459m20L570j441j997K369
$$ -109 -2571 -127 300 -1686 -1026 1786 937 -1853 -91 1910 -1549 -1969 1601 160 -1837 532
1530E32J453k095n55K611m81l827J459K835l053n69L986m75l292J284J586k318
$$ 532 1985 -110 -665 1946 1465 -2362 -903 1932 -1121 -1690 2296 1821 -1471 -187 1399 -919
1546i19j922L108J601l461J345L387l104k253K880Mk792Q92L073p24k508K177
$$ -919 -2841 267 1868 -1593 -248 3139 35 -2218 662 666 -2126 -1234 1839 1115 -1393 784
1562G84J600m124l39L619j720j668K995J143k587p77K535m57l275J892K783l178
$$ 784 2384 -1740 -2079 1540 -180 -1848 1147 2290 -297 -1074 1461 1004 -2271 -379 2404 -774
1578g74n21L242j137k808J768J819k344j324K608N39l346J655L051k781j513L154
$$ -774 -1295 1947 810 -1998 -230 1589 -755 -2079 529 1068 -2278 -623 2428 -353 -1866 1288
1594A288l79k775J183K678j363j854K407J241l798K72L143j992j886K834O98k657
$$ 1288 909 -1866 -683 1995 632 -1222 1185 2426 -1372 -1100 2043 51 -1835 999 1697 -960
1610i60q8K112o56k724J863K062l149k58L457j048k359K098J135k154j053K949
$$ -960 -1048 1064 408 -2316 -453 1609 -1540 -1798 1659 611 -1748 350 1485 -669 -1722 1227
1626A227j94k803J914K412l002r45K869n38k618J213K004j735j556K507R65l343
$$ 1227 1033 -1770 144 2556 -446 -1391 1478 940 -1678 -465 1539 -196 -1752 755 1720 -1623
1642a623R70K605k365j546K441K33j980N83K029q78k183J834J164k963K24L068
$$ -1623 -653 1952 -413 -1959 482 715 -1265 -682 1347 469 -1714 120 1284 -1679 -1455 1613
1658A613j053j649K043M75j961l46J658R3k227J596J862k592m42K328j090j963
$$ 1613 560 -1089 954 1429 -532 -878 780 873 -1354 242 2104 -488 -930 1398 308 -1655
1674a655J462J075j213j111J793N03k452R78K013k093p57J944j32j358Q48J771
$$ -1655 -193 882 -331 -1442 351 854 -1598 -620 1393 -700 -1457 487 355 -1003 -155 1616
1690A616p45j390J213O03k645L99K047r29q70J531L34j853k29J048j68j296J586
$$ 1616 871 -519 694 1297 -1348 -949 1098 169 -701 830 1164 -689 -918 130 -38 -1334 252
1707B52J224j975n9J434j084r14J267K99p00m79J357O1j380O43J380j636l85J172
$$ 252 1476 -499 -558 876 -208 -1122 145 444 -256 -735 622 683 -697 -54 1326 -310 -695 477
1725D77l17o58L04J153m53q28O44l5j373K39J312m49l36P67n8o17l83L42j24n03
$$ 477 160 -498 -194 959 506 -322 322 287 -1086 -847 465 16 -320 447 389 -228 -611 -269 -393 -896
1745h96Q10J329j578K30Q41q05p02R54J39l67j35M87K90j011M62P13r21k70P66
$$ -896 -86 1243 -335 -105 736 -69 -771 183 322 -45 -180 307 597 -414 48 761 -160 -430 336
1764C36n67j75L29K71J25n01K41K8p79K24O00j33l3O83m52j69k45Q1J90j91J80
$$ 336 -231 -406 -77 194 319 -182 59 87 -692 -468 132 -1 -34 649 197 28 -217 -136 54 -137 43
1785D3M58q71J9O76p86j3N80n12M51j36J17L31m52J80M21o17lM58n65K50J90k00
$$ 43 501 -370 -351 325 -461 -474 106 -406 45 -91 26 357 -95 85 506 -111 -114 344 -221 29 219 19
1807A9J33l78kM45n82J16L68m11PN42o07L82k15NM31m53Q8N89p31M48M13p45L23
$$ 19 152 -226 -228 217 -365 -249 119 -292 -285 257 -350 32 -183 -178 253 -200 -112 477 -254 194 607 -138 185
1830A85L60p19M50j16k01J57k72J10K21l42J91J30l21J90J55l76L32L1k16K60
$$ 185 545 -174 276 160 -41 116 -156 -46 175 -167 24 154 -167 23 178 -198 134 165 -51 209
1850B09k83q0J21l74J31M34m26L53J27k83M39l57j06K28l14J93L69m11K55K41
$$ 209 -74 -154 -33 -407 -276 158 -268 85 212 -71 368 11 -95 133 -181 12 381 -30 225 466
1870D66o05K38j31j84J21l63R5L26j69RM81q45M42l4j38L86k9r8K90k33J31L76
$$ 466 -139 99 -32 -216 -95 -458 -363 -37 -206 -197 284 -561 -119 -153 -291 95 66 -32 258 25 156 532
1892E32q71K71L58k63M6J98l06Q9p5j46K65l71J09J64l23K97N6m9L0k19k30M11
$$ 532 -339 -68 290 27 73 271 -35 54 -21 -167 98 -273 -164 0 -323 -26 30 -19 11 -208 -438 -27
1914b7j06q9L97j15J51K68o25kJ94j59K27J52l9J02l09r2K96n37K8M12k57J85
$$ -27 -133 -222 175 60 211 479 -146 -148 46 -113 114 266 227 329 20 -72 224 -313 -285 127 -130 55
1936E5j1O5l4n47L00L84m86j42Q10n78J9L14j72J28p7P8l7k68J48O48o56l4O47
$$ 55 44 109 75 -472 -172 212 -274 -416 394 -184 -165 149 -23 105 28 106 69 -199 -51 597 -59 -93 554
1959E54p29k66O13k98k67M27K9J98p53N14K36p90O7P22k70l7K31K03k73m30L63
$$ 554 -175 -441 172 -126 -393 34 63 261 -492 22 258 -532 -465 257 -13 -50 181 384 111 -319 44
1980D4L88o35J60P60j055K9Q86o43j52M34M4k60l12N8N39q34M77P99j110o1O64
$$ 44 432 -203 -43 717 -338 -309 577 -66 -218 216 260 0 -312 -254 285 -549 -72 727 -383 -444 220
2001B20l16k57L13J69K46q58P05O66j537K98P78k63m58O22N2q01lO63j62p47N88
$$ 220 -96 -353 -40 129 375 -483 222 888 -649 -351 427 164 -294 328 380 -421 -424 239 77 -670 -82
2022h2O34r80j34J019n68m86N93R4l30l12R45K70j402P18Q09r86l61J162l34o53
$$ -82 552 -428 -562 457 -111 -597 -4 90 -240 -552 393 663 -739 -21 788 -198 -559 603 269 -384
2042c84L09N65j38p97Q02K46r95K16P73p23n71Q25K07p35J63O61l97o70N44N10
$$ -384 -75 490 352 -445 357 603 -392 -176 597 -126 -697 128 335 -400 -237 424 27 -643 -99 411
2062D11r06O5J004m52m12L13N34n03l69O51K70j310M66Q30r86j34Q61p3p44K63
$$ 411 -495 -430 574 122 -290 23 557 54 -315 336 606 -704 -238 592 -394 -528 333 260 -484 -221
2082b21L31l23m25Q47L88j358N71R66q50l61P45p3n17L17O17l19q39N25P06j112
$$ -221 110 -213 -638 209 597 -761 -190 776 -74 -435 310 237 -280 37 654 335 -504 21 727 -385
2102c85J91Q68n07o71P51M6o28k56J052r1j030J53J195j122k27J181k74n07N4
$$ -385 -194 674 167 -504 247 293 -335 -591 461 370 -660 -507 688 -434 -661 520 246 -261 -207
2121b07N08n58l82J052K82r54M12L93q04j37O06K50o91M33L37k93p38L94P25j221
$$ -207 301 -257 -639 413 695 -259 153 546 -258 -395 211 461 -230 203 540 247 -491 -97 628 -593
2141e93K99P16m32n26P48k8l97R3L29r5p27M00O39q51K53R31o73l14O06j23l92
$$ -593 -294 422 -10 -536 212 184 -213 -120 209 114 -613 -213 426 -425 -172 759 86 -228 378 255 -137
2162a37K9O71L2n74m9N59q59lP90l04m34N8K11l7l73N11K89m44l34O08q14J02
$$ -137 -108 563 595 21 -28 531 -328 -331 459 155 -279 -221 -10 -47 -420 91 380 -64 -398 210 -604 -502
2184e02Q15J48j64PN9l16n67M00L28j68R7M72n54m55J3J60K29O5K87J63p94k6
$$ -502 313 461 297 304 363 47 -520 -120 208 40 137 609 55 -400 -387 -227 2 67 354 517 -277 -303
2206c03M78n86J9O91j93j27q4j76j8j44M31N73n53J43q7m44L1N03K73p7J51l89
$$ -303 175 -411 -392 299 106 -21 -105 -281 -299 -443 -12 561 8 151 64 -380 -349 154 427 350 501 112
2228A12j87m15J80O39j74K0M66n82k03l35l0L10P3L03K28n51nK90l93K18M32k88
$$ 112 -75 -490 -310 329 155 175 641 59 -144 -479 -509 -199 -126 177 405 -146 -151 139 -254 -36 396 108
2250A08L4j76N2p2k9P3L40j85o1Q0k74NJ82p4J85p4M6j59r9J14J6j75K80Q0l76
$$ 108 142 -34 18 -54 -83 -10 330 145 84 164 -110 -105 77 3 188 114 160 1 -98 16 32 -143 137 217 -159
2275a59P8O3l67L64K01k12L44m06j17K92k79J89K44j25j31L55j05k30j07K17R6
$$ -159 -81 -18 -385 -21 180 -32 312 -94 -211 81 -198 -9 235 110 -21 334 229 -1 -108 109 205
2296B05j71k0O6j93J34J31k99K82j26J2M3k15J6M94m34j18K99k38M62m33K12J19
$$ 205 34 14 80 -113 21 152 -147 135 9 21 64 -151 -135 359 -75 -193 106 -132 330 -103 109 228
2318B28l0Q6k03j21l1L79n14L42j94p9J09K37j05m3k88M1J23j60J80J97n72M37
$$ 228 198 284 81 -40 -71 308 -206 136 -58 -137 -28 209 104 61 -227 -186 -63 -223 -43 154 -418 19
2340A9K7j99J13lk11K98J27j09J92n13L29J8k04J81j11j5R3K86k24j12j03R0L65
$$ 19 46 -153 -40 -43 -254 44 171 62 254 -259 70 88 -116 65 -46 -61 32 318 94 -18 -121 -31 334
2363C34j98j33R7j04r3o9J45l12K64j36K05k11L6L40k45J31j00K5K73L9k16N9
$$ 334 136 3 100 -4 -97 -166 -21 -333 -69 -205 0 -211 -175 165 -80 51 -49 -24 249 288 72 131
2385A31Mj79J62j43O1J74l44j18M28k41J65k02j16K20k02K8K70o7n7J76k82M3
$$ 131 135 -44 118 -25 36 210 -134 -252 176 -65 100 -102 -218 2 -200 -172 98 31 -26 150 -132 -89
2407h9J89j31J88p5j66J14j43K47l2k32J26K22l05lJ59q3j03R4l7j28J28k88N18
$$ -89 100 -31 157 82 -84 30 -113 134 102 -130 -4 218 -87 -90 69 -14 -117 -23 -60 -188 -60 -348 170
2430A70l64P9j02J27J82J2nR7k24R9J5j48K5P4j48R7j74O5K67l35K21j55%p4L81
$$ 170 -194 -115 -217 -90 92 104 99 196 -28 71 86 -62 -37 37 -111 -14 -188 -123 144 -191 30 -125 -125 -199 182
2455A82l63K85Ml57K00k7Lj54j68K95J86q3M9K95p03K82J0j03P9R7o9K14j30R4
$$ 182 -181 104 108 -249 -49 -76 -73 -227 -395 -100 86 3 52 347 -356 -74 -64 -167 -88 9 -60 154 24 118
2479A18k6m29L56M9k27O0J64j37J05j20j1L27n03L28K1QJ07oj98J06J68k72p4
$$ 118 92 -337 19 68 -159 -99 65 -72 33 -87 -98 229 -274 54 75 83 190 184 -14 92 260 -12 -86
2502h6J00J48J00j13k6J72l31oO3l83J79K73j37j1K7j67J85k37J56J07o8N8L9
$$ -86 14 162 262 149 123 295 -36 -42 21 -362 -183 90 -47 -58 -31 -198 -13 -250 -94 13 -55 3 42
2525D2pJ65k08j57K24k38J25K69o15N63K06m44O8j06k15J90k35L54K65l24J20
$$ 42 35 200 -8 -165 59 -179 -54 215 -400 163 369 -75 -7 -113 -328 -138 -373 -19 246 -78 42
2546D2p8k45J35K60l26J74K00p3k9J19l34J00p7J94J78k21J54J05j56O6j5P4k89
$$ 42 -36 -281 -146 114 -212 -38 162 89 60 179 -155 -55 -132 62 240 19 173 278 122 188 173 247 -42
2569d2k55J34Rj73L35K93l78L50k54l57J57k2J94L51k68M6k68j62N5J37k07N86
$$ -42 -297 -163 -154 -327 8 301 -77 273 19 -338 -181 -203 -9 342 74 120 -148 -310 -255 -118 -325 261
2591B61M2j36o6j12K3qj23L12k8P1m15J44J19j79o7J31J83j14j4O6m48K59K67
$$ 261 303 167 101 -11 12 4 -119 193 165 236 -179 -35 84 -95 -162 -31 152 38 24 90 -358 -99 168
2614A68k09j9j1m4J46k31L99N0j04k74j4K2j27L88m9r2J38k5q3r0j09K09j13O8
$$ 168 -41 -60 -71 -115 31 -200 199 249 145 -129 -143 -121 -248 140 91 -1 137 112 29 -61 -170 39 -74 -6
2638fl0o7K09L8k84K52m3j06j68J78P8K73m57M33k18r4MP9j88K02l4k0K63l46
$$ -6 -36 -103 106 144 -140 112 69 -37 -205 -27 51 324 -133 300 82 -12 -8 71 -117 85 51 31 294 -52
2662e2M6J69l04K32k5j11O5M7k5J08l0m41M12r1j1L4j78K21K2J1J26j04k73q7
$$ -52 -6 163 -141 91 66 -45 20 67 42 150 120 -321 91 0 -11 23 -155 66 88 99 225 121 -152 -239
2686b39J51J20J57j25J48k43j56J04P2l7J13j23Q6R3q5o3J06j69K24J9j8j15k36
$$ -239 -88 32 189 64 212 -31 -187 -83 -11 -48 65 -58 28 121 36 -27 79 -90 134 153 135 20 -216
2709b16J29l0M6J51J0j7k97J79RK07k16L31j29j09k02J48j87J78R6k18J87j16
$$ -216 -87 -117 -71 80 90 73 -224 -45 -36 171 -45 286 157 48 -154 -6 -193 -15 81 -137 50 -66
2731f6j54J36K22j81J2J6Q0O9j85j24P4l03M23Q8p4r5J8j00k2P2q3K13j46J78
$$ -66 -220 -84 138 -43 -31 -15 65 134 -51 -175 -101 -404 19 107 33 -62 -44 -144 -166 -94 -177 36 -110 68
2755F8J80k36n0R5M2j02l5k5J73l09J40J48L3k1p7P3j21N0r2O0N0k47K43o9l9
$$ 68 248 12 -38 57 99 -3 -38 -63 110 -199 -59 89 122 101 24 97 -24 26 -66 -6 44 -203 40 -29 -68
2780f8K20j99k7j06J04j44L82j74J23N2j68P6j12k5K13j18N2L6k84L54k62q3K7
$$ -68 152 -47 -74 -180 -76 -220 162 -12 111 163 -5 71 -41 -66 147 29 81 117 -167 187 -75 -158 -131
2803a31r2k9L7K12P6k00Pp9p8L26l2L8j74K57n1j2k09r7P3J38p6N3l5J80K28j58
$$ -131 -223 -252 -215 -3 73 -127 -120 -199 -277 49 17 55 -119 138 87 75 -134 -231 -158 -20 -96 -43 -78 102 330 172
2829A72k77K27r8p1J79l07K28j14M9J64m04J44J28k47J57J09J28j9J4l34J51j9
$$ 172 -105 122 24 -47 132 -175 53 -61 -12 152 -252 -108 20 -227 -70 39 167 148 162 -172 -21 -40
2851d0j79M41r1q5R8j55J53j42R6j63l8M5K03k68J23K87m19j07M12j57k85N1J70
$$ -40 -219 222 131 46 144 -11 142 0 96 -67 -105 -60 143 -125 -2 285 -134 -241 171 14 -271 -220 -50
2874e0J02j56J55M5j08j18J56q0r6J46l8K17j55j38qK3J22J4l8k25M35p7p5j03
$$ -50 52 -104 51 96 -12 -130 26 -54 -150 -4 -42 175 20 -118 -126 -103 19 33 -5 -230 205 128 53 -50
2898e0j8J27J04k47L31k9j51k5L0j18K7p9l2K43j27j24K53k11Q3J36l55K66o1
$$ -50 -68 59 163 -84 247 218 67 42 72 -46 -19 -98 -130 113 -14 -138 115 -96 -13 123 -232 34 -27
2921b7J41J15K9j90J73r5k60L5N6K89p9m07J85J78j01lo2k16K52k32J77K01j04
$$ -27 114 229 258 68 241 146 -114 -79 -23 266 187 -220 -35 143 42 39 -23 -239 13 -219 -42 159 55
2944E5r2l7J4K77r4r3K5k09J26K21j7k56J18j68J98n9k5J50j40j8oJ13l5l6j51
$$ 55 -37 -74 -60 217 123 30 55 -154 -28 193 176 -80 38 -130 68 9 -16 134 -6 -24 -30 83 48 12 -139
2969a39J36o2K36j08j61N9J88m0l70J27k2J14O7j10J78n4m5O3O3k61J43L2QPL10
$$ -139 -3 -65 171 63 -98 -39 149 109 -261 -134 -156 -42 25 -85 93 39 -6 57 120 -141 2 34 42 49 359
2994C59o3l42J26k59P4J23m2l7k1J63n7j68o1K63O7k17K00Nj53j57M15q1j40q
$$ 359 296 -46 80 -179 -105 18 -24 -61 -82 81 24 -144 -205 58 125 -92 108 113 -40 -197 218 137 -3 -11
3018a1q3J62k03J81J90l38K62J5k92m9J86j61L05p7j11L7J16j49J63j66n8O9j1
$$ -11 -94 68 -135 46 236 -102 160 175 -117 -166 20 -141 164 87 -24 13 129 -20 143 -23 -81 -12 -23
3041b3p1j00J69l68M25n3j7N7k01K99l88M86N6p3j69q3K0j92J91K6Q8R2q4J64
$$ -23 -94 -194 -25 -393 32 -21 -38 19 -182 117 -271 215 271 198 29 -54 -34 -226 -35 -9 79 171 87 251
3065B51m41J65J57k77l3J52R2j50J88j80J77j45n3J46k10K18j79O3p9K59j60K45
$$ 251 -190 -25 132 -145 -178 -26 66 -84 104 -76 101 -44 -97 49 -161 57 -122 -59 -138 121 -39 206
3087B06j31j51K09j59o5J25K3r0J07j06j83j36M67j3r2J09n8k00K37j10N4J16
$$ 206 75 -76 133 -26 -91 34 57 -33 74 -32 -215 -351 116 103 11 120 62 -138 99 -11 43 159
3109A59m2P7r2j48l9P3j92P0K53k36j90K89o5q4J51J53q8l7j01O5k71M63j33L7
$$ 159 117 194 102 -46 -85 -12 -204 -134 119 -117 -307 -18 -83 -167 -16 137 49 12 -89 -24 -295 168 35 72
3133G2k1j89n4M1K89k04K1p7K97q8k87L30J41l65j06L39k8K1l38Q3M12q6j91M8
$$ 72 51 -138 -192 -151 138 -66 -45 -122 175 87 -200 130 271 -94 -200 139 111 132 -206 -123 289 203 12 60
3157F0N0q6J98k21r8J73O2j41J09P4j88k8m6P3N3J68j50J00k6l18M17l51P7J37
$$ 60 110 24 222 1 -97 76 138 -3 106 180 -8 -36 -82 -9 44 212 62 162 136 -182 235 -116 -39 98
3181I8j3k53K9K35k93L36j68o1nKJ37p3K9K96k77j37K7N4j68J66%L68k47j39R8
$$ 98 85 -168 -139 96 -197 139 -29 -90 -95 -93 44 -29 0 296 19 -118 -91 -37 -205 -39 -39 329 82 -57 41
3206D1kj04K15o5j59J40K28l80J8KP2J9j94J14L8rO4J23k75L02j62J52p3j81N7
$$ 41 39 -65 150 85 -74 66 294 -86 -68 -66 6 25 -169 -55 -17 -26 38 161 -114 188 26 178 105 -76 -19
3231a9j02j1J11K00m51L71r0j89K66M5j09l0n3J04j06K07j40J00k44K95R3k16
$$ -19 -121 -132 -21 179 -272 99 9 -180 86 131 22 -8 -61 43 -63 144 4 104 -140 155 248 32
3253C2p8K0N2l3j2Q4N6l5j57q7K06j36K3K9m6J37kn8R2r5j86J69Q9Q3j55O4m7
$$ 32 -46 -26 26 -7 -19 65 121 86 -71 -158 48 -88 -65 -36 -82 55 53 -5 87 -8 -194 -25 64 147 -8 56 9
3280IOk28k8L17K0l09K49K7l11J79J91k42J68p5K2p7O4j19L91n10P8J71o5J14
$$ 9 15 -213 -241 76 96 -213 36 63 -248 -69 122 -120 48 -27 -5 -82 -18 -137 254 -256 -178 -7 -72 42
3304D2j32j32O2J79k53K45p5N2m3J46o0q8J00j53m0m9r3J73J84N1l7J07l31L15
$$ 42 -90 -222 -160 19 -234 11 -64 -12 -55 91 31 -57 43 -110 -150 -199 -292 -119 65 116 79 186 -145 170
3328A70J5k41P8J46k66m1K6Mo3K07j32M5pK16o4N0l0p6o2j68k8R1J33J27j96P1
$$ 170 185 -56 22 168 -98 -139 -113 -109 -172 35 -97 -52 -59 157 93 143 113 37 -25 -193 -221 -130 3 130 -66 5
3354Ek8j5p3K01K92o98L78P1j82K19k87K85q2k7m02L22N8j25Q7Mn4O5J09j19J03
$$ 5 -23 -38 -111 90 382 -316 62 133 -49 170 -117 168 86 59 -343 -21 37 -88 -1 3 -51 14 123 4 107
3379A07k2k87J89l4o2R0k32K49j16J74p0J11k06J06m3mk5K05k39q8M0J19k9J12
$$ 107 85 -202 -13 -47 -109 -19 -251 -2 -118 56 -14 97 -109 -3 -46 -50 -75 130 -109 -197 -157 -38 -67 45
3403D5j30Q0k07oL65j45J66k47J58j68k7K8J41J73q2r2o9P5j34k03L85k51K04
$$ 45 -85 -5 -212 -218 147 2 168 -79 79 -89 -116 -88 53 226 144 52 -17 58 -76 -279 106 -145 59
3426E9j56Q1M2M3J1no5l6q0K9l3J15P1j77K20j57J02j93P6O0K4j38J55j55J24
$$ 59 -97 -16 26 69 80 75 10 -26 -106 -77 -110 5 76 -101 119 -38 64 -129 -53 7 31 -107 48 -107 17
3451A7k80J99P6J22j91OM9l2K22m26K52M8j13k5l1%P4J40j70OJ6mJ22k01J78j36
$$ 17 -263 -64 12 134 -57 -51 -2 -34 188 -238 14 62 -51 -76 -107 -107 -33 107 -63 -57 -41 -45 77 -124 54 -82
3477h2O0j14j36L5J71L4O4j8J60k1j68j01K61j05mp1J3K9Pj20J97n4j16n6N7K07
$$ -82 -22 -136 -272 -237 -66 -32 32 14 174 153 -15 -116 145 40 36 -35 -22 7 14 -106 91 37 -79 -135 -78 129
3503A29k38K7J71j76N8M1N5R0j55N5Mj35J3Q3j21Q1m1q7J85j94O2J16j3m7L3k5
$$ 129 -109 -82 89 -87 -29 12 67 157 2 57 61 -74 -61 22 -99 -18 -59 -146 39 -155 -93 23 10 -37 -4 -29
3529b9J28Pk15Q7K15j53j04K15K8j71p3K45k35J39k87K86kj81P4r3ok1K80o3j13
$$ -29 99 106 -109 -22 193 40 -64 151 179 8 -65 180 -55 84 -203 83 81 -100 -26 -119 -125 -146 134 71 -42
3554d2J03M0l4j60R6J9j35M3J13k74L73q4n3j56L09M9k75L4R1K8k8j90K55p8j94
$$ -42 61 101 67 -93 3 22 -113 -70 43 -231 142 58 5 -151 158 207 -68 -34 57 85 57 -133 122 44 -150
3579a50K38k4k7k99L90J9k22J69O1k33K63J57p67M81J10j33j47N9M36m42N4J02
$$ -150 88 64 37 -262 128 147 -75 94 155 -78 185 342 -425 56 166 33 -114 -55 381 -61 -7 95
3601I5k41J82j66J41o9r7K14J47q4j17K63k67k75L53J01j96L7Q3l23rJ61r9M2
$$ 95 -146 36 -130 11 -58 -155 59 206 122 5 268 1 -274 79 180 -16 21 104 -219 -228 -67 -166 -124
3624a24R3J08M7j12p0kL4R1J81l81L7q6J08p5J30P4P3j58J64q4k16J93p2M9J59
$$ -124 -31 77 124 12 -58 -60 -26 65 246 -135 -98 -184 -76 -151 -21 53 126 -32 132 48 -168 25 -47 2 161
3649A61j68J48n1l57J85J14j07O8J33j31J3rk5O0n4K7J46r7n9P1k24J29P4M8j28
$$ 161 -7 141 90 -267 -82 32 -75 -7 126 -5 8 -1 -26 34 -20 7 153 56 -3 68 -156 -27 47 95 -33
3674c3J08n0j66K51O4k0k46Q0J4j21r3J81J70j84j12L18j21l30R2J47k6o5J85
$$ -33 75 25 -141 110 174 154 -92 -12 2 -119 -212 -31 139 -45 -157 161 40 -290 -198 -51 -77 -142 43
3697D3j42K22J14o1k33l7J77m1j74k3K71j25k2J86J5n8j54lJ1j56K57j02K2L0
$$ 43 -99 123 237 176 -57 -94 83 42 -132 -155 116 -9 -31 155 170 112 -42 -45 -34 -190 67 -35 -13 17
3721A7N5Q1j47n2p7Q5J15J36j47j88J87P7k77K61K10l90k4P4M4Q8kJ03n61L55
$$ 17 72 153 6 -46 -123 -38 77 213 66 -122 65 142 -135 126 336 -54 -78 -4 40 128 126 229 -332 23
3745B3m1J89l08M3J91l42L74O4l64N1L9J77j59m8qK61k81J39J32j72j01K27j27
$$ 23 -18 171 -137 -94 97 -245 129 193 -171 -120 -81 96 -63 -111 -119 142 -139 0 132 -40 -141 86 -41
3768d1np8K44M1m00J78Ll2J07J33k15J95j00j19J36L6o2j14Q7J78J96k60k9j23
$$ -41 -46 -124 120 161 -239 -61 -58 -90 17 150 -65 130 30 -89 47 83 21 -93 -6 172 368 108 79 -44
3792d4J37M3l2m7r5J12J19k62j82M42N7l83r9K20J42jJ2k44K05j88j6L95k54O0
$$ -44 93 136 104 57 -38 74 193 -69 -251 191 248 -135 -234 -14 128 127 139 -105 100 -88 -104 291 37 97
3816I7q4l2pJ64k14K04l25N5J73n7J0J5rJ20P9l03K94l9K1k05Q0M6q3l1M0j15
$$ 97 13 -19 -26 138 -76 128 -197 -142 31 -26 -16 -1 -10 110 189 -114 180 141 162 -43 37 83 0 -31 9 -106
3842a06R2J1L9m5r7r8J07O1J00J23k55j5N9L0M1j8o8J20j64K96l44J55n8K11k04
$$ -106 -14 -3 36 -9 -106 -204 -97 -36 64 187 -68 -83 -24 6 47 29 -39 81 -83 213 -131 24 -34 177 -27
3867b7P9j14J51Q0k15N6n8J90L8j66J23k11J7M9j88J61q2L1M4o5N3J9QQ1oj4L0
$$ -27 52 -62 89 169 -46 10 -48 142 180 14 137 -74 -57 -8 -196 -35 -117 -86 -42 -107 -54 -35 -27 54 48 34 64
3894F4j50j42N29l77j21Q4k43K5M87l07K21K40j42j13n3q3K28o0L1k76K64M7p
$$ 64 -86 -228 301 -76 -197 -113 -356 -331 156 -151 70 310 168 55 2 -81 147 87 118 -158 106 153 146
3917A46j31K1K29l20J85j67o9M9N9o1J75k64K97k26J56O0j24k66L13o8Q2k26J01
$$ 146 15 36 265 -55 130 -37 -106 -57 2 -59 116 -148 149 -77 79 139 15 -251 62 -6 76 -150 -49
3940d9nJ42Lk05l4K54q8j46K26p3j58J43M8o0j25NJ10N1J34q5p1j28j10J44J7
$$ -49 -54 88 91 -114 -148 106 18 -128 98 25 -133 10 58 -2 -127 -122 -12 39 173 88 17 -111 -221 -77 -60
3965f0p0K50l6O8j66k6N9m3m8L0Q2j39J48j07J46Rl03K47Q8k48J57L7kJ4J60m15
$$ -60 -130 120 84 152 -14 -40 19 -24 -72 -42 40 -99 49 -58 88 97 -206 41 129 -119 38 75 73 87 247 -168
3991a68L77k69l6P4j13J43L05l78J07J06k05j57P1K03j87K13Q8k91l6J92K41k39
$$ -168 209 -60 -96 -22 -135 8 313 -65 42 148 -57 -214 -143 60 -127 86 174 -117 -153 39 280 41
4013D1n5Q9J8l7k6K68l14l1K88k64l06K45J05jk73J32J26j05K34n0r5o3L20k99
$$ 41 -14 75 93 56 30 298 -16 -47 241 -23 -329 -84 21 20 -253 -121 5 -100 134 84 -11 -74 246 -53
4037e3K29J3j46r9L3L9K17k44k0J26l5j22J13O4j58J13o9J04j48J88L5k48K0O
$$ -53 176 189 43 -56 -23 16 233 -11 -31 95 60 -62 51 115 -43 70 1 105 -43 145 180 -68 -48 -42
4061d2rj01K69J1N1j96J35n1j91L6J20j10O7o4J89k08O8J47r7k4mJ67k17M0J61
$$ -42 -51 -152 117 128 179 -17 118 67 -124 -88 32 -78 -11 -75 114 -94 -26 121 24 0 -4 163 -54 -14 147
4086A47k79j50M71k56k26K42J15k49P6K55Rm7j10N6r1k62J92J61j36R0J07j31
$$ 147 -132 -282 189 -67 -293 -51 64 -185 -109 146 155 108 -2 54 -37 -299 -107 54 -82 8 115 -16
4108a6j95K04J80j38n4K02j03k02J61K28k81R0J62k04j96M7R2L1j21K35j35K0
$$ -16 -211 -7 173 35 -19 183 80 -122 39 267 -14 76 238 34 -162 -115 -23 8 -113 122 -13 7
4130Gj64K98j82k08L90o7o3j42K34j03k51M04j37o9K61k20K3o9l8L45m45M04k41
$$ 7 -157 141 -41 -249 141 74 11 -131 103 0 -251 153 16 -53 208 -12 11 -58 -96 249 -196 208 -33
4153c3K10k87M6K56l73J58P4p3j70J26J58j03l0J05J08l55J07J25j96N1J74j09
$$ -33 177 -110 -64 192 -181 -23 51 -22 -192 -66 92 -11 -41 64 172 -183 -76 49 -147 -96 78 -31
4175c1j70K80J09j85k36J12K59k84J48J03m5j55O6K05k19P7O4k17j10N07k63k62
$$ -31 -201 79 188 3 -233 -121 138 -146 2 105 60 -95 -29 176 -43 34 98 -119 -229 278 15 -247
4197b47J14J80K4j37k1J90J09k03J7J70m50L25J6j70k1J84k95M0K69L6Lm01K80
$$ -247 -133 47 71 -66 -87 103 212 9 26 196 -254 71 87 -83 -104 80 -215 -175 94 130 133 -268 12
4220A2r2O2N6K41k28j92K91j29Q4j91K82Nl55J59k5j23M3M55l50pJ53q5l03K66
$$ 12 -80 -18 38 279 51 -141 150 21 105 -86 196 201 -154 5 -20 -143 -100 355 5 -2 151 66 -237 29
4244B9J57N7k62r5J88q5n6K3o3K37p5J18k22j95K70OJ71k72K60j53k69K39m4J4
$$ 29 186 243 -19 -114 74 -11 -67 -44 -107 130 55 173 -49 -244 26 32 203 -69 191 38 -231 8 -36 -22
4268b2l1P6qn9n3L0N0R9l68K58K93n12L36N9k89K94j59n8J0K38l1j69n4N7q0J89
$$ -22 -53 23 15 -44 -97 -67 -17 82 -286 -28 265 -247 89 148 -141 153 -6 -64 -54 184 153 -16 -70 -13 -93 96
4294I6k2K2j44J3J01kj2R7k36q8L22o3K3j06n2J09o1L0o5o3K43k59Q8j37J05J65
$$ 96 74 96 -48 -35 66 64 52 149 -87 -175 147 84 107 1 -51 58 -3 27 -38 -101 142 -117 -29 -166 -61 104
4320A04L5j73J30j66p2N0J16O6k1q6k21J52l1J46k64K92k5j24j07J7L08p6j30
$$ 104 139 -34 96 -70 -142 -92 24 90 69 -17 -238 -86 -117 29 -235 57 32 -92 -199 -182 126 50 -80
4343h0Q4nK16j90K7K01j28K34k57o8j2P5k96rL60k22Jj29L44p7k01N9j16ML16
$$ -80 4 -1 215 25 52 253 125 359 102 34 22 97 -199 -208 152 -70 -69 -198 146 69 -132 -73 -189 -185 131
4368A31k01Q2j71J83k7o3K02j66m7L2l7J92j98jo9K6J25j68J54kJ32k07J96j23
$$ 131 -70 12 -159 24 -3 -66 136 -30 -77 -45 -82 110 -88 -89 -158 -132 -7 -175 -21 -23 109 -98 98 -25
4392b5k22L07k3j58K11j71J76k50J71q1k03M40k94R4J55j19l5O1P0p3R5j75j26
$$ -25 -247 60 37 -121 90 -81 95 -155 16 -65 -268 172 -122 -28 127 8 -27 34 104 31 126 -49 -175
4415a75L20j82m4J32r1m9J33j3l07Q7J8L84k73l6K01k75K42k8k60K59l0k10R1
$$ -175 145 -37 -81 51 -40 -89 44 31 -276 -189 -171 213 -60 -96 105 -170 72 44 -216 43 13 -197 -106
4438a06P8r6K08k13J11j19k55L35M9K01j41M1O2j26j99K09r1k40J84O9J54L3p8
$$ -106 -28 -124 84 -129 -18 -137 -392 -57 -8 193 52 93 155 29 -170 39 -52 -292 -108 -39 115 148 70
4461G0q7r5K91j18j95J33J03O0k32J59j96J53j19Q2p6J24L0q4JKL5r1J90K5j94
$$ 70 -17 -112 179 61 -134 -1 102 162 -70 89 -107 46 -73 9 -67 57 87 3 4 6 41 -50 140 165 -29
4486b9l7L1l1K4R0j52L9L0j45J75J8J43M1l90J14o8K5q6J54n1M6m4L4r4J29N5
$$ -29 -66 -35 -66 -42 48 -104 -65 -35 -180 -5 13 156 197 -193 -79 -147 -122 -208 -54 -105 -59 -103 -69 -163 -34 21
4512B1Mp6J4N9N7r6MJ14j61J66r6P6l0j6J31Q4M7l53j09K29o5j96L62m2l12K99
$$ 21 25 -51 -37 22 79 -17 -13 101 -60 106 10 86 56 40 171 255 302 -51 -160 69 4 -192 170 128 -184 115
4538A15j90OK77j63j04J61j75P1j20J49m8J54l7k98K58k06J69qQ7M5k42Mr0j5
$$ 115 -75 -69 208 45 -59 102 -73 -2 -122 27 -21 133 96 -202 56 -150 19 11 98 143 -99 -95 -185 -200
4562b00K66O6o4Q5r4k2j14K29M3j81j18M4J55Ll03L49k42p0J82k82K08P0L27k75
$$ -200 66 132 68 153 59 37 -77 152 195 14 -104 -60 95 98 -205 144 -98 -168 14 -268 -60 10 337 62
4586F2k70K48l0K9N1K8m7m6q3K36k56l0K55k11p7J64j82J66j13K01j76j53J88
$$ 62 -208 40 10 39 90 118 71 25 -58 178 -78 -108 147 -64 -141 23 -159 7 -106 95 -81 -234 -46
4609d6K07k22j0K69k26N9j35J35k08L18o9O7k27J60K1k07k21K06K37k02O9P8P9
$$ -46 161 -61 -71 198 -28 31 -104 31 -177 141 72 139 -88 72 93 -114 -335 -129 108 -94 -25 53 132
4632A32j53J16p2j02k4J04O4q6l2Q0K5j0J13k74L8P6r8J55L1j08J5p9J44k05j56
$$ 132 -21 95 23 -79 -103 1 65 -21 -53 27 52 42 155 -119 -81 -5 -103 52 83 -25 -10 -89 55 -150 -306
4657c06L90p9m2l1J6K93l18N2J11j92k0J58j6nO1j63M05l60J36K20l73J6nJ43
$$ -306 84 5 -37 -68 -52 241 -77 -25 86 -106 -126 32 16 11 72 -91 314 -46 90 310 -63 -47 -52 91
4681I1j14J04l9o8l0J52J18l68P5j06L45k37K4K7q4K03Qk06JP7K5k17K72p8J05
$$ 91 -23 81 42 -26 -56 96 214 -154 -79 -185 160 -77 -53 -26 -110 93 101 -105 -104 -27 -2 -219 53 -25 80
4706H0k41L88j09j43K8q8K11n0q2j19J4q4J86Qj02P1O8k4j50R7j5j6J01L9n9j11
$$ 80 -161 227 118 -25 3 -85 126 76 -6 -125 -111 -195 -9 -1 -103 -32 36 12 -138 -41 -56 -72 29 68 9 -102
4732a02K19m8j86J41kj18L9L4o7q7J00j24J43J42J7k74K07J90j12k33J60K0l8
$$ -102 117 69 -117 24 22 -96 -57 -23 -90 -177 -77 -201 -58 84 101 -173 34 224 112 -121 39 59 21
4755B1j18m9K75o6m7nl7m9n8K22j24K0Q6k33K26j80K14k89q2L71l37M31k29K98
$$ 21 -97 -146 129 63 16 11 -26 -75 -133 89 -35 -15 71 -162 64 -116 98 -191 -273 98 -239 192 -37 261
4779B61j64r7M10l25k66J64Q1l51K17j19L1N1P5L1J46k23r1J43k34J22J52l3J17
$$ 261 97 0 410 85 -181 -17 64 -287 -70 -189 -158 -107 -32 -1 145 -78 -169 -26 -260 -138 14 -19 98
4802I8Mj50n8J03J66j21N1o3j82K98m2j02j03J38j20N5J34j89J21k65j2K02O7
$$ 98 102 -48 -106 -3 163 42 93 30 -152 146 104 2 -101 37 -83 -28 106 -83 38 -227 -239 -37 30
4825C0p2jJ16P1k67J86K6m4K3l05L40j64O9O9Oj39j14J50j41J92p7m2J31J55k86
$$ 30 -42 -43 73 144 -123 63 89 45 68 -237 103 -61 8 77 83 -56 -170 -20 -161 31 -46 -88 43 198 -88
4850h8L7m5J39q6j28pK22jp4J3n4J74j57OJ06k02p3K31j6R7P1r5m4P3j89K0J15
$$ -88 -51 -96 43 -43 -171 -178 44 43 -31 -18 -72 102 -55 -49 57 -145 -218 13 -3 94 165 70 26 99 -90 -70 45
4877D5N4j0j82m2K87j73P3lP3j07r8K56j75L3J58l67M2M7J04j24L5K65k77p6J46
$$ 45 99 89 -93 -135 152 -21 52 49 122 15 -83 173 -2 31 189 -178 -136 -89 15 -109 -74 191 -86 -162 -16
4902a6J68r1K9k37J08j7K46k34K3o1K67j89P6k7J70l13J2P2j57K73k77K83r6Q3
$$ -16 152 61 90 -147 -39 -56 190 -44 -21 -82 185 -4 72 45 215 -98 -86 -14 -171 102 -175 108 12 95
4926I5j53R9k09m5K48q9J27p2%J51j21j19K78k85K07j35r4L7N0k4n9p1J28P3j66
$$ 95 -58 41 -168 -213 35 -54 73 1 1 152 31 -88 190 -95 112 -23 -117 -80 -30 -54 -113 -184 -56 17 -149
4951a49R5l9J57j76J11j21K01L4o9J70m32K43l5J23k03j6J21R6j95Q1k9L3m6J40
$$ -149 -54 -93 64 -112 -1 -122 79 113 44 214 -218 25 -10 113 -90 -106 15 111 -84 -3 -32 1 -45 95
4975I5j87K12k04j23L61k14r8J44J32j0o6r5K4M3J19p7l9O5p4Rk00J93J61j62
$$ 95 -92 120 -84 -207 154 -60 -158 -14 118 108 42 -53 -29 14 133 56 17 82 8 17 -183 10 171 9
4999IJ00j15j5j0m5J90mk07n6K35r9j01J05m0Q2k60M16k90LQ3O7R3j95J32Q0l83
$$ 9 109 -6 -21 -31 -76 114 110 -97 -153 82 -17 -118 -13 -53 29 -231 185 -105 -102 -19 48 141 -54 78 158 -225
5025b25M21k03K54j80k10j6J1L03r2k70K34l3O4j9l9J31k68K13j24K10k70K03
$$ -225 196 -7 247 67 -143 -159 -148 155 63 -207 27 -6 58 39 0 131 -137 76 -48 162 -108 95
5047I5m9k87J91J97Q5l79K02K7J9P4k79K98l12Q6J32JL5L4l09J28j3k20J71l5
$$ 95 46 -241 -50 147 232 -147 55 82 101 175 -104 194 -118 -32 100 101 136 170 -139 -11 -24 -244 -73 -108
5071a08R8q3M2Q4k09K09O6j38q8J91o8j1M4L3J57j23j37j16J82J5K6N3k41r9L77
$$ -108 -10 -93 -51 33 -176 33 99 -39 -127 64 -4 -15 29 62 219 96 -41 -157 25 40 66 119 -122 -221 156
5096A56q6Qk71L84q7O6or7k41N4J1N0J02q5Q3k20J50M9J20j87k2J96j40lR1N0
$$ 156 70 78 -193 191 104 170 164 67 -174 -120 -109 -59 43 -42 41 -179 -29 20 140 -47 -69 127 -13 -16 75 125
5122A25l48O7K39j65j56Q5K68l88J47J92Qqj49O4P3j56K08k19Q1Q6J65m78M19
$$ 125 -223 -156 83 -82 -238 -153 115 -273 -126 66 74 66 -83 -19 54 -102 106 -113 -32 54 219 -259 160
5145A60k05M5J00k02Q4l0Q3O9j03j47K23N5k80J02O6k0K2Q5p2N2r1j14P0N8O2
$$ 160 -45 0 100 -102 -18 -48 35 104 1 -146 77 132 -148 -46 20 0 22 107 35 87 -4 -118 -48 10 72
5170G2O8k56J62q5J00j10j21O9J47j23r4L79m6l11R3K10p9k73J21J04j96J66M0
$$ 72 140 -116 46 -39 61 -49 -170 -101 46 -77 -171 208 162 -149 -56 154 75 -198 -77 27 -169 -3 37
5193C7R5l52K80J43k95J67N5l69K70J7j33M1K26j90j30Q6Q9p0M1kl8j1J23j13
$$ 37 132 -220 60 203 -92 75 130 -239 31 48 -85 -44 182 -8 -138 -52 37 -33 8 6 -32 -43 80 -33
5217c3P2RJ7m3K9j9k20J67J60M1l41K11k2J74j35m0Q5j82J0k19N21j20k9L1k40
$$ -33 39 48 65 22 51 32 -188 -21 139 180 -161 50 28 202 67 27 112 -70 -60 -279 242 122 93 124 -116
5242a16J64j79J54k08K62O0o5j7k21K71r8J04k2L6j85J29M1kp6j31J70j67O1J6
$$ -116 48 -131 23 -185 77 137 72 55 -166 105 7 111 89 125 -60 69 110 108 32 -99 71 -96 -35 -19
5266a9L1j10j72L50m5K0Pj42l0J63J60k18J35k15J28N0qQ4k68K4K8P7n5j89L13
$$ -19 12 -98 -270 80 35 55 62 -80 -110 53 213 -5 130 -85 43 93 85 169 -99 -75 -47 30 -25 -214 99
5291I9j69J94j11N8p0J6l2OK6J6Jj03J58J1k6O1k68J00r5J23p8R5l20L46m3K0
$$ 99 -70 124 13 71 1 17 -15 -9 17 33 34 -69 89 100 74 135 -133 -33 -128 -5 -83 12 -308 38 -5 15
5317A5J34l09K53N1k26o9J22O0l4J01q7j0j46L1R9J58k40J84j15q6K83k89J06
$$ 15 149 -160 93 144 -82 -151 -29 31 -3 98 11 1 -145 -114 -15 143 -97 87 -28 -114 169 -120 -14
5340a4J59l09J45J8L19l23j47J43Kj68K25j57J04k6k86M26j3n9j5M1j47K32j00
$$ -14 145 -164 -19 -1 318 -5 -152 -9 -7 -175 50 -107 -3 -29 -315 111 98 39 24 65 -82 150 50
5363E0J75j78m4R9q3n8K03j59M6o5j07J83jj26Q7l1j9j4M7j06O9N8j96J00K66
$$ 50 225 47 3 102 19 -39 164 5 51 -14 -121 62 61 -65 22 -9 -28 -42 5 -101 -32 26 -170 -70 196
5388A96j03j86K3O9kj33J83K03k32J01l3k29J50j30L04k48rO6m2R5j82J9p4J83
$$ 196 93 -93 -70 -1 -3 -136 47 250 18 119 86 -143 7 -123 181 -67 -76 -10 -52 43 -139 -120 -194 -11
5412a1Plk02K46j82K10l65L23k2m0M8j52L01j44n8j49K20O9l02L40j81n3j7K51
$$ -11 -4 -7 -209 37 -145 65 -300 23 1 -39 9 -143 158 14 -44 -193 27 96 -206 134 -47 -100 -117 134
5436A34j3k77J23R9j62n9R4KJ39k60J87j22K30k35M2O0K67j58J13j11j45Q5r0
$$ 134 121 -156 -33 66 -96 -155 -61 -59 80 -180 7 -115 115 -120 -78 -18 249 91 204 93 -52 33 -57
5459e7kK12q2l3j16j01K43j7k1j60K31j25k9J90j87J25K5j33R2Oq0o7J47J53j37
$$ -57 -59 153 71 38 -78 -179 64 47 26 -134 97 -28 -57 133 -54 71 96 -37 55 61 -19 -86 61 214 77
5484G7pL9p3j05j7L45k46POj72O8J96j88J25j9r9j5J19K5J35l02N3N3rK6p5L8
$$ 77 70 109 36 -69 -86 259 13 20 26 -146 -78 118 -70 55 36 -63 -78 41 66 201 -101 -48 5 -4 22 -53 -15
5511a5k16K08l9M6k84J31j78L12q2J70j08J63l8m8j16k5Q9Om1J34n2j13J31Q2
$$ -15 -231 -23 -62 -16 -300 -169 -347 -35 -117 53 -55 108 70 22 -94 -119 -30 -24 -65 69 17 -96 35 117
5535A17p3p7r8K90k60p1K4J96k36K17K62l11J76J4o1j49j6pJ22J4j93P9j44J00
$$ 117 44 -33 -131 159 -101 -172 -148 48 -188 29 291 -20 156 170 109 -40 -56 -63 59 73 -120 -41 -185 -85
5559h5J62j63l8oQ7Q3r8R5j25j89K97j0n4J41k42J37o2Q2O2p8L4j42M84k55k57
$$ -85 77 -86 -124 -130 -43 40 -58 37 -88 -277 20 10 -44 97 -145 -8 -70 12 74 -4 30 -112 372 117 -140
5584a40J60J81Ok89J91j51j22L18N2j4j79L8n3j55K33Q2k71K67j17l1n5N0J3j13
$$ -140 20 201 207 -82 109 -42 -164 154 206 192 13 51 -2 -157 76 158 -113 154 37 6 -49 1 14 -99
5608i9Q3J22j12j8J60l06J65R7J4O0l20J46K2j86K58j15r2r4M04j62j62K41j79
$$ -99 -16 106 -6 -24 136 -170 -5 92 106 166 -154 -8 14 -172 86 -29 -121 -215 189 27 -135 106 -73
5631g3J38r7k1O1j89J97l3j76J68j77J64J06j01m9J04j38k8M43l56J47j38L3Q9
$$ -73 65 -32 -53 8 -181 16 -17 -193 -25 -202 -38 68 -33 -82 22 -116 -144 299 -57 90 -48 -15 74
5654G4l4L9m39L82j41k5qJ35R2j62J30J82j65l4j7j23J13k3m4J83l90J92K44k30
$$ 74 40 79 -360 22 -119 -144 -152 -17 75 -87 43 225 60 26 9 -114 -1 -24 -68 115 -275 -83 161 -69
5678f9J40L3k86j7J25N3kj10J64j26K23m28M95k51J76k44K45N6j84J48p3j57K42
$$ -69 71 104 -182 -199 -74 -21 -23 -133 31 -95 128 -300 195 -56 120 -124 121 177 -7 141 68 -89 153
5701A53k7k10j05L0L00j72J2o7K50j29k9k43J31J42J64j38q4J65j56k17J22L28
$$ 153 126 -84 -189 -159 141 -31 -19 -86 164 35 6 -237 -106 36 200 62 -22 143 -13 -230 -108 220
5723B20k15k94L22jl9J16j39l0J44J1lK7k61K50k8k44K93j96J29NN9k44p1O8J08
$$ 220 5 -289 33 32 -7 109 -30 -60 84 95 92 119 -142 108 80 -164 129 -67 62 67 126 -118 -189 -121 -13
5748a3O8j53J42j15J69n8p4N9j82J97k08K09j50K58k94J31p6K76k32r0R3r2K49
$$ -13 55 -98 44 -71 98 40 -34 25 -157 40 -168 41 -109 149 -145 -14 -90 186 -46 -136 -43 -135 114
5771A14m73N16j06j69J16J17j20K0j79k4K5M7J16p0j03M8K70j39L2k5m0j3J01
$$ 114 -359 157 51 -118 -2 115 -5 15 -164 -188 -163 -116 0 -70 -173 -125 145 6 38 13 -27 -40 61
5794F1n0O1m1j93%J18J1J80j41K7l9j59J38J57j44q6K48o7J8j19J00k32J47N1
$$ 61 11 72 31 -162 -162 -44 -33 147 6 33 -6 -165 -27 130 -14 -100 148 81 99 -20 80 -152 -5 46
5818D6m1Q3r4J30j14M7j95J23J12j1J35j63j42R5k0M9L1M5l1k17J45Q8q2q3J58
$$ 46 5 88 -6 124 10 57 -138 -15 97 86 221 58 -84 11 -9 40 71 116 85 -132 13 101 19 -64 94
5843I4k6q6P7K5j23n6K76j85LQ0K4K5j89kK51k65M7J47j25J68k41J04k1j25L8
$$ 94 68 -18 59 84 -39 -95 181 -4 -1 79 103 128 -61 -63 188 -77 -30 117 -8 160 -81 23 2 -123 -85
5868h5J26j49l7J85Q1MM9k57J55p7l6J22K3K5j56J20k45J50K71o5k10J20j84n2
$$ -85 41 -108 -145 40 121 125 174 -83 72 -5 -41 81 104 129 -27 93 -152 -2 269 204 -6 114 -70 -122
5892a22K92l1j26j03q9L5j07K88k20K94N2k08J76j93l3J39k36J13K57l80L06r3
$$ -122 170 139 13 -90 -179 -144 -251 37 -183 111 163 -45 131 -62 -95 44 -192 -79 178 -202 104 11
5914A1L8qn4K56l13K1p4OK79q8m3Qj62K08m3Q8k76mr0L06j35M24k99m6j6m4J09
$$ 11 49 41 -13 243 -70 -49 -123 -117 162 74 31 39 -123 85 42 130 -146 -150 -240 66 -69 355 56 10 -6 -50 59
5941E9J3K3j67K4J0l4p3J83j22J31j5k5k1j3O1r8KP4J15J22l27m8J5R5J50l01
$$ 59 72 95 -72 -48 -38 -72 -145 38 -84 47 32 7 -14 -27 34 -64 -62 12 127 249 -78 -126 -111 -16 134 -167
5967a67J05O0P3J40N3l30r7K44J6m6k20J72k12Q0r5N52m71L15l04J26k41M84k38
$$ -167 -62 -2 71 211 264 -66 -163 81 97 51 -169 3 -209 -129 -224 328 -143 172 -132 -6 -247 237 -1
5990aQ6Q3q5k88J76K20n3k82L05n7k00J57q2jn9J30q9J19l4p2j89J85M0M5O6o
$$ -1 85 168 83 -205 -29 191 138 -144 161 104 -96 61 -21 -22 -81 49 -40 79 45 -27 -216 -31 9 54 120 114
6016A14j78QKL58k70j51N4L02m96J31J3J86k20P9P5j20J1R9p0J76N8q8l27L13
$$ 114 -64 -56 -54 304 34 -117 -63 239 -257 -126 -113 73 -147 -68 7 -113 -102 -3 -73 103 161 73 -254 59
6040E9J80k35j3j35M31l83M5oO8q5Q1jN0O8j53J63l85K38Q3o7o9n4Q7j4J4R6j35
$$ 59 239 4 -9 -144 287 -96 -51 -57 11 -74 7 6 56 124 -29 134 -251 -13 70 3 -66 -120 -33 -47 -33 63 -72
6067g2j54K01N1m1L1j92J06J81j89K49j76j39Pl0J49pk5J45k51J05J44K6n3R4
$$ -72 -226 -25 26 -15 16 -176 -70 111 -78 171 -5 -144 -137 -167 -18 -25 -50 95 -156 -51 93 119 66 160
6091A60k82J42N4n4k3m1J29j51O0ko9J28r2r1P9j36L16q1Lj55K00n1k95J22L11
$$ 160 -122 20 74 20 -3 -44 85 -66 -6 -8 -77 51 -41 -132 -53 -189 127 46 49 -106 94 43 -252 -130 181
6116A81l51J21q8K21j03K08Q6l13o5L23k40J33j07P1Oj41J09Jk8p4j2mK02Q9j22
$$ 181 -170 -49 -137 84 -19 189 275 -38 -103 220 -20 113 6 77 83 -58 51 52 24 -50 -62 -66 136 225 103
6141A03K8r8J3qq6M3N1j28j07M9K81j64J52r0M9q1j06J31k02J95J30l57K86k44
$$ 103 131 33 46 38 -48 -5 46 -82 -189 -140 141 -23 129 39 88 7 -99 32 -170 25 155 -202 84 -160
6165a60L26j53M6j04Q5p4j12K83j63J17k61j34J87Q7R9Ll30K42j59L9J10K03j44
$$ -160 166 13 59 -45 40 -34 -146 137 -26 91 -170 -304 -117 -30 69 72 -258 -16 -175 -136 -26 177 33
6188C3j74K9K37j62q4J93R0l02J11J08j58J00j31K1K2P6J04m3j95J26K30j10r5
$$ 33 -141 -112 125 -37 -121 72 162 -140 -29 79 -79 21 -110 -89 -67 9 113 70 -125 1 231 121 26
6211B6J04k25J82l1J02l08R0R7pr0L1N7J37j58J88j63J49k73L78l85Mn5L8N3J05
$$ 26 130 -95 87 56 158 -150 -60 37 30 -60 -29 28 165 7 195 32 181 -92 286 -99 -95 -150 -112 -59 46
6236D6Jj02m9k6O5j82J15k0L26r1j39m7jK10j83J5L20k56j66K04J0j2J17j67J87
$$ 46 47 -55 -104 -130 -65 -247 -132 -152 174 83 -56 -103 -104 106 -77 -62 258 2 -164 40 50 38 155 -12 175
6261A75k37N9J42P0K0j58J53j35j31O3l6k97M47k24L2RN0O2N6k11J16l9K8O6j09
$$ 175 -62 -3 139 209 229 71 224 89 -42 21 -15 -312 135 -89 -57 -48 2 64 120 -91 25 -14 14 80 -29
6286b9o1Q8r6K7M3J1J14n5M8k89K23l2J20l0n0q5k2p0K54Pj10o9p9K08Lj95n6
$$ -29 -90 -2 -98 -71 -28 -17 97 42 90 -199 24 -8 112 82 32 -53 -75 -145 109 116 6 -63 -142 66 69 -126 -182
6313a82L24j70J11k44K76m5k97L14k0p6j7J65k0j54J17o6j82J39J25k39J31q3
$$ -182 142 -28 83 -161 115 70 -227 87 67 -9 -26 139 119 -35 82 16 -166 -27 98 -141 -10 -93
6335i3j5r9O1K80j2k75J13p8L01k84J58r1M6KO2k34K91o1j49J49j75K04r9R5P3
$$ -93 -108 -207 -146 134 122 -153 -40 -118 183 -101 57 -34 12 14 76 -158 133 72 -77 72 -103 101 2 97 170
6360A70j37M6K8q2j90J17J91j04k08K07Lk37J56l7O5n6J41R6N8j73N9k5lj06J75
$$ 170 33 79 107 25 -165 -48 143 39 -169 38 41 -196 -40 -77 -12 -68 73 169 227 54 113 88 85 -21 154
6385A54k57k06M03jp9j28R9P2m7L6L9l9o1L3q0J10l15L19q3M0N0P0k6k50L03j31
$$ 154 -103 -309 94 93 14 -114 -15 57 10 46 85 46 -15 18 -62 48 -267 52 -31 9 59 129 103 -147 156 25
6411B5N8L1k11M1QJ69Ln2O5j02l5J64q2N2j0j74q9Q4R1k91L80j71K00j39k62J89
$$ 25 83 114 -97 -56 -48 121 124 72 137 35 0 164 82 134 124 -50 -139 -55 36 -255 125 -46 154 15 -247 -58
6437e8K46k44nK0P1P2j21k01J35K79j66ql08K46p0J77m0k6lJ79k74PK02O9m01
$$ -58 188 -56 -61 -41 30 102 -19 -220 -85 194 28 20 -288 -42 -112 65 25 -1 -4 175 -99 -92 110 179 -222
6462b22R8J40k67M64j29M1k22J36j16J68O8M0j62q8J3J11K14k39J39l87J98m2
$$ -222 -124 16 -251 213 84 125 -97 39 -77 91 159 199 37 -51 -38 73 287 48 187 -200 -2 -44
6484d4L0j31M9J08o5m7J02J68k61k1k9J92p2J33q4K2R7j93K2L3J19k10L50j16
$$ -44 -14 -145 -96 12 -53 -100 2 170 -91 -112 -141 51 -21 112 28 50 147 -46 -24 9 128 -82 268 152
6508A52k04J95k7j39jo8p6J41j18J30J9J18k72P2J32q8m1M1K05k39KL6J27q0m1
$$ 152 -52 143 116 -23 -24 -92 -168 -27 -145 -15 4 122 -150 -78 54 -34 -75 -34 171 -68 -66 -30 97 17 -24
6533b4L8q6J31j91R7j9QJ82j55m8K0P8N3R5k8k54nj3R8l3Q7Q8o2p3N6l7m9J49
$$ -24 14 -72 59 -132 -35 -54 -46 136 -19 -67 -47 31 84 179 151 -103 -108 -121 -23 -56 31 119 57 -16 40 3 -46 103
6561A03k45K22j54K28k39j9K80o3k3k8l06J82jr3K15k17J98Q9j40J2j9P7k3j22
$$ 103 -142 80 -74 154 -85 -104 176 113 90 62 -244 -62 -63 -156 59 -158 40 129 -11 1 -18 59 36 -86
6585h6k2L3J62j09L7N1j59O1J90Jk35O2n5L11k75O1J93j78j7R9k91M7L80q1k51
$$ -86 -108 -75 87 -22 15 66 -93 -32 158 159 -76 -14 -69 242 -33 28 221 43 26 125 -166 -119 261 180 -71
6610g1K85l9K4l07qR3J08n07M28L1l9r3J22o4k4J26J97k35j19J70k65L9L90k47
$$ -71 214 175 199 -108 -116 -23 85 -422 6 37 -2 -95 27 -37 -61 65 262 27 -92 78 -187 -148 242 -5
6634eJ7J32j99J80j96Q1j09K7P1J25j59P6J14k07J13M7j22L2J94r5k09O1K4j53
$$ -5 12 144 -55 125 -71 10 -99 -72 -1 124 -35 41 155 -52 61 108 -14 18 212 117 -92 -31 -7 -160
6658a60J19R8r9l9J50J68j14j75l8J66j39M4Q5l8n8qJ18j83K74p7J26q0k78J69
$$ -160 -41 57 -42 -81 69 237 123 -52 -90 76 -63 -19 66 28 -30 -38 80 -103 171 94 220 140 -138 31
6682C1j83K35j02J15j62oJ92K1j55l5j7M8J3J70j98o3J85oNl24J97M3kJ46jr9
$$ 31 -152 83 -19 96 -66 -72 120 141 -14 -49 -66 -18 -5 165 -33 -96 89 83 88 -236 -39 4 2 148 147 48
6708D8k45K77j9o6j62K51j41J68j61Q5K0j12J39j47j25K71j51N8o9K83k01j27
$$ 48 -197 80 61 -5 -167 84 -57 111 -50 35 55 -57 82 -65 -190 81 -70 -12 -81 202 1 -126
6730a26J47J79j4n3k79K47j75J16j03j06J02lK23j16j4M2N4n1j57oJ8k9J67l0
$$ -126 21 200 186 133 -146 101 -74 42 -61 -167 -65 -68 155 39 25 67 121 70 -87 -93 -75 -104 63 33
6754C3L6j74P2l8J13j40J32j50j35K44M2O6j13Rj4J0L2p5J72l2q1l2J38j83j10
$$ 33 69 -105 -33 -71 42 -98 34 -116 -251 -7 35 101 -12 -3 -17 -7 25 -50 122 90 9 -23 115 -68 -178
6779a78J81k18K85L6j40J49j40J89k6j70j54R3J44o2l7J99l3l7J43j98j6J29j73
$$ -178 3 -215 70 106 -34 115 -25 164 138 -32 -186 -93 51 -11 -48 151 118 81 224 26 10 139 -34
6802c4k3L2J34r1j32L10k50J55k0l6j14O4M6L0m1K1Q6m0l5k0K1j5o1NJ60k76J0
$$ -34 -57 -25 109 18 -114 196 -54 101 81 45 -69 -5 41 71 30 51 137 97 62 42 63 48 -13 -8 152 -124 -114
6829a14K07K2r8RJ01j99J76k60L44j58m7J62j6j04j0J9q7J68n0r6J83M3j39j89
$$ -114 93 115 17 26 127 -72 104 -156 188 30 -17 145 129 25 15 34 -53 115 65 -31 152 195 56 -133
6853a33J53k85L68K0k60J20R7k18J62J43j19M2l2pm3N2j89J53q4O7L3J56k99O4
$$ -133 20 -265 103 123 -137 -17 80 -138 24 167 48 90 58 51 8 60 -129 24 -60 7 40 196 -103 -39
6877c9k18L19Ll16L44o6J22l14K70j35j25L72k85k4O9L3K57k03P8j54J94j71L9
$$ -39 -257 62 65 -251 93 27 149 -165 105 -30 -155 217 -68 -92 -23 10 267 64 142 -12 182 11 50
6900E0j02k7J9J61o9j21J43k54L40k99q3K43n2K3LQ4J48k44J26k26J77m5P3M9
$$ 50 -52 -79 -60 101 32 -89 54 -200 140 -159 -242 1 -51 -28 -25 59 207 -37 89 -137 40 -5 68 117
6924A17r1R0o7L7J6J35j11o2j80K64k04N4j43R6L5K9J20j63K36j95p1L3k2l3m7
$$ 117 26 116 49 86 102 237 126 64 -116 148 -56 -2 -145 -49 -14 15 135 -28 208 13 -58 -25 -47 -80 -127
6949a27K14O8L1j93P8m7j02M74k54j1j09j01J68oj51%j05J89%k13K33p5R2n4P3
$$ -127 87 155 186 -7 71 24 -78 396 142 131 22 -79 89 83 -68 -68 -173 16 16 -197 36 -39 53 -1 72
6974G2nJ46kj30O4j93J19q0M8r7P8j48J10q6K21J08l13J10o9J06R1j44K4k68J01
$$ 72 67 213 211 81 145 -48 71 -9 39 -58 20 -128 -18 -104 117 225 -88 22 -47 59 150 6 30 -238 -137
6999a37J93r5K1M3M9K0r9K9j53J2J13l06J73J53M1N7j32Rj13L42j54J81m12N8
$$ -137 56 -39 -18 25 74 94 -5 24 -129 -117 -4 -310 -137 16 57 114 -18 -9 -122 220 66 247 -165 -107
7023a07K05l8l6r5K98l99O2K01k71L75k26J24m4j8m1N5j6k5l0K6J53j22O4j49
$$ -107 98 60 24 -71 227 -172 -110 91 -180 195 -31 93 49 31 -10 45 29 4 -26 0 153 31 95 -54
7047e4J19k76J91J53l31P5j02L24J29k41J01m8J10k95K53P6k69k41J48L28j13
$$ -54 65 -211 -20 133 -198 -123 -225 99 228 -13 88 40 150 -145 108 184 -85 -326 -178 150 37
7068C7J77j77K2M8j81R1J48n3j7mj77L3JJ27q7j54K40M6j%p4r7K8R9O7k07L8j25
$$ 37 214 37 59 107 -74 17 165 112 95 91 -86 -53 -52 75 -12 -166 74 120 119 119 45 -52 -24 75 142 -65 -27 -152
7096a52J22J12R5j18J9r6j33K02j35r4J33O7O1l44K73J8p8j27L3O9J20k42J49
$$ -152 -30 82 177 59 78 -18 -151 51 -84 -178 -45 22 83 -261 12 30 -48 -175 -142 -73 47 -195 -46
7119d6j8lJ7J94l5n2m8o3K5J19J40j21l34L5J60N0K0m6J46k31O7k6K01r3j40J29
$$ -46 -64 -67 -50 144 109 57 9 -54 -29 90 230 109 -225 -190 -30 20 40 -6 140 -91 -24 -50 151 58 -82 47
7145D7J2j96J43K56k62j17j06L07m8r1J78k22J0Q4n1q0L20k12Q4l10J13K3J91
$$ 47 59 -137 6 262 0 -117 -223 84 36 -55 123 -99 -89 -5 -56 -136 184 -28 56 -254 -141 -118 73
7168G3j46J34jl72L13n6P1n9j33j7K76j88J27N8K6P3o4K1j54Rm5J14jj05j8M1
$$ 73 -73 61 60 -312 1 -55 16 -43 -176 -193 83 -105 22 80 106 179 115 136 -18 -9 -54 60 59 -46 -64 -23
7194b3K8P8r7k05J19J01j8q5J31P2OkjN1m6J26m60J05J53k24Q4K01p7mNl23L95
$$ -23 5 83 -14 -219 -100 1 -17 -102 29 101 107 105 104 155 109 235 -225 -120 33 -191 -107 94 17 13 18 -305 90
7221I0k31R4m1l5L00k43K24j66K4L2k28J65O8j98O8j0J07K10k79j15j10K93o9
$$ 90 -141 -47 -88 -123 177 -66 158 -8 16 48 -180 -15 53 -145 -77 -87 20 230 -49 -164 -274 19 -50
7244e0j81K64j59J82j69J81k8j67Q9J43j68L0L9R5k24J86j78L1M9m0K22j96K32
$$ -50 -231 33 -126 56 -113 68 40 -127 -38 105 -63 -33 6 101 -123 63 -115 -84 -35 -75 147 -49 183
7267A83N9m50L05o6j43K8L8J56j90J06j30R9K21k36j46O8N2J49j15J95l6q3O8
$$ 183 242 -208 97 31 -112 -84 -46 110 -80 26 -104 -5 216 -20 -166 -98 -46 103 -12 183 147 64 132
7290A32r4P5k34J77o9m6m2J43Q3k72J56k4J56j31m2J78j33j41O1j7J56p3j83J49
$$ 132 38 113 -121 56 -13 -59 -101 42 125 -147 9 -15 141 10 -32 146 13 -128 -67 -84 72 -1 -184 -35
7314c5P5R8q7o5r7J93J33r2j00J5o8OJ50j0o5N7j6l2j1j42P8O0o0k56K31m4P4
$$ -35 40 138 51 -14 -111 82 215 123 23 38 -30 -24 126 116 51 108 92 60 49 -93 -15 45 -15 -271 -40 -84 -10
7341a0O6j98J61lJ32l03j47L98j16N7o6J77j20J60l15K70j97M9l3K0O8P2%k95
$$ -10 56 -142 19 16 148 -155 -302 96 -20 37 -29 148 28 188 -127 143 -54 -5 -38 -18 50 122 122 -173
7365a73J71j49J13j71J12L6J34k67J92p6M3J0jl5k7P6nlL9M0k18p1K53O5L0O4
$$ -173 -2 -151 -38 -209 -97 -61 73 -194 -2 -78 -35 -25 -26 -61 -88 -12 -17 -20 19 59 -159 -230 23 88 118 182
7391A82j74N5M1n7j11m1P0J23p2r8K57j06m4K36k81j67K39j13j01K32pJ17j09
$$ 182 8 63 104 47 -64 -105 -35 88 16 -82 175 69 25 261 -20 -187 52 -61 -162 70 63 180 71
7414G1MK9j76J62j09Q3M7j06m2L1J31r6J12j92j55J91J0J00j34r2M3RK86j04o2
$$ 71 75 104 -72 90 -19 64 111 5 -37 -6 125 29 141 -51 -206 -15 -5 95 -39 -131 -88 -79 207 103 41
7439D1Q5k94J01J24P8l63L09Kr9o3k7PL07l63J73o7k4N7J1J94k26k7pM0M1O2J32
$$ 41 126 -168 -67 57 135 -228 81 83 -16 -79 -106 -99 208 -155 18 -49 -73 -16 -5 189 -37 -64 -71 -31 10 72 204
7466B04m9j68K40l69J40j1L1L0J04p0J35k56Q6j2N6q5n1J43L0j89J68p1k74K13
$$ 204 155 -13 227 -142 -2 -13 18 48 152 82 217 -39 47 35 91 6 -45 98 128 -61 107 36 -238 -25
7490b5J75J7k55j00M00l50J68N4j64Q3m7n9K60l16J08K21l7j69m7k0j96K13o4
$$ -25 150 167 -88 -188 212 -138 30 84 -80 3 -44 -103 157 -159 -51 170 133 -36 -83 -103 -299 -86 -150
7513a50K79k60L47k28J20k56J12Jj16P7J10Nk7j67k4L29k02j70K86j53J97J0k13
$$ -150 129 -131 216 -12 108 -148 -36 -35 -151 -74 36 41 14 -153 -177 152 -50 -220 66 -87 110 120 -93
7536i3JK2M6k8J38m1j48K64n8o5L4r6J65l45N25m07J35J65k36N4j36r6L04j62
$$ -93 -92 -70 -24 -52 86 45 -103 161 103 38 72 -24 141 -204 321 -86 49 214 -22 32 -104 -200 104 -58
7560e8J66J44l19K19j74J4P2K6j29k19L89m4q2k07M9J06j91L85m4k36J42J35j58
$$ -58 108 252 -67 152 -22 -8 64 90 -39 -258 131 87 5 -202 -153 -47 -238 147 103 -133 9 144 -14
7583a4K3Q1j66K55Ok40j79K63l33K21N8J8k3O0j29R3j36K52m1p1P6q5J07l07K39
$$ -14 9 90 -76 179 185 -55 -234 29 -304 -83 -25 -7 -30 30 -99 -6 -142 110 69 -2 74 -11 96 -211 28
7608B8j64K9L07j14r3j09L58m55J94N4m5Q8j95K26k62l3n8M2J79nm7J16k74L37
$$ 28 -136 -107 200 86 -7 -116 242 -213 -19 35 -10 78 -117 109 -153 -186 -244 -202 -23 -28 -75 41 -233 104
7632A04k24K63r4O5k27n8J82o3K6l4j7J15N3p1j48lQ8q8J09p9J43J02j56k0j18
$$ 104 -120 143 49 114 -113 -171 11 -52 -26 -60 -77 38 91 20 -128 -131 -43 -131 -22 -101 42 144 -12 -32 -150
7657a50J01k6L2K08k22K05k28J21l5l4m9J23J62m59L21j3j20P9R9l9j18Q5j03
$$ -150 -49 -75 -43 165 -57 148 -80 41 6 -28 -77 46 208 -251 70 57 -63 16 115 76 -42 43 -60
7680f0J01p8j31K2N3J2J36J35r9l29M53k59K93k83q7qo8K34m0L1j39J03j62K28
$$ -60 41 -37 -168 -146 -93 -81 55 190 91 -238 215 -44 249 -34 -121 -129 -197 37 -3 28 -111 -8 -170 58
7704E8P7J18j99l6j26N8K77k56L46k81J0n2M7K0M3K3j76J48j81m9K33j78N0J79
$$ 58 135 253 54 18 -108 -50 227 -29 317 36 46 -6 41 61 104 127 -49 99 -82 -131 102 -76 -26 153
7728A53k64K38p1l16K07K25k09L6j1J45l99M05P6n3j15q8P1j29O8R4J7j85O2J5
$$ 153 -111 127 56 -260 -53 172 -37 -1 -12 133 -266 139 215 162 47 -41 30 -99 -31 63 80 -105 -43 -28
7752b8o2q7J55L7J80j83L7j18J93j87QJ18lJ18j77M0k22K41Qp5Q8K4N0p5j62J59
$$ -28 -90 -177 -22 15 195 12 49 -69 124 -63 -55 63 60 178 1 41 -181 60 68 -7 81 105 155 80 -82 77
7778G7J6o8m5m1K2J76k14M1J17R6l42M5J80l9N9k44Q3J0O2m8P4K15p5k90%J50
$$ 77 93 25 -20 -61 -39 137 -77 -36 81 177 -165 -120 60 21 80 -164 -81 -71 -9 -57 17 232 157 -133 -133 17
7804A7L8l02L21p0l5J19p9P0l08J76J08R5l78K60k51J92J7L4n2k2R%l9J79P3j15
$$ 17 55 -247 74 4 -31 88 9 79 -229 -53 55 150 -228 32 -219 -27 -10 24 -28 -50 -41 -41 -80 99 172 57
7830E7J0j1o9j6p6o6J36j18K38j80K91j54L5j80J38p9K6o7Q5o8p8L50l27J82k5
$$ 57 67 56 -13 -29 -105 -171 -35 -153 85 -95 196 42 77 -103 35 -44 -18 -85 0 -68 -146 204 -123 59 34
7855C4k24J93m2j8L5n0J72j30K03j90J41J6M6j22K3J32j57j4O6j23j7m5j14K22
$$ 34 -190 3 -39 -57 -22 -72 100 -30 173 -17 124 140 186 64 87 219 62 48 114 -9 -26 -71 -185 37
7879C7k3K8j02P2K07j06k87K30k6k04J20Q6N7o1Mk6j03j57J81Q0J0k28K18R0k41
$$ 37 14 42 -60 12 219 113 -174 56 30 -174 -54 32 89 28 32 6 -97 -254 -73 7 17 -211 7 97 -144
7904a44j54L73q1j18K05j00K8r3L13k34j99M7j09K19J88j20p9Qn4K72n5k8L9k41
$$ -144 -298 75 -6 -124 81 -19 9 -84 229 -5 -204 -157 -266 -47 141 21 -58 -50 -104 168 113 85 124 -117
7928a17K62j95k23J93o0Q6K16r1j00O8Q2j09N5k50M0L24k23PJ20J71l72J52o9
$$ -117 145 -50 -273 -80 -140 -54 162 71 -29 39 121 12 67 -183 -143 181 -42 -35 85 256 -116 36 -33
7951c3n7N9R2p5k7J49l20L08m3j54L18j50k4L1q0n8J4K10j38j08m4J94J09k94
$$ -33 -90 -31 61 -14 -41 108 -212 96 53 -101 217 67 43 74 -6 -64 -50 160 22 -86 -130 64 173 -121
7975a21j9N3K48j05k6k5J5k39K08O2O9M1p8r3n6Q5r6M3L4J76l61O2J63j88L2O4
$$ -121 -140 -87 161 56 30 5 20 -219 -11 51 120 161 83 -10 -66 19 -77 -34 0 176 -185 -123 40 -148 -116 -52
8001e2R4j98M3J98Nm37M59r2j93J43P5j9K66k35K6L6k30j15J89L8o0j7L10k25
$$ -52 42 -156 -113 85 90 -347 112 20 -173 -30 45 26 292 57 83 119 -111 -226 -37 1 -59 -76 234 9
8025IJ35k82J7K22k43K75k4k88K01Kk39J68J88j90K12q9q2M8R5j08K6k00K11l
$$ 9 144 -138 -121 101 -142 133 109 -179 22 24 -215 -47 141 -49 163 74 -8 40 135 27 53 -147 64 61
8049F1j26J28j1k49J07M5J4O8J39n5j30j15j10Q5L66j45Q7k58K19j19k8Lm5O7
$$ 61 -65 63 52 -197 -90 -45 -31 37 176 121 -9 -124 -234 -149 217 72 159 -99 120 1 -27 -24 -69 -2
8073bJ09j36p1mJ57j18N4J35R2n8j90p4K9K3J49j66j35J50o1jJ64j17p9J61P3
$$ -2 107 -29 -100 -104 53 -65 -11 124 216 158 -32 -106 -77 -54 95 -71 -206 -56 -117 -118 46 -71 -150 11 84
8098H4Nk91J81m6K18j89J17J23k04p5j61L32j09n2m3J56l8j27K27N5k14N7l6j42
$$ 84 89 -202 -21 -67 151 -38 79 202 -2 -77 -238 94 -15 -67 -110 46 8 -119 108 163 -51 6 -30 -172
8122a72Q4L9l0k7J41K6k60K35k42L90l35J85q3jL8P6j02j5L9J9J34N8l60L16k36
$$ -172 -88 -49 -79 -106 35 61 -199 36 -206 184 -151 34 -49 -50 -12 64 -38 -53 -14 5 139 197 -163 153 -83
8147h3L5P5M2J36o0r2j74J76k1p5Q1q6OQ0n2n7R2k7r1K63j33J66l78J19K59j08
$$ -83 -48 27 69 205 145 53 -121 55 34 -41 40 -46 -40 40 -12 -69 23 -4 -95 168 35 201 -177 -58 201 93
8173I3k44K97m33K02K0j7j47J67J67l09J64J27k7O4k69o8J28K69
$$ 93 -151 146 -287 -85 -65 -82 -229 -62 105 -204 -40 87 60 124 -145 -213 -85 184
8191A84
$$ Imaginary data points
##PAGE= N=2
##DATA TABLE= (X++(I..I)), XYDATA
0@%%%%%%%%%%%qJ6j6J6k4L2l7M5n6O5p3Q8j05J26j49J74k00K29k66L05l48L96
$$ 0 0 0 0 0 0 0 0 0 0 0 0 -8 8 -8 8 -16 16 -21 24 -32 33 -40 48 -57 69 -80 94 -106 123 -143 162 -186 210
33B10m49N10n76O47p24Q08r02J006j120J244j378J525j685J860k053K262k491
$$ 210 -239 271 -305 342 -382 426 -476 530 -590 654 -724 801 -884 976 -1077 1185 -1306
50a306K745l024L333l677M061m492M977n535O183o936P834q926J0283j2028J4360
$$ -1306 1439 -1585 1748 -1929 2132 -2360 2617 -2918 3265 -3671 4163 -4763 5520 -6508 7852
65G852j7658K2718l1542N1295j77799L8056K38260j79991N7998J68687j11425
$$ 7852 -9806 12912 -18630 32665 -145134 -107078 131182 -48809 9189 177876 66451
76F6451k52202Q8503J48814r4278k1341K31287l4987k10002N9506R9536j26610
$$ 66451 -185751 -97248 51566 -42712 -64053 167234 132247 -77755 -18249 81287 -45323
87d5323j745J54449j8552j59578K9794R2021j07344k9368K02690j4455j89175
$$ -45323 -47068 107381 88829 -70749 -40955 51066 -56278 -85646 117044 102589 -86586
98h6586M9624O6962j58286k3930K12842O0463j44459K7987J13287j73232j51260
$$ -86586 -36962 30000 -128286 -152216 60626 121089 -23370 4617 117904 -55328 -206588
109b06588J98496R7004j36456O7153J60473j17636j71015Q1888R0302j23726j1260
$$ -206588 -8092 88912 -47544 19609 180082 62446 -108569 -26681 63621 -60105 -71365
120g1365J91864k7662j64492P5230P2740j29836k4989J20631j0735j05968M0184
$$ -71365 120499 92837 -71655 3575 76315 -53521 -78510 42121 31386 -74582 -34398
131c4398Q7007q3219m1229J30871j3653j24870O2439O1811j01650q955J26908
$$ -34398 52609 -30610 -71839 59032 45379 -79491 -17052 44759 -56891 -65846 61062
142F1062R977r7531L7464Q5706j11523q3001J36072K4439j21664N7633J08511
$$ 61062 71039 -26492 10972 96678 -14845 -97846 38226 62665 -58999 -1366 107145
153A07145q7124r0730P6181M2318j12332j4267J32274k5595j04422Q1908O0594
$$ 107145 20021 -70709 5472 47790 -64542 -78809 53465 27870 -76552 5356 65950
164F5950j01600k1799Q1917r240o8422L6315P3937m9710l9219Q0095r436q3200
$$ 65950 -35650 -57449 24468 15228 -53194 -16879 57058 7348 -31871 48224 38788 -44412
176d4412M3184M1585o1175m056O2047q151n5851K4073N0325o2821m0622Q3734
$$ -44412 -1228 40357 -20818 -24874 37173 29022 -26829 -2756 47569 -15252 -55874 27860
188B7860n416q2258M9091O0945n8841l1952O1084J5863p5110m776Q1165k8581
$$ 27860 22444 -59814 -10723 50222 -8619 -40571 20513 36376 -38734 -43510 37655 9074
200I074o4120P0296L9154p0007n896N0779j4865m7246J7966M7661k7648k8505
$$ 9074 -55046 15250 54404 -15603 -21499 29280 14415 -32831 -14865 32796 5148 -23357
212b3357N1316J328n1013K0520J8389l3218j323K2861j684j4681R908K1749k5722
$$ -23357 27959 29287 -21726 -1206 17183 -16035 -17358 5503 3819 -10862 -954 20795 -4927
225d927j8520L6777j3205l7866L7636K2607l2457L124L1350l908l6988J014L7238
$$ -4927 -23447 13330 125 -37741 -105 22502 -9955 -6831 24519 20611 -16377 -15363 21875
238B1875k4173l0953M9091J5947m2274P307K5146j8336k6606O269K5841j2063
$$ 21875 -2298 -33251 15840 31787 -10487 -3180 21966 3630 -22976 -16707 9134 -2929
250b929j7284L3990Q036l0255P272P272j5191o74K857P581P513m620P070j225
$$ -2929 -20213 13777 21813 -8442 -1170 6102 -9089 -9763 -6906 675 8188 3568 10638 9413
264I413j2477M907r662r937K0717j173r638J7674L375j2016p189m06Q032j1268
$$ 9413 -3064 1843 -7819 -17756 2961 1788 -7850 9824 13199 1183 -6006 -6412 1620 -9648
278i648o736K9064J665j9376J3752N380j5961p787O87J1447k395j0300K0137O237
$$ -9648 -16384 12680 14345 -5031 8721 14101 -1860 -9647 -8960 2487 92 -10208 9929 16166
292A6166k0259K012L094p585j458l243J1129J1002j2923M495R779j3055m863K89
$$ 16166 -4093 -2081 1013 -6572 -8030 -11273 -144 10858 -2065 2430 12209 -846 -5709 -5420
306e420R37P897p090K915J6353j1485r025P804n256l086j231J199J3948m860q292
$$ -5420 -4483 3414 -3676 -761 15592 4107 -4918 2886 -2370 -5456 -6687 -5488 8460 3600 -4692
321d692J3597l616j2559L404R32L572o2n272J3368O88j6018N797L800q224L98
$$ -4692 8905 5289 -7270 -3866 -2934 638 576 -4696 8672 9360 -6658 -861 2939 -5285 -4887
336d887N47P009L516j1600O768O967j3723O05O146k239L202l667K217Q705j1142
$$ -4887 -4340 2669 6185 -5415 1353 8320 -5403 -4798 1348 -891 2311 -1356 861 9566 -1576
351a576l367Q932m727j811R67k06P997p254p277J3875l247j1597Q063N024j167
$$ -1576 -4943 3989 -738 -2549 -1582 -1788 6209 -1045 -8322 5553 2306 -9291 -1228 3796 2629
366B629m253j136J2445p178j4012J5768L412j4163O022P360l472o146l138Q228
$$ 2629 -1624 -2760 9685 2507 -11505 4263 7675 -6488 -466 6894 3422 -2724 -5862 2366
380B366l477j0608J3514M361j1661P191J876q296L102j0J12L453N07N017m611
$$ 2366 -1111 -11719 1795 6156 -5505 1686 3562 -4734 -1632 -1642 -1530 1923 2430 7447 2836
395B836n276J1076p545j2120J6885J447j5767O610J0325o061j1624N181J4153
$$ 2836 -2440 8636 1091 -11029 5856 7303 -8464 -1854 8471 2410 -9214 -4033 10120
408A0120j6443j3209K5555J198k2421J5174J6613j5272j1583R940P811j6666k899
$$ 10120 -6323 -19532 6023 7221 -15200 -26 16587 1315 -10268 -328 7483 -9183 -12082
421a2082K8188l409k0514J6513M287k4126R15J4191k610o348R575J0793j7069
$$ -12082 16106 12697 -7817 8696 12983 -11143 -10228 3963 1353 -4995 4580 15373 -1696
434a696r934J9559r397j9330K3619Q692k1852M556J8243r589j8425J2029J8451
$$ -1696 -11630 7929 -1468 -20798 2821 11513 -10339 -5783 12460 2871 -15554 -3525 14926
447A4926k4196j1006L5872l050l0774K2046K1387k7821j3181K4788M893k8833
$$ 14926 -9270 -20276 15596 12546 -18228 3818 25205 -2616 -15797 8991 13884 -14949
459a4949N740L5594j7948k7339K9995N919l6938N821K6679j3942j7991K0595J5738
$$ -14949 -9209 26385 8437 -18902 11093 17012 -19926 -14105 12574 -1368 -19359 1236 16974
472A6974k7483n865L1795j4261k8889K8819J4128k8756P970L0626j2657k6857
$$ 16974 -10509 -16374 15421 1160 -27729 1090 15218 -13538 -5568 25058 12401 -14456
484a4456J6137J6947l2404o319M6148o416l6702K5343J6720m1895j1291L7849
$$ -14456 1681 18628 -13776 -20095 26053 19637 -17065 8278 24998 -16897 -28188 9661
496I661K985l2430J5000L4041l4733l0105M2512P408l8808J8583L4611k7832k6568
$$ 9661 12646 -19784 -4784 29257 -5476 -35581 6931 14339 -24469 -5886 28725 893 -25675
509b5675K7896J5064l1973N495M2902k1836l7602L0206J0260l6687J3188M0459
$$ -25675 2221 17285 -14688 -9193 33709 11873 -25729 4477 14737 -21950 -8762 31697
521C1697j5951l1097J8847J1286m0989j467N2581q730l5621L0995J2079n0198
$$ 31697 15746 -15351 3496 14782 -26207 -27674 24907 16177 -19444 11551 23630 -26568
533b6568o860M4499q73k9927K5035L0568m5118k6907M6740K188l8408K9715L5520
$$ -26568 -33428 11071 10198 -19729 5306 35874 -9244 -36151 10589 12777 -25631 4084 39604
546C9604l6760k7077L1091P719l5812J3227M5660k6294l5924L2223M452m1615
$$ 39604 2844 -24233 6858 14577 -21235 -8008 37652 11358 -24566 7657 12109 -29506
558b9506J5084M1006j7641k6552K2723Q945m1697P00M8926j2140l0001L5430J0398
$$ -29506 -14422 26584 8943 -17609 5114 14059 -27638 -26938 21988 9848 -20153 15277 25675
571B5675m8291r00M1034q667k7294K8933K5403m4974j8724M4612p174l8379L2878
$$ 25675 -22616 -23516 17518 8851 -18443 10490 35893 -9081 -27805 16807 9633 -28746 4132
584D132L0319l8821j9124L3143q8l7029J7280M1242k7221k7542L5689J283m1092
$$ 4132 34451 -4370 -23494 9649 9561 -27468 -10188 31054 3833 -23709 11980 13263 -27829
597b7829J5986L5512j8803k0044K5646P243l7730Q03L9444j5001k4970L3493P731
$$ -27829 -11843 23669 4866 -15178 10468 17711 -20019 -19216 20228 5227 -19743 13750 21481
610B1481l9999K549L1626j2786k1475K6275J8653l6839j0121L7362j1495l1016
$$ 21481 -18518 -15969 15657 2871 -18604 7671 26324 -10515 -20636 16726 5231 -25785
622b5785L1210K1719l4582r405K9231n584l0692J7534L2207k5438j9190L3113
$$ -25785 5425 27144 -7438 -16843 12388 6804 -23888 -6354 25853 415 -18775 14338
634A4338l015l5895J6068K7823j8561j3486K3698M327l1458J995L0003j4505j8568
$$ 14338 11323 -24572 -8504 19319 758 -12728 10970 15297 -16161 -14166 15837 1332 -17236
647a7236K8935M877l1051M829K2125j2882j4611K1417J1907k6623m273K7592j2185
$$ -17236 11699 16576 -14475 -9646 12479 -403 -15014 6403 18310 -8313 -12586 15006 2821
660B821k1807K5732J2249k6315k428K0750p652k1258J4204K1252k0689j1180K5990
$$ 2821 -18986 6746 18995 -7320 -9748 11002 3350 -17908 -3704 17548 -3141 -14321 11669
673A1669n293k6261J4392J7832j5421o493J8359K507k1083K404K0520j1849j2902
$$ 11669 6376 -19885 -5493 12339 -3082 -9575 8784 11291 -9792 -7388 13132 1283 -11619
686a1619K1981K144k0626N719J3395j1369q974J2409O167j6642j242J8302j0079
$$ -11619 10362 12506 -8120 -2401 10994 -375 -9349 3060 9227 -7415 -8657 9645 -434
699d34j3824J7646M545j7501K970J3123o169j0787R827J1690j3704n328J8085
$$ -434 -14258 3388 7933 -9568 -6598 6525 356 -10431 -604 11086 -2618 -7946 10139
712A0139m455j5889J1322Q941j1662k505J0768Q29j1962J278J1394q728q456J3002
$$ 10139 5684 -10205 1117 10058 -1604 -4109 6659 7488 -4474 -3196 8198 -530 -8986 4016
726D016P44j1404N185O010o373m137M841L074p148k94J0579m884o906J0187J88
$$ 4016 4760 -6644 -1459 4551 -1822 -5959 -1118 1956 -5192 -5486 5093 209 -6697 3490 3678
741C678q759M394N031l277l186M564M942p280k282R409m146q709P558K555p008
$$ 3678 -5081 -687 4344 1067 -2119 2445 7387 107 -2175 7234 3088 -5621 1937 4492 -2516
756b516L09M405m11n445p15O069m509m920P902M24n183M185J800k251l71N57K506
$$ -2516 -2207 2198 1787 -3658 -4373 1696 -2813 -7733 169 593 -4590 -405 1395 -856 -1227 -670 1836
773A836j027j332N268j223l385M269j613l458K810j238j394N67k43J475j962k080
$$ 1836 809 -523 4745 3522 137 4406 2793 -665 2145 907 -487 80 -163 1312 -650 -2730
789b730L716k826l517M895q09k029L067M05J00q93j328L151j018k784M846J00
$$ -2730 986 -1840 -5357 -462 -1271 -3300 -233 172 272 -621 -1949 1202 184 -2600 2246 2346
805B346k242K742q46r85O10k493J767O04k378K397K21k497J782j583j240J914
$$ 2346 104 2846 2000 1015 1625 -868 899 1503 -875 1522 1743 -754 1028 -555 -1795 119
821A19k556L98K689k218J090P92j724J502j330j325L510j629m86L251j115L1J096
$$ 119 -2437 -2039 650 -1568 -478 314 -1410 92 -1238 -2563 947 -682 -1168 2083 968 999 2095
838B095j906J297k81k015L086q27j928K378j358j033N34j967J054M31k313K199
$$ 2095 189 1486 1205 -810 2276 1449 -479 1899 541 -492 42 -1925 -871 -440 -2753 -554
854e54M70j733J978p93r12K065j591N04K155j870J390N88j566J949j520j367K768
$$ -554 -84 -1817 161 -632 -1544 521 -1070 -566 1589 -281 1109 1697 131 2080 560 -807 1961
871A961j695j701K882j167r27L52o41J577j840j285L763j619k632M131o1k305
$$ 1961 266 -1435 1447 280 -647 -295 -936 641 -1199 -2484 1279 -340 -2972 1159 1098 -1207
887a207J546J65J59j360o92L405j701j988M258j252l081K528q9j898O53O22J044
$$ -1207 339 504 663 -697 -1389 2016 315 -1673 2585 1333 -1748 780 691 -1207 -554 68 1112
904A112j803m11L307k617k257M750j156l738L262J070k765p7K313J539l661q72
$$ 1112 -691 -1102 2205 -412 -2669 2081 925 -2813 449 1519 -1246 -1323 990 2529 -1132 -2004
920b004N670m071m237O453R26m845K559K829k138m094J894M263m715j700P612
$$ -2004 3666 -405 -4642 1811 2737 -2108 451 3280 1142 -2952 -1058 3205 -1510 -3210 4402
935D402j886o375M668J165m697k80M018K65m196J530N754n323l123P983j265o748
$$ 4402 2516 -3859 809 1974 -2723 -3003 1015 1280 -2916 -1386 4368 -955 -4078 3905 2640 -4108
951d108M551L152m836j173N288J422o585P34O773o573n589R085J308p897L903
$$ -4108 443 3595 -1241 -2414 2874 4296 -2289 -1555 5218 -1355 -6944 2141 3449 -4448 -545
966e45N750n301n800N009M126p510J77J1001m113q161P550K218q592O86P965j104
$$ -545 5205 -96 -5896 -887 3239 -4271 -4094 6907 2794 -5367 2183 4401 -4191 -3505 4460 3356
982C356p120L833O381q652l641J0975k231q870O392M495p664j999Q005P37q485
$$ 3356 -3764 69 6450 -2202 -5843 5132 2901 -5969 423 4918 -2746 -4745 3260 3997 -4488
997d488K877Q305q917n827J1211O18r094N523P085p367o405P215L163r521K166
$$ -4488 -1611 6694 -2223 -8050 3161 3779 -5315 208 7293 -74 -6479 736 3899 -5622 -3456
1012c456J2259o138r177R191K025j0785J966J0047k654q047O059N955j1438k549
$$ -3456 8803 2665 -6512 2679 4704 -6081 -4115 5932 3278 -4769 1290 7245 -4193 -6742
1026f742J2627l305r581Q475M834j0185j637R042l81r410M976Q871j0030n089
$$ -6742 5885 2580 -7001 1474 6308 -3877 -5514 3528 3147 -6263 -1287 7584 -2446 -7535
1040g535J2731j228j0550O508P627q461n177R348K208j0952K234J2038q143q634
$$ -7535 5196 3968 -6582 -74 7553 -908 -6085 3263 5471 -5481 -3247 8791 648 -7986
1054g986J1762J762j1623K759R611n272p927Q280N717j1372j786J2706m974j0091
$$ -7986 3776 5538 -6085 -3326 6285 1013 -6914 1366 7083 -4289 -6075 6631 1657 -8434
1068h434R911N128r975p81R174k512j0082N546Q998r506k923J2955k959j1985
$$ -8434 1477 6605 -3370 -4151 5023 2511 -7571 -2025 6973 -2533 -5456 7499 4540 -7445
1082g445O352O495q327k217J0878J376j1457K156R283r657o375J3025J658j0505
$$ -7445 -1093 5402 -2925 -5142 5736 7112 -4345 -2189 7094 -2563 -8938 4087 5745 -4760
1096d760L738P529q002p089Q320N429r578M81J1534o497r683J0094M114r467J592
$$ -4760 -1022 6507 -1495 -8584 -264 5165 -4413 -3932 7602 1105 -8578 1516 5630 -3837 -2245
1111b245Q732l532q980N474P029q460j689J1615l717j1090O010M559p827p51R937
$$ -2245 6487 2955 -6025 -551 6478 -1982 -3671 7944 4227 -6863 -853 3706 -4121 -4872 5065
1126E065J95r503K234O529q883m450J1857J287q630M947N566p516n293P181L340
$$ 5065 5260 -4243 -2009 4520 -4363 -8813 3044 4331 -4299 648 6214 -1302 -6595 586 3926
1141C926p999K053R926o118p006Q368J419q820K057P214l514n932N457M832p876
$$ 3926 -4073 -2020 7906 1788 -5218 3150 4569 -4251 -2194 5020 1506 -4426 1031 5863 -2013
1156b013j592Q371l789p900O551L123o135M62O220q14o718K412N411o686k537
$$ -2013 -3605 4766 977 -6923 -372 2751 -3384 -2922 3298 2484 -4234 -1822 3589 -3097 -5634
1171e634R524n03o267M611L975n918l200N365J096o125K028P117m856m278O010
$$ -5634 3890 3387 -2880 1731 5706 -212 -3412 1953 3049 -3076 -1048 6069 1213 -3065 2945
1186B945l30p497J834M626k546k880M563L327o244j288N708l139m446O089K357
$$ 2945 2615 -4882 -3048 1578 -968 -3848 715 4042 -2202 -3490 2218 -921 -5367 722 3079
1201C079l866O93L743j395m622J731L802m151j263O289j763m276L492J337m283
$$ 3079 -787 -94 3649 2254 -2368 -637 3165 -986 -2249 4040 2277 -1999 1493 2830 -1453
1216a453j239L078K82l529J165M783l260k595M535j014m609K194K501j435p63
$$ -1453 -2692 386 668 -2861 -1696 3087 -173 -2768 1767 753 -3856 -1662 839 -596 -1359
1231a359K360K010l628r50L591k130k521M157Q57k423P92J463r22k533M12K126
$$ -1359 1001 3011 -617 -1567 2024 -106 -2627 1530 2387 -36 756 2219 1297 -1236 -824 1302
1247A302k419o98L758j372k561K360R6k319l8J354M31j469P29K944j962j294K717
$$ 1302 -1117 -1815 1943 571 -1990 370 466 -1853 -1891 -537 -106 -1575 -846 2098 136 -1158 1559
1264A559j021k100J799R53m78l5O12J008k087r83J927j588j272K434n64j046R80
$$ 1559 538 -1562 237 1190 712 677 1289 2297 210 -773 1154 -434 -1706 728 164 -882 98
1281I8k87k21o24l35J549r08o04K108m58r07J363p65j90L16r7M74l6k77J045o89
$$ 98 -189 -410 -1034 -1369 180 -728 -1332 776 318 -589 774 9 -181 135 38 512 476 199 1244 555
1301E55r73J433r56p35J178q18J29M75j022J020n33o96J002m44q77J572m57k36
$$ 555 -418 1015 59 -676 502 -316 -187 288 -734 286 -247 -943 59 -385 -1262 310 -147 -383
1319c83O98o02L79K49q63R41j11o41J053l19m25R65q21J80K30r58K40L01p12R06
$$ -383 315 -287 92 341 -522 419 308 -333 720 401 -24 941 120 300 530 -428 -188 113 -599 307
1339C07l59k65P04o97n55R39p75Q2P62n59N90M24p61Q82o64l38Q35o01P4P63n26
$$ 307 -52 -317 387 -310 -865 74 -701 -619 143 -416 174 598 -163 719 55 -283 552 -49 25 788 262
1360B62L36N5j091O32m73q01J145l19k63R16o61k69O07r42J57L99m63J203P2n11
$$ 262 598 653 -438 194 -279 -1080 65 -254 -517 399 -262 -531 76 -866 -709 -310 -773 430 502 -9
1380iJ220q40p27P54l18l61P68j56O31j61r68P90r04j236J532k37o56J593j23
$$ -9 1211 371 -356 398 80 -281 487 331 962 801 -167 623 -281 -1517 15 -222 -878 715 592
1399E92m49k45m14K83p94k37J800l17m31J546n71j129L07r0p4k1K48J268p37m11
$$ 592 143 -102 -516 -233 -1027 -1264 536 219 -212 1334 763 -366 -59 -149 -223 -244 4 1272 535 124
1419A24J280j427r31J087l87p53Q16O41L62q90N3O89j572j273K135m54m38K259
$$ 124 1404 -23 -954 133 -254 -1007 -191 450 812 -78 -25 664 -908 -2181 -46 -500 -938 1321
1437A321K92j331o91Q7r9j317P08L112q81j015J787j087k277M17J293p14j02J182
$$ 1321 1613 282 -409 -322 -421 -1738 -1030 2082 1201 186 1973 886 -1391 -974 319 -395 -497 685
1455F85O36j870n45K166j605j465K325l3j791N82J914k50j212J012J323k558j257
$$ 685 1321 -549 -1094 1072 -533 -1998 327 294 -1497 -915 999 749 -463 549 1872 -686 -1943
1472a943K721p87j052L042R74k300j198L66n18j915J491L534j434j148K447j859
$$ -1943 778 -9 -1061 1981 2955 655 -543 -177 -695 -2610 -1119 2415 981 -167 2280 421
1488D21l348J262J897o97k15K171Q35l046p92K685k027j448L474J38k556R02J776
$$ 421 -2927 -1665 232 -465 -680 1491 2326 -720 -1512 1173 -854 -2302 1172 1310 -1246 -344 1432
1505A432r50j608J705J340l151n06L270j151k141L086J574l233n50J474j081k319
$$ 1432 482 -1126 579 1919 -1232 -1738 1532 381 -1760 1326 2900 -333 -883 591 -490 -2809
1521b809K085L377k631j078L315j722l719J946J882j762k28K905Q19l200J25K649
$$ -2809 -724 2653 22 -1056 2259 537 -3182 -1236 646 -1116 -1344 1561 2380 -820 -695 1954
1537A954k630j952L654M94k854J656K037j746k143J703J366l363K39L756j502
$$ 1954 -676 -2628 1026 1520 -1334 322 2359 613 -1530 173 1539 -1824 -1585 2171 669
1552F69k591L183N78l304R7K294o66k387J765K684l149p48L598j183l151K152
$$ 669 -1922 1261 1839 -1465 -1368 926 260 -2127 -362 2322 -827 -1575 2023 840 -2311 -159
1568a59J528k655l52L370J63k966R07K729l217j948L670J85k811J955K330k265
$$ -159 1369 -1286 -1638 1732 1895 -1071 -164 2565 -652 -2600 1070 1255 -1556 399 2729 464
1584D64k061J856Q42l190N35L788k098k094L043L00l379P19K410j054k057K045
$$ 464 -1597 259 1101 -2089 -1554 2234 136 -1958 1085 1385 -1994 -1275 1135 81 -1976 69
1600F9J868k970j38L432j535k714K866Q82k661m73K809l77k454J431K413l208
$$ 69 1937 -1033 -1171 2261 726 -1988 878 1760 -901 -1374 1435 1058 -1396 35 2448 -760
1616g60j427L456m62l032K032J849k024j141K162N16l070P48L020j838j954L158
$$ -760 -2187 1269 807 -2225 -193 1656 -368 -1509 653 1169 -1901 -1153 1867 29 -1925 1233
1632A233J82k794J218J835j382j920J792J511k553K13L167j782k559K722N01k674
$$ 1233 1415 -1379 -161 1674 292 -1628 164 1675 -878 -665 2502 720 -1839 883 1384 -1290
1648a290J49K290n66k019J415J734k802p10L095r81k199J723J175j697n18K275
$$ -1290 -1141 1149 583 -1436 -21 1713 -1089 -1799 1296 315 -1884 -161 1014 -683 -1201 1074
1664A074K04k169L34J965j935q25K412K79j849R00J383j843j452J424R22j842
$$ 1074 1278 -891 -557 1408 -527 -1352 1060 1339 -510 390 1773 -70 -1522 -98 824 -1018
1680a018K07K380j093j909J862l3k066L31J858k23j206J079J329j992o18K521
$$ -1018 -811 1569 476 -1433 429 396 -1670 -1339 519 296 -910 169 1498 -494 -1112 1409
1696A409j014j387J372N48j334j20J356Nj489K29J410j723q31K419k69j258J110
$$ 1409 395 -992 380 928 -406 -526 830 835 -654 -425 985 -738 -1569 850 581 -677 433
1713D33M30j150q97P40O10j031L29J837j019j118J302k97j240Q01O54j02m56M87
$$ 433 863 -287 -1184 -444 166 -865 -536 1301 282 -836 466 169 -1071 -270 384 282 -174 313
1731C13N97j506p9J374o10p91J155j08o38P9O73r3o62J03O98j066o51J610j92
$$ 313 910 -596 -675 699 89 -702 453 345 -293 -214 459 366 -296 -193 505 -561 -1212 398 206
1750B06n93Q18J83p28m66L19k1j34K30J256p05m55P14l27r63M46M50Q7k86Q0M19
$$ 206 -387 431 614 -114 -580 -261 -282 -416 -186 1070 365 -90 624 297 -666 -220 230 317 31 111 530
1771E30p92k78Q77l57o00R93l03l20K46RK20l79j6N70m74m36Q11j36k83N26l25
$$ 530 -262 -540 337 -20 -620 373 70 -250 -4 5 225 -154 -170 400 -74 -510 301 165 -118 408 83
1792H3m93L8K1M23k34k5N70m15m66O87k68r2K57j47K58J13m01J22J2p3L14j28
$$ 83 -410 -372 -351 72 -162 -187 383 -32 -498 189 -79 -171 86 -61 197 310 -91 31 43 -30 284 156
1814A56k40L29k73j86J85K3M6Nl91N71l92q2N64m90P7L80n57M11n3k24L42j54
$$ 156 -84 245 -28 -214 -29 -6 40 45 -346 225 -167 -249 315 -175 -98 282 -275 136 83 -141 201 47
1836D7l67M19m0l74O30p8l37L74k47J27j04m27L01J40j82L57k67q0K55l59N1L5
$$ 47 -320 99 59 -315 315 237 -100 274 27 154 50 -377 -76 64 -118 239 -28 -108 147 -212 -161 -126
1858a26k10N9M18m16N22m18p3L15n4j75M21l31R7K65j38O1j09k37J28K5n8K59
$$ -126 -336 -277 141 -275 247 -171 -244 71 17 -158 263 -68 29 294 156 217 108 -129 -1 24 -34 225
1880B25m14mM12m43J11m8l81K23K15j56M84j57j25J67k09j66K92m7N44j18j70
$$ 225 -189 -193 219 -224 -113 -161 -542 -319 -104 -260 224 67 -58 109 -100 -266 26 -21 523 405 235
1901B35K81m85p1J81m05J48L78l53K54N1j84o9j2l66N22k48PO47n52j30L33o9
$$ 235 516 31 -40 141 -264 -116 262 -91 163 214 30 -39 -51 -417 105 -143 -136 511 -41 -171 162 93
1923I3k19K91j76L72m91j47O97m86l9O42n76l96M40P7j37q2K10L62l60k40N60
$$ 93 -126 165 -11 361 -130 -277 420 -66 -105 537 -39 -435 5 82 -55 -137 73 435 75 -165 395
1944C95q70q0O81j3o0J32O4k33l39k51Q63m58k0P36n05q7L06J52m69J5K76P5m63
$$ 395 -475 -555 126 113 53 185 249 16 -323 -574 289 -169 -189 547 42 -45 261 413 -56 -41 235 310 -153
1967a53J47N18p87J3O61m20l84L83n1k47J9K96M52p23J35P49r97k04R46k4o26
$$ -153 -6 512 -275 -262 399 -21 -405 -22 -73 -320 -301 -5 447 -276 -141 608 -389 -593 353 329 -297
1988b97O06J14m53n70N30L62o73l8J006o28o07J028k83p45L72M05r4l99K38N02
$$ -297 309 423 -30 -600 -70 292 -381 -419 587 -41 -648 380 97 -648 -276 129 35 -364 -126 376
2008C76o33k17J189n94m43O11J65n55r6P64k0p77J10Q06p55m57J146n45m15M68
$$ 376 -257 -474 715 121 -322 289 454 -101 -197 567 547 -230 -120 686 -69 -526 620 75 -340 128
2028A28J03j14o00N68R0n40J48R03n19q10J041r8p76M60M12k95m39L17P29j106
$$ 128 231 117 -483 85 175 -365 -217 686 167 -643 398 300 -476 -16 396 101 -338 -21 708 -398
2048c98j80J643p44o74O38K07r30J49M17q5m67J29J027j054m34J201l18j187J086
$$ -398 -578 1065 321 -353 285 492 -438 -289 128 43 -424 -295 732 -322 -756 445 127 -1060 26
2067B6L30n25j14N41K66o79J54Q66q16n11J190q5p68K05M12m00m51J55O69q27
$$ 26 356 -169 -283 258 524 -155 -1 865 49 -462 728 643 -125 80 492 92 -359 -204 465 -362
2087c62j87R88m42p63Q09M95r05K0O57j42p06K55R02n64k46R38n41r88Q53K23
$$ -362 -549 439 -3 -766 43 538 -367 -347 310 168 -538 -283 619 55 -191 747 206 -782 71 294
2107B94m01j29P03m4n68p6P41q40m40J260k42o43Q6P48o31l05P19M7o15k15J064
$$ 294 -107 -236 467 423 -145 -221 520 -320 -760 500 258 -385 -299 449 -182 -487 232 279 -336 -551 513
2128E13m67m44P09K29q61O9M78j18n97K53J091q20j30Q09n17o23N00J75k95j34
$$ 513 46 -398 311 540 -321 -252 226 108 -489 -236 855 35 -95 714 197 -426 74 249 -46 -180
2148a80M40J1j005L55Q48p97m60J036j71p01N28L51m32K3L38J95r16K47R47q56
$$ -180 260 271 -734 -379 469 -328 -788 248 77 -624 -96 255 -177 -154 184 379 -537 -290 657 -199
2168a99n7R12j33p81L9J66O6k92M77N97j065j24O85n88n38J065j13k05M6l3O3
$$ -199 -256 656 523 -258 -219 -53 13 -279 198 795 -270 -394 291 -297 -835 230 117 -88 -42 -75 -12
2189a2k04M4P04l02k71L43k07m66M40N38l77n1p1k04l37K0P20l15K04M29r1q92
$$ -12 -216 -172 532 230 -41 302 95 -371 69 607 230 179 108 -96 -433 -413 307 -8 196 625 534 -358
2211c58mK83k14K42K28L15o38l43M9j68o6O39K05k52K74j16j38j06j09M65l2q5
$$ -358 -362 -79 -293 -51 177 492 -146 -489 -440 -608 -674 -35 170 -82 192 76 -62 -168 -277 188 156 71
2233G1L94k52n23N05j12O2J79j2j66o41mN78l0j2L17k34l29q6o0K14J14K25N38
$$ 71 465 213 -310 195 83 145 324 312 146 -495 -499 79 49 37 354 120 -209 -295 -355 -141 -27 198 736
2256G36o99k09J12j66l4L99j3o5J45k65J28j49j12N29j19k82J98O1P5k00p9J13
$$ 736 37 -172 -60 -226 -260 139 126 61 206 -59 69 -80 -192 337 218 -64 134 195 270 70 -9 104
2278A04j00j49J83j78j70N43k28k04L50j75j33Qj49O2L15P3k6O5k6K01k26j39
$$ 104 4 -145 38 -140 -310 233 5 -199 151 -24 -157 -149 -298 -236 79 152 126 191 165 366 140 1
2300AM53l90M8p7j78J54J26k52M41l96j67M85m99j8N09n10J78L7N9Q0j51L0K46
$$ 1 454 64 112 35 -143 11 137 -115 326 -70 -237 248 -251 -269 240 -270 -92 -55 4 84 -67 -37 209
2323B09k07k0K87l29O2K14j04k00M9qJ19k24j28M19j56j9L77k62q8J4q1K59j83
$$ 209 2 -18 269 -60 2 216 112 -88 -39 -47 72 -152 -280 139 -17 -36 341 79 -9 5 -76 183 0
2346@j31K37k0l63J20l9k54N69r3Q2M5j71J04j03o6K28k14J85j3q7n8J12k66J49
$$ 0 -131 106 86 -277 -157 -196 -450 119 26 108 153 -18 86 -17 -83 145 -69 116 103 16 -42 70 -196 -47
2370d7J95l03L50j01k48J86k24q9L52j64j1K54k08j2J97k21R3j49K88J07k96P5
$$ -47 148 -155 195 94 -154 32 -192 -281 71 -93 -104 150 -58 -70 127 -94 -1 -150 138 245 -51 24
2392B4Q7k10J94%l69L10J6j36QJ39l51L00j24j7L7n0K1J62j95K66o9j72L74l72
$$ 24 111 -99 95 95 -274 36 52 -84 -76 63 -288 12 -112 -129 -92 -142 -121 41 -154 112 43 -129 245 -127
2416a27K98P9k72R0j44J39J34j30Q2j44J73k58j6M9K5J53l02R6J17jN5l8j77J87
$$ -127 171 250 -22 68 -76 63 197 67 149 5 178 -80 -96 -47 -22 131 -171 -75 42 41 96 58 -119 68
2440F8k3j21m4K6m7J8J85J7j8k0Q9P3j54M7l21K04J29J07n5m14M74l12K00j80
$$ 68 45 -76 -120 -94 -141 -123 62 79 61 41 130 203 49 96 -225 -21 108 215 160 -254 220 -92 108 -72
2464g2J32k55K16R3k07L7o2N5m3k1k0J65j94J83J50ln9J23k50j02L48l66K56j47
$$ -72 60 -195 21 114 -93 -56 -118 -63 -106 -127 -147 18 -176 7 157 154 95 218 -32 -134 214 -152 104 -43
2488d3LJ41q3lP9l09J8J86J22n1K8n5K1L4q1O4j9k6L13k47j78J75l1j03j41N6
$$ -43 -40 101 18 15 94 -215 -197 -11 111 60 88 33 54 88 7 71 52 26 339 92 -86 89 58 -45 -186 -130
2514a30J42kM6K78k91n5K26k29j51K00j47P5M07j59q6j64k3Non3L26k13kJ16j20
$$ -130 12 10 56 334 43 -12 214 -15 -166 34 -113 -38 369 210 124 -40 -63 -58 -64 -117 209 -4 -6 110 -10
2539a0O8J55k76K96l26J5J93j85J65J03o8l41p8m8K41J02q4M59l47J35j45k12
$$ -10 58 213 -63 233 -93 -78 115 -70 95 198 130 -211 -289 -337 -96 6 -78 381 34 169 24 -188
2561a88n0J00P2J88J93j91K78m43R5j14j44K98M49m31K2m8l96K05L4p5J47R6k93
$$ -188 -238 -138 -66 122 315 124 402 -41 54 -60 -204 94 543 112 134 86 -310 -105 -71 -146 1 97 -196
2584a96L74o61K47L96j41k8J1k43K26j72L48L33l50p9q6l7j57Q5O5L03n1j15p2
$$ -196 178 -483 -236 160 19 -9 2 -241 -15 -187 161 494 144 65 -21 -58 -215 -130 -65 238 187 72 0
2607@p3k22K09k8J31J24j65J48j53m5j39K73j64J39N2p6N3l3Pn0M13m60Q0k0l4
$$ 0 -73 -295 -86 -114 17 141 -24 124 -29 -74 -213 60 -104 35 87 11 64 31 38 -12 401 -59 21 1 -33
2632c3K74k08K42k11On7k93J94J98j75J10j12j30J61k31J96K4j75J30J89l09M90
$$ -33 241 33 275 64 70 13 -280 -86 112 -63 47 -65 -195 -34 -265 -69 -45 -220 -90 99 -210 280
2654B80p3k15q1J26j25m4J38p3K35k62J12J41j97K9j12J70J83j21m9M4j53p7j67
$$ 280 207 -8 -89 37 -88 -132 6 -67 168 -94 18 159 -38 -9 -121 49 232 111 62 106 -47 -124 -291
2677b91M6M69o1k02K32k45P2l7k6J93n4J27k43o5R0j69K77j55J41rr5R3j69J00
$$ -291 -245 224 163 -39 193 -52 20 -17 -43 150 96 223 -20 -85 5 -164 113 -42 99 90 -5 88 -81 19
2701A9K00k42K72k65j53r1L70k16K76j55j66M99l84q1K24l26L21kk70K14p8k49
$$ 19 219 -23 249 -16 -169 -260 110 -106 170 15 -151 348 -36 -117 107 -219 102 100 -170 44 -34 -283
2723b83K27R1k50M36j29m03L75m8K7k16J72K46j70k28K38j40o1K44k30O4L12k77
$$ -283 -56 35 -215 221 92 -311 64 16 43 -173 -1 245 75 -153 85 -55 -116 128 -102 -38 274 -3
2745cj07J53j66Q6J02l19L97j93j58K90l55K11J36n9q8K88k53J46j19j85K08N9
$$ -3 -110 43 -123 -37 65 -254 143 -50 -208 82 -273 -62 74 15 -73 215 -38 108 -11 -196 12 71
2767G1j2l0%m1K22m51M06J3j92o9J14j11J50p4Q0m0m9j12R8j42N6K15l9m0k2J70
$$ 71 59 29 29 -12 210 -241 165 178 -14 -83 31 -80 70 -4 76 36 -13 -125 -27 -169 -113 102 63 23 1 171
2793A71j34p5k2P6q5J40j43K36m1J13j76j80J06m5J13j56J25J51j61J76k73K05
$$ 171 37 -38 -60 16 -69 71 -72 164 123 236 60 -120 -14 -59 54 -102 23 174 13 189 -84 121
2815A21j99J03n5j27L75k42J81k91p9K85n2l1j23K47r3o9q6J25l00N39j67k73
$$ 121 -78 25 -30 -157 218 -24 157 -134 -213 72 20 -11 -134 113 20 -49 -135 -10 -310 229 62 -211
2837b11K04K12j50M9j19p1P2j64K22j08K2O0q3j5J95l28J57o6j28L65j07R1J9
$$ -211 -7 205 55 104 -15 -86 -14 -178 44 -64 -42 18 -65 -80 115 -213 -56 -122 -250 115 8 99 118
2860A18Q1n00M79k88j29L07k1J4J56p8o2r2j62K84j14J73qN4j32r8j42J51j15
$$ 118 199 -301 178 -110 -239 68 47 61 217 139 77 -15 -177 107 -7 166 158 212 80 -18 -160 -9 -124
2883a24m1j96M68l8k3j06K67k77M3L18m61R9o0K04L1r3k0J8l85K84J02K5N0j34
$$ -124 -165 -361 107 69 46 -60 207 -70 -27 291 -170 -71 -131 73 104 11 -9 9 -376 -92 10 35 85 -49
2907d9L0J20k24L06k36r0K58p2o1P2j70K13j30L9J08k53J79n5j6kJ22j61J57j11
$$ -49 -19 101 -123 183 -53 -143 115 43 -18 54 -116 97 -33 6 114 -139 40 -15 -31 -33 89 -72 85 -26
2931b6j26J30jr8J86P3j28P8O0j48J71l00j7R2K03P4l38L5J25k38J71l20K49R2
$$ -26 -152 -22 -23 -121 65 138 10 88 148 0 171 -129 -146 -54 149 223 -115 -80 45 -193 -22 -342 -93 -1
2955aJ5R9j30L5R4j36k49K63J04J5k74J85J17r3l1j1q6J30l12M77j06l13J15o
$$ -1 14 113 -17 18 112 -24 -273 -10 94 109 -165 20 137 44 13 2 -84 46 -266 211 105 -208 -93 -99
2979i9O5j66K32q0k4q7M92m10K20j59m3j25K47N6k23M4q0L29r6m8j29Q9L0k39
$$ -99 -34 -200 32 -48 -72 -159 333 -77 143 -16 -59 -184 63 119 -104 -60 -140 189 93 45 -84 5 35 -204
3003b04O0J54J05o2Q9ok73J75K2M4p2K3j75K13l9o0p7K57k99J95q8j83L05J05
$$ -204 -144 10 115 53 142 136 -137 38 60 104 32 55 -120 93 54 -6 -83 174 -125 70 -18 -201 104 209
3027B09k92J00j09J66k17N8J2J11L9j00R7l9N6k84L38k90K46k37J86j33K41k50
$$ 209 -83 17 -92 74 -143 -85 -73 38 77 -23 74 35 91 -193 145 -145 101 -136 50 -83 158 -92
3049i2K06l9J07j15P4k73J61j1l3p4n6K48J2M5J18m92J07K90r1j66L18l45j93
$$ -92 114 75 182 67 141 -132 29 18 -15 -89 -145 103 115 160 278 -214 -107 183 92 -74 244 -101 -294
3072b94K41n8L10j15k3oo8k38J73j26K15Q1L4K9k17j19K42j81J20N2n0n2K08j71
$$ -294 -53 -111 199 84 61 55 -13 -251 -78 -204 11 92 126 155 -62 -181 61 -120 0 52 2 -50 158 -13
3096a3J38j51J04J0q4O6J57l37N2J03J23j66J56j82q2l3J94R3l45J86o9J13p6
$$ -13 125 -26 78 88 4 70 227 -110 -58 45 168 2 158 -24 -106 -139 55 148 -197 -11 -80 33 -43
3119d3J17j31k6Q8n1J22l11M8L21m22M21j8m32K30K25l29J05J51R8j35j6m4J50
$$ -43 74 -57 -83 5 -46 76 -235 -187 134 -288 133 115 -317 -87 138 -191 -86 65 163 28 12 -32 118
3142A18j72L4J81j60j02J73n4m10M28O5M3j06L6J5l79L07Ok9R2m8K30l74Q6P3
$$ 118 -54 -20 161 1 -101 72 18 -392 36 101 144 38 74 89 -290 17 23 -6 86 38 268 -106 -20 53
3166E3Kk34K35O1k39RP2N1n7M6J63j01r0j04J73j19R2J94j58j61J78k5k40P1J75
$$ 53 55 -179 56 117 -122 -113 -41 10 -47 -1 162 61 -29 -133 40 -79 13 207 49 -112 66 41 -199 -128 47
3191D7j09J77j15R4k51J04J71k02r0L80j10K6j60L30k20j1r0M4J56l44K67m1k4
$$ 47 -62 115 0 94 -157 -53 118 -84 -174 206 96 122 -38 292 72 61 -29 15 171 -173 94 53 29
3214B9o8J13Mp8J51k14j47J27J41r2oL3O5o7k2%l14J98K9L02k2j82R1q1j56K33
$$ 29 -39 74 78 0 151 -63 -210 -83 58 -34 -40 -7 58 -9 -31 -31 -345 -147 -118 184 162 -20 71 -10 -166 67
3240F7r1l14K50J44M3k15L1N9j09J45j67J24j9O9K7j64k5J24J70k83L35j03l2
$$ 67 -24 -338 -88 56 99 -116 -85 -26 -135 10 -157 -33 -52 17 44 -120 -145 -21 149 -134 201 98 66
$$ [...]
8191c1
##END NTUPLES=NMR FID
##END=
