##TITLE=31Pdec_Bay-i-VN
 DMSO+CDCl3, 24 sc
 23.12.2019
##JCAMPDX= 6.0         $$ Bruker NMR JCAMP-DX V2.0
##DATA TYPE= NMR SPECTRUM
##DATA CLASS= NTUPLES
##ORIGIN= UXNMR, Bruker Analytische Messtechnik GmbH
##OWNER= root
$$ XWIN-NMR		Version 3.5
$$ Mon Dec 23 14:02:38 2019 Russian Standard Time (UT+4h)  she@DPX200
##.OBSERVE FREQUENCY= 81.013821
##.OBSERVE NUCLEUS= ^31P
##.ACQUISITION MODE= SIMULTANEOUS
##.ACQUISITION SCHEME= undefined
##.AVERAGES= 24
##.DIGITISER RES= 17
##SPECTROMETER/DATA SYSTEM= spect
##.PULSE SEQUENCE= zgpg30
##.SOLVENT NAME= CDCl3
##.SHIFT REFERENCE= (INTERNAL, CDCl3, 0, 182.463)
##AUDIT TRAIL= $$ (NUMBER, WHEN, WHO, WHERE, WHAT)
$$ ##TITLE= Audit trail, XWIN-NMR		Version 3.5
$$ ##JCAMPDX= 5.01
$$ ##ORIGIN= Bruker BioSpin GmbH
$$ ##OWNER= she
$$ F:/spectra/data/she/nmr/P31/1/pdata/1/auditp.txt
$$ ##AUDIT TRAIL=  $$ (NUMBER, WHEN, WHO, WHERE, WHAT)
(   1,<2019-12-23 14:01:36.09 +0400>,<she>,<DPX200>,
      <created by zg, POWCHK disabled, PULCHK disabled
       configuration hash MD5:
       00 E9 B6 7A A2 85 ED C7 34 08 36 98 17 FE 4E 26
       data hash MD5: 32K
       B7 E2 4F 46 D7 E7 3B CF B8 7A 75 29 10 DA 8D C5>)
(   2,<2019-12-23 14:01:38.53 +0400>,<she>,<DPX200>,
      <Start of raw data processing
       efp BC_mod = 2 LB = 1 FT_mod = 6 PKNL = 1 PHC0 = -1602.123 PHC1 = -43.99883 SI = 64K 
       data hash MD5: 64K
       09 1A AF 4E 5A 0C E3 0D A9 85 0D E8 18 48 75 BC>)
(   3,<2019-12-23 14:02:13.48 +0400>,<she>,<DPX200>,
      <pk PHC0 = -94.7886 PHC1 = 143.4 
       data hash MD5: 64K
       BA D6 E8 CA 2F A7 A8 E0 07 66 DF BE D9 AB C8 85>)
$$ ##END=
$$ 
$$ hash MD5
$$ E0 4D FA 85 95 87 DB 2B B2 55 9A ED 6A A6 FE 84
##$RELAX= 
##$RELAX= 
##$RELAX= 
##$RELAX= 
##$RELAX= 
##$RELAX= 
##$RELAX= 
##$RELAX= 
$$ Bruker specific parameters
$$ --------------------------
##$DU= <F:/spectra>
##$EXPNO= 1
##$NAME= <P31>
##$PROCNO= 1
##$TYPE= <nmr>
##$USER= <she>
##$AMP= (0..31)
100 100 100 100 100 100 100 100 100 100 100 100 100 100 100 100 100 100 
100 100 100 100 100 100 100 100 100 100 100 100 100 100 
##$AQSEQ= 0
##$AQ_mod= 1
##$AUNM= <au_zg>
##$AUTOPOS= <>
##$BF1= 81.014009
##$BF2= 200.13
##$BF3= 200.13
##$BF4= 200.13
##$BF5= 200.13
##$BF6= 200.13
##$BF7= 200.13
##$BF8= 200.13
##$BYTORDA= 1
##$CFDGTYP= 0
##$CFRGTYP= 5
##$CHEMSTR= <none>
##$CNST= (0..31)
1 1 145 1 1 1 1 1 1 1 1 1 1 1 1 1 1 1 1 1 1 1 1 1 1 1 1 1 1 1 1 1 
##$CPDPRG= <waltz16>
##$CPDPRG1= <>
##$CPDPRG2= <waltz16>
##$CPDPRG3= <>
##$CPDPRG4= <mlev>
##$CPDPRG5= <mlev>
##$CPDPRG6= <mlev>
##$CPDPRG7= <mlev>
##$CPDPRG8= <mlev>
##$CPDPRGB= <>
##$CPDPRGT= <>
##$D= (0..31)
0 1 0 0 0 0 0 0 0 0 0 0.03 2e-05 3e-06 0 0 0 0 0 0 0 0 0 0 0 0 0 0 0 0 
0 0 
##$DATE= 1577095295
##$DBL= (0..7)
120 120 120 11 120 120 24 19 
##$DBP= (0..7)
150 150 150 150 150 150 150 150 
##$DBP07= 0
##$DBPNAM0= <>
##$DBPNAM1= <>
##$DBPNAM2= <>
##$DBPNAM3= <>
##$DBPNAM4= <>
##$DBPNAM5= <>
##$DBPNAM6= <>
##$DBPNAM7= <>
##$DBPOAL= (0..7)
0.5 0.5 0.5 0.5 0.5 0.5 0.5 0.5 
##$DBPOFFS= (0..7)
$$ [...]
##$SUBNAM2= <"">
##$SUBNAM3= <"">
##$SUBNAM4= <"">
##$SUBNAM5= <"">
##$SUBNAM6= <"">
##$SUBNAM7= <"">
##$SUBNAM8= <"">
##$SUBNAM9= <"">
##$SW= 369.568048894756
##$SWIBOX= (0..15)
0 1 3 0 0 0 0 0 0 0 0 0 0 0 0 0 
##$SW_h= 29940.119760479
##$TD= 32768
##$TD0= 1
##$TE= 0
##$TE2= 300
##$TE3= 300
##$TEG= 300
##$TL= (0..7)
0 120 53 12 22 120 120 120 
##$TP= (0..7)
150 150 150 150 150 150 150 150 
##$TP07= 0
##$TPNAME0= <>
##$TPNAME1= <>
##$TPNAME2= <>
##$TPNAME3= <>
##$TPNAME4= <>
##$TPNAME5= <>
##$TPNAME6= <>
##$TPNAME7= <>
##$TPOAL= (0..7)
0.5 0.5 0.5 0.5 0.5 0.5 0.5 0.5 
##$TPOFFS= (0..7)
0 0 0 0 0 0 0 0 
##$TUNHIN= 0
##$TUNHOUT= 0
##$TUNXOUT= 0
##$USERA1= <user>
##$USERA2= <user>
##$USERA3= <user>
##$USERA4= <user>
##$USERA5= <user>
##$V9= 5
##$VALIST= <valist>
##$VCLIST= <CCCCCCCCCCCCCCC>
##$VD= 0
##$VDLIST= <DDDDDDDDDDDDDDD>
##$VPLIST= <PPPPPPPPPPPPPPP>
##$VTLIST= <TTTTTTTTTTTTTTT>
##$WBST= 1024
##$WBSW= 4
##$XGAIN= (0..3)
0 0 0 0 
##$XL= 0
##$YL= 0
##$YMAX_a= 4065
##$YMIN_a= -13004
##$ZGOPTNS= <>
##$ZL1= 120
##$ZL2= 120
##$ZL3= 120
##$ZL4= 120
##$ABSF1= 0
##$ABSF2= 0
##$ABSG= 0
##$ABSL= 0
##$ALPHA= 0
##$AQORDER= 0
##$ASSFAC= 0
##$ASSFACI= 0
##$ASSFACX= 0
##$ASSWID= 0
##$AUNMP= <proc_1d>
##$AZFE= 0.1
##$AZFW= 0.5
##$BCFW= 0
##$BC_mod= 2
##$BYTORDP= 0
##$COROFFS= 0
##$CY= -3
##$DATMOD= 1
##$DC= 0
##$DFILT= <>
##$DTYPP= 0
##$F1P= 0
##$F2P= 0
##$FCOR= 1
##$FTSIZE= 65536
##$FT_mod= 6
##$GAMMA= 0
##$GB= 0
##$INTBC= 1
##$INTSCL= 5.30512e-09
##$ISEN= 30
##$LB= 1
##$LEV0= 0
##$LPBIN= 0
##$MAXI= 10000
##$MC2= 0
##$MEAN= 0
##$ME_mod= 0
##$MI= 50
##$NCOEF= 0
##$NC_proc= -9
##$NLEV= 6
##$NOISF1= 182.463
##$NOISF2= 159.3651
##$NSP= 0
##$NTH_PI= 0
##$NZP= 0
##$OFFSET= 182.463
##$PC= 4
##$PHC0= -1696.912
##$PHC1= 99.40117
##$PH_mod= 1
##$PKNL= yes
##$PPARMOD= 0
##$PSCAL= 0
##$PSIGN= 0
##$REVERSE= no
##$SF= 81.0140089999434
##$SI= 65536
##$SIGF1= 159.3651
##$SIGF2= -187.1042
##$SINO= 113.3802
##$SIOLD= 16384
##$SREGLST= <1H.CDCl3>
##$SSB= 0
##$STSI= 65536
##$STSR= 0
##$SW_p= 29940.119760479
##$SYMM= 0
##$S_DEV= 0
##$TDeff= 32768
##$TDoff= 0
##$TI= <>
##$TILT= no
##$TM1= 0
##$TM2= 0
##$TOPLEV= 0
##$USERP1= <user>
##$USERP2= <user>
##$USERP3= <user>
##$USERP4= <user>
##$USERP5= <user>
##$WDW= 1
##$XDIM= 65536
##$YMAX_p= 229343640
##$YMIN_p= -299560460
$$ End of Bruker specific parameters
$$ ---------------------------------
##NTUPLES= NMR SPECTRUM
##VAR_NAME=  FREQUENCY,     SPECTRUM/REAL,   SPECTRUM/IMAG
##SYMBOL=    X,             R,               I
##VAR_TYPE=  INDEPENDENT,   DEPENDENT,       DEPENDENT
##VAR_FORM=  AFFN,          ASDF,            ASDF
##VAR_DIM=   65536,         65536,           65536
##UNITS=     HZ,            ARBITRARY UNITS, ARBITRARY UNITS
##FACTOR=    0.456856943014862, 1,           1
##FIRST=     14782.0589164792, 0,            0
##LAST=      -15158.0608439998, 0,           0
##MIN=       -15158.0608439998, -299560460,  0
##MAX=       14782.0589164792, 229343640,    0
$$ Real data points
##PAGE= N=1
##DATA TABLE= (X++(R..R)), XYDATA
$$ [...]
##PAGE= N=2
##DATA TABLE= (X++(I..I)), XYDATA
8807 -10613350 -1155311 12829469 20764798 20803359 17239918 14212993 10656751 3190809
8799 3190809 -4688147 -2529575 12194963 25377506 21816815 5514514 -6214217 -6413066
8791 -6413066 -4008760 -5812769 -6462866 -231903 8691269 13704232 14745156 14241273 12058832
8782 12058832 9571581 10764220 14293888 13191319 7885629 9058586 19559973 24477135
8774 24477135 10777603 -12573818 -28125289 -35654119 -47295308 -61975159 -65068212
8767 -65068212 -54502577 -47058085 -52275359 -57512399 -48468615 -29875354 -14405724 -3905687
8759 -3905687 4474149 3997895 -12687561 -35476485 -44671336 -36468210 -26281903 -25776310
8751 -25776310 -30402300 -32721471 -34211513 -36650264 -32781124 -15834334 7502240 23292682
8743 23292682 27132630 26692024 28177474 27836319 19436674 5262732 -4800358 -4419768
8735 -4419768 2081244 5114390 586908 -7279469 -13150556 -16345393 -17792421 -15881844
8727 -15881844 -9602112 -2534347 1517329 4520135 9976253 14708512 12292749 4399956
8719 4399956 800244 6516300 16206875 23183653 26016391 23049782 9561335 -12666328
8711 -12666328 -29797936 -28803303 -12705191 4139537 12964714 15359876 13963770 8326809
8703 8326809 1411740 1448687 12183597 25641401 29619209 21303098 10282486 7891383
8695 7891383 15469455 24408594 27191483 25708747 26374612 29396497 28469794 21769485 16758317
8686 16758317 19846849 25919085 24187601 12703407 1405348 221880 7824142 13535673
8678 13535673 9221917 -1224911 -5279368 3173406 13674219 9714487 -9570369 -25089324
8670 -25089324 -19291742 3315243 21897441 21325103 4328031 -13548290 -16471721 -819507
8662 -819507 19745592 26587288 17748640 10201413 15326945 22575527 17376012 4646779
8654 4646779 -651496 1302882 -2071262 -11429917 -13791230 -5786407 810350 123484
8646 123484 -557289 -127609 -9912408 -30497395 -41776730 -31013261 -14631645 -14085604
8638 -14085604 -22878707 -18600419 266226 12458724 7306444 -1482355 467405 8542030
8630 8542030 11210071 8665042 9186197 14008127 15241714 7091212 -6488061 -15806461
8622 -15806461 -15447937 -9778544 -7291353 -9441660 -9043783 -1558718 7816305 12677735
8614 12677735 14713960 17474214 16530860 5489460 -11208025 -21229624 -19053674 -9772617
8606 -9772617 -440285 3915210 -788952 -11423663 -12933138 5850456 31219215 35185207
8598 35185207 11780790 -12236746 -11281189 7629782 18699597 12126622 740684 -2584374
8590 -2584374 545142 2060342 -1357453 -7385409 -10935487 -6383875 7135318 21880031
8582 21880031 28557169 27792193 28709523 35103624 39618582 34869762 24838803 20093687
8574 20093687 24564890 32151139 35200890 31192279 20723307 4809104 -11978936 -19825885
8566 -19825885 -11896536 5578412 17288730 15141298 5990735 698957 968195 1509049
8558 1509049 -238022 -3862442 -11555722 -24394631 -34120949 -29282903 -12399649 -1709933
8550 -1709933 -10290110 -29941139 -41545705 -36033069 -18748527 2170673 22831903 39588330
8542 39588330 46272115 39649806 24948074 12651159 9315452 12322907 14433173 13090684
8534 13090684 12693798 16255310 18884866 14827738 8532608 10922249 23819956 35589073
8526 35589073 35087739 23714514 10766982 3452161 4891174 14349600 23835759 21697525
8518 21697525 7108909 -4974211 -1696252 10277782 15195552 11420712 11156511 18020655
8510 18020655 19687106 8018837 -5422970 -3284892 14569306 31153252 33071989 23509686
8502 23509686 14338769 11206851 9435201 2728872 -7314111 -12832061 -10773574 -8104989
8494 -8104989 -11746137 -16419579 -10357398 6117652 16245080 6163037 -17059612 -32839875
8486 -32839875 -28967535 -10329593 10665470 24773486 28617320 25393131 24500433 33136318
8478 33136318 45293806 45692034 28889341 8572496 1971984 9607698 17518814 16293267
8470 16293267 9338984 3233515 -766999 -3271119 -2843112 145092 1668741 472925
8462 472925 1225349 6549264 10614798 6188286 -5388290 -16286155 -20937081 -18222449
8454 -18222449 -9532782 -386279 1103429 -5108971 -6683179 5550096 22048444 25917830
8446 25917830 16745024 9571557 11114171 12858908 10462365 12738410 23087321 27167414
8438 27167414 11636002 -15295951 -34822125 -41079360 -41086496 -38208955 -30279739 -20679786
8430 -20679786 -16952573 -18540915 -17668857 -12726568 -10132165 -12337306 -14239243 -12863416
8422 -12863416 -11331818 -11779990 -12910399 -15362872 -20248339 -21379271 -9646065 11675142
8414 11675142 26200105 24106983 14025923 9822635 13318125 16647617 15243530 10888943
8406 10888943 6022772 2172131 1824889 5876561 10234991 9652146 4795922 2425138
8398 2425138 8203074 20290512 29654681 27492100 14578452 2321685 1236350 9393271
8390 9393271 16289729 16274668 11933308 5512593 -4197590 -14576027 -17092695 -6911403
8382 -6911403 10452074 24433733 26623069 13314170 -10068138 -25940690 -17940931 7120031
8374 7120031 21863563 11094414 -8106955 -9408446 8498428 23835404 22272909 10950630
8366 10950630 3455664 4259198 9912277 15194231 15375973 10000855 5537295 7261066
8358 7261066 9200887 977295 -15667744 -27592891 -28873743 -27651111 -31026437 -34359667
8350 -34359667 -31662709 -26562557 -24509975 -21795838 -11809797 2931695 14248816 20244792
8342 20244792 25035071 29216719 29432235 25770484 20811081 12486485 -2352347 -17278443
8334 -17278443 -20560276 -13122302 -10676711 -21436994 -32456317 -28484411 -15799362 -12826494
8326 -12826494 -21035683 -22095063 -6396689 11803385 15889353 10285177 9948162 15640492
8318 15640492 15269699 6344637 737167 4694448 8359793 1907672 -8446906 -9530192
8310 -9530192 -106030 8024515 5105627 -7015989 -18926621 -22365143 -16207865 -7289648
8302 -7289648 -3551258 -4060036 478078 13981166 26653436 26198329 13770698 1687125
8294 1687125 -2789046 -3604921 -5852754 -7590760 -5034850 -368896 454261 -4419508 -10927164
8285 -10927164 -14863905 -16604555 -18667414 -20204189 -17412588 -10900439 -8714386 -16842805
8277 -16842805 -28600658 -30799001 -21268685 -12226308 -13131835 -18567864 -18772739 -14073642
8269 -14073642 -10115651 -5018043 7307850 23273076 30191249 22187571 7646934 -678700
8261 -678700 2901717 15239627 27351169 29388764 19685159 9069904 9006651 15269232
8253 15269232 12004792 -5753690 -22151435 -18233702 5493945 29162201 34076879 20536376
8245 20536376 6164244 6911902 19720759 27542894 22759296 17469942 23970380 34292786
8237 34292786 32116464 18771585 10567630 12389587 12604230 5931583 1588690 2849729
8229 2849729 -1265741 -13278197 -15399306 3831923 26555151 28220512 12207657 1652307
8221 1652307 4082068 5703980 -1637071 -9078577 -9112509 -7421128 -10294286 -13514986 -10384658
8212 -10384658 -1731883 6777415 10314620 5764538 -5844440 -16701609 -19048929 -14262550
8204 -14262550 -7787416 1812505 17482544 29915889 24510898 4069114 -10644584 -8148766
8196 -8148766 -378129 -3130202 -15451596 -26785911 -32720709 -33592887 -27468716 -15449154
8188 -15449154 -5988279 -3338981 987125 14287107 27282622 25542324 11527002 1578693
8180 1578693 2926951 7213097 7635220 9473277 18730674 29720397 30899606 19251651
8172 19251651 4200044 -2034292 3165680 9648314 5163388 -9956646 -22366768 -21956738
8164 -21956738 -13223206 -6517997 -4335509 -2980597 -1952131 -2394669 -24530 10294619
8156 10294619 24706394 34378284 37481594 37388882 31350860 13811374 -8452103 -18319850
8148 -18319850 -9915109 3425267 8183396 6735729 7583012 9950503 7750067 1646489
8140 1646489 -2792054 -4576370 -6457959 -8277700 -8845538 -10831567 -15641956 -16224024 -3879406
8131 -3879406 18062328 34749941 35021842 21533953 6270814 383851 7142065 19746061
8123 19746061 26376519 21318805 10325462 2269115 -1349261 -4401064 -7761416 -9335546
8115 -9335546 -9336303 -8261019 -2072102 12249649 27610600 32267848 24705342 14528273
8107 14528273 8059850 2752671 -2056918 226869 12198659 24363523 25800394 17343434
8099 17343434 7516368 395094 -5179145 -8136583 -5337831 1298515 4326084 -1112198
8091 -1112198 -11649050 -18465626 -14798974 -2734088 6817613 4976729 -3174803 -3936414
8083 -3936414 4951972 8644135 -2987720 -16748043 -12481357 6307370 14159433 -2146429
8075 -2146429 -26163368 -35306890 -29193068 -23603559 -24858554 -24340979 -16432530 -8486170
8067 -8486170 -9085604 -15324733 -17664402 -12650438 -5325367 -1550899 -3113531 -9762348
8059 -9762348 -21122095 -34634165 -44364351 -44662902 -34916304 -19787364 -5411555 3878005
8051 3878005 6527343 3949858 14368 -1487775 253993 3321814 5760253 6402773
8043 6402773 3719135 -2922855 -10048091 -11575542 -5742693 2157769 6563022 8678061
8035 8678061 13463914 21656191 28812129 31249162 28903142 22905734 14845613 8921503
8027 8921503 10257077 18788969 27406941 28083683 18717086 4073601 -7477593 -8504464
8019 -8504464 1758590 14290778 16611750 5474952 -8743518 -13108638 -6021634 2648136
8011 2648136 3861749 -1849363 -8064810 -11022134 -11739869 -11341844 -8282433 -1733780 5154627
8002 5154627 8733621 10130264 12562918 13754917 7502175 -4522156 -9499469 1257314
7994 1257314 17969183 21567499 6003260 -15896583 -28202874 -25955820 -13624370 1566270
7986 1566270 12180743 13960506 10051532 6147672 325291 -13849566 -31933449 -37692675
7978 -37692675 -24509607 -7811440 -6189586 -17343966 -23923587 -18072766 -7784682 -1147503
7970 -1147503 3254558 9126403 15634344 19950557 19653869 12602276 1545502 -2978753
7962 -2978753 5844162 17623732 14630852 -3464261 -17262988 -13736272 -1835883 4358124
7954 4358124 5604817 10687845 19385925 24015828 21877372 15389241 4730552 -9140787
7946 -9140787 -18349899 -15887381 -6597219 -121345 3760035 11231372 19009877 16811356
7938 16811356 4801988 -6073557 -12785010 -23335472 -36464448 -35262082 -11712930
7931 -11712930 15996509 24451945 13911890 2266471 -2223612 -6045028 -12362466 -15061652
7923 -15061652 -11924712 -8933696 -7962783 -2794326 8174775 16913674 19319267 23204339
7915 23204339 34865077 46052436 43726564 28134794 12926832 9387989 16138053 22579366
7907 22579366 18979286 5781177 -5157225 -3132738 6448988 7251329 -5520541 -18220000
7899 -18220000 -19572694 -15987945 -16271369 -13742161 551921 16056205 14416792 -428198
7891 -428198 -5113125 8301533 20830253 16246564 3429636 -1283084 1996476 4025639
7883 4025639 5545482 13553652 25314785 30367015 25364886 15764491 5410031 -5590537
7875 -5590537 -14647999 -17259101 -12692417 -2906714 10917920 24467489 28122769 17472238
7867 17472238 2119453 -4900310 -2967688 -343065 599601 3350378 5679331 1122251
7859 1122251 -7974743 -11103314 -5193233 982478 267192 -4680452 -8971104 -11772453
7851 -11772453 -11992258 -6585359 2940102 9539429 9405067 5806235 2987158 2844854 7139731
7842 7139731 13967611 12623932 -5954822 -31869488 -42612427 -30966942 -13358898 -4980392
7834 -4980392 -1741810 3674410 3686522 -10085333 -25512813 -22531966 -3481510 7511404
7826 7511404 -2898830 -20548883 -24345140 -12001100 1253838 2393116 -7038847 -14677997
7818 -14677997 -9790980 6089277 20012999 21167189 12435419 4847562 2532641 -569641
7810 -569641 -8977368 -17655654 -19076792 -13848407 -9661083 -10439564 -10101089 330492 19386369
7801 19386369 32639619 28220988 13319957 7532397 17576311 27143143 18236866 -4309257
7793 -4309257 -18921591 -14138409 830695 11842188 16242359 20601927 29017317 38137794
7785 38137794 41140811 34654155 23233875 16365665 18575711 24339918 26479792 26843012
7777 26843012 32233042 40883243 41285676 27345357 8387042 -792939 3520977 12266946
7769 12266946 17170799 20530383 28649897 38895728 40176985 28888885 17788659 21214657
7761 21214657 35106237 42440002 37780796 32954498 34922506 33337553 19428092 3306810
7753 3306810 -1586906 -218347 -4943152 -11063333 -4114750 11761673 15080285 -618411
7745 -618411 -16139162 -14950398 -4143244 1603732 690136 -1734478 -6548091 -14096504
7737 -14096504 -16058707 -7464232 1916930 1618199 -1784649 4441731 16310149 17218749
7729 17218749 3134501 -11535615 -14522766 -8790999 -1963313 5292522 14688378 23308837
7721 23308837 28049897 31367870 36510718 40674960 38182452 28332840 15834336 4842420
7713 4842420 -3455493 -7758274 -5297474 4440071 16821467 25731230 29568180 30550054
7705 30550054 28100326 18078097 1671766 -10330928 -8951058 282763 4091953 -630622
7697 -630622 -5202833 -5654563 -9279178 -20483889 -30941988 -31423995 -25371449 -22456105
7689 -22456105 -24993889 -28925639 -32401889 -34525263 -30907731 -20561798 -13130073 -18049490
7681 -18049490 -28449964 -27287290 -10110985 8531375 13611645 5965475 -2685486 -3791036
7673 -3791036 2385723 9745005 11623110 6304805 -1218624 -5353601 -6784694 -9660764
7665 -9660764 -14036496 -16569775 -17113345 -18330195 -19803974 -19014853 -17114014 -16677699 -14764737
7656 -14764737 -6255829 6332676 15020979 18176415 20268763 19322929 6980219 -14701285
7648 -14701285 -28752431 -23911168 -10851356 -8429875 -19786911 -31427860 -32200329 -24351146
7640 -24351146 -17379987 -18023868 -25795794 -33591199 -33709378 -26445697 -20151060 -20171382 -22514604
7631 -22514604 -22324423 -22222222 -25492505 -26819240 -19137033 -6205322 1753366 3356120
7623 3356120 6373719 12287548 11704780 -611503 -14949431 -17099923 -4507683 12873251
7615 12873251 23720844 23233139 14143570 4880174 4071387 12507421 22315087 26945155
7607 26945155 28601268 31791489 33753614 28526715 18972089 16200800 24722665 35156767
7599 35156767 36199872 28611045 21276284 16902829 9743104 -2217280 -10938068 -8572099
7591 -8572099 1212131 8180838 9195795 10035961 13300198 11607377 -2527551 -23482499
7583 -23482499 -34872610 -25846976 -2127323 20144270 29327703 25550095 15261774 2893541
7575 2893541 -9999869 -20423121 -24289930 -22208727 -19936260 -19518012 -14292010 1234655
7567 1234655 19271157 25013330 15740723 4823030 2959150 3997967 -3440684 -17156059
7559 -17156059 -24437653 -20533035 -12738269 -6300454 1868251 11961257 15038297 5452644
7551 5452644 -8704722 -16568261 -19992813 -27991643 -39691740 -44743386 -40346086 -35939851
7543 -35939851 -37858445 -39876900 -34595676 -25454970 -20016666 -17856661 -13548653 -7476792
7535 -7476792 -5242201 -8479351 -13639341 -18347240 -22248591 -23264457 -20018820 -16376856
7527 -16376856 -16124337 -14935481 -6519801 4466067 6562430 -501095 -3983423 1864495
7519 1864495 6108954 -1302916 -12821046 -14155774 -4396848 5650421 10613566 15141539
7511 15141539 23042906 31072894 33862119 29247955 19877212 13774947 19184607 32796821
7503 32796821 38223682 24797633 4075653 -2043181 12589507 33323124 43315132 37330190
7495 37330190 19593488 48764 -7514769 3766744 22622534 30031976 22855972 16263249
7487 16263249 20947329 30709816 36273672 37593985 35890227 26849627 11292591 1199002
7479 1199002 3922358 9670120 6584795 260821 4675171 19136131 28866692 26876099
7471 26876099 21816802 22810085 27493003 27997859 20757291 7901327 -5007776 -11520460
7463 -11520460 -10352018 -9208896 -16363170 -27943751 -30322003 -16902024 3298894 16211028
7455 16211028 17203536 12614546 10602169 13284665 16036389 12719749 2414088 -8571213
7447 -8571213 -11964386 -4636292 9187951 20943882 23431675 17220034 11646964 14688834
7439 14688834 21514459 20218630 10633502 7558663 19496692 34153760 35069603 25119757
7431 25119757 21181705 29884267 41440556 45598292 41389143 31590852 19559496 12162078
7423 12162078 14060383 17614320 10277798 -5662659 -13095658 -3876832 9640966 13007466
7415 13007466 8237417 5903288 8573542 12084083 15982266 21834076 25190823 19274822
7407 19274822 5457680 -7244952 -12445644 -11218376 -8566330 -9529604 -16409502 -25662733
7399 -25662733 -30134273 -27737556 -24018769 -22682422 -19414195 -10577512 -1706328 650420
7391 650420 228681 4344206 9697399 6483159 -4618850 -12061616 -11548357 -11739995 -17114187
7382 -17114187 -17656702 -4786544 12353148 19127786 18094319 24650134 40706341 48204776
7374 48204776 34581524 11927163 655907 3005454 5589430 2868579 2089440 4579631
7366 4579631 -592090 -16610487 -27055694 -17431494 674472 3238052 -11944854 -21788515
7358 -21788515 -11006676 7124970 10856755 -981681 -11067348 -8253023 1508442 7816832
7350 7816832 9716461 13376614 20345779 22778675 12203045 -7383532 -19067033 -10459007
7342 -10459007 9828815 19830733 9510790 -8431057 -15874145 -10250036 -2694262 -984861
7334 -984861 -2287467 -1101756 2676441 4915142 2653948 -2883353 -7195642 -6495105 -1492056
7325 -1492056 3595809 5550409 3792160 -1243440 -7358749 -9130959 -3161084 4708365
7317 4708365 4352454 -4505526 -10423659 -5546712 5064716 13752571 21162370 29707609
7309 29707609 34198594 29210368 21016124 21487365 31801344 41240707 41495151 34477900
7301 34477900 26528554 21796767 20970919 20833571 16336418 7867543 2633902 2736425 -1800910
7292 -1800910 -17708267 -31971652 -25911828 -4317935 6787071 -4692979 -20728480
7285 -20728480 -20376228 -7997667 -1278971 -2569207 723867 11938327 18816315 13330764
7277 13330764 3986361 2730992 9462090 16587195 22018102 29005198 36214872 36907029
7269 36907029 29125860 20057504 17274483 20529012 25926572 33338382 43111440 48429076
7261 48429076 40339468 21902003 8498318 9345150 15757348 14015428 3971099 -2964475
7253 -2964475 -133447 8628160 16792436 19800862 13698847 -1138510 -14718004 -15292005
7245 -15292005 -4204765 5341956 5669063 1903522 305793 -56021 139131 5357617
7237 5357617 15480000 20472055 14042170 5584462 8219424 19838491 26791241 23280916
7229 23280916 15711563 8847596 -22792 -10482324 -13779797 -4601930 9435670 17094618
7221 17094618 17331959 16797574 17256792 13909639 5441482 -2728949 -7397900 -12378207 -20102825
7212 -20102825 -24864751 -21008683 -13051091 -9143943 -7531031 -84010 11447720 15706221
7204 15706221 11480531 13062331 27515961 39852463 34137898 18613925 12322296 14044000
7196 14044000 6311766 -10895465 -14356404 7575945 35118655 43983868 35702265 26886187
7188 26886187 21928394 13800705 3383844 -416155 2880337 4037214 -1014513 -6979000
7180 -6979000 -9366978 -8225420 -2702098 7461037 15571729 13636709 4498864 -1392824
7172 -1392824 -1121498 -1241437 -4861598 -7638434 -7326791 -6280714 -3202151 5909197 16393803
7163 16393803 17089719 7877785 2389010 7300096 11593510 4752105 -6303515 -9422211
7155 -9422211 -6247684 -5828855 -6562124 662116 14667655 23595844 22001601 16025792
7147 16025792 10853258 4907697 -1259589 -1814617 4061901 8253743 5665017 2358424
7139 2358424 5794156 13360186 16979826 14181079 8464295 2917484 -254345 2598226
7131 2598226 12643420 24450324 31568469 33769078 32773349 24404221 4437012 -18362440
7123 -18362440 -25862067 -11414561 10599900 21210358 17032881 8831299 5473991 6682320
7115 6682320 9129215 12189141 16616371 21767072 25244905 23835747 16149334 5895349
7107 5895349 -440551 -1599605 -3125220 -7423284 -7972589 -218219 6904327 483846
7099 483846 -17155873 -29246211 -24898207 -8709354 10305078 27224801 35657285 27432840
7091 27432840 6216095 -9422377 -7088868 3173039 4291699 -3639992 -7489325 -3925378
7083 -3925378 -2603730 -7429195 -10032571 -5211462 645167 2635163 7395806 21247073
7075 21247073 36070821 36865739 19765504 -5495189 -28573560 -45940608 -55862278 -54214875
7067 -54214875 -39280486 -17224898 841115 7117293 1969180 -7788753 -14052602 -12161774
7059 -12161774 -3225409 7029778 12920625 13749990 13690375 16104404 19588442 21068945
7051 21068945 20060731 16616897 8678835 -1964896 -3863272 13289130 40540439 54116690
7043 54116690 43712436 25710054 20039467 24424423 23443839 14053068 6283965 3957974
7035 3957974 2581706 5057694 20442915 43404411 52687689 37960867 13994825 -483859
7027 -483859 -5039775 -8778821 -12053748 -10449712 -8138109 -12367317 -19112476 -17760821
7019 -17760821 -8114133 -697020 -599043 -1762593 1888434 9026113 16152655 22157447
7011 22157447 25545578 23890333 18483174 14164157 12194192 7568797 -4068877 -19147984
7003 -19147984 -27340515 -19906624 1290015 22195170 28147242 20217499 15561285 26936468
6995 26936468 46545845 56291226 49328729 33291659 16017341 -1178796 -16600488
6988 -16600488 -25413868 -26705869 -25393809 -24071313 -19346929 -8908893 3536865 12848114
6980 12848114 17071573 16125674 11210980 6580995 5984551 6272686 1043879 -8244360 -12536972
6971 -12536972 -8770750 -4774560 -6759957 -10493946 -10760298 -11602924 -18867747 -28092968
6963 -28092968 -29081476 -20187477 -10151910 -6408958 -7701048 -8195220 -4545088 778592
6955 778592 720393 -9347716 -23450514 -28478313 -19829424 -7926008 -3252944 -1636179
6947 -1636179 5848273 13673273 6632777 -15911390 -34340308 -32469904 -16498851 -3724104
6939 -3724104 -671463 -439549 3854557 11559284 18083292 19327495 13626524 4162571
6931 4162571 -1700507 528998 7381734 12474652 14210370 14684822 13567504 8018516
6923 8018516 -2294655 -13786887 -21454503 -20659313 -10181262 2863723 6528488 -711453
6915 -711453 -3010540 14530559 42736861 55215332 39831896 12467781 -3944878 -3290806
6907 -3290806 6258144 17573528 27515171 31846897 28629654 24027851 25496238 30499893
6899 30499893 29772118 20816895 11176827 9013382 16622280 31890397 49382855 60842107
6891 60842107 61301908 54332412 45822446 35291027 20918816 9706781 11044824 20392352
6883 20392352 22092680 11620861 2794958 6850928 15367416 12729703 -2647294 -19130575
6875 -19130575 -28120546 -29906123 -26957724 -20649090 -13506180 -7700510 -2047221 4546347
6867 4546347 9021224 9033095 9241531 16406680 29696903 41490561 46354569 44082972
6859 44082972 36110872 25339467 18301016 20650923 29561615 35105518 29680834 13428963
6851 13428963 -7499350 -23933327 -27681067 -18425868 -5720991 271265 -1794096 -7858756
6843 -7858756 -16289997 -25136993 -26234797 -12842489 7758591 19961248 19438704 17240292
6835 17240292 21983774 28054866 26447108 18827550 13926344 15166076 18097113 17129973
6827 17129973 10634431 2115797 -1151497 5281391 15246182 15905176 3306576 -11060920
6819 -11060920 -14217091 -7620919 -2817591 -4452357 -5531976 389485 9446800 12724577
6811 12724577 6828586 -4162115 -14389838 -19714327 -16753230 -3838187 14629428 28666711
6803 28666711 32107439 29720411 30001719 32310047 28218368 16263619 6987124 9621938
6795 9621938 21006964 32039491 37595854 35125142 22719219 6267939 -1236388 1928217
6787 1928217 -1537833 -23077768 -44779762 -40110050 -13313446 3972117 -4183627 -20784853
6779 -20784853 -26437863 -24342656 -24373569 -22300627 -10343021 5345849 13122243 12801475
6771 12801475 12298941 15972512 25864989 43605793 60507328 58231535 32735253 5953453
6763 5953453 -1345903 2879878 -1610347 -14698350 -20974035 -19314602 -22714196 -30900550
6755 -30900550 -28039686 -11104607 1873940 -1176719 -10224536 -12440027 -10658552 -12249281
6747 -12249281 -13898327 -9423425 -2219308 1541468 4178458 10332203 15566283 11376698
6739 11376698 -1650179 -13831352 -17941766 -15433357 -12757495 -14849173 -20240064 -21109419
6731 -21109419 -11280815 5582987 20009197 27565352 28901845 21270565 1735280 -19765428
6723 -19765428 -24403190 -8286686 9142270 9423872 -1801897 -6312207 369856 7130810
6715 7130810 7137220 5677021 7879554 10143653 7155558 -230488 -7536368 -11820230 -11605324
6706 -11605324 -5896282 3930810 13932481 21381990 26851366 31129634 32298265 28471518
6698 28471518 22643737 21417764 26919653 32198148 28630802 17443428 8539565 6406454
6690 6406454 3916991 -5158173 -14089581 -11705554 1513100 15333191 24726976 31964180
6682 31964180 35122785 27344242 9800137 -6573956 -16352596 -25192164 -34657319 -33411335
6674 -33411335 -13118156 15324228 32299618 31882059 24821206 22191483 24084539 23354063
6666 23354063 14724826 526868 -10194400 -10857870 -6658947 -8996745 -18654079 -22726200
6658 -22726200 -13165878 -77331 1178843 -9906141 -19842779 -17858989 -4596848 12254334
6650 12254334 24549362 28869424 29706369 33658913 38146478 33828126 21871613 17111574
6642 17111574 25870824 32945126 23347425 6097617 -223833 2613427 -2890988 -18916280
6634 -18916280 -27397735 -18566028 -4844029 160911 -91355 3304370 8233052 7140819
6626 7140819 -99150 -8051216 -13509020 -14292042 -7508286 3652073 8285270 1114690
6618 1114690 -7911502 -5517775 7425150 18122538 18502084 11861360 4578424 -1005537
6610 -1005537 -4597547 -4889220 -1227952 4143420 7431580 6787411 4665522 6255568 13598065
6601 13598065 21163636 20221860 8741536 -5863177 -15325268 -18851238 -20461664 -20664147
6593 -20664147 -14924708 -839604 16058546 26106268 25061893 17763420 11016454 5457513
6585 5457513 -1833603 -8871884 -9845795 -5407699 -4132366 -10326422 -17719434 -19943912
6577 -19943912 -19578664 -20408901 -18811422 -11722792 -5735591 -7143519 -9165760 -2161641
6569 -2161641 8130547 7648122 -2825551 -7609533 -4747 9677690 12907088 13899667
6561 13899667 16245292 13721864 3204101 -5522929 -2912004 6188410 10413283 6810289
6553 6810289 507659 -3906291 -4446079 -1710737 -1460972 -9370791 -19433552 -18080081
6545 -18080081 -4751344 4504686 1583878 -4964 11838768 24805802 19413936 -121835
6537 -121835 -11672427 -7115799 1336832 6140304 15681058 34952595 51232469 49039656
6529 49039656 30195186 10366343 1081400 1775475 5808604 8110115 7555684 5559557
6521 5559557 3637738 2447494 2829660 5663292 9678585 11915296 11426221 9193696 3725259
6512 3725259 -7537916 -20193443 -23432829 -13621076 -1252991 1439364 -5386733 -12752208
6504 -12752208 -14459597 -9081161 2833525 15830993 20076755 13218425 5802086 6193697
6496 6193697 7074753 -2089850 -15715369 -19095584 -11092621 -5238898 -8657346 -13375620
6488 -13375620 -10461268 -1632641 5744957 6805421 1216856 -6000293 -7055837 -1871856
6480 -1871856 -1866148 -13893903 -26068122 -22701357 -8539271 -1691649 -4952112 -3206584
6472 -3206584 9227064 18668413 15595428 10013322 13680319 21447677 21305600 12538763
6464 12538763 3972614 1924023 7262979 17065576 23548484 18936798 5648280 -6017127
6456 -6017127 -11683793 -13697015 -8180369 12290560 39136673 49553068 36935903 22484735
6448 22484735 24988043 35225919 34504063 23944277 18414176 22274606 28068157 31340429
6440 31340429 31808844 27147385 18765397 15213651 17479612 12428258 -4541263 -14081533
6432 -14081533 435701 23458444 27883845 15045876 7569786 9620455 4726447 -8445775
6424 -8445775 -10413503 3500292 11692863 862342 -13808773 -15302862 -8305858 -3018947
6416 -3018947 2018028 5863704 -4007953 -28214647 -42485172 -29679205 -8277395 -5705005
6408 -5705005 -17613108 -20138966 -11936342 -13601009 -28543949 -35050980 -21917187 -5258684
6400 -5258684 -597862 -1100470 3634562 6290730 -3946731 -18587467 -18768926 -1068895
6392 -1068895 19927028 31750665 34638142 33325401 29131390 21814478 12196793 1547436
6384 1547436 -7133628 -8137493 971912 12789428 15657947 6991766 -4141075 -9227778
6376 -9227778 -10022127 -13382377 -20780598 -27163895 -28079882 -23812358 -16921239 -9092505 -1233834
6367 -1233834 5333250 8865988 7893065 2306455 -4970468 -7897188 -1349007 13347308
6359 13347308 27889430 33273530 26555757 11491011 -5822477 -20279280 -27846818 -25735849
6351 -25735849 -14855453 -1010778 9293451 15022986 20029892 24762838 22244323 7330624
6343 7330624 -11899347 -19708346 -11687564 -713128 553347 -4536634 -6073654 -5735647
6335 -5735647 -12941505 -25714484 -30048340 -20815942 -9839061 -7584497 -9054554 -5894327
6327 -5894327 -1503055 -3283328 -8175730 -7982800 -3560063 -1971241 -3766916 -4801580
6319 -4801580 -6968756 -14205020 -20042390 -13348966 2823706 11866307 6205873 -2987065
6311 -2987065 -3100555 3963788 8597852 6413958 -1974717 -15522391 -29631334 -34711452
6303 -34711452 -25542076 -9171577 1641473 1341444 -3826598 -1899352 12962357 30385823
6295 30385823 29268647 2190110 -28978928 -34904153 -15363502 1826728 329276 -5435754
6287 -5435754 1851088 14958497 17142264 9317818 4384677 4887848 4369158 3484075 6824450
6278 6824450 8986576 1548857 -9680207 -11857824 -6891309 -8046354 -16150748 -18243830
6270 -18243830 -11022837 -6173760 -8461644 -7593891 1338016 7144498 1434192 -7633605
6262 -7633605 -11072156 -14142033 -23510662 -32100300 -30904696 -25996722 -28733177 -35943572
6254 -35943572 -34719549 -22580770 -9026514 86782 6394467 9015260 4257991 -3889323
6246 -3889323 -5285382 1656479 6991314 3964599 -2632030 -6484293 -9183010 -14056934
6238 -14056934 -17617499 -14136551 -4978832 2768157 5212351 4419236 3228955 1639664
6230 1639664 -1137407 -4183145 -6165946 -7835298 -11201962 -15768781 -17375714 -13071682
6222 -13071682 -6424806 -4353502 -7528444 -7913278 929985 14248620 21500757 19621010
6214 19621010 15226606 13376687 10459240 1912565 -7592463 -8551206 -1362149 222533
6206 222533 -14111232 -34094877 -36854916 -14375275 14621435 26482496 20208781 13550172
6198 13550172 15620686 17755818 13661331 12816727 23737211 35358200 29552075 7167780
6190 7167780 -12268364 -15396230 -7068698 2353352 8750766 10539315 5805021 -660024
6182 -660024 2486868 18174692 33634340 35974142 28613171 23598105 23448000 21692965
6174 21692965 18175366 20633258 29284924 31953689 20845651 5731994 2230930 11736671
6166 11736671 21200631 20480024 11768832 2192663 -4680508 -7763699 -6335052 -3479280
6158 -3479280 -6083062 -15921765 -24831596 -24643707 -18430642 -14892943 -14429358 -10014870 -1729757
6149 -1729757 -136557 -11515888 -28113208 -38353195 -40094243 -38036062 -34193455 -28244197
6141 -28244197 -22900644 -21045395 -19839929 -14604015 -6952039 -2810192 -3542615 -4549741
6133 -4549741 -1389791 7300351 20207396 31270427 30884090 16385844 -1340856 -8994033
6125 -8994033 -5678943 790378 7568830 15875289 20287240 13147751 -583038 -7273199
6117 -7273199 -5203962 -6642427 -16140897 -22633151 -19507042 -16692676 -22948896 -30328522
6109 -30328522 -28398638 -21566452 -18503930 -15107039 -3727135 8755428 8847700 -2521349
6101 -2521349 -12681143 -17327495 -22465241 -28816245 -30044343 -25820504 -21809634 -16804469
6093 -16804469 -4562268 11247761 19016884 17279537 15579190 15708549 8878565 -4675011
6085 -4675011 -10947307 -4146771 2908419 -468237 -6748362 -5862230 -3306783 -9220328
6077 -9220328 -19798719 -23517985 -18864522 -13651688 -12305820 -14283673 -19453296 -25523863
6069 -25523863 -26275990 -21294093 -20044710 -26811574 -30544675 -21479435 -8775295 -7126297
6061 -7126297 -13642756 -14814577 -10546764 -12196795 -19204982 -17723254 -4209330 8286303
6053 8286303 11574922 12602766 15910503 12420851 -4294559 -23562503 -30759360 -25741749
6045 -25741749 -17610618 -8640642 5037640 20713251 28234893 22861701 12305680 8396468
6037 8396468 13701605 18139917 10564248 -6070818 -15887020 -10114645 482469 1352267
6029 1352267 -3807566 164197 13738737 19431454 7906197 -6949075 -5818667 13210414
6021 13210414 35344799 44457131 34428217 14108326 2984085 11496291 25155262
6014 25155262 22099172 6518506 4247214 20127261 25002079 34036 -29348514 -27121896
6006 -27121896 2348716 24071560 23038157 16115143 16705528 16845140 9519283 3809769
5998 3809769 7104849 10109012 1251041 -15747329 -28145879 -29480991 -21791408 -10038449
5990 -10038449 71810 4366696 3801380 1763291 -1226241 -4163878 -1175194 9125802
5982 9125802 14291703 2802204 -14101371 -13467693 4923916 15119735 2531502 -14514591
5974 -14514591 -12193340 6468749 21425468 24972980 24511277 24249988 21364227 17279835
5966 17279835 17953622 22476065 22224353 12691451 -975828 -10346593 -10522853 -2293958
5958 -2293958 7681523 10997152 5789612 -1845890 -7028914 -10963904 -13351183 -7943372
5950 -7943372 7810184 25491032 35337938 37016846 33787340 23489781 5027237 -12417028
5942 -12417028 -17936501 -13070961 -7405844 -3901605 626183 3967481 26549 -9153040
5934 -9153040 -15097373 -17340326 -24362991 -37475243 -44521923 -34681768 -12239344 8592412
5926 8592412 17038228 11268285 -3458809 -18220609 -25439951 -23321858 -14585655 -2673264
5918 -2673264 7680206 9913418 2446175 -6148718 -6525832 -1992095 -4154157 -15370222
5910 -15370222 -24933183 -24640730 -19169055 -17136209 -19362746 -20925374 -19429191 -16353955
5902 -16353955 -13470662 -11302231 -8883293 -3805637 4567648 11887097 12844189 8084590
5894 8084590 2371217 -2882488 -8368900 -9095010 2300547 21726652 32816430 25957948
5886 25957948 11132471 5065587 10919189 17982249 17798814 12529337 7871944 4451024
5878 4451024 -1608441 -12687464 -25862096 -34085604 -31255389 -17351046 1021316 15194014
5870 15194014 19901575 16124954 10194976 8551895 11192164 11755661 6207565 -1054136
5862 -1054136 -2836675 1962843 8961386 14316274 15229215 8918752 -1387107 -3499489
5854 -3499489 10263449 28426225 31116431 16314790 2721084 2918848 7057689 1273611
5846 1273611 -9228075 -8236768 5975579 16568064 10334622 -5396973 -11822254 40679
5838 40679 20764780 33560129 30242818 14630868 -6255892 -26981947 -38799936 -30941740
5830 -30941740 -5684225 16042424 17030029 6739185 6988887 18404675 20397533 5683502
5822 5683502 -6988580 -2572239 7885384 7410749 -1232926 -5644933 -5486976 -6321668
5814 -6321668 -2930143 11464619 26575447 25740462 11423665 862248 -1600754 -7966678
5806 -7966678 -21686698 -29863114 -26033248 -22625505 -30968723 -42476545 -41031492 -25408518
5798 -25408518 -9127039 -3331799 -7988208 -16152754 -19862523 -14009821 -61181 14471026
5790 14471026 22786608 23672077 18595659 7398441 -9842559 -27944747 -36938978 -29660355
5782 -29660355 -10065996 7742764 12315034 6189228 56118 -2970468 -8813848 -17571660
5774 -17571660 -19345164 -10600141 -2584058 -4175691 -7830085 -4769428 -2994744 -13736859
5766 -13736859 -28335458 -27939539 -12161983 1038172 2087761 -2534476 -8092369 -16361912
5758 -16361912 -21494743 -13059091 2317590 4053700 -10654147 -19808043 -10803645 329236
5750 329236 -2718851 -10028201 -5291575 5805902 8528928 6751300 14059753 25910121
5742 25910121 25089255 11913121 5996173 16036654 27475411 25168304 12456261 1201580
5734 1201580 -4622363 -7759913 -8756907 -6093565 -1323030 1583219 1465796 2111331 7767968
5725 7767968 15568443 15174705 1376619 -15165287 -19240813 -12716819 -11841908 -20912379
5717 -20912379 -25468136 -18430110 -13746814 -21078834 -26016289 -14628055 -919990 -5454850
5709 -5454850 -19602013 -19466022 -6883870 -4786239 -14704999 -13059328 6087220 18481660
5701 18481660 10706251 2102907 9190939 16695673 6144798 -9933539 -8216246 7746615
5693 7746615 16635109 14930967 17142841 26417308 29314876 18618335 1388284 -14943940
5685 -14943940 -27003337 -27856117 -13378761 3826097 4754547 -10233482 -22504629 -23226432
5677 -23226432 -22359774 -26208825 -25347477 -13624268 -2640678 -4819981 -13463584 -12692002
5669 -12692002 -538610 9323702 5728571 -8277622 -19904547 -18106758 -3797553 8695636
5661 8695636 5962036 -6085478 -6509440 12817295 33188687 32022151 12277266 -2945227
5653 -2945227 -894814 9128367 14494455 16234400 21733182 29821623 31891230 24737957
5645 24737957 15127875 11030404 12764243 14839782 13906826 11170493 6912685 -2546568
5637 -2546568 -18151622 -31402627 -31646870 -20626644 -11903882 -12419005 -12683531 -2165048
5629 -2165048 12447433 15002615 3074067 -8496192 -8860817 -5013278 -8926519 -19380173
5621 -19380173 -25198084 -22502528 -19467971 -23158842 -28874159 -26893996 -16449269 -7155134
5613 -7155134 -5224640 -3171343 10880199 34728352 51065189 48873543 38488157 37173421
5605 37173421 44702754 44684043 29163613 9438815 -659575 -739586 2299805 5488262
5597 5488262 6982888 1943468 -8392674 -11566757 706 14017388 13167646 400667
5589 400667 -6463117 -3327100 -4511178 -15943099 -22782618 -12994578 2805472 8272613
5581 8272613 5961954 9401493 18576551 20836010 13777479 10377770 18615633 29719529
5573 29719529 32414678 28614969 27460030 30163703 28994315 19722275 8982301 7151061
5565 7151061 15385563 22179768 15676034 -543046 -8940986 1371445 20490343 30062814
5557 30062814 25571332 18013863 15858193 15977787 14004390 13358220 18609728 26808484
5549 26808484 31333120 29879893 23607879 12434316 -2995430 -16947612 -22105342 -17839919
5541 -17839919 -11416843 -10000349 -13224017 -14557917 -9499137 -1243315 3376801 3177327
5533 3177327 3918755 8508170 11331920 7545194 2730683 4596001 8511040 2909514
5525 2909514 -11076967 -18371568 -12054682 -4162011 -7195237 -15688456 -16110958 -7051023
5517 -7051023 1631537 4639307 5460419 8022717 13765209 23995561 35540412 37302300
5509 37302300 22582040 3491302 919390 18899320 40127423 49078368 47925516 45222872
5501 45222872 40612604 29325489 13928370 1997128 -3981039 -6625291 -6352392 -1206053
5493 -1206053 7203365 13598947 15027584 13179254 11202409 11010500 12414547 12179000 5788526
5484 5788526 -6777329 -18976473 -24716453 -25417252 -26386209 -28284978 -26909956 -20154393
5476 -20154393 -10044805 1589251 13777379 22242408 21057262 11506035 3916981 5849639
5468 5849639 12056970 11888049 4531061 -141740 3461059 8185724 4959801 -3215242
5460 -3215242 -5073008 2898549 11785298 13164165 10022193 10395795 14700819 15593163 9066817
5451 9066817 42347 -3835159 -36334 7984423 14233680 13439882 4411251 -7494191
5443 -7494191 -13154735 -7292091 6507169 18207179 18395162 5254144 -12193830 -19151204
5435 -19151204 -8380043 10740729 21046427 16659260 8223311 7388588 12752353 15980984
5427 15980984 15617845 16594339 19298270 18766111 14923028 14200888 17712013 16076994 2215384
5418 2215384 -16269071 -25115283 -21345348 -15562807 -16374767 -20002150 -18354357 -11446971
5410 -11446971 -6115615 -5110120 -3883964 1122940 6462623 7066703 3985686 1989533
5402 1989533 1006871 -4020429 -13167449 -17193675 -8202127 8508660 19586122 19937643
5394 19937643 17109778 17923083 18312769 11800405 2199203 -604685 4681862 9545958
5386 9545958 9989486 12553149 21389310 27576853 19976564 2626249 -8400093 -5357631
5378 -5357631 2685440 4047389 -897811 -4612887 -6105604 -11586894 -22634165 -31415166
5370 -31415166 -30603318 -23279105 -18482574 -18891177 -17979667 -10429116 -916433 1404190 -4817713
5361 -4817713 -11511439 -12384478 -10468049 -11573431 -14836305 -14973716 -11346395 -8764452 -9921745
5352 -9921745 -12608410 -14547179 -15470369 -13862542 -7790602 -718726 -279084 -8197870 -16986033
5343 -16986033 -20032369 -19228935 -18385614 -15551880 -8638226 -3594752 -8332219 -20380723
5335 -20380723 -28082685 -23395763 -7864135 11738709 26568568 27098074 11193813 -8774159
5327 -8774159 -16412988 -10979494 -7688377 -15739735 -25973356 -25734280 -16611851 -9068290
5319 -9068290 -6413032 -4030914 -479814 895798 341631 2738558 9640509 17255402
5311 17255402 22638405 25060432 21166957 7130704 -12065069 -23527596 -21063261 -12602103
5303 -12602103 -8477919 -8734115 -8190197 -7667370 -10724430 -12999262 -6405045 5682885
5295 5682885 8976074 -1914842 -14374184 -15254746 -8638974 -6486153 -8456670 -4392236
5287 -4392236 5408906 7405095 -4095884 -16255597 -15913677 -8230448 -6674657 -11625275
5279 -11625275 -11832517 -4385818 271025 -4816760 -13101878 -16696751 -18943261 -26394852
5271 -26394852 -34234856 -30212522 -12618673 4645829 8213556 576346 -5256193 -2465860
5263 -2465860 4276156 8734725 10908506 12516450 11359235 5986817 1878632 5818546
5255 5818546 15998165 24857427 30228767 34952925 35990319 25310229 4742367 -11497460
5247 -11497460 -15044791 -13445002 -14543374 -12526850 -1113047 9670535 5713933 -8070050
5239 -8070050 -13532368 -5816622 1997259 536445 -5206707 -8288446 -7873464 -2536431
5231 -2536431 9468975 19959702 16449997 3000700 -383415 13886005 28884866 28329351
5223 28329351 18565433 14325385 16804404 19232833 21759199 25929719 24788486 13860292
5215 13860292 3031447 2052462 3171237 -4560464 -12090601 -2265615 19636982 29537673
5207 29537673 18989172 4797651 614136 -752276 -8798608 -16896671 -14619299 -6739710
5199 -6739710 -6922584 -17805756 -27414051 -24190027 -10262799 307925 -4158231 -19638591
5191 -19638591 -30597617 -30179423 -28962633 -36182243 -41477018 -29713651 -7582249 3687384
5183 3687384 573375 893678 11496618 14509050 -3339139 -26186796 -29446532 -12722194
5175 -12722194 3365813 6090237 2218041 4110926 15327459 29168158 35449584 30919461
5167 30919461 25196798 29835614 39463928 34830258 10181986 -14763332 -19752172 -9916274
5159 -9916274 -4605902 -9036765 -11142048 -1895664 14320284 27726943 31550029 24579323
5151 24579323 13507423 9520150 15259437 19779813 13732341 3248634 24634 4423847
5143 4423847 8614400 9916649 9906112 6741848 516793 -243180 9205934 17655101 13242444
5134 13242444 4780288 9761012 25211244 30991302 21525616 12789524 14426919 16086925
5126 16086925 8877929 1272724 2989157 8535786 8581284 5692371 7530563 13798926
5118 13798926 19339211 21485130 16716523 280135 -22253961 -33637241 -25434329 -10825697
5110 -10825697 -6716246 -11856008 -13733771 -8759544 -2909856 1231167 4955309 5368952
5102 5368952 -673934 -7504466 -6854328 -787491 1958226 -30181 -783595 1874268 5892687
5093 5892687 13076435 25556066 35490651 31156073 14399595 180258 -3378118 -3194294
5085 -3194294 -6740287 -10969785 -10804126 -8443667 -7488657 -5869543 -1829264 -506647 -6977532
5076 -6977532 -17304265 -23763848 -25587938 -27155631 -27664113 -20916157 -6714327 4438990
5068 4438990 2648387 -8294810 -14291059 -8018369 1684582 1081287 -10597667 -20960668
5060 -20960668 -22366572 -21677058 -27065862 -32608759 -25941126 -8246103 4611210 2463131
5052 2463131 -7187059 -11509317 -8840166 -6839382 -9155957 -10761534 -5656747 4878423
5044 4878423 12212442 8097608 -5866546 -17047375 -14068933 -716563 7647785 3377734
5036 3377734 -3625423 622533 15817875 28038382 25944539 11027087 -6386065 -16004829
5028 -16004829 -13365924 -2135702 8486574 12228179 12136891 15612050 23396147 27801546
5020 27801546 23272275 14849409 12936072 21198923 32534368 36917496 31205177 20687382
5012 20687382 12709239 10454754 12385520 15115765 15095657 9190462 -2971060 -16454460
5004 -16454460 -23429056 -20158132 -10823517 -3380326 -2450713 -6808118 -12025469 -13882532
4996 -13882532 -10407092 -2910982 4840037 9782735 11855570 12344437 10951729 6661756
4988 6661756 1325136 -612178 2227098 4795756 1080482 -7244164 -10908255 -3594106
4980 -3594106 9704140 17561263 14743896 7484266 5896574 13032423 22143464 23873311
4972 23873311 16042403 6474039 4495334 8944130 8587230 -1897886 -11088602 -4050522
4964 -4050522 15590217 27470921 20431780 5958585 810491 6661537 14684710 20386374
4956 20386374 22802246 16955487 1027886 -13429970 -12754847 -569142 7863535 8783049
4948 8783049 11493993 16719706 12164943 -4829162 -17983335 -15103070 -5475595 -2938735
4940 -2938735 -5020928 -2432862 2351634 1985930 1049040 8533217 18728417 17436215
4932 17436215 5583584 -630892 5364089 11612732 8304147 3369633 9396532 24143949
4924 24143949 32752173 25635799 8606841 -3911098 -4031861 1462501 827864 -4754264
4916 -4754264 -1701606 12616218 19264095 3437287 -19427866 -22303523 -5893630 2980764
4908 2980764 -8128997 -22528750 -24997759 -22457153 -23107694 -18236237 -1783903 11190353
4900 11190353 6391137 -3713223 1858910 18569242 23960446 13145150 3034814 3320417
4892 3320417 6556701 8741587 17003383 30518871 33684181 18080401 -3783566 -16017138
4884 -16017138 -17852460 -15902823 -10737150 -2278801 1657619 -5057600 -14566105 -13301914
4876 -13301914 526035 15686308 20938230 12922468 -4683339 -22883076 -31426297 -27389288
4868 -27389288 -17447252 -8047750 1558764 12013021 16746851 10209896 -1958916 -9859151
4860 -9859151 -12901045 -17602812 -24603752 -27500606 -23757112 -17603969 -11592348 -3614999
4852 -3614999 6395344 14497872 19375764 23929355 27991059 26283431 17039109 6981475
4844 6981475 3864134 8322733 16161834 24004036 28851306 26707368 17379793 8343181
4836 8343181 8025055 15236740 19656365 13694435 494522 -11250004 -17324865 -19790229
4828 -19790229 -20372932 -16945406 -8865645 -2140908 -4074361 -13471510 -21800021 -25080033
4820 -25080033 -28099966 -33439379 -33500155 -21016718 -2925979 5874927 1388323 -6298150
4812 -6298150 -9021533 -9381739 -10502289 -7855125 911940 5902243 -4441668 -25270427
4804 -25270427 -37619197 -29736075 -9317658 6962146 10670811 6666021 5656493 14282743
4796 14282743 29704502 42065487 44018276 38111069 32438281 29973247 27210376 23929116
4788 23929116 27056490 39507736 50329004 44764293 24149450 7596470 9934070 23702683
4780 23702683 29235637 19545418 7200082 5545810 11258806 11506979 3480835 -2386428
4772 -2386428 1065149 7161201 6500653 1822823 2861984 9056800 8526935 -2559246
4764 -2559246 -9782732 1478485 23367333 32634161 20763390 5796411 8522976 25263843
4756 25263843 33711576 22389194 4179790 -841120 12101677 31437785 45135369
4749 45135369 51087675 52729965 50386902 41031019 26094388 15463385 18771047 31776871
4741 31776871 36921721 22918996 775465 -7350064 4858857 20526630 22199608 13397079
4733 13397079 10689900 19912734 29589289 27220084 14151565 1836252 -2019228 -532360
4725 -532360 -2331456 -10686008 -18615862 -16509009 -4530902 6487481 8341186 4870821
4717 4870821 4361998 7316584 7663116 2838626 -3746683 -7959610 -6453019 4198322
4709 4198322 22129570 35942952 34673020 21575338 9409440 2520699 -6176274 -19441160
4701 -19441160 -28631417 -26669136 -18065944 -10791744 -7114906 -7545550 -13966327 -22303463
4693 -22303463 -22369637 -13517676 -10227420 -21261275 -33159209 -28729460 -14011196 -9163807
4685 -9163807 -16603111 -18165044 -5431749 6879374 4825456 -4247653 -5590770 1795960
4677 1795960 10239473 19155706 31154669 38851258 31388455 12897602 327441 871008
4669 871008 3813719 -999298 -7927680 -6315864 2267566 8292222 11406803 20973449
4661 20973449 38146935 48708099 40617474 21785111 11345308 16008782 24251107 24015454
4653 24015454 16706529 10323724 7332936 5635428 5267422 6692581 6834092 4204301
4645 4204301 3717259 7752253 6655503 -10008887 -34147669 -44807225 -35834972 -24353833
4637 -24353833 -25411545 -31032368 -25075693 -9043403 895521 -2020677 -8023382 -7494542
4629 -7494542 -2650898 40397 -510380 -2205272 -4873485 -8957925 -13273331 -16649627
4621 -16649627 -18158696 -14634525 -2925334 13590585 25823816 28908574 26902327 25169431
4613 25169431 23043605 17596260 10115396 4122771 108591 -3118694 -4182564 -650166
4605 -650166 6959376 16374184 26372766 34295831 34104162 23421879 10615279 6817281
4597 6817281 10383427 7630073 -8065125 -25966616 -32159946 -27062381 -20946561 -17143822
4589 -17143822 -10257879 205410 5933740 2831825 -1788707 -1225668 -807126 -8643425
4581 -8643425 -20207025 -22967310 -15055054 -8123942 -9312748 -10921796 -4036375 6097327
4573 6097327 7379031 -1257608 -9126995 -9426157 -6029184 -3683804 -618096 4971297
4565 4971297 8099751 2768612 -8921125 -18523896 -20364891 -15567807 -9141604 -6125572
4557 -6125572 -8297888 -11634694 -9413139 -568562 8368857 12726995 16014391 21445185
4549 21445185 22992681 14340060 3225322 4382983 17163926 22763871 8907181 -13341978
4541 -13341978 -24952072 -22592530 -17876089 -19240251 -24624909 -28564635 -26985588 -17029420
4533 -17029420 -1057274 10608712 9997856 4074910 7846576 24044853 38622798 38886779
4525 38886779 28185841 19101714 18440666 22721860 23841494 16268043 2137479 -9539065
4517 -9539065 -12084307 -8685759 -6214720 -4650244 -646968 1666791 -4231121 -11922260
4509 -11922260 -6734277 10837489 22014143 16912920 8906213 10898810 12860461 -185670
4501 -185670 -19088371 -20149956 416096 21032051 24412803 16329973 11777327 15877854
4493 15877854 22863952 24107172 14029450 -3937507 -16368051 -13166862 -1479309 3171670
4485 3171670 -1551310 -4014924 354597 1075259 -10102877 -25637700 -32128613 -25975933
4477 -25975933 -14867361 -9814682 -16741303 -28858802 -29218877 -11276197 6028418 -1065839
4469 -1065839 -26432398 -39311311 -27298898 -12199312 -14305477 -23317859 -20352695 -9561132
4461 -9561132 -6956615 -11242693 -8533549 1450357 5646069 697267 -3566855 -2364512
4453 -2364512 -482227 873890 5653539 11056692 9026643 667373 -4308650 -2965297
4445 -2965297 -881795 897105 6184488 11136576 7501253 -254317 1634638 12057321
4437 12057321 12689597 -2675155 -14256172 -3860434 17761684 25577937 12658573 -6454375
4429 -6454375 -18127259 -20886375 -17380992 -8916859 595700 5092974 3547761 870134
4421 870134 395558 430669 -796142 -1509228 67930 1616721 -576414 -4968937 -3741268
4412 -3741268 8315466 24300420 29701278 19320555 4865274 608010 6002673 9571013
4404 9571013 6091907 657952 -2105350 -2352026 983091 9382611 16532821 11958072
4396 11958072 -3924702 -18177933 -21953862 -19028608 -14916466 -8952027 -2185524 -1472358
4388 -1472358 -8219433 -13017864 -9466968 -4185518 -4721278 -6632030 -2483443 4130376
4380 4130376 4370473 -1878910 -7986015 -11564413 -14002955 -13788116 -9569580 -5311286 -3608367
4371 -3608367 754405 11282292 20141375 19274019 15229863 19605716 28937481 28893063 16844173
4362 16844173 5403704 2889253 4516109 5343078 8294149 14815407 19308884 18361658
4354 18361658 16206414 16568447 17818031 19674978 24918179 30174127 25520386 9521399
4346 9521399 -5021508 -7955041 -5732727 -9527567 -16868867 -16193560 -5439527 5264169
4338 5264169 8440471 6558659 3290426 -3103217 -13192125 -19853434 -15220223 -2071804
4330 -2071804 8195842 10237798 11653886 20363890 29082682 21733874 -2907216 -23797970
4322 -23797970 -21166806 -588003 16256407 20052359 20413670 25219975 28250229 22475210
4314 22475210 13399715 10217976 11343511 7880378 -2915096 -15369795 -23399405 -24220787
4306 -24220787 -17240273 -5989883 1247380 -567194 -6321635 -8113231 -7321725 -11302681
4298 -11302681 -18582476 -17043988 -747750 19034228 26352376 20314833 14998444 20113763
4290 20113763 28687910 27324125 14409080 2469397 2533072 10947080 14454493 5945820
4282 5945820 -8206850 -16072040 -12567348 -3071125 3718373 4907182 4971042 8935275
4274 8935275 16097812 22204238 25753529 28131312 28353036 23418149 15109337 10115194
4266 10115194 10142221 8049943 -1278584 -11872502 -14777372 -10496449 -6274122 -5000623
4258 -5000623 -4450650 -3918413 -3311092 919187 9694064 14396249 6647663 -7452594 -14546068
4249 -14546068 -13482993 -14101354 -17592041 -14406448 -4086246 327058 -5998219 -10314310
4241 -10314310 -3815977 3291878 122577 -6106347 -4166786 1178316 256948 -1348777
4233 -1348777 6559109 16002770 11011391 -3114698 -4659027 8758210 13357581 -3917055
4225 -3917055 -23176472 -19851352 984501 15133383 13865019 10564372 16894267 28027125
4217 28027125 32828845 27430607 15518378 2413563 -7971793 -14352454 -17953838 -19129723
4209 -19129723 -15397645 -6307428 1891468 2265150 -2406827 -1657070 8182907 17088707
4201 17088707 12989472 -3192964 -18618355 -22449399 -13930849 1747420 18624551 29216131
4193 29216131 25781268 8657699 -10091124 -18320836 -18038199 -21134791 -30924203 -36272391
4185 -36272391 -27480339 -10545604 490685 301739 -5523719 -11378472 -16481324 -19725377
4177 -19725377 -18009816 -12190406 -8882844 -12735486 -20163673 -23774108 -20887805 -15054648
4169 -15054648 -10701210 -9473128 -11968497 -19708441 -32133123 -42434739 -41255594 -27744814
4161 -27744814 -13421090 -9548485 -12497907 -8742445 5522136 18319778 18708690 11450964
4153 11450964 8552610 12202150 14195403 9494082 2805606 1893143 9345113 20988255
4145 20988255 29624713 31402605 29790303 30198080 30298909 22378715 7636201 -1029839
4137 -1029839 3452717 11111290 10226647 5592471 9583773 21055852 27141507 23580580
4129 23580580 19715046 23307445 32222087 41473850 47503657 45513121 33938297 21737968
4121 21737968 19541396 23285302 19017336 4400545 -8156162 -10949941 -8594962 -3823223
4113 -3823223 7593207 22375524 26889312 16800409 4443544 -1644794 -8301635 -18734868
4105 -18734868 -19787673 -3320892 15321630 18606752 13927604 19291919 32369782 36566482
4097 36566482 31060942 30028841 34158896 28481821 11885339 4524298 17026695 32572102
4089 32572102 31406223 17277595 6812656 5394832 7151626 9422845 13366656 15810943
4081 15810943 12758101 7870091 7640884 10707875 10224064 3950358 -5791732 -18606320
4073 -18606320 -33499955 -42948646 -40200322 -31926971 -32552018 -43930056 -51303577 -44043390
4065 -44043390 -30399071 -23887827 -23469298 -18882594 -11058135 -12293367 -23835214 -27544324
4057 -27544324 -9035369 20169187 35544208 30148349 19838089 18614281 21252480 14193872
4049 14193872 -5834409 -29164397 -42511616 -37644521 -18097309 -561860 -1106052 -15529847
4041 -15529847 -22516749 -11750500 1846317 253082 -12458733 -19380514 -15970747 -10791876
4033 -10791876 -7345263 -2044581 2634109 8573 -6350694 -6706125 -4129903 -11136108
4025 -11136108 -24400222 -23195781 -1809306 15264622 4567395 -23793507 -40579695
4018 -40579695 -34440140 -18147113 -4611944 5685905 14710242 20136917 21747899 23462575
4010 23462575 25183982 20397625 5353277 -14554268 -29867781 -35228425 -32364189 -28365877
4002 -28365877 -30115005 -36790535 -39291358 -30693380 -15087300 -2067659 4477826 6950548
3994 6950548 6718127 3019139 -2563344 -7226399 -11607749 -17383904 -21842461 -21500643 -19296644
3985 -19296644 -20105354 -20306388 -11743352 2918391 9648276 2179603 -8041661 -7849646
3977 -7849646 -375533 1814535 -3839688 -7974324 -5321051 -2007614 -4065366 -6971418
3969 -6971418 -2489119 8541698 16613266 15370418 7421091 -1834470 -10264293 -16136959
3961 -16136959 -14739530 -4357022 6524455 5835413 -6529332 -16458965 -12760131 -1077266
3953 -1077266 4685565 550810 -5051529 -4919247 -1158890 1385142 2737068 5396268
3945 5396268 8895880 10572293 9252660 5246744 -1253197 -8799278 -13141299 -10462980
3937 -10462980 -2667312 2721949 -561794 -11067420 -21141294 -25350364 -26107690 -28987037
3929 -28987037 -33256260 -30902542 -16690531 4247750 21784030 30981870 33432469 31265575
3921 31265575 25107855 16934303 9486915 2537248 -5431881 -11316853 -8508730 4220823
3913 4220823 19540766 29504186 32443054 29773197 21368645 8758590 -1499435 -4469975
3905 -4469975 -5130554 -12644395 -25347027 -28696624 -12856187 12210990 25663862 18668869
3897 18668869 2262113 -8214192 -9456536 -6947690 -2073061 8456539 22092431 29240985
3889 29240985 25239676 15839180 7193041 -1750095 -11337439 -13876532 -3797356 9715674
3881 9715674 11179769 -1516129 -15754072 -22046527 -23128831 -24173818 -24270397 -21008295
3873 -21008295 -14945354 -6156509 5559897 14507094 13144422 6160836 8608013 22961932
3865 22961932 30516637 16847383 -5266822 -13365228 -7175188 -4383375 -9139957 -6813549
3857 -6813549 7164027 14811932 1907891 -19895630 -30211323 -26717410 -20704520 -15807072
3849 -15807072 -7900027 -782586 -4156317 -15650091 -20174334 -10573670 3482810 11303078
3841 11303078 14429345 18604682 22902736 24345472 25205989 27566602 26834804 18751109
3833 18751109 7828891 1071494 -1927437 -4665652 -4917321 -303818 1843514 -7090869
3825 -7090869 -20154415 -19968861 -2624748 16249862 23000799 21045413 18873476 15931134
3817 15931134 10084320 8269109 16692920 26892918 24810596 10774896 -1226963 -2217806
3809 -2217806 4987135 15868454 28386545 36305595 31322468 16247158 5538031 7087840
3801 7087840 12033995 8608387 -1587118 -8267843 -7499722 -4135903 -2535969 -2143118
3793 -2143118 -1207607 752837 4210553 9346940 14041567 14589067 9260133 930155 -3795778
3784 -3795778 166465 9684592 14005716 6293656 -6777194 -11956765 -4521714 9641100
3776 9641100 24981896 40041312 50203484 48067898 35203293 23748476 20791739 19796065
3768 19796065 13187857 4170968 -1327147 -5314677 -10912052 -12827369 -5826737 3087343
3760 3087343 2858081 -4576785 -6461176 3347946 18552617 30064062 32865306 26063251
3752 26063251 15183891 11441904 19362675 28678508 28668091 25755939 33563450 49001727
3744 49001727 54497228 44165428 31350715 26994855 26192439 21873984 17527655 18404184
3736 18404184 21491369 22292539 22628214 25149787 28128470 30166328 31096316 25461905 7474821
3727 7474821 -13519436 -17777486 -2887293 9105406 3079126 -6873342 -1859248 9876087
3719 9876087 6223425 -12773353 -25079095 -20118765 -10626404 -9099298 -11125021 -7670126
3711 -7670126 626538 8242203 13517854 16866207 17613217 16237213 13965356 9535637
3703 9535637 2867588 279043 6888317 15314423 13252950 2338798 -2902061 3312103
3695 3312103 10328768 8913807 4111148 3755543 5039764 878505 -8035175 -15257368
3687 -15257368 -17259709 -14573652 -9723296 -7988311 -13431237 -20197553 -15965925 640307
3679 640307 14742957 14295184 6196685 4545768 9984911 11668138 5612460 -307387
3671 -307387 732017 5668358 7245397 3063729 -2058329 -110656 11928117 25296524
3663 25296524 24929931 6523658 -15512237 -22760729 -12662736 1514181 7203339 2945088
3655 2945088 -4565793 -6479157 3566315 23316644 40143669 41500465 28252822 13728982
3647 13728982 9858464 17884664 31210055 42453603 48148198 50551748 54268773 58413501
3639 58413501 55215849 40798297 23495740 14797136 14852512 14853856 11913721 12083301 18102218
3630 18102218 24050138 25600323 27008773 32328132 36122069 30002115 15197449 2007523
3622 2007523 -2578532 -1492875 -1091272 -2390318 -1885084 641480 -182465 -7124357 -13050754
3613 -13050754 -7977807 6165196 14927311 9396123 -1555021 -3608837 3752067 9679759
3605 9679759 10682728 14962067 26083030 34019399 29931093 22150565 26807885 44201001
3597 44201001 54843842 43395929 19949045 9325446 20192933 33930154 28882130
3590 28882130 8036249 -6978649 -5016888 4593682 11144574 16295361 23021641 25488931
3582 25488931 20450918 16600414 19663771 18918732 4176174 -12890480 -13004983 1392076
3574 1392076 11505408 12603480 15531387 18544494 4980160 -23932035 -40351994 -27724697
3566 -27724697 -5281221 2104501 -1004581 4017581 15743873 18433556 11839920 9881887
3558 9881887 13518642 9056889 -5498731 -13926838 -6365833 7281638 14917209 18608647
3550 18608647 25546923 33483529 33514894 21806675 3939902 -8766764 -7224933 5662883
3542 5662883 15021424 10845549 1484843 982390 7726027 9615767 7304210 13712833
3534 13712833 28183946 30920267 11804901 -11824495 -17853469 -6802320 5705090
3527 5705090 12336100 15783140 16246142 13072329 13492730 23737204 33460196 24452342
3519 24452342 -3473527 -28333267 -31485186 -17144034 -2239161 4329220 6371753 10239686
3511 10239686 16476622 20148178 16427949 6770654 51546 5148064 21542433 39121067
3503 39121067 47201289 41930366 26483534 8235626 -4238533 -5723508 2064918 12904761
3495 12904761 21729330 26019407 23779343 15106188 5708259 3475743 9377943 15437192
3487 15437192 13923830 5573180 -3297181 -8487207 -9491612 -5840888 3403099 15739823
3479 15739823 23949572 21311914 8203110 -7584405 -17709883 -20057512 -18234028 -15782648
3471 -15782648 -13600659 -12797316 -15336311 -18670318 -13900158 4161834 25821330 32625054
3463 32625054 17637548 -5479172 -17598575 -14250071 -5604014 -1468 4321068 10479165
3455 10479165 14244814 9651871 -790450 -7678687 -5718723 1353808 6346975 4612066
3447 4612066 -5275980 -20922370 -33871436 -33386269 -17627413 1095937 6901770 -3919821
3439 -3919821 -20081915 -26941906 -18499558 56592 17431152 24078780 18773426 8595140
3431 8595140 1504267 264027 4703781 15547483 31028202 42989809 43689555 35883385
3423 35883385 29065814 25371910 16973969 -341231 -18509834 -26199465 -20938459 -8603162
3415 -8603162 3817885 11201572 11774765 10499290 16085570 29702473 41368772 42434907
3407 42434907 36104439 29641248 22736488 12672087 5626551 10512266 22908364 27784203
3399 27784203 20477084 13353403 16531282 22336743 17515658 4017441 -3205092 2488483
3391 2488483 10283912 7190416 -4315162 -10109956 -3713339 5333920 5267609 -1311136
3383 -1311136 -2119436 5072014 7394878 -4284836 -20438463 -25138179 -16917211 -6551764
3375 -6551764 2041938 14958558 31680439 39740818 32307314 19869550 15686158 17885385
3367 17885385 15784463 7853719 2542620 4647546 11500528 20879852 31558408 35886539
3359 35886539 24129013 533329 -15453239 -11391669 2222690 6627887 -427417 -5153854
3351 -5153854 -409446 4310950 -1602215 -14730602 -24499551 -27641746 -26917974 -20117962
3343 -20117962 -2048373 21540829 33070248 22645514 2053661 -8281107 -3114841
3336 -3114841 4323615 1629915 -8345002 -14691769 -13504470 -10553601 -11761141 -16157627
3328 -16157627 -18442700 -15104432 -6678742 4042374 13888907 19636741 18724585 11630893
3320 11630893 3090080 -1208591 139880 3605739 5272469 3676683 -2136924 -13355934
3312 -13355934 -27428293 -36495420 -33946947 -21302818 -5396875 9473245 22592651
3305 22592651 31768950 33018282 26447941 18368298 15776895 20750153 30095346 37530125
3297 37530125 36527916 25093676 8935315 -2865047 -6184902 -4212059 -2658101 -5590270
3289 -5590270 -14142114 -24573085 -28790165 -22587743 -12985455 -10913849 -16275258 -17601858
3281 -17601858 -8224765 4800213 10824843 7311751 -2211911 -14206604 -24039155 -26138979
3273 -26138979 -21449776 -18091378 -18123795 -11380145 8466313 29077053 33166331 22555187
3265 22555187 14445775 15409043 14916588 7329627 3777621 13233502 24795627 22084091
3257 22084091 8036883 1173909 9337710 20747420 23499253 21763007 25312435 31354288
3249 31354288 27993978 14003106 3779883 7888733 16688756 12401658 -5474687 -17561058
3241 -17561058 -10096997 6260092 10036082 -4743431 -24488567 -34799465 -33207076 -23594669
3233 -23594669 -8971553 5683449 11796263 5884640 -3804766 -5361308 3991306 17470384
3225 17470384 28498232 35420646 37751666 34008886 25164540 16191436 11298685 9187815
3217 9187815 4971137 -3897830 -14801897 -22420935 -22761103 -15207911 -2859101 7698518
3209 7698518 8915271 -1423445 -15607969 -21560781 -15375268 -4866639 2230791 8426849
3201 8426849 18489618 26204472 20556252 5112299 -1742059 8778967 22851582 24281901
3193 24281901 17314728 16114508 19142539 11850826 -6274514 -16270830 -6893118 9077471
3185 9077471 15320684 14662112 17889116 21523088 14927773 3433041 3545928 14529254
3177 14529254 15403947 -3039651 -22122258 -23151792 -15227025 -17670820 -26113267 -18600284
3169 -18600284 7672516 28939794 28879583 19539681 17889948 18788697 7605257 -11217413
3161 -11217413 -17704617 -5848685 7598968 6453441 -6031981 -16093383 -16553428 -9297058
3153 -9297058 602322 6293617 1132232 -13099798 -23620503 -19052577 -2451196 13094917
3145 13094917 19348738 18045469 13775758 8885109 5342479 5122933 7046440 8066560
3137 8066560 9092751 14567006 24122992 29753629 25157281 14309446 6460991 5212256
3129 5212256 6989848 8124015 7891818 5377776 -524629 -6900299 -8340417 -5110426
3121 -5110426 -4575133 -10872578 -17907103 -17669404 -11807545 -8570848 -10287801 -10798242 -5185867
3112 -5185867 4215367 11990331 13805474 6224332 -9966550 -24367850 -23693673 -8929475
3104 -8929475 1888007 -5017195 -21587504 -30300212 -28544107 -29009229 -37799828 -45372987
3096 -45372987 -42552330 -34318281 -30548234 -30480694 -25243176 -12907714 -2859149 -4103946
3088 -4103946 -14352187 -23417955 -25479519 -25051512 -29757523 -39105708 -44385049 -40682272
3080 -40682272 -33976022 -32107856 -33361621 -31180828 -26981254 -28166144 -33428271 -31500941
3072 -31500941 -18475351 -5556867 -2521429 -2959941 4060016 15137277 18223360 13466655
3064 13466655 14070535 25165145 35032108 32469969 22141747 15017428 11644845 4696153
3056 4696153 -6170340 -12403568 -9373844 -2362931 2687038 7576892 16648183 27689511
3048 27689511 33719880 32571512 29668975 30283852 32564169 30335371 20842717 7597067
3040 7597067 -3289879 -7512597 -4274051 3437238 9621610 8930632 1834701 -4497397
3032 -4497397 -2499126 7788581 17845801 19136502 12806832 9512641 17811193 33544311
3024 33544311 43702216 41000795 30626534 20957025 12958546 3720207 -3934075 -3562981
3016 -3562981 4026746 10270816 10604487 9010497 8274912 4070975 -5938056 -14531336
3008 -14531336 -14278967 -9384055 -9430976 -14439553 -15611711 -9921920 -4125323 -2921590 -2724590
2999 -2724590 -957688 -2745157 -11826272 -21262646 -21289107 -12721370 -4221353 1713843 10336639
2990 10336639 21112470 22907804 9015003 -9978176 -17087168 -9450180 1117967 6751708
2982 6751708 11794510 19929568 24703514 20788108 15611664 18431421 23740414 19246959
2974 19246959 7764757 5271541 15009618 19772957 7208622 -11663314 -20042932 -19158563
2966 -19158563 -20443690 -23402615 -18376487 -6493200 841326 1175115 2498245 4698476
2958 4698476 -1913456 -14891953 -15742901 1940468 17610013 12434498 -511793 5466429
2950 5466429 29505724 42460189 27869352 2976283 -8272950 -6155586 -6793698 -14580297
2942 -14580297 -19062910 -15472365 -12589526 -16658766 -19288601 -9693105 6943155 12999586
2934 12999586 54052 -20997824 -34346226 -37146010 -37030141 -36581668 -30368316 -18332196
2926 -18332196 -11663626 -18172548 -28091102 -24290112 -5289502 11385641 11115568 -390515
2918 -390515 -6419387 -381018 9106239 11883620 8078220 5146709 7725600 12830607
2910 12830607 13384625 5723983 -4844758 -6600016 6930395 27186839 36716280 27697250
2902 27697250 10938520 3166508 8761521 18676852 24017138 23176231 16387117 2368241
2894 2368241 -16166826 -30910238 -37025136 -38382721 -38454462 -31730129 -12082579 13983863
2886 13983863 31638588 34533415 29104737 22216084 13581665 2711945 -5288135 -5798274
2878 -5798274 -815207 5220466 10637356 13863153 11541647 4715123 1585887 7212843
2870 7212843 14203626 11561748 1241779 -2270941 9609499 27669798 34542551 23303115
2862 23303115 4126157 -6586804 -2793082 5757590 5885056 -2019792 -4002276 8678104
2854 8678104 26852248 34796860 29221340 19388942 12074848 6441964 3070843 6676716
2846 6676716 16157072 21349505 15790957 6062817 2166185 4082787 4884488 2884801
2838 2884801 2557267 5372838 7809670 8615777 10898561 15455665 18107546 16072537 11850933
2829 11850933 7790292 1544977 -8618100 -17365725 -16972028 -8016803 -311704 -1336328
2821 -1336328 -7044252 -6933082 3310624 17222690 25463852 25193759 19920465 12758813
2813 12758813 4087791 -4036809 -5974092 1532628 13844769 22684733 24663704 21825524
2805 21825524 15382996 5212441 -3695989 -1995237 11896088 26217867 29440480 25435048
2797 25435048 26323443 32451419 31214949 18310984 7841872 12836089 24794592 24840903
2789 24840903 10867968 30623 4006037 15162477 21731063 24389228 28898046 31542573
2781 31542573 24360632 11007677 4867149 10715050 18831034 20220876 18366701 20545342
2773 20545342 24802621 23067459 13610548 3387396 -1003151 540627 4093469 6151375
2765 6151375 5947057 6681679 13375480 25708650 34516162 30715376 17435950 7532915
2757 7532915 8323995 14847812 19700193 22121766 23264553 19935701 10623104 2813630
2749 2813630 5202114 14782189 20870211 21337716 24649468 33664085 38011028 28979247
2741 28979247 14253152 9169033 16914073 25282867 21983846 6935800 -10439803 -21044994
2733 -21044994 -22580697 -19521403 -17129486 -14640125 -7006447 5060130 12160948 8197534
2725 8197534 195023 -1335364 1999787 255999 -6999507 -7990273 3883734 20461167
2717 20461167 31336803 36669729 40706646 40582508 31427847 18575314 14173941 20961084
2709 20961084 27056325 19599892 -739493 -21032630 -29134146 -23844512 -13908041 -8655521
2701 -8655521 -9710769 -11637239 -9782713 -5527802 -3338083 -4676644 -6260504 -3674223
2693 -3674223 3398548 8759221 4154059 -10874719 -24865925 -24600913 -9398264 8844285
2685 8844285 19102758 19081551 10614823 -3723533 -16694204 -18180838 -7035070 5205047
2677 5205047 8353711 5549483 5384020 8788377 11682982 14753817 20689960 25456412
2669 25456412 22694414 14998862 10989449 12146724 12252679 9396090 8076085 8391172
2661 8391172 3916423 -6416857 -13902645 -12074758 -5322385 -1079755 -727576 -2953355
2653 -2953355 -8810055 -17199684 -21185331 -15774067 -5750774 68866 -606613 -3663336
2645 -3663336 -5851725 -6441880 -4257571 1290196 7614571 11989654 15555876 19774655
2637 19774655 20770204 13047422 -927462 -9902955 -4592072 12977948 31435165 39455376
2629 39455376 33324487 17772000 715402 -13081270 -23158740 -29033104 -27606632 -16728116
2621 -16728116 497792 17057855 26623164 25952740 15907286 3182022 -1815561 5552508
2613 5552508 16486688 15745221 -982769 -20131153 -24547968 -13076836 -1231802 -1936258
2605 -1936258 -10874448 -14790293 -10260555 -6838247 -11498784 -18163517 -17323615 -10111218
2597 -10111218 -5618209 -7026210 -7959450 -2398785 8226525 18309258 22392580 15836111
2589 15836111 -1279010 -18185271 -19279561 -2433161 13639194 8589129 -14547615
2582 -14547615 -31888341 -27756811 -12868090 -7524440 -13072316 -11836716 3940315 16931589
2574 16931589 8584871 -11343334 -15845715 768220 14705940 8868080 -2041492 3497312
2566 3497312 19147765 21414677 6575552 -5814005 -4676969 -346402 -1761955 -1103763
2558 -1103763 9820430 23701128 29038833 26024886 21578421 17893405 14382561 12634435
2550 12634435 12007416 8432556 3989041 8566856 25176868 42720428 50085522 48073596
2542 48073596 41446415 30892224 20517081 20389563 31483347 40248404 38886186 38013602
2534 38013602 46805684 54692489 48763045 36647487 33964326 39942179 44291595 47527391
2526 47527391 54177866 56892217 50232544 49032065 66441937 85280884 84298830 82787558
2518 82787558 114768141 158238774 142006213 43108021 -67226018 -106956011 -79266003
2511 -79266003 -49198894 -50839986 -61542811 -56076920 -41303971 -32328032 -27820212 -20203416
2503 -20203416 -9281266 2565791 13803933 18560789 11784375 837594 -2257558 -251448
2495 -251448 -6719408 -22061271 -30592744 -24818884 -15856709 -14024959 -14416573 -9450889
2487 -9450889 -2565346 -282399 -719080 1167290 4346420 5029045 3020951 -794514 -7011686
2478 -7011686 -12954014 -12158976 -3715610 4223220 5201487 2612953 2325484 3451070 1939111
2469 1939111 -2072745 -5991738 -9345695 -11879857 -11398963 -7707136 -4356659 -2902536
2461 -2902536 -484226 3229578 2656372 -5228059 -14352072 -16790595 -12251138 -6119404
2453 -6119404 -2979391 -5689175 -14096799 -19959819 -11636989 8705828 21313224 13053886
2445 13053886 -1801344 1151723 22483599 38004587 32163604 16751720 11318917 18049538
2437 18049538 24178758 20164792 6819498 -9485576 -20646847 -19876590 -8008332 5435007
2429 5435007 12221226 13603385 14736149 15510567 12643907 7148962 3173009 1777774
2421 1777774 1996357 5638693 13945235 20906276 17954495 6142417 -3518639 -3940497
2413 -3940497 -147089 -1080797 -8563903 -17360640 -21520770 -17463963 -5217118 9437153
2405 9437153 17709819 17138907 15319916 19513098 24853840 19309901 988440 -15419012
2397 -15419012 -13515080 5687052 23740265 24541981 10802104 -2048139 -5622683 -5591598
2389 -5591598 -7814731 -6474416 5706271 20966833 22747955 8780452 -4383013 -4171758
2381 -4171758 2128580 1810322 -3314656 -3013625 1945345 365417 -10633695 -20005253
2373 -20005253 -18273612 -8828734 127232 7300818 16655520 28077354 34496371 28383986
2365 28383986 10648943 -7152241 -12847121 -8092059 -7680815 -19527154 -31423559 -26619616
2357 -26619616 -8200354 3849826 -888045 -11703839 -13770223 -5953579 2469360 4339117
2349 4339117 -556674 -6857261 -7010289 1069242 9049829 7537952 -795582 -6629412
2341 -6629412 -10502412 -20509977 -33333893 -34216990 -20631805 -9478121 -12737245 -21349978
2333 -21349978 -22785256 -19047258 -15439275 -7275912 6827907 12818186 912328 -14122178
2325 -14122178 -12539589 -222098 1662246 -9847969 -19731195 -23854342 -31985482 -42339202
2317 -42339202 -39414488 -22255559 -10921440 -16558979 -26111698 -25974238 -20455139 -15379610
2309 -15379610 -3112633 20658017 40975545 41406143 26715589 12783012 4056330 -3720208
2301 -3720208 -7522912 -1093875 9751328 11369856 148981 -15395354 -27420595 -33016666
2293 -33016666 -29681050 -18297235 -8031657 -7210009 -11241015 -9372858 -458987 8241130
2285 8241130 14262159 19925227 21994072 15066744 4986096 5087146 16876112 26818467
2277 26818467 25489186 18173805 12330339 6268356 -3083216 -10859566 -10780181 -4425647
2269 -4425647 2944531 10295952 18117784 23004625 21913497 18162671 16811465 17100151
2261 17100151 15427622 12701392 11956541 10986352 5060793 -3506375 -6366513 -1267855
2253 -1267855 4032306 3294118 876139 4105514 11412826 14933223 12498007 9727551
2245 9727551 10653380 13599659 17290539 23141729 28732808 27409242 19495789 15375771
2237 15375771 19501887 19702524 4311119 -16307422 -20974103 -8315206 1322734 -3139948
2229 -3139948 -9105776 -4422478 2014824 -2527270 -10758471 -6495146 8406611 16742208
2221 16742208 12616338 8155571 12885830 21772046 27305990 30557954 34616888 36604528
2213 36604528 32180059 21951068 9482321 -2324579 -10940780 -15073398 -16411504 -15589332
2205 -15589332 -7796097 10297338 30305726 38121186 31257758 21474030 18396769 19095240
2197 19095240 16046281 7077005 -4799631 -13262112 -9316938 9695400 29785671 31098923
2189 31098923 13293385 -2231378 -1256094 5685227 3430026 -4364545 -5814632 -3289939
2181 -3289939 -7099811 -12789053 -4406739 19050593 37531697 35002067 18067713 4237282
2173 4237282 1578027 5793990 9675979 9075967 4093385 -763197 31986 7287628 16692883
2164 16692883 23346145 23084127 12132956 -7122664 -21366916 -17172753 1400093 14975442
2156 14975442 11714662 -764260 -10048833 -15268689 -21398249 -26097875 -23097061 -14458859
2148 -14458859 -9368853 -12268649 -20076875 -29018911 -35684340 -33182047 -16774276 5421769
2140 5421769 17284914 13672455 5902859 3920644 2124522 -9110316 -24875978 -30040038
2132 -30040038 -20166636 -7136322 -1951413 -1617959 1661553 6046890 3615634 -4986455
2124 -4986455 -9386833 -4698146 330995 -4421298 -15418425 -19761546 -12018694 1253766
2116 1253766 14008828 28587709 46325220 57851512 52024382 32372960 15724392
2109 15724392 12947049 17724012 16961970 6870670 -4640715 -7531622 1611200 17187110
2101 17187110 28254526 27443907 18246214 10571340 8555554 7917953 6195967 7554375
2093 7554375 13777454 19279081 21269193 25858225 35373878 39040851 28713089 15486764
2085 15486764 14366125 18665937 10118448 -7952069 -12022604 2705267 10464293 -5535396
2077 -5535396 -24872913 -20708742 -1237710 3500441 -14060839 -32288690 -33770707 -22807193
2069 -22807193 -9457622 3584920 14809982 20974789 24174451 28829640 30491542 21378378
2061 21378378 7113243 1854855 5319007 2305804 -11050061 -18964170 -11023287 1663989
2053 1663989 4797750 375662 -2238425 -1125047 2551447 10816939 20613783 22260354
2045 22260354 16465031 18481599 33213341 41885387 29379387 9817892 5168405 11115337
2037 11115337 7446097 -6545216 -12482470 -4635407 3948926 6574621 9698362 12377437
2029 12377437 3480349 -14293539 -20564884 -7147278 8312547 9685654 4607585 5892130
2021 5892130 7961636 -542496 -12851499 -12067356 2768175 15567286 16256078 11153171
2013 11153171 10108181 14184786 17983624 16951811 10493942 1622454 -5930364 -11170736
2005 -11170736 -14267422 -12201620 -1916058 11801521 19612288 20571539 22779333 28943236
1997 28943236 32344461 30685987 30562478 31887571 23052769 2193052 -11693740 -3999856
1989 -3999856 11570671 12209161 -798835 -8308054 -5496054 -4706263 -8444281 -3525565
1981 -3525565 14066786 29554093 31612522 26989758 25651705 26902406 27700548 29840896
1973 29840896 30785717 22074329 6164068 320716 12389410 26125930 23872446 11922859
1965 11922859 8370280 15745517 22310601 22871387 20367645 11856545 -7327212 -25934895
1957 -25934895 -23068025 2789290 27144302 29910032 19837410 18617518 29745779 35785695
1949 35785695 24343173 5728490 246870 12440454 24667415 18985481 627571
1942 627571 -8774226 -1271379 6139063 -2606785 -16874114 -13551319 8918913 27626434
1934 27626434 26315986 13175467 3338511 -1365088 -6628706 -11064147 -8617235 -35063
1926 -35063 7142257 7432421 861473 -8849483 -15141413 -12065577 -1503700 6978534 7041511
1917 7041511 1609912 -4795890 -12709736 -21889491 -26161577 -20974409 -10443827 -459634
1909 -459634 9133469 18547942 21370652 13408026 2754106 646206 6214778 10384064
1901 10384064 10736597 11169059 10715455 6320783 4654925 15681544 33319338 38471693
1893 38471693 26069231 14164662 18218982 29230149 27976843 11654369 -4723518
1886 -4723518 -7368297 5354199 25811986 41956747 43697269 32914106 23436555 23876346
1878 23876346 25795747 17438383 2923568 -4240423 -2560743 -2959565 -8280455 -7947092
1870 -7947092 2516324 10685201 4637572 -9141173 -15788229 -13043633 -10440825 -10969744
1862 -10969744 -6392025 7164407 19684680 19656052 9786562 2769974 3563322 3663634
1854 3663634 -4756910 -14810781 -10905527 11953284 39985355 53998733 48050398 32306832
1846 32306832 20125720 16728851 19535071 23539803 23672266 16436082 4116000 -4561221
1838 -4561221 -2785969 5833796 11661944 11679134 11978969 16275617 18866802 13722684 4564080
1829 4564080 -1449111 -5723645 -14209145 -23094543 -20181076 -3237525 13648426 17556381
1821 17556381 11622898 5792116 1422030 -5474121 -12422661 -13427812 -10375865 -10750013
1813 -10750013 -15724099 -20253449 -22969404 -25482228 -23761855 -12669647 1046875 4129757
1805 4129757 -2158537 -503838 17063995 35226656 35586353 20376798 5892225 261506
1797 261506 -1325505 -4408334 -8889425 -12651319 -13315448 -7907897 2734549 10796663
1789 10796663 8331988 -3703249 -16836793 -23531919 -21836692 -14975639 -8699966 -5521412
1781 -5521412 -870826 9453247 18411410 13796485 -3119044 -16507775 -17451620 -13482516
1773 -13482516 -10532295 -771692 19746882 35106810 27708319 3811861 -15255126 -21010318
1765 -21010318 -21037910 -19807505 -13701646 -3267615 5468734 11997574 20537814 29117196
1757 29117196 31755277 29866293 29286737 28527168 22729038 15855791 14831657 15326000 9302846
1748 9302846 3173714 9903381 24360218 26283813 9468756 -10515013 -19840084 -19231545
1740 -19231545 -11248976 4900634 21138754 23103311 11782441 4372329 7239471 7036463
1732 7036463 -3924006 -13450595 -10641425 -2622575 1151521 4055111 9901449 11542202
1724 11542202 4089007 -4991318 -9976049 -16457092 -26759667 -31570228 -26478280 -20591267
1716 -20591267 -18683417 -12805244 -2214738 -1259624 -14436181 -24746126 -21799992 -19685174
1708 -19685174 -29953568 -39452330 -34762272 -26597123 -28436731 -32668469 -30192952 -30643286
1700 -30643286 -39246622 -38845867 -21725439 -11754557 -24284012 -34674124 -22811015 -13933445
1692 -13933445 -29852597 -39966331 -24272251 -45160305 -163952934 -302769323 -300100282
1685 -300100282 -125508062 62009529 113712451 59737509 18946359 23367065 19666853
1678 19666853 -9005698 -22803106 -9769466 -4122334 -16580058 -15299510 12866927
1671 12866927 38247630 39310826 31432725 30345990 26427345 10714053 -6256169 -15737950
1663 -15737950 -23622233 -31286247 -29206090 -18762482 -15589653 -22504971 -23011842 -10152908
1655 -10152908 1696573 2704063 2507882 9774523 18212015 22537439 28057133 35106962
1647 35106962 34055246 25068261 22565501 30195889 32065079 19857454 7637605 6723529
1639 6723529 6885016 -1646999 -7308583 2857445 19417087 27131171 30885956 42871351
1631 42871351 55110696 48998353 26688710 10131198 10020392 15645106 16439117 15176637
1623 15176637 16061591 15625964 11757619 9848467 13079801 15037019 8487708 -4111957
1615 -4111957 -14456444 -19200800 -22119860 -26813654 -31007736 -29256108 -19966796 -7384536
1607 -7384536 4422362 16434800 29774673 38892380 36645972 25661872 16842936 15442480
1599 15442480 16507063 15637401 14751360 13752401 7156150 -4161776 -7416280 6182948
1591 6182948 26340395 34555776 26381629 13858498 8470453 10329682 13042084 11576756
1583 11576756 5247319 -1408652 -1078939 8377701 19647013 24074715 22265664 21548045
1575 21548045 24299875 24418793 15777206 -3338 -15364056 -24274619 -27070116 -27910746
1567 -27910746 -27335723 -20154223 -4607867 9593815 10760391 2537516 1587527 14985089
1559 14985089 30150614 32609380 23738392 13450095 5138613 -1594766 -1287318 10929381
1551 10929381 26690843 30708693 19586722 5057809 -1153261 2380825 10550387 17256117
1543 17256117 17130444 9140399 -797447 -5855308 -5738530 -3613395 463996 6427897
1535 6427897 9175550 5711425 3435864 10389323 19730913 16761206 1967274 -5988341
1527 -5988341 5358032 25081876 31755864 16959909 -8036143 -23669251 -18049783 2475464
1519 2475464 17108495 11108099 -6801042 -14877183 -6465883 2357792 -4040360 -20940390
1511 -20940390 -32815261 -33644813 -28832343 -22612166 -13365724 -443207 11523996 16766017
1503 16766017 14161926 8328731 5192637 5477488 3650701 -4268637 -14116709 -19155781
1495 -19155781 -19422391 -18808437 -15411855 -4322555 10546513 18381400 17006707 15546253
1487 15546253 18631570 19653228 14239394 7771081 2636217 -8379495 -25297140 -30711538
1479 -30711538 -12221795 13824169 19418224 1762173 -15531453 -17636996 -14974707 -18715526
1471 -18715526 -18546577 1093083 32962836 51126977 41456947 16328652 -2514214 -6400545
1463 -6400545 -1004451 7221745 17180948 26761237 28882614 19009491 3083686 -7351585
1455 -7351585 -6906877 592036 8688103 12828938 10661486 4933145 4452457 13063317 18458933
1446 18458933 4115517 -25322570 -44308103 -38093350 -20442296 -10697283 -7631478 -107960
1438 -107960 9096188 9229636 3294040 3070046 6523162 1702521 -7787037 -4179926 13993092
1429 13993092 25531616 18570714 7597218 6919686 7409421 -3580043 -15584201 -9357037
1421 -9357037 11656653 24841305 19376162 5925399 -2773001 -5098708 -4570976 -4664494
1413 -4664494 -9978295 -20312302 -24266131 -11828217 7246446 12696940 3026846 -831806
1405 -831806 13452100 30943801 31909950 20014051 14482337 21843028 29705652 26261611
1397 26261611 14012288 3497060 2360564 11845953 26200833 32911471 20400183 -8950997
1389 -8950997 -35941039 -39906974 -18599507 8884146 20723400 13693767 4006099 6619101
1381 6619101 17550749 20492319 8213732 -9053476 -16997088 -12859832 -5234632 -3015243
1373 -3015243 -7898374 -14894092 -17651582 -15153053 -13379640 -16648566 -18093174 -6334747
1365 -6334747 16192228 30700615 24310434 7365109 -615510 3090967 3876665 -6831043
1357 -6831043 -20354066 -25648456 -24379278 -24500664 -25883158 -20396226 -3904766 17705919
1349 17705919 33844015 37121622 27589081 13095607 4819377 8502342 19060817 25855123
1341 25855123 23542510 15727345 8054742 1438831 -5303698 -9164410 -5043768 5107065
1333 5107065 11251146 7636194 1456317 2294319 6343528 1520724 -11493196 -16094430
1325 -16094430 -3620394 11414917 11018301 2795 -2144181 8458152 14626147 4550125
1317 4550125 -11712995 -18034215 -12025547 -1412800 9004456 17539333 20748393 18359304
1309 18359304 17537627 22709298 25620572 15595734 -3055285 -14058777 -9101591 4066075
1301 4066075 13657885 15580075 11588426 3417516 -7284750 -17085132 -21924661 -19512736
1293 -19512736 -11410827 -3896459 -3331265 -7864419 -8569809 -3090828 -1289473 -9727041
1285 -9727041 -18272065 -14756442 -7235593 -14319227 -33933629 -41204086 -23397847 904129
1277 904129 8135711 166225 -5423858 -3293110 -1415401 -1663543 1989593 7525650 4335941
1268 4335941 -8561507 -17550899 -12555862 163146 8260913 8018151 3796106 -535376
1260 -535376 -4208392 -7324463 -9512821 -8766353 -1606902 11906952 24774425 30403148
1252 30403148 31696179 35067485 36906955 26915296 6359138 -9193387 -10650293 -7920834
1244 -7920834 -13886630 -25325291 -30126098 -26992438 -26243385 -33126945 -40099568 -36073196
1236 -36073196 -17213373 10502737 34214198 41740055 32100024 17194763 8731265 6562498
1228 6562498 4465749 1874397 2041116 3439667 3174334 5690467 16208237 26543492
1220 26543492 20880007 -1385695 -20635292 -20330580 -5513902 8070997 14070693 16367655
1212 16367655 16966399 13687232 7897497 5633471 9446907 13847778 10591440 -2840137
1204 -2840137 -19827291 -29414649 -26104403 -14699274 -3383554 5892524 15373310 22464731
1196 22464731 21672128 16361755 18591906 32819728 48148197 52345518 46223896 38057284
1188 38057284 31025736 23849219 18021669 16050365 16198790 15698896 15304102 15068247 11359740
1179 11359740 4782511 4291171 14609949 25845391 25930970 17942725 13687195 15034300
1171 15034300 14657189 11850621 13344524 19502034 23346990 22968062 21710731 17222392
1163 17222392 5535586 -4436472 1468164 18080980 23367677 11324547 2327576 10738239
1155 10738239 22120877 17814232 4847651 1831374 7699096 6552180 -3326539 -7401761
1147 -7401761 -293168 6247757 2659489 -6949326 -15065741 -18857932 -15921985 -5230951
1139 -5230951 4911102 2827500 -8568742 -11817082 1858988 20125661 26447981 20171259
1131 20171259 13122031 13779146 21343588 29411217 29756647 18104865 1617895 -4735479
1123 -4735479 5061716 19566942 23473070 15192232 5129793 644302 -159713 -1551516
1115 -1551516 -3805883 -4176940 -32216 9334292 21122450 29360365 29343188 22158441 13872296
1106 13872296 10768818 15544145 25873334 35064290 35918236 26338887 11169091 -2040456
1098 -2040456 -8602611 -8598619 -5228280 -1741343 1435652 6791973 15897107 26050617 32424917
1089 32424917 33006532 29705098 25287202 20972575 16261346 9812558 2062844 -1989412
1081 -1989412 4112755 19979875 36614866 45782730 47085769 42889913 32856711 19341377
1073 19341377 11023389 11893762 12329252 2235676 -11721375 -15541475 -11341208 -14740077
1065 -14740077 -27722774 -31647100 -13792209 13575997 29157188 26383397 13554024
1058 13554024 1122949 -2864573 5012217 16740362 17273618 4096094 -7204659 -5214309
1050 -5214309 1210369 140016 -2792853 3426936 12865294 11780143 3725278 4463761
1042 4463761 13638530 13068948 -3334901 -17749926 -14168702 262464 9391661 10423879
1034 10423879 10602805 11096601 7100855 -302030 -3676543 -420725 3117338 -56505
1026 -56505 -9229195 -16901373 -16364316 -8090195 1428138 7457191 11373975 15096931 15167850
1017 15167850 8327855 417890 1426497 11317194 18855961 16601378 9535050 5446230
1009 5446230 3817350 -184151 -5141489 -3143659 10085619 27715898 35639608 25507345
1001 25507345 5550098 -4816363 4484572 22098469 29531515 23966167 17972966 18891414
993 18891414 20559429 17029768 12034759 9653546 6435862 155269 -2400757 5106730
985 5106730 17622830 25071310 24506711 19232406 12091052 7574109 13912444 32065884
977 32065884 46657640 40051491 14879285 -8303340 -16257637 -14827526 -13294348 -9506474
969 -9506474 1394235 12279881 10061511 -5148361 -17066502 -12589677 2288380 10746759
961 10746759 5768429 -3518287 -5715796 -1006608 2306529 759874 -668746 2908941
953 2908941 9631311 14217349 14220880 11251483 8758564 10037585 15791272 22084042 23056016
944 23056016 17433287 10706691 9518957 15100614 22801469 26713206 24649865 20034460
936 20034460 18328127 19873330 17844963 6343464 -10985646 -24335794 -28523575 -26048292
928 -26048292 -20953820 -15512394 -12357639 -13004926 -13279250 -6979066 3735034 7699918
920 7699918 -2463174 -21315014 -36193630 -37510833 -23030486 1610351 24309344 34232838
912 34232838 31288824 24249706 18972296 13688431 5944710 -2484513 -8316339 -8304227 656836
903 656836 15024902 20923394 8661843 -10756703 -18133295 -14267245 -17221477 -29698022
895 -29698022 -32414412 -18277898 -8304669 -17696075 -28985963 -20742382 -3287455 1019701
887 1019701 -2358677 8692221 31200513 40074409 30265509 22648251 24895843 19500815
879 19500815 -96672 -12359094 -1841464 15141932 16989043 7971292 3899536 4144097
871 4144097 -1533901 -10956242 -13875434 -9149917 -947918 12599513 30114523 36151704
863 36151704 19240935 -5705735 -12952204 -534567 9860547 6113418 -882162 780604
855 780604 6953332 8547071 5210995 512108 -5356550 -10706290 -9153254 1246075
847 1246075 11980981 13568215 6424784 -2341361 -8097377 -9966189 -7710171 -3195220
839 -3195220 -2148353 -8588898 -18202824 -22144651 -18134786 -13588861 -15114245 -17875587
831 -17875587 -10736139 7312246 21902682 19586639 5424040 -3252495 1084554 9554602
823 9554602 12964897 13663136 16694084 18949149 14806046 5891355 -1927313 -5561208 -2895435
814 -2895435 8318078 22437527 25780054 14762110 5595643 12911269 26596923 26451989
806 26451989 14265669 10905938 22008538 28495871 16926408 -1030543 -9773287 -12636035
798 -12636035 -19091158 -23188172 -13208607 4809382 12198276 4950697 -784629 6498399
790 6498399 17050390 14932989 1016436 -7560615 1632920 21957924 35291706 31286118
782 31286118 16669204 5121699 1532257 1213733 2643527 11168213 25946604 32917063
774 32917063 20909547 -154485 -8663754 2198144 18523640 27200743 31104724 37490507
766 37490507 42472529 37421318 24373743 13332534 6559917 -2583997 -14101855 -16793135
758 -16793135 -5212095 8304880 8079594 -3751520 -11008295 -6310827 974258 993024
750 993024 -3464308 -5464604 -6364248 -11109308 -16982244 -17266296 -13868611 -15756267 -23405699
741 -23405699 -24327636 -9201565 13612546 26121852 20937029 7990072 1111975 2418843
733 2418843 2519913 -5690989 -17213836 -20650333 -11517170 3719067 16266509 22695387
725 22695387 22651311 15046472 1716636 -9109812 -9855046 -3212876 811170 -2816587
717 -2816587 -9752437 -13890359 -14204765 -13150218 -12372572 -11178954 -6971835 2138123 12998895
708 12998895 18479149 16500629 14058202 16671623 18645289 12526374 4280963 7167614
700 7167614 21492239 33345413 34891610 32424968 30756453 24473902 12510132 7572053
692 7572053 19049912 36301826 41614911 32687206 19915436 7907658 -5923355 -17998898
684 -17998898 -19131315 -9407848 -173633 1332389 -220563 2156605 8613746 14537273
676 14537273 14896479 6606845 -6070633 -10158594 2021858 18308075 18412924 1659608
668 1659608 -10567862 -4709344 6773832 6158853 -3151541 -5024130 2109183 2863936
660 2863936 -10442692 -25070149 -24920405 -11031603 1680546 3001669 -4012045 -11058394
652 -11058394 -14580948 -15930029 -15939096 -13564779 -8825326 -2972994 4665501 15588222 26152841
643 26152841 28068503 19239338 9400102 8379053 12306217 10063612 1741666 203869
635 203869 12321040 28415329 35121151 31179348 24909071 21949609 21390262 19881289
627 19881289 14663761 5908533 -914770 -60346 4158542 -527056 -16524711 -28711059
619 -28711059 -23216404 -7448258 -486504 -7269094 -14118687 -9050367 4959260 18467345
611 18467345 26891596 29905170 28099439 24658541 23918940 24472198 19452278 7066938
603 7066938 -4963567 -9181611 -7036885 -3910768 -1479916 -197281 -3747486 -13960688
595 -13960688 -24791971 -28676230 -27041621 -27445449 -31069215 -30566640 -21683439 -10266745
587 -10266745 -4480484 -5129512 -7774485 -10477256 -13934087 -15595286 -9905146 3682952
579 3682952 17004070 20896887 15168285 8094787 6629226 9892485 12803660 13578442
571 13578442 15611093 22247744 30758526 32647595 21899413 3520195 -9576555 -11523874
563 -11523874 -11537854 -20013178 -29025997 -18550558 14059849 42865614 41667784 15451664
555 15451664 -8722668 -16415066 -16086933 -17041565 -15928339 -10599423 -10217842 -19691953 -25878300
546 -25878300 -13649859 10874219 27172002 26998285 20552836 16799187 11737808 123892
538 123892 -12644439 -17461117 -13809987 -8982898 -8838121 -13478624 -18581438 -17655351 -6782248
529 -6782248 9158341 18377945 14394675 3944075 -956885 3598214 11962468 18496980
521 18496980 22940376 26240285 26498028 21820928 14276969 7776691 2942922 -2925459
513 -2925459 -10112068 -13334702 -7200010 5599116 14824491 13138398 3789892 -4200435
505 -4200435 -6131380 -3669587 750386 5990442 8910019 5438848 -2412235 -5808342
497 -5808342 566197 11192565 17225367 17990977 19196718 21832623 20387579 13035370
489 13035370 6261714 5382740 5933184 327803 -10071677 -16388243 -15051746 -12012776
481 -12012776 -12045984 -10547506 -1269974 12105249 19136530 15992797 8649745 2195121
473 2195121 -5602649 -16567184 -24391144 -21142217 -8779796 1876906 3216231 -2499267
465 -2499267 -8080727 -8868429 -5036100 -15261 2389662 974990 -2931728 -8856223 -17258566
456 -17258566 -24320653 -22014288 -8814228 4377637 6834237 2851500 4057456 9423474
448 9423474 6246358 -7403153 -15763850 -7676298 6439010 9431470 -382826 -12503224
440 -12503224 -21394133 -27746021 -28664764 -20890065 -11277547 -10219006 -14859225 -12118268
432 -12118268 268536 9041697 5282348 -3669470 -7925863 -9121265 -12613889 -15048401
424 -15048401 -9867368 524167 7868907 10261899 12985027 18975945 25500988 29165251
416 29165251 28179629 20566022 5771753 -11994087 -26345329 -34384042 -36665267 -33249680
408 -33249680 -24074171 -12365626 -3644008 -1215205 -4547784 -10323952 -13115444 -8523140
400 -8523140 833033 6168686 3765399 1043522 5454457 12004196 10716293 3424162
392 3424162 1755803 8121979 10885365 2766296 -6775399 -5140733 5193101 10964984
384 10964984 6004595 -3743513 -10297590 -10456779 -3795274 7832592 17685706 18078383
376 18078383 9790032 2826076 4934178 12631725 16197081 11232437 2950155 184623
368 184623 6435977 16031039 19148789 12114427 2078171 -918682 4422726 10775106
360 10775106 13349682 15043825 18623956 20427597 17154344 13955016 18015414 26046344
352 26046344 26643110 16260744 5028141 2931885 6481381 4738794 -5409308 -16393402
344 -16393402 -20513272 -16973033 -8379985 3451350 15479143 21559215 17016081 4535300
336 4535300 -6958416 -9861268 -3990360 4353914 8751884 7872702 4363221 -99965
328 -99965 -5894291 -11294770 -11517455 -5121165 2113307 4399172 4178693 7069630 11126238
319 11126238 9900197 5831342 9437935 21279441 26150667 14167632 -1143724 1522915
311 1522915 21532071 35716248 28152227 8371730 -4065776 -3048628 2435343 3012922
303 3012922 -2204942 -8090607 -8944359 -3108618 4225843 4993684 -2113032 -9018904 -8446270
294 -8446270 -3236240 -1407322 -5120843 -9618655 -10969760 -9477616 -6287151 -1525329
286 -1525329 4162399 9820723 15308841 19080298 16911098 7560583 -2149233 -4040943
278 -4040943 337807 2086765 -1415695 -3061729 1789479 8009643 10226570 12017741
270 12017741 18387502 24781573 22833865 14591359 11596814 19157486 29373714 31951569
262 31951569 25645184 16342055 9231817 6023109 5395441 2943238 -5305192 -16052665
254 -16052665 -19668640 -12189668 -2473224 -1881448 -9653417 -14982947 -12245656 -6879162
246 -6879162 -5275557 -5988697 -4441079 -949651 846367 395970 37445 -173357 -2684692
237 -2684692 -7477337 -11000216 -11265602 -10696370 -11676938 -11512920 -5180985 6855626 16605237
228 16605237 16682795 9619634 6131176 12798776 23669591 26915503 19008430 8642495
220 8642495 5594038 9281453 11390412 7503991 1506630 -1793031 -3762212 -8525334
212 -8525334 -14974891 -16804788 -11035217 -2525543 2564444 4871446 9063198 14308191
204 14308191 13637541 4919024 -3199590 -1461233 7275712 11805063 7651211 1510962
196 1510962 347485 3469247 7848784 13614189 18906538 15926268 666384 -16587929
188 -16587929 -19954840 -7610118 5584789 7600981 3716452 6297720 15938095 20857123
180 20857123 14012014 3304450 1636776 10868113 20022848 18732807 8702740 91446
172 91446 -1186576 1111764 1209106 245099 3421391 9584716 9477063 -2593536 -19045377
163 -19045377 -26276152 -21125447 -14592422 -16802382 -23194249 -21279274 -8887092 1970312
155 1970312 1292443 -6028319 -8843531 -5913860 -5276439 -9497937 -10843625 -3039759 9909286
146 9909286 20199567 24852019 23378205 13507892 -3538987 -17829594 -19242080 -10151423
138 -10151423 -2521845 -2539211 -4817199 -2501154 3723508 9218485 12359736 14090608 13990902
129 13990902 10642913 4613744 -1242939 -3931739 -2290717 1804029 4216397 2445715
121 2445715 -1452876 -4001156 -5471926 -8496635 -12006854 -11258639 -5034992 1662387 4407756
112 4407756 5057011 7670989 11718943 12979831 9601461 3853201 -1412370 -4735491 -4266366
103 -4266366 2429426 13971385 22155230 18061630 3496446 -7587995 -4416650 6135904
95 6135904 8248436 230247 -1982804 11035317 26451772 27921940 20179085 19647785
87 19647785 26445023 24460329 9103883 -4379627 -5258795 -1901380 -3250209 -2332446
79 -2332446 8929799 21912148 23639155 17296440 14685880 15663262 11765005 5199935
71 5199935 6393208 14263683 16277145 9136223 3093487 2986513 955192 -7162756 -13516040
62 -13516040 -13352506 -14321705 -21557225 -25984337 -18552356 -5811744 866734 3154155 9447236
53 9447236 17086123 16012097 7717843 5607552 14943345 25086736 25330844 18118346 11904770
44 11904770 9411326 8313609 6917874 3714219 -3444586 -12494232 -15927586 -9715512
36 -9715512 -19158 4043191 1421656 -1944496 -2339708 -775604 1690695 5040208 7445152
27 7445152 7084054 6587666 10024146 15501056 17142475 15152227 16499866 22968338 26132597
18 26132597 19192454 7281124 -342718 -2705480 -3923356 -2315378 7184403 21259313
10 21259313 28991535 25656123 17321043 10055834 2902188 -5637090 -12154589 -13681785
2 -13681785 -12096599 -9277423
0 -9277423
##END NTUPLES=NMR SPECTRUM
##END=
