##TITLE=31Pdec_Bay-17-2024
 D2O
 24 sc
 12.3.2024
##JCAMPDX= 6.0         $$ Bruker NMR JCAMP-DX V2.0
##DATA TYPE= NMR SPECTRUM
##DATA CLASS= NTUPLES
##ORIGIN= UXNMR, Bruker Analytische Messtechnik GmbH
##OWNER= root
$$ XWIN-NMR		Version 3.5
$$ Tue Mar 12 16:08:24 2024 Russian Standard Time (UT+4h)  she@DPX200
##.OBSERVE FREQUENCY= 81.013821
##.OBSERVE NUCLEUS= ^31P
##.ACQUISITION MODE= SIMULTANEOUS
##.ACQUISITION SCHEME= undefined
##.AVERAGES= 24
##.DIGITISER RES= 16
##SPECTROMETER/DATA SYSTEM= spect
##.PULSE SEQUENCE= zgpg30
##.SOLVENT NAME= D2O
##.SHIFT REFERENCE= (INTERNAL, D2O, 0, 248.564)
##AUDIT TRAIL= $$ (NUMBER, WHEN, WHO, WHERE, WHAT)
$$ ##TITLE= Audit trail, XWIN-NMR		Version 3.5
$$ ##JCAMPDX= 5.01
$$ ##ORIGIN= Bruker BioSpin GmbH
$$ ##OWNER= she
$$ F:/spectra/data/she/nmr/P31/1/pdata/1/auditp.txt
$$ ##AUDIT TRAIL=  $$ (NUMBER, WHEN, WHO, WHERE, WHAT)
(   1,<2024-03-12 16:07:11.42 +0400>,<she>,<DPX200>,
      <created by zg, POWCHK disabled, PULCHK disabled
       configuration hash MD5:
       00 E9 B6 7A A2 85 ED C7 34 08 36 98 17 FE 4E 26
       data hash MD5: 32K
       21 5D 52 DA A8 C4 ED F9 23 74 40 79 11 38 97 92>)
(   2,<2024-03-12 16:07:24.43 +0400>,<she>,<DPX200>,
      <Start of raw data processing
       efp BC_mod = 2 LB = 10 FT_mod = 6 PKNL = 1 PHC0 = -12742.5 PHC1 = -245.1165 SI = 64K 
       data hash MD5: 64K
       FC 00 12 AA FF 68 0B 6F C0 31 4C EF E0 32 6B 26>)
(   3,<2024-03-12 16:07:45.96 +0400>,<she>,<DPX200>,
      <pk PHC0 = -30.75483 PHC1 = 71.59999 
       data hash MD5: 64K
       27 07 24 17 AD C3 DC 28 9D BB 99 6F 35 8B 9B 5E>)
(   4,<2024-03-12 16:07:49.64 +0400>,<she>,<DPX200>,
      <abs ABSG = 5 
       data hash MD5: 64K
       96 8B 2C 78 77 40 C6 82 0F C1 CE 5F 6F 14 81 3D>)
$$ ##END=
$$ 
$$ hash MD5
$$ 16 23 88 E5 56 E0 5B E4 3B 02 C9 D7 E9 BE 7B 45
##$RELAX= 
##$RELAX= 
##$RELAX= 
##$RELAX= 
##$RELAX= 
##$RELAX= 
##$RELAX= 
##$RELAX= 
##$RELAX= 
$$ Bruker specific parameters
$$ --------------------------
##$DU= <F:/spectra>
##$EXPNO= 1
##$NAME= <P31>
##$PROCNO= 1
##$TYPE= <nmr>
##$USER= <she>
##$AMP= (0..31)
100 100 100 100 100 100 100 100 100 100 100 100 100 100 100 100 100 100 
100 100 100 100 100 100 100 100 100 100 100 100 100 100 
##$AQSEQ= 0
##$AQ_mod= 1
##$AUNM= <au_zg>
##$AUTOPOS= <>
##$BF1= 81.014009
##$BF2= 200.13
##$BF3= 200.13
##$BF4= 200.13
##$BF5= 200.13
##$BF6= 200.13
##$BF7= 200.13
##$BF8= 200.13
##$BYTORDA= 1
##$CFDGTYP= 0
##$CFRGTYP= 5
##$CHEMSTR= <none>
##$CNST= (0..31)
1 1 145 1 1 1 1 1 1 1 1 1 1 1 1 1 1 1 1 1 1 1 1 1 1 1 1 1 1 1 1 1 
##$CPDPRG= <waltz16>
##$CPDPRG1= <>
##$CPDPRG2= <waltz16>
##$CPDPRG3= <>
##$CPDPRG4= <mlev>
##$CPDPRG5= <mlev>
##$CPDPRG6= <mlev>
##$CPDPRG7= <mlev>
##$CPDPRG8= <mlev>
##$CPDPRGB= <>
##$CPDPRGT= <>
##$D= (0..31)
0 1 0 0 0 0 0 0 0 0 0 0.03 2e-05 3e-06 0 0 0 0 0 0 0 0 0 0 0 0 0 0 0 0 
0 0 
##$DATE= 1710245230
##$DBL= (0..7)
120 120 120 11 120 120 24 19 
##$DBP= (0..7)
150 150 150 150 150 150 150 150 
##$DBP07= 0
##$DBPNAM0= <>
##$DBPNAM1= <>
$$ [...]
##$SUBNAM3= <"">
##$SUBNAM4= <"">
##$SUBNAM5= <"">
##$SUBNAM6= <"">
##$SUBNAM7= <"">
##$SUBNAM8= <"">
##$SUBNAM9= <"">
##$SW= 501.771253377433
##$SWIBOX= (0..15)
0 1 3 0 0 0 0 0 0 0 0 0 0 0 0 0 
##$SW_h= 40650.406504065
##$TD= 32768
##$TD0= 1
##$TE= 0
##$TE2= 300
##$TE3= 300
##$TEG= 300
##$TL= (0..7)
0 120 53 12 22 120 120 120 
##$TP= (0..7)
150 150 150 150 150 150 150 150 
##$TP07= 0
##$TPNAME0= <>
##$TPNAME1= <>
##$TPNAME2= <>
##$TPNAME3= <>
##$TPNAME4= <>
##$TPNAME5= <>
##$TPNAME6= <>
##$TPNAME7= <>
##$TPOAL= (0..7)
0.5 0.5 0.5 0.5 0.5 0.5 0.5 0.5 
##$TPOFFS= (0..7)
0 0 0 0 0 0 0 0 
##$TUNHIN= 0
##$TUNHOUT= 0
##$TUNXOUT= 0
##$USERA1= <user>
##$USERA2= <user>
##$USERA3= <user>
##$USERA4= <user>
##$USERA5= <user>
##$V9= 5
##$VALIST= <valist>
##$VCLIST= <CCCCCCCCCCCCCCC>
##$VD= 0
##$VDLIST= <DDDDDDDDDDDDDDD>
##$VPLIST= <PPPPPPPPPPPPPPP>
##$VTLIST= <TTTTTTTTTTTTTTT>
##$WBST= 1024
##$WBSW= 4
##$XGAIN= (0..3)
0 0 0 0 
##$XL= 0
##$YL= 0
##$YMAX_a= 6596
##$YMIN_a= -6746
##$ZGOPTNS= <>
##$ZL1= 120
##$ZL2= 120
##$ZL3= 120
##$ZL4= 120
##$ABSF1= 248.5645
##$ABSF2= -253.2056
##$ABSG= 5
##$ABSL= 3
##$ALPHA= 0
##$AQORDER= 0
##$ASSFAC= 0
##$ASSFACI= 0
##$ASSFACX= 0
##$ASSWID= 0
##$AUNMP= <proc_1d>
##$AZFE= 0.1
##$AZFW= 0.5
##$BCFW= 0
##$BC_mod= 2
##$BYTORDP= 0
##$COROFFS= 0
##$CY= -3
##$DATMOD= 1
##$DC= 0
##$DFILT= <>
##$DTYPP= 0
##$F1P= 0
##$F2P= 0
##$FCOR= 1
##$FTSIZE= 65536
##$FT_mod= 6
##$GAMMA= 0
##$GB= 0
##$INTBC= 1
##$INTSCL= 6.047779e-11
##$ISEN= 30
##$LB= 10
##$LEV0= 0
##$LPBIN= 0
##$MAXI= 10000
##$MC2= 0
##$MEAN= 0
##$ME_mod= 0
##$MI= 50
##$NCOEF= 0
##$NC_proc= -6
##$NLEV= 6
##$NOISF1= 182.463
##$NOISF2= 159.3651
##$NSP= 0
##$NTH_PI= 0
##$NZP= 0
##$OFFSET= 248.5645
##$PC= 4
##$PHC0= -12773.25
##$PHC1= -173.5165
##$PH_mod= 1
##$PKNL= yes
##$PPARMOD= 0
##$PSCAL= 0
##$PSIGN= 0
##$REVERSE= no
##$SF= 81.0140089999694
##$SI= 65536
##$SIGF1= 159.3651
##$SIGF2= -187.1042
##$SINO= 113.3802
##$SIOLD= 16384
##$SREGLST= <1H.CDCl3>
##$SSB= 0
##$STSI= 65536
##$STSR= 0
##$SW_p= 40650.406504065
##$SYMM= 0
##$S_DEV= 0
##$TDeff= 32768
##$TDoff= 0
##$TI= <>
##$TILT= no
##$TM1= 0
##$TM2= 0
##$TOPLEV= 0
##$USERP1= <user>
##$USERP2= <user>
##$USERP3= <user>
##$USERP4= <user>
##$USERP5= <user>
##$WDW= 1
##$XDIM= 65536
##$YMAX_p= 357680155
##$YMIN_p= -3807182
$$ End of Bruker specific parameters
$$ ---------------------------------
##NTUPLES= NMR SPECTRUM
##VAR_NAME=  FREQUENCY,     SPECTRUM/REAL,   SPECTRUM/IMAG
##SYMBOL=    X,             R,               I
##VAR_TYPE=  INDEPENDENT,   DEPENDENT,       DEPENDENT
##VAR_FORM=  AFFN,          ASDF,            ASDF
##VAR_DIM=   65536,         65536,           65536
##UNITS=     HZ,            ARBITRARY UNITS, ARBITRARY UNITS
##FACTOR=    0.620285442955139, 1,           1
##FIRST=     20137.2065510682, 0,            0
##LAST=      -20513.1999529968, 0,           0
##MIN=       -20513.1999529968, -3807182,    0
##MAX=       20137.2065510682, 357680155,    0
$$ Real data points
##PAGE= N=1
##DATA TABLE= (X++(R..R)), XYDATA
$$ [...]
38625A66420l5038k7339j6600m811N988J4197J9010K0508J9515J7306J5277J4552
$$ 166420 131382 104043 87443 82632 88620 102817 121827 142335 161850 179156 194433 208985
38613B08985J5605J8080K0876K2579K2013J8826J3689Q002L147k54k472m195n794
$$ 208985 224590 242670 263546 286125 308138 326964 340653 348655 351802 351548 349076 344881 339087
38600C39087p039p391o560m809k806j269o64j075k187l388m103m172m036m505
$$ 339087 332048 324657 318097 313288 310482 309213 308549 307474 305287 301899 297796 293624 289588 285083
38586B85083o320r752j4471j9715k4705k9077l3184l7986m4585n3518o4185p4632
$$ 285083 278763 269011 254540 234825 210120 181043 147859 109873 65288 11770 -52415 -127047
38574a27047q2009q3564p7762o4891m6823k6216n678J2751K7697L8387M4495M6071
$$ -127047 -209056 -292620 -370382 -435273 -482096 -508312 -513990 -501239 -473542 -435155 -390660 -344589
38562c44589M3585L7998L0691K3109J6288J0564N714J437k109m239m199j891J736
$$ -344589 -301004 -263006 -232315 -209206 -192918 -182354 -176640 -175203 -177312 -181551 -185750 -187641 -185905
38549a85905M956O030L935j306q765j7062k4896l1405l6198l9153m0153l9079
$$ -185905 -180949 -174919 -170984 -172290 -181055 -198117 -223013 -254418 -290616 -329769 -369922 -409001
38537d09001l5983l1408k6541k2973k2058k4214k8672l3865l8145m0449m0564
$$ -409001 -444984 -476392 -502933 -525906 -547964 -572178 -600850 -634715 -672860 -713309 -753873
38526g53873l8968l6294l2679k7444j9494q174O072K1693L6592M8835N7240O1739
$$ -753873 -792841 -829135 -861814 -889258 -908752 -916926 -910854 -889161 -852569 -803734 -746494 -684755
38514f84755O3320O3464O3245O2677O0706N5953M7652L6230K3214J0652M01o340
$$ -684755 -621435 -557971 -494726 -432049 -371343 -315390 -267738 -231508 -208294 -197642 -197241 -203581
38502b03581r204q600n541j357K700N738P320P370O128M195K505K019L191N652
$$ -203581 -212785 -221385 -226926 -228283 -225583 -219845 -212525 -205155 -199027 -194832 -192327 -190308 -187117 -181465
38488a81465Q371J0273J0864J0459R907R967J0825J1941J2422J1623R689P722
$$ -181465 -173094 -162821 -151957 -141498 -131591 -121624 -110799 -98858 -86436 -74813 -65124 -57402
38476e7402P374J0026J6052K4681L4485M3998N2001N7508N9790N8584N4185M7331
$$ -57402 -50028 -40002 -23950 731 35216 79214 131215 188723 248513 307097 361282 408613
38464D08613L8971L0101K1598J4007P435J747l116o965r555j0839j1055j0553
$$ 408613 447584 477685 499283 513290 520725 522472 519356 512391 502836 491997 480942 470389
38452D70389r577q177o335m235k526k315m828j0814j9973l0808m1040m8506n2012
$$ 470389 460812 452635 446300 442065 439539 437224 432396 421582 401609 370801 329761 281255 229243
38439B29243n1722m8863m5009m1310l8050l4652l0151k3882j6020p643k79M754
$$ 229243 177521 128658 83649 42339 4289 -30363 -60514 -84396 -100416 -108059 -108338 -103584
38427a03584O778N784K263k964q844j4329j8638k1432k2621k2054j9302j3779
$$ -103584 -96806 -91022 -88759 -91723 -100567 -114896 -133534 -154966 -177587 -199641 -218943 -232722
38415b32722n099O509K0052L4067M7182N8621O8295P6538Q3629Q9410R3157R3810
$$ -232722 -237821 -231312 -211260 -177193 -130011 -71390 -3095 73443 157072 246482 339639 433449
38403D33449R0378Q2214O9058N1124K9347N534j7960l8932n5850o7922p4957p7309
$$ 433449 523827 606041 675099 726223 755570 761104 743144 704212 648362 580440 505483 428174
38391D28174p5832p1570o5341n7429m7659l5726k1613n870J0499K6472M1451N5368
$$ 428174 352342 280772 215431 158002 110343 74617 53004 47134 57633 84105 125556 180924
38379A80924O8529Q1433R4585J08142J21404J32591J39277J39333J31859J17638
$$ 180924 249453 330886 425471 533613 655017 787608 926885 1066218 1198077 1315715
38369A315715R8957P8904O0303M4703L1889K0208P626p064k3587m0368n5285o6515
$$ 1315715 1414672 1493576 1553879 1598582 1630471 1650679 1658305 1651241 1627654 1587286 1532001 1465486
38357A465486p3066p5021p3515p0393o7584o6379o6995o8597o9728o8881o4999
$$ 1465486 1392420 1317399 1243884 1173491 1105907 1039528 972533 903936 834208 765327 700328
38346G00328n7750m7578l5521k2958j1360k040M071O615N874K635k040p009j1175
$$ 700328 642578 595000 559479 536521 525161 523121 527192 533807 539681 542316 540276 533267 522092
38333E22092j3567j3485j0706n576J104Q459J5954K3591L1556L9583M6525N0645
$$ 522092 508525 495040 484334 478758 479862 488321 504275 527866 559422 599005 645530 696175
38321F96175N0497M5766L7518K7877J9405J4417J4329J9234K7920L8273M7911
$$ 696175 746672 792438 829956 857833 877238 891655 905984 925218 953138 991411 1039322
38310A039322N4791N7730N6701N2635M6839M0308L3445K6198J8367R857Q04q364
$$ 1039322 1094113 1151843 1208544 1261179 1308018 1348326 1381771 1407969 1426336 1436193 1436997 1428633
38298A428633j6893k3740k7751k8011k4255j7166q357NN848P788N439p09r661
$$ 1428633 1411740 1388000 1360249 1332238 1307983 1290817 1282460 1282465 1288313 1296101 1301540 1300831 1291170
38285A291170k0214l1041m0725m7926n1693n1751m8593m3430l7952l3912l2584
$$ 1291170 1270956 1239915 1199190 1151264 1099571 1047820 999227 955797 917845 883933 851349
38274H51349l4325l8492m3778m8774n2452n4345n4492n3332n1625n0223m9668
$$ 851349 817024 778532 734754 685980 633528 579183 524691 471359 419734 369511 319843
38263C19843m9870n0207m9928m8409m5175l9943l2887k4966j7772j2940j1498
$$ 319843 269973 219766 169838 121429 76254 36311 3424 -21542 -39314 -52254 -63752
38252f3752j3568j8388k4629l0808l5714l8577l8923l6358l0563k1523r806L421
$$ -63752 -77320 -95708 -120337 -151145 -186859 -225436 -264359 -300717 -331280 -352803 -362609 -359188
38240c59188J6599K8191L7068M2696M5126M4821M2508L9026L5163L1411K7840
$$ -359188 -342589 -314398 -277330 -234634 -189508 -144687 -102179 -63153 -27990 3421 31261
38229C1261K4144J9922J4943R263L207k657p555j0645j1379r880p070m330k917
$$ 31261 55405 75327 90270 99533 102740 100083 92528 81883 70504 60624 53554 49224 46307
38216D6307l473n979j0021j5139k0901k6699l1544l4146l3306k8371j9549p942
$$ 46307 42834 36855 26834 11695 -9206 -35905 -67449 -101595 -134901 -163272 -182821 -190763
38204a90763M671J6369K5720L2130L5649L6446L4566L0079K3383J5192O393k028
$$ -190763 -186092 -169723 -144003 -111873 -76224 -39778 -5212 24867 48250 63442 69835 67807
38192F7807q886j2839j2806q532q21Q703J8185K6084L1519L4209L4056L0706K3478
$$ 67807 58921 46082 33276 24744 23923 32626 50811 76895 108414 142623 176679 207385 230863
38179B30863J1909l394k0342l5774m6554n0707m8011l9855k8653j7133p750k279
$$ 230863 242772 239378 219036 183262 136708 86001 37990 -1865 -30518 -47651 -55401 -57680
38167e7680j623n810j4055k4885l6309m6247n3146n6402n6408n4179n0915m7678
$$ -57680 -59303 -65113 -79168 -104053 -140362 -186609 -239755 -296157 -352565 -406744 -457659 -505337
38155e05337m5211m3819m3309m3083m2296m0074l5825k9543k1940j4234p664l042
$$ -505337 -550548 -594367 -637676 -680759 -723055 -763129 -798954 -828497 -850437 -864671 -872335 -875377
38143h75377n11M00N86J107K929O700J2662K0723L0603M1889N3884O5446P5025
$$ -875377 -875888 -875488 -874902 -873795 -870866 -864166 -851504 -830781 -800178 -758289 -704405 -638959 -563934
38130e63934Q1087Q2651P9647P2860O3571N3234M3377L5611L1484L2005L7100
$$ -563934 -482847 -400196 -320549 -247689 -184118 -130884 -87507 -51896 -20412 11593 48693
38119D8693M5452N4938O3468O9659P3053P3840P2309O8418O1638N1201L6609J8137
$$ 48693 94145 149083 212551 282210 355263 429103 501412 569830 631468 682669 719278 737415
38107G37415k905k4409m4039n9934p1085p7317p9059p7141p2720o7196o1911n7819
$$ 737415 734510 710101 666062 606128 535043 457726 378667 301526 228806 161610 99699 41880
38095D1880n5255n3982n3330n2405n0300m6436m0842l4197k7461k1251j5462r445
$$ 41880 -13375 -67357 -120687 -173092 -223392 -269828 -310670 -344867 -372328 -393579 -409041 -418486
38083d18486k687M551J1113J5484J6567J4261R514L910r50m031n058m453l045
$$ -418486 -421173 -416622 -405509 -390025 -373458 -359197 -349683 -345773 -346723 -350754 -355812 -360265 -363310
38070c63310j797j525k638m876p375r091r428q497o853m897k546O22N051J1102
$$ -363310 -365107 -366632 -369270 -374146 -381521 -390612 -400040 -408537 -415390 -420287 -422833 -422211 -417160 -406058
38056d06058J9100K9304M1603N5265O8884Q0638Q8619R1262Q7824P8811O6008
$$ -406058 -386958 -357654 -316051 -260786 -191902 -111264 -22645 68617 156441 235252 301260
38045C01260N1948L8998K8575K0828J4999J0140N768J962j024l210m986o780q706
$$ 301260 353208 392206 420781 441609 456608 466748 472516 474478 473454 470244 465258 458478 449772
38032D49772j0459j1545j1638j0809r562q535q096q032p577n870k474K262P290
$$ 449772 439313 427768 416130 405321 395759 387224 379128 371096 363519 357649 355175 357437 364727
38019C64727J1294J3311J3219J1817J0456J0339J1979J5067J8762K2080K4144
$$ 364727 376021 389332 402551 414368 424824 435163 447142 462209 480971 503051 527195
38008E27195K4238K1792J6462Q320j856j2507k1632k7560k9686k8633k5749k2423
$$ 527195 551433 573225 589687 598007 596151 583644 562012 534452 504766 476133 450384 427961
37996D27961j9728j8430j8962k1289k4781k8507l1765l4452l6970l9788m3074
$$ 427961 408233 389803 370841 349552 324771 296264 264499 230047 193077 153289 110215
37985A10215m6558m9653n1638n1934n0391m7509m4400m2320m2021m3252m4787
$$ 110215 63657 14004 -37634 -89568 -139959 -187468 -231868 -274188 -316209 -359461 -404248
37974d04248m4997m2504l6602k7332j5471k464R774J9292K4572K4807K0026J1172
$$ -404248 -449245 -491749 -528351 -555683 -571154 -573618 -563844 -544552 -519980 -495173 -475147 -463975
37962d63975P6j0785j8897k2353k0324j3147k122J0887K3833L4738M1799M3592
$$ -463975 -463899 -474684 -493581 -515934 -536258 -549405 -551527 -540640 -516807 -482069 -440270 -396678
37950c96678L9521L0232J7662M464o895j4859j8986j9691j7757j3979r078l832
$$ -396678 -357157 -326925 -309263 -304799 -311694 -326553 -345539 -365230 -382987 -396966 -406044 -409876
37938d09876P81L734M388K925L80j814k399n13M502J3255K5981M1767N8100P1322
$$ -409876 -409095 -405361 -400973 -398048 -397668 -399482 -401881 -402394 -397892 -384637 -358656 -316889 -258789 -187467
37924a87467P7960P6189O6496N1242L3532J6159J044j0813j9178k4415k7228k8331
$$ -187467 -109507 -33318 33178 84420 117952 134111 135155 124342 105164 80749 53521 25190
37912B5190k8160k6861k4594k1898j9818j9549k1817k6393l2059l7107m0054m0096
$$ 25190 -2970 -29831 -54425 -76323 -96141 -115690 -137507 -163900 -195959 -233066 -273120 -313216
37900c13216l7064l1083k2386j1428R63J3675K5677L6375M5627N3525O0168O5591
$$ -313216 -350280 -381363 -403749 -415177 -414214 -400539 -374862 -338487 -292860 -239335 -179167 -113576
37888a13576O9756P2439P3098P0941O5425N6817M6331L5557K5599J6549P769j351
$$ -113576 -43820 28619 101717 172658 238083 294900 341231 376788 402387 418936 426705 425354
37876D25354j0701j9411k6327l0587l1799k9867k4829j6994p115L802J5000K6231
$$ 425354 414653 395242 368915 338328 306529 276662 251833 234839 227724 231526 246526 272757
37864B72757L7368M7682N5501N8719N5933M7385L5165K2510J2654P783Q550J4071
$$ 272757 310125 357807 413308 472027 527960 575345 610510 633020 645674 653457 662007 676078
37852F76078K2314L0715L6897L9293L7379L1495K2427J1101j446j3996k5148l3558
$$ 676078 698392 729107 766004 805297 842676 874171 896598 907699 906253 892257 867109 833551
37840H33551l8344l9452l7774l4922l2613l1901l2674l3792l3901l2378k9801
$$ 833551 795207 755755 717981 683059 650446 618545 585871 552079 518178 485800 455999
37829D55999k7631k7416l0092l5743m3816n3473o3847p4064q3115q9753r2581
$$ 455999 428368 400952 370860 335117 291301 237828 173981 99917 16802 -72951 -165532
37818a65532r0415q2827p0491n5201l9467k5884j6331j1187r055p363l764K592
$$ -165532 -255947 -338774 -409265 -464466 -503933 -529817 -546148 -557335 -566390 -573753 -577517 -574925
37806e74925J0747J8761K4953K8692L0461L1419L2960L6380M2601N1867O3467
$$ -574925 -564178 -545417 -520464 -491772 -461311 -429892 -396932 -360552 -317951 -266084 -202617
37795b02617P5643Q5825R1229Q9750Q0731O5175M5268K3647K826j5089k8706l7649
$$ -202617 -126974 -41149 50080 139830 220561 285736 331004 354651 357477 342388 313682 276033
37783B76033m2494m4271m3831m1662l8114l3703k9109k4909k1298j7980j4481
$$ 276033 233539 189268 145437 103775 65661 31958 2849 -22060 -43358 -61338 -75819
37772g5819j0656p033m629m362o545j0742j5943k0789k3910k4267k1419j5508
$$ -75819 -86475 -93508 -98137 -102499 -109044 -119786 -135729 -156518 -180428 -204695 -226114 -241622
37760b41622p066L222J4624K6398L7769M7813N5332N8939N7426N0368L8606K4354
$$ -241622 -248688 -245466 -230842 -204444 -166675 -118862 -63530 -4591 52835 103203 141809 166163
37748A66163J0724P94l397j484N211J4244K2930K9235L2388L2942L2218L1389
$$ 166163 176887 177681 174284 172800 178011 192255 215185 244420 276808 309750 341968 373357
37736C73357L0665K9000K4524J5549J756j5140l1801m4620n1238n1294m6175l8210
$$ 373357 404022 433022 457546 473095 474851 459711 427910 383290 332052 280758 234583 196373
37724A96373k9800k2675j7408j3427r624n115M13O903J4208K2192L0650L9203
$$ 196373 166573 143898 126490 113063 103439 98324 98737 105640 119848 142040 172690 211893
37712B11893M7252N3950N8356N9755N7884N2935M5369L5842K5230J4673N438j420
$$ 211893 259145 313095 371451 431206 489090 542025 587394 623236 648466 663139 668577 667157
37700F67157n552p667r443j2889j9421k9299m1649n4973o7626p8039q4711q6247
$$ 667157 661605 653938 644495 631606 612185 582886 541237 486264 418638 340599 255888 169641
37688A69641q1545p0143n2578l0642p239J4210L0771M0807M4139M1549L4168K3147
$$ 169641 88096 17953 -34625 -65267 -72506 -58296 -27525 13282 57421 98970 133138 156285
37676A56285R666n026j9646l2968m3897n1641n5837n6641n4611n0584m5524m0368
$$ 156285 165951 160925 141279 108311 64414 12773 -43064 -99705 -154316 -204900 -250424 -290792
37664b90792l5781l2000k8892k6194k3724k1362j8900j5935j1920o367J022J0227
$$ -290792 -326573 -358573 -387465 -413659 -437383 -458745 -477645 -493580 -505500 -511867 -510845 -500618
37652e00618K0834L1948M2362N0852N6499N8831N7901N4364M9415M4423M0395
$$ -500618 -479784 -447836 -405474 -354622 -298123 -239292 -181391 -127027 -77612 -33189 7206
37641G206L7604L5571L3382L0096K5134J8540J0968L386l263q279j1304j2406
$$ 7206 44810 80381 113763 143859 168993 187533 198501 201887 198624 190345 179041 166635
37629A66635j2115j1350j1264j2952j7047k3208k9958l5121l6751l3799k6134
$$ 166635 154520 143170 131906 118954 101907 78699 48741 13620 -23131 -56930 -83064
37618h3064j4120J706K0554M1147O1664Q0031R4307J03035J05360J01103R0826
$$ -83064 -97184 -95478 -74924 -33777 27887 107918 202225 305260 410620 511723 602549
37607F02549P5866N8224M0132K3592J0073N17m620n440k745J998O936J0243J0581
$$ 602549 678415 736639 776771 800363 810436 810953 806333 800893 798148 800146 807082 817325 827906
37594H27906P469J402o471j5103k4158l4073m5357n7770o9929p9770q5498q6442
$$ 827906 835375 836777 830306 815203 791045 756972 711615 653845 583916 504146 418648 332206
37582C32206q3187p7085o9428o0953n1770m1672l0512j8548o607M029J1971J6216
$$ 332206 249019 171934 102506 41553 -10217 -51889 -82401 -100949 -107556 -103527 -91556 -75340
37570g5340J6485J3257P548O44o017j0966j3045j1954q574m607j755r35k028m043
$$ -75340 -58855 -45598 -38050 -37406 -43423 -54389 -67434 -79388 -87962 -92569 -94324 -95259 -97287 -101330
37556a01330n523n044j760M223J1921J9857K6571L0891L2065K9772K4140J5809
$$ -101330 -106853 -111897 -113657 -109434 -97513 -77656 -51085 -20194 11871 41643 65783 81592
37544H1592N926m036j2660j9018k2838k4400k4231k2891k0883j8709j6813j5408
$$ 81592 87518 83482 70822 51804 28966 4566 -19665 -42556 -63439 -82148 -98961 -114369
37532a14369j4223j2470r220m021K662R599J5420J9292K1220K1740K1234J9391
$$ -114369 -128592 -141062 -150282 -154303 -151641 -142042 -126622 -107330 -86110 -64370 -43136 -23745
37520b3745J5343Q476p05j0390j8110k1773k0409j4290m658O604J7212K4804K7491
$$ -23745 -8402 74 -631 -11021 -29131 -50904 -71313 -85603 -90261 -83657 -66445 -41641 -14150
37507a4150K4482J6451N316o430j6518k3427k6577k6253k3377j9213j5001j1610
$$ -14150 10332 26783 32099 25669 9151 -14276 -40853 -67106 -90483 -109696 -124697 -136307
37495a36307r349q081p516p564q482j0717j4494j9376k4095k6893k6236k1511
$$ -136307 -145656 -153737 -161253 -168817 -177299 -188016 -202510 -221886 -245981 -272874 -299110 -320621
37483c20621j3255k901P838J7544K5387L1115L4831L6765L7226L6635L5597L4830
$$ -320621 -333876 -336777 -328939 -311395 -286008 -254893 -220062 -183297 -146071 -109436 -73839 -39009
37471c9009L4915L6021L7676L8819L8128L4528K7666J8175P475k866j1905j9616
$$ -39009 -4094 31927 69603 108422 146550 181078 208744 226919 234394 231528 219623 200007
37459B00007k6479l2721l7904m1098m1474l8768l3472k6669j9685j3672r337o857
$$ 200007 173528 140807 102903 61805 20331 -18437 -51909 -78578 -98263 -111935 -121272 -128129
37447a28129o023o476p973j0549j4418j9658k5873l2025l6540l7658l3940k4781
$$ -128129 -134152 -140628 -148601 -159150 -173568 -193226 -219099 -251124 -287664 -325322 -359262 -384043
37435c84043j0649O956K5737M2866N5483O1363N9710N1558L9570K7203J7619J2804
$$ -384043 -394692 -387736 -361999 -319133 -263650 -202287 -142577 -91019 -51449 -24246 -6627 6177
37423F177J3193J7833K4808L1803L6783L8580L7137L3172K7698K1718J6215J2064
$$ 6177 19370 37203 62011 93814 130597 169177 206314 239486 267184 288902 305117 317181
37411C17181R736R160R828J1225J3091J5481J8526K2151K5925K9189L1403L2321
$$ 317181 326917 336077 345905 357130 370221 385702 404228 426379 452304 481493 512896 545217
37399E45217L1925L0144K6757K1482J4178M946n826j7502k9208l9946m8661n4312
$$ 545217 577142 607286 634043 655525 669703 674649 668823 651321 622113 582167 533506 479194
37387D79194n5880n2495m3756l0242j3709L268J8137K9131L5591L7798L6604L3041
$$ 479194 423314 370819 327063 296821 283112 286380 304517 333648 369239 407037 443641 476682
37375D76682K8050K2298J6080R259J456p563j7425k7085l5177m0576m2636m1259
$$ 476682 504732 527030 543110 552369 553825 546262 528837 501752 466575 425999 383363 342104
37363C42104l6854l0398k3276j6902j2226r493q358q304r006j0529j3130j6993
$$ 342104 305250 274852 251576 234674 222448 212955 204597 196293 187287 176758 163628 146635
37351A46635k1973k7452l2390l5543l5987l3620k9348k4749k1501k0838k3340
$$ 146635 124662 97210 64820 29277 -6710 -40330 -69678 -94427 -115928 -136766 -160106
37340a60106k8922l6963m6401n5693o2906o6065o3806n5929m3423k7993j1433
$$ -160106 -189028 -225991 -272392 -328085 -390991 -457056 -520862 -576791 -620214 -648207 -659640
37329f59640M788J9652L2524M3062N1081N6380N8580N7098N1430M1632K8653J4271
$$ -659640 -654852 -635200 -602676 -559614 -508533 -452153 -393573 -336475 -285045 -243413 -214760 -200489
37317b00489N48j0779j8694k3033k4352k3615k1690j8927j5097r810l076M406
$$ -200489 -199941 -210720 -229414 -252447 -276799 -300414 -322104 -341031 -356128 -365938 -369014 -364608
37305c64608J1409J6680J9535K0214J9793J9593K0410K2108K3750K4124K2361
$$ -364608 -353199 -336519 -316984 -296770 -276977 -257384 -236974 -214866 -191116 -166992 -144631
37294a44631J8254J2331N495j437p992j3860j8548k1328k1670j9710j6239j2220
$$ -144631 -126377 -114046 -108551 -109988 -117980 -131840 -150388 -171716 -193386 -213096 -229335 -241555
37282b41555q201m132L55N485J1022J6309K0534K2984K3193K0996J6594J0611
$$ -241555 -249756 -253888 -253533 -248048 -237026 -220717 -200183 -177199 -154006 -133010 -116416 -105805
37270a05805M043j948o300q195p135l008L702J1751J9207K3944K4277J9535J0314
$$ -105805 -101762 -103710 -110010 -118205 -125340 -128348 -124646 -112895 -93688 -69744 -45467 -25932 -15618
37257a5618j661j4045k4574l1705l4887l4493l1620k7784k4508k2730k2316k1998
$$ -15618 -17279 -31324 -55898 -87603 -122490 -156983 -188603 -216387 -240895 -263625 -285941 -307939
37245c07939j9889j4422n195O696J9016K9239L5457L6928L4119K8326K1019J3254
$$ -307939 -327828 -342250 -347445 -340749 -321733 -292494 -257037 -220109 -185990 -157664 -136645 -123391
37233a23391N355k928j1954k1720l1675m0814m7994n2167n2472m8267l9192k5351
$$ -123391 -118036 -120964 -132918 -154638 -186313 -227127 -275121 -327288 -379760 -428027 -467219 -492570
37221d92570p435J3309L5267N6784P6405R2975J05473J12823J13913J07974R5147
$$ -492570 -500005 -486696 -451429 -394645 -318240 -225265 -119792 -6969 106944 214918 310065
37210C10065P6902N5971L5744J9289Q534L779L683N708O950N179k98q494j7325
$$ 310065 386967 442938 478682 497971 506505 510284 513967 519675 526625 531804 531506 523012 505687
37197E05687k4587k8681k8857k5107j8006q706J095R370J4319J4959J1472N139
$$ 505687 481100 452419 423562 398455 380449 371743 372838 382208 396527 411486 422958 428097
37185D28097k124q354j2104j2715j0278n437P25O776J1220J3014J1902Q358L240
$$ 428097 425973 417619 405515 392800 382522 377085 377810 384586 395806 408820 420722 429080 432320
37172D32320k433p574j1207j2797j2517j1193r870r259r344r489r003p813o680
$$ 432320 429887 422313 411106 398309 385792 374599 364729 355470 346126 336637 327634 319821 313141
37159C13141o821r239j4097k0342k5707k7335k3036j2548K085J7384K9995L7914
$$ 313141 306320 297081 282984 262642 236935 209600 186564 174016 176101 193485 223480 261394
37147B61394M0696L8772L2660K2734R561n631k0910l4070m3293m7653m7229m2849
$$ 261394 302090 340862 373522 396256 405817 400186 379276 345206 301913 254260 207031 164182
37135A64182l5641k6772j7449q988k661O76Q12j949o963j3296j9654k4594k7034
$$ 164182 128541 101769 84320 75332 72671 73347 74159 72210 65247 51951 32297 7703 -19331
37122a9331k6636k3759j9066j3263p091j463K626M345L269n02o371j3377k0459
$$ -19331 -45967 -69726 -88792 -102055 -109146 -110609 -107983 -103638 -100369 -100871 -107242 -120619 -141078
37109a41078k6729l1690l5277l7818l9837m1695m3141m3166m0449l4241k5051
$$ -141078 -167807 -199497 -234774 -272592 -312429 -354124 -397265 -440431 -480880 -515121 -540172
37098e40172j4526m640L114P977R676Q223M051j888q384j4541k0115k5312l0297
$$ -540172 -554698 -559338 -556224 -548247 -538571 -530348 -526297 -528185 -536569 -551110 -571225 -596537 -626834
37085f26834l4865l8415m0126l9198l5073k7579j6896l428J2202K8976M5370N9547
$$ -626834 -661699 -700114 -740240 -779438 -814511 -842090 -858986 -862414 -850212 -821236 -775866 -716319
37073g16319O9879P5425P6044P2138O4242N2885L8783K3207Q098m291j2117j4688
$$ -716319 -646440 -571015 -494971 -422833 -358591 -305706 -266923 -243716 -235618 -239909 -252026 -266714
37061b66714j2788q427m113j971l090p270j3223j9070k3030k4026k1978j7691
$$ -266714 -279502 -287929 -292042 -294013 -297103 -304373 -317596 -336666 -359696 -383722 -405700 -423391
37049d23391j2503p902n167n024p353j1210j5177j7956j8918j8435j7815j8750
$$ -423391 -435894 -443796 -448963 -453987 -461340 -472550 -487727 -505683 -524601 -543036 -560851 -579601
37037e79601k2429k8852l6818m4586n0670n4279n5265n3774m9926m3656l4907
$$ -579601 -602030 -630882 -667700 -712286 -762956 -817235 -872500 -926274 -976200 -1019856 -1054763
37026a054763k4026j1997k09J0161J8647K5487L1154L5885L9502M1571M1752M0181
$$ -1054763 -1078789 -1090786 -1090995 -1080834 -1062187 -1036700 -1005546 -969661 -930159 -888588 -846836 -806655
37014h06655L7630L5273L4085L4328L5595L7322L9251M1433M3784M5746M6266
$$ -806655 -769025 -733752 -699667 -665339 -629744 -592422 -553171 -511738 -467954 -422208 -375942
37003c75942M4169L8654K9691J8120N371p059j8096k7349l5016m1499m6986n1178
$$ -375942 -331773 -293119 -263428 -245308 -239937 -246996 -265092 -292441 -327457 -368956 -415942 -467120
36991d67120n3354n2674m8578m1169l1436k1151j2284o231l327k996m290o455
$$ -467120 -520474 -573148 -621726 -662895 -694331 -715482 -727766 -733997 -737324 -740320 -744610 -751065
36979g51065r106j2007j4676j6224j5527j1574l750Q047K3254M0450N7395P1450
$$ -751065 -760171 -772178 -786854 -803078 -818605 -830179 -833929 -825882 -802628 -762178 -704783 -633333
36967f33333Q0310Q2701P8805P0270N9638M9447M1440L6351L4197L4600L6838
$$ -633333 -553023 -470322 -391517 -321247 -261609 -212162 -170722 -134371 -100174 -65574 -28736
36956b8736L9775M2003M2326M0331L6604L2342K8619K5764K3339K0645J7294J3407
$$ -28736 11039 53042 95368 135699 172303 204645 233264 259028 282367 303012 320306 333713
36944C33713R401N700K621M14p20p75j89K10l12j738l009k527Q69P140J5049K2953
$$ 333713 343114 348814 351435 351849 351129 350354 350165 350375 350063 348325 345316 342789 343658 350798 365847 388800
36928C88800K9733L5210L9832M3950M7268M8857M7617M2965L5296K5973J6828
$$ 388800 418533 453743 493575 537525 584793 633650 681267 724232 759528 785501 802329
36917H02329R420M553K197J733K226K609J863q02n693j2474k0248k7908l4597
$$ 802329 811749 816302 818499 820232 822458 825067 826930 826128 820435 807961 787713 759805 725208
36904G25208l9927m3952m6992m9528n2056n4866n7859o0716o3262o5755o8723
$$ 725208 685281 641329 594337 544809 492753 437887 380028 319312 256050 190295 121572
36893A21572p2407p6245p8774p8106p2840o2782m9004l3230j7053j653J2019K2944
$$ 121572 49165 -27080 -105854 -183960 -256800 -319582 -368586 -401816 -418869 -420522 -408503 -385559
36881c85559L0122L2961L1673K7294K1338J5354J0708Q490R304J2811J7425K0778
$$ -385559 -355437 -322476 -290803 -263509 -242171 -226817 -216109 -207619 -198315 -185504 -168079 -147301
36869a47301K0828J6936J0041J969n550j1469j5488j7767j8556j7944j5861j2345
$$ -147301 -126473 -109537 -99496 -97527 -103077 -114546 -130034 -147801 -166357 -184301 -200162 -212507
36857b12507p762k709K268O803J0475J2455J1520O533k850j5824l0638m5107n7114
$$ -212507 -220269 -222978 -220710 -213907 -203432 -190977 -179457 -172924 -175774 -191598 -222236 -267343 -324457
36844c24457o4837o6847o2325n1467l5770j7788l17J4601K6170L4590M0401M4045
$$ -324457 -389294 -456141 -518466 -569933 -605703 -623491 -623808 -609207 -583037 -548447 -508046 -464001
36832d64001M5888M6441M6417M6440M6695M6705M5428M1737L5129K6203J6573
$$ -464001 -418113 -371672 -325255 -278815 -232120 -185415 -139987 -98250 -63121 -36918 -20345
36821b0345Q080J862k005m129n116n223m575l517k636k400k821l552m311n104
$$ -20345 -12265 -10403 -12408 -16537 -21653 -26876 -31451 -34968 -37604 -40004 -42825 -46377 -50688 -55792
36807e5792o026o914p277o748n613m799n254p091r348j0548r607o403j589M011
$$ -55792 -61818 -68732 -76009 -82757 -88370 -93169 -98423 -105514 -114862 -125410 -135017 -141420 -143009 -138998
36793a38998R939J6242K3334L1782M2185N5029P0450Q7775J05283J20393J30400
$$ -138998 -129059 -112817 -89483 -57701 -15516 39513 109963 197738 303021 423414 553814
36782E53814J33365J28583J16434R7866P4051M6508J7386j0529l4451n2443o3969
$$ 553814 687179 815762 932196 1030062 1104113 1150621 1168007 1157478 1123027 1070584 1006615
36771A006615o9711p0839o8345o2825n4811m5090l4657k4261j4039l700O903J7180
$$ 1006615 936904 866065 797720 734895 680084 634994 600337 576076 562037 558337 565240 582420
36759E82420K5734L0775L0820K5333J4970J374j3342k7116l8330m6157n0711n2819
$$ 582420 608154 638929 669749 695082 710052 711426 698084 670968 632638 586481 535770 482951
36747D82951n3353n2517m9670m3743l4006k0624m795J1582K6520L8596M7253N2614
$$ 482951 429598 377081 327411 283668 249662 229038 224243 235825 262345 300941 348194 400808
36735D00808N4987N4493N1102M4910L6350K6063J4634K499r806k1269l0326l5356
$$ 400808 455795 510288 561390 606300 642650 668713 683347 685846 676040 654771 624445 589089
36723E89089l5516l1324k4481j7084j0762o390m283m561p290j2448j9877k9184
$$ 589089 553573 522249 497768 480684 469922 463532 459249 454688 447398 434950 415073 385889
36711C85889l9694n0467o0519o8971p5069p7994p6834p0835n9813m4468k6362
$$ 385889 346195 295728 235209 166238 91169 13175 -63659 -134494 -194307 -238775 -265137
36700b65137p532J0110K5300L7689M7631N5710O2114O6365O7555O4968N8667M9615
$$ -265137 -272669 -262559 -237259 -199570 -151939 -96229 -34115 32250 99805 164773 223440 273055
36688B73055L9392K9670K1815J6573J3958J3275J3379J3011J1243P904L869Q36
$$ 273055 312447 342117 363932 380505 394463 407738 421117 434128 445371 453275 457144 457980
36676D57980M86L341Q153J2269J2979Q862M56j0163k0428k8324l3002l4793l4784
$$ 457980 458466 461807 469960 482229 495208 504070 504526 494363 473935 445611 412609 377816 343032
36663C43032l4186l3796l3732l3424l1860k8069k1721j3649n814o78j78m915j3937
$$ 343032 308846 275050 241318 207894 176034 147965 126244 112595 106781 106103 105925 101010 87073
36650H7073k5144l5929m3902m7461m6141m0520l1690k0698q325M688J7394K8689
$$ 87073 61929 26000 -17902 -65363 -111504 -152024 -183714 -204412 -212737 -208049 -190655 -161966
36638a61966L7566M3398M6092M6099M4194M1060L6977L1930K6028J9803J4131
$$ -161966 -124400 -81002 -34910 11189 55383 96443 133420 165350 191378 211181 225312
36627B25312R870P535P103P992R179R458P753L411l560j2420k1921l0696l7537
$$ 225312 235182 242717 249820 257812 266991 276449 284202 287613 284053 271633 249712 219016 181479
36614A81479m1494m2015l9258l4294k8754k3992k0356j7168j3284p842p13P483
$$ 181479 139985 97970 58712 24418 -4336 -28328 -48684 -65852 -79136 -86978 -87691 -80208
36602h0208J5594K2237K6082K6220K2582J6185Q964L104K37J004N037J1256J8102
$$ -80208 -64614 -42377 -16295 9925 32507 48692 57656 60760 60997 62001 67038 78294 96396
36589I6396K3847K7015K6967K4248K0373J7136J5875J7087K0459K5177L0344L5260
$$ 96396 120243 147258 174225 198473 218846 235982 251857 268944 289403 314580 344924 380184
36577C80184L9469M2496M3698M2360L8078L0974K1624J0695j262j3804k6334l7819
$$ 380184 419653 462149 505847 548207 586285 617259 638883 649578 648316 634512 608178 570359
36565E70359m6709n1263n0231m3558l2648k0076q766j109J700k04n683j3176k1219
$$ 570359 523650 472387 422156 378598 345950 325874 317108 315999 317699 317495 311812 298636 277417
36552B77417k8798l5457m1233m6359n1002n5089n8329o0304o0543n8640n4338
$$ 277417 248619 213162 171929 125570 74568 19479 -38850 -99154 -159697 -218337 -272675
36541b72675m7555l8435k7422j5347l415P022J4691J8572J8096J3399N592l386
$$ -272675 -320230 -358665 -386087 -401434 -404849 -397827 -383136 -364564 -346468 -333069 -327477 -330863
36529c30863j1258j6068j6558j2233l297R269K3665L7552M8787N6209N9800O0129
$$ -330863 -342121 -358189 -374747 -386980 -390277 -381008 -357343 -319791 -271004 -214795 -154995 -94866
36517i4866N7614N2218M3874L3104K1377J0838L557O98K137O816J3537K1554L0578
$$ -94866 -37252 14966 58840 91944 113321 124159 127716 128414 130551 137367 150904 172458 203036
36504B03036M0403N0550O0128O8001P3126P5043P4108P1226O7196O2107N5318
$$ 203036 243439 293989 354117 422118 495244 570287 644395 715621 782817 844924 900242
36493I00242M5847L2965J6575k676k3472m3944o1866p4994q1666q1426p5356o5786
$$ 900242 946089 979054 995629 992953 969481 925537 863671 788677 707011 625585 550229 484443
36481D84443n5464m6615m0263l6187l3355l0668k7490k3840k0118j6693j3669
$$ 484443 428979 382364 342101 305914 272559 241891 214401 190561 170443 153750 140081
36470A40081j0931q364o046m339l922n605r855j6256k3418k9570l3445l4838l4571
$$ 140081 129150 120786 114740 110401 106479 100874 91019 74763 51345 21775 -11670 -46508 -81079
36457h1079l4092l4914l8035m3456n0080n6124n9811n9933n6067m8453l7743k4724
$$ -81079 -115171 -150085 -188120 -231576 -281656 -337780 -397591 -457524 -513591 -562044 -599787 -624511
36445f24511j0248M662J8759L0720L9420M4160M4700M1261L4596K6024J7276J0055
$$ -624511 -634759 -630097 -611338 -580618 -541198 -497038 -452338 -411077 -376481 -350457 -333181 -323126
36433c23126N564M229N760R305J3550J6781J7217J3637O120l647j2800j8295j7990
$$ -323126 -317562 -313333 -307573 -298268 -284718 -267937 -250720 -237083 -230963 -234610 -247410 -265705 -283695
36420b83695j1214J340J8136L7274N6760P4730Q9705J00708J07078J08227J03723
$$ -283695 -294909 -293569 -275433 -238159 -181399 -106669 -16964 83744 190822 299049 402772
36409D02772R3722P9221O1861M3363K5118Q175o577j8364k6767l1969l4688l5851
$$ 402772 496494 575715 637576 680939 706057 714232 707655 689291 662524 630555 595867 560016
36397E60016l6258l6525l7184l8677m1210m4740m9246n4865o1653o9000p5351
$$ 560016 523758 487233 450049 411372 370162 325422 276176 221311 159658 90658 15307
36386A5307p8494p6387o8025n4086l7013k0357p449j10J872K23k890n804p748
$$ 15307 -63187 -139574 -207599 -261685 -298698 -319055 -326504 -326614 -324742 -324519 -327409 -333213 -340961
36373c40961q714r000q783p956o368m151j841k03J09j146l655o627r121j0451
$$ -340961 -349675 -358675 -367458 -375414 -381782 -385933 -387774 -387977 -387868 -389014 -392669 -399296 -408417 -418868
36359d18868j0474r607q573q002q025q037o866l302L167J1919K1274K9111L3651
$$ -418868 -429342 -438949 -447522 -455524 -463549 -471586 -478452 -481754 -478587 -466668 -445394 -416283 -382632
36346c82632L4034L0462K4019J6333R140L767P18l10PJ190L190O255J0576J6063
$$ -382632 -348598 -318136 -294117 -277784 -268644 -264877 -264159 -264469 -264462 -263272 -260082 -253827 -243251 -227188
36332b27188K2255K8401L3618L7066L8104L6367L1805K4668J5437M797o369j6984
$$ -227188 -204933 -176532 -142914 -105848 -67744 -31377 428 25096 40533 45330 38961 21977
36320B1977k5832l1719l3724l1474k5330j6322n891M513J3700K0871K5574K7698
$$ 21977 -3855 -35574 -69298 -100772 -126102 -142424 -148315 -143802 -130102 -109231 -83657 -55959
36308e5959K7461K5456K2575J9791J7780J6649J5918J4900J3234J1241R798R899
$$ -55959 -28498 -3042 19533 39324 57104 73753 89671 104571 117805 129046 138844 148743
36296A48743J2152J6512K2252K8100L2548L4365L3065K9053K3372J7235J1787
$$ 148743 160895 177407 199659 227759 260307 294672 327737 356790 380162 397397 409184
36285D09184P940O281O935R502J3123J6610J8733J8572J5861J1130N594Q00j861
$$ 409184 417124 423405 430340 439842 452965 469575 488308 506880 522741 533871 539465 540265 538404
36272E38404j722Q53M612P972R631Q989O222K088k487o894j1091j5497k0660k6921
$$ 538404 536682 537535 542147 550119 559750 568739 574961 577049 574562 567668 556577 541080 520420 493499
36258D93499l4136m1618m8332n3351n6227n6990n5865n3111m9068m4291l9520
$$ 493499 459363 417745 369413 316062 259835 202845 146980 93869 44801 510 -39010
36247c9010l5523l2988l2444l4059l7370m1230m4187m5098m3511l9619l3903k6860
$$ -39010 -74533 -107521 -139965 -174024 -211394 -252624 -296811 -341909 -385420 -425039 -458942 -485802
36235d85802j8921j0560k312N289J1819J6952K0383K1843K1324J9381J7258J6620
$$ -485802 -504723 -515283 -517595 -512306 -500487 -483535 -463152 -441309 -419985 -400604 -383346 -366726
36223c66726J9042K5447L5727M8601O1798P2670P9081Q0118P6254O8886N9602
$$ -366726 -347684 -322237 -286510 -237909 -176111 -103441 -24360 55758 132012 200898 260500
36212B60500M9597L9442K9184J8703Q174j677r762j5172j7727j8169j7869j8249
$$ 260500 310097 349539 378723 397426 405600 403923 394161 378989 361262 343093 325224 306975
36200C06975k0197k3663k7644l0612l1236k8978k4280j8257j2196p105l381o66
$$ 306975 286778 263115 235471 204859 173623 144645 120365 102108 89912 82807 79426 78760
36188G8760J972N573J0644J6866K3324K9116L3739L6989L8613L8149L5134K9257
$$ 78760 80732 86305 96949 113815 137139 166255 199994 236983 275596 313745 348879 378136
36176C78136K0284P904q123k7467m8872p0255q9264j03890j12768j15118j10603
$$ 378136 398420 406324 398201 370734 321862 251607 162343 58453 -54315 -169433 -280036
36165b80036r9408q2642o2577m2296k4730j1676l474O87K094J854N89j537m369
$$ -280036 -379444 -462086 -524663 -566959 -591689 -603365 -606839 -606152 -604058 -602204 -601615 -603152 -607521
36152f07521p364r608j0284r150o559l050J049N692J0779J5852K0060K2524K2918
$$ -607521 -614885 -624493 -634777 -643927 -650486 -653536 -652487 -646795 -636016 -620164 -600104 -577580 -554662
36139e54662K1739K0180J9511K0478K3007K6372K9622L2002L3130L2901L1355
$$ -554662 -532923 -512743 -493232 -472754 -449747 -423375 -393753 -361751 -328621 -295720 -264365
36128b64365K8615K4993K1006J7250J4096J1452Q783N394Q43m816j1080j7335
$$ -264365 -235750 -210757 -189751 -172501 -158405 -146953 -138170 -132776 -131933 -136749 -147829 -165164
36116a65164k3203k8701l3972l8804m2239m2659l8370k8460j3371N011K3922M0568
$$ -165164 -188367 -217068 -251040 -289844 -332083 -374742 -413112 -441572 -454943 -449932 -426010 -385442
36104c85442N2939O0162O2321O0085N4413M6487L7627K9077K1748J6198J2759
$$ -385442 -332503 -272341 -210020 -149935 -95522 -49035 -11408 17669 39417 55615 68374
36093F8374J1636J2775J5733J9703K3785K7284K9857L1365L1478K9378K3947J4530
$$ 68374 80010 92785 108518 128221 152006 179290 209147 240512 271990 301368 325315 339845
36081C39845J718j2398k4899l3083l5469l2212k4940j6040p821j922Q46L60k902
$$ 339845 341563 329165 304266 271183 235714 203502 178562 162522 154701 152779 153625 153985 151083
36068A51083p960j3552j8600k2569k5464k7384k8074k6843k2952j6174p177K535
$$ 151083 143123 129571 110971 88402 62938 35554 7480 -19363 -42315 -58489 -65666 -63131
36056f3131J1178J7411K0948K2594K3767K5731K9017L3324L7738M1181M2735M1811
$$ -63131 -51953 -34542 -13594 9000 32767 58498 87515 120839 158577 199758 242493 284304
36044B84304L8136L1639K2451J0907k390j6537l0358m2499n1696n7099n8465n6067
$$ 284304 322440 354079 376530 387437 385047 368510 338152 295653 243957 186858 128393 72326
36032G2326n0402m1952l1149j8460m669Q921K0547K8563L2290L2399L0380K7554
$$ 72326 21924 -20028 -51177 -69637 -74306 -65385 -44838 -16275 16015 48414 78794 106348
36020A06348K4416K0868J6754J2147P200J981l343q263j1953j3651j3119j0831
$$ 106348 130764 151632 168386 180533 187733 189714 186371 178108 166155 152504 139385 128554
36008A28554p771n013l317k889l468m559n765p041q799j1806j6844k4299l3886
$$ 128554 120783 115770 112453 109564 106096 101537 95772 88731 79932 68126 51282 26983 -6903
35995f903m4631n5135o4004p0278p3613p4156p2120o7366n9275m7089l0559j0525
$$ -6903 -51534 -106669 -170673 -240951 -314564 -388720 -460840 -528206 -587481 -634570 -665129 -675654
35983f75654J1095L1992N0384O5527P7511Q6667R3082R6486R6430R2544Q4721
$$ -675654 -664559 -632567 -582183 -516656 -439145 -352478 -259396 -162910 -66480 26064 110785
35972A10785P3260N8970M3169K7425J3107R82q821j6449k2035k5689k7606k8004
$$ 110785 184045 243015 286184 313609 326716 327698 318877 302428 280393 254704 227098 199094
35960A99094k6893k4038j9208j2484m322M508J2903J9276K1708J8567R457m221
$$ 199094 172201 148163 128955 116471 112149 116657 129560 148836 170544 189111 198568 194347
35948A94347j9447l2609m0837m3027m0085l4262k8088k3371k0742j9735j9238
$$ 194347 174900 142291 101454 58427 18342 -15920 -44008 -67379 -88121 -107856 -127094
35937a27094j8049j5371j1045n463P81P213J3605J9944K6308L2747L9095M4874
$$ -127094 -145143 -160514 -171559 -177022 -176241 -169028 -155423 -135479 -109171 -76424 -37329 7545
35925G545M9287N1387N0312M5461L6702K4461R707o236k1973l6286m8255n7292
$$ 7545 56832 108219 158531 203992 240694 265155 274862 268626 246653 210367 162112 104820
35913A04820o3169o5984o6132o4165o0630n5899n0047m3005l4928k6548j9046
$$ 104820 41651 -24333 -90465 -154630 -215260 -271159 -321206 -364211 -399139 -425687 -444733
35902d44733j3309r062m644K257J3395K9146M8385O8884Q7910J02858J11889J14339
$$ -444733 -458042 -467104 -471748 -469491 -456096 -426950 -378565 -309681 -221771 -118913 -7024 107315
35890A07315J10749J02387R0704P6941O2109M7073L2622J9371P739j989r611j5161
$$ 107315 218064 320451 411155 488096 550205 597278 629900 649271 657010 655021 645410 630249
35878F30249j9143k2525k6348l1184l6782m2113m5723m6264m3072l6617k8439
$$ 630249 611106 588581 562233 531049 494267 452154 406431 360167 317095 280478 252039
35867B52039k0526j4365j0330p804n971m629m409o239j0533j6676k3102k7768
$$ 252039 231513 217148 206818 199014 193043 188414 184005 177766 167233 150557 127455 99687
35855I9687k8793k5008j6339l876J0301K3529L3129L7165L5136K8172J8404P887
$$ 99687 70894 45886 29547 25671 35972 59501 92630 129795 164931 193103 211507 219394
35843B19394k111j1012j8380k3677k6548k7141k6081k4031k1345j8072j4245j0171
$$ 219394 217283 206271 187891 164214 137666 110525 84444 60413 39068 20996 6751 -3420
35831c420o519m091l452m604o903r276j0621j0258q170m900j101K888P105J1685
$$ -3420 -9939 -14030 -17482 -22086 -28989 -38265 -48886 -59144 -67314 -72214 -73315 -70427 -63322 -51637
35817e1637J6457K0786K3708K4299K2105J7365J0875L614l543r876j4875j8419
$$ -51637 -35180 -14394 9314 33613 55718 73083 83958 87572 84029 74153 59278 40859
35805D0859k0824k2574k3816k4221k3369k1258j8439j5756j4002j3667j4741j6567
$$ 40859 20035 -2539 -26355 -50576 -73945 -95203 -113642 -129398 -143400 -157067 -171808 -188375
35793a88375j8068j8343j7248j5468j4070j3964j5537j8509k1946k4553k5117
$$ -188375 -206443 -224786 -242034 -257502 -271572 -285536 -301073 -319582 -341528 -366081 -391198
35782c91198k2862j7533r343J026J2417K3359L2408L8466M0961L9866L5649K9181
$$ -391198 -414060 -431593 -440936 -439910 -427493 -404134 -371726 -333260 -292299 -252433 -216784 -187603
35770a87603K1629J4446R260P563J0241J7229K7487L9339N0965O0963O8688P4356
$$ -187603 -165974 -151528 -142268 -134705 -124464 -107235 -79748 -40409 10556 71519 140207 214563
35758B14563P8696Q2417Q5771Q8399Q9513Q8338Q4583P8680P1644O4668N8625
$$ 214563 293259 375676 461447 549846 639359 727697 812280 890960 962604 1027272 1085897
35747A085897N3699M9277M4207L7278K7700J5311N72j5506l1452m5561n6319o2843
$$ 1085897 1139596 1188873 1233080 1270358 1298058 1313369 1313941 1298435 1266983 1221422 1165103 1102260
35735A102260o5082o3666n9492n3326m5685l7000k7863j9026j1162m657L50L807
$$ 1102260 1037178 973512 914020 860694 815009 778009 750146 731120 719958 715301 715651 719458
35723G19458N712O175N338L334L88k823n037m798j109O143J6151K7338L7567M4635
$$ 719458 725170 731345 736683 740017 740405 737582 732545 727747 726638 732781 748932 776270 813837 858472
35709H58472M7048M4604L8336K9866K0608J1315K102p120j6051k3743k8876l0391
$$ 858472 905520 950124 988460 1018326 1038934 1050249 1052351 1045231 1029180 1005437 976561 946170
35697I46170k7986k2261j4563o656j34M260O961R281J2539J7210K2600K7256K9676
$$ 946170 918184 895923 881360 874704 874570 878830 885791 895072 907611 924821 947421 974677 1004353
35684A004353K8948K4893J7997R281J54p937j3944j7441j8468j7211j3839q481
$$ 1004353 1033301 1058194 1076191 1085472 1085626 1077689 1063745 1046304 1027836 1010625 996786 988305
35672I88305j354P031J5742K3580K9592L3496L5495L5645L3330K7401J6930K064
$$ 988305 986951 993982 1009724 1033304 1062896 1096392 1131887 1167532 1200862 1228263 1245193 1247257
35660A247257j5544l3019m7119n5196n5842m9124l6595k1052n920N706J2052J3137
$$ 1247257 1231713 1198694 1151575 1096379 1040537 991413 954818 933766 927846 933552 945604 958741
35648I58741J0544O586L280J715K015L698O033Q257R749J0143R245O889L049j822
$$ 958741 969285 975871 979151 980866 982881 986579 992612 1000869 1010618 1020761 1030006 1036895 1039944 1038122
35634A038122o602r895j0772r244o135k541O64K962M008L439R66l284q577j3829
$$ 1038122 1031520 1021625 1010853 1001609 995474 992933 993597 996559 1000567 1004006 1004972 1001688 993111 979282
35620I79282j8092k0799k1601k0047j5651q300J299J1695K1250K8871L4371L8300
$$ 979282 961190 940391 918790 898743 883092 874792 876091 887786 909036 937907 972278 1010578
35608A010578M1459M4534M7949N1849N5984N9627O1683O1061N7175N0257M1322
$$ 1010578 1052037 1096571 1144520 1196369 1252353 1311980 1373663 1434724 1491899 1542156 1583478
35597A583478L1806K3113J6117J0881O675K425k622q395j4098j8737k1682k2752
$$ 1583478 1615284 1638397 1654514 1665395 1672070 1674495 1671873 1663478 1649380 1630643 1608961 1586209
35585A586209k1971j9251j4460p830m18N870Q855P166J106p227j4708j8458j6986
$$ 1586209 1564238 1544987 1530527 1522697 1522279 1528149 1537004 1544170 1545276 1538049 1523341 1504883 1487897
35572A487897j0653j345Q417J6465K1630K3867K3910K2705K0963J9045J7152J5539
$$ 1487897 1477244 1475899 1484316 1500781 1522411 1546278 1570188 1592893 1613856 1632901 1650053 1665592
35560A665592J4468J3885J3253J1745Q803M624K11l014l855j813K778Q966J5567
$$ 1665592 1680060 1693945 1707198 1718943 1727746 1732370 1732581 1729567 1725712 1723899 1726677 1735643 1751210
35547A751210K1520K6184K9548L2127L4524L6813L8359L8226L5898L1670K6409
$$ 1751210 1772730 1798914 1828462 1860589 1895113 1931926 1970285 2008511 2044409 2076079 2102488
35536B102488K1096J6514J3315J2142J3469J7244K2573K7780L0917L0479K6093
$$ 2102488 2123584 2140098 2153413 2165555 2179024 2196268 2218841 2246621 2277538 2308017 2334110
35525B334110J8800J0840M872L029O289J4371K6104L9931N4351O8159Q0517R0925
$$ 2334110 2352910 2363750 2368622 2371651 2377940 2392311 2418415 2458346 2512697 2580856 2661373 2752298
35513B752298R9208J05640J10898J15791J20815J25980J30942J35379J39264J42999
$$ 2752298 2851506 2957146 3068044 3183835 3304650 3430630 3561572 3696951 3836215 3979214
35503C979214J47281J52687J59048J65018J68201J65814J55576J36423J08879
$$ 3979214 4126495 4279182 4438230 4603248 4771449 4937263 5092839 5229262 5338141
35494E338141P4957L7608m3l5251o5839r0127j06959j15848j17085j11591j00623
$$ 5338141 5413098 5450706 5450663 5415412 5349573 5259446 5152487 5036639 4919554 4807963 4707340
35483D707340q5556o7933m9575l2499j8504q652k939l53Q03K352N626J0980J7779
$$ 4707340 4621784 4553851 4504276 4471777 4453273 4444621 4441682 4441329 4442132 4444484 4450110 4461090 4478869
35470D478869K4813L0955L5597L8744M0894M2755M4899M7387M9680N0874N0241
$$ 4478869 4503682 4534637 4570234 4608978 4649872 4692627 4737526 4784913 4834593 4885467 4935708
35459D935708M7677M3894M0233L8228L9099M3467N1394O2637P6764R3014J10130
$$ 4935708 4983385 5027279 5067512 5105740 5144839 5188306 5239700 5302337 5379101 5472115 5582245
35448E582245J26467J40480J51379J59441J65742J71378J76717J81179J83754
$$ 5582245 5708712 5849192 6000571 6160012 6325754 6497132 6673849 6855028 7038782
35439G038782J83754J81343J77509J73600J70753J69491J69812J71572J74860
$$ 7038782 7222536 7403879 7581388 7754988 7925741 8095232 8265044 8436616 8611476
35430H611476J80035J87320J96494K06794K17200K26815K35166K42319K48614
$$ 8611476 8791511 8978831 9175325 9382119 9599319 9826134 10061300 10303619 10552233
35421A0552233K54341K59563K64318K69007K74528K82005K92336L05850L22353
$$ 10552233 10806574 11066137 11330455 11599462 11873990 12155995 12448331 12754181 13076534
35412A3076534L41397L62449L84882M07792M30093M50920M70226M89156N09997
$$ 13076534 13417931 13780380 14165262 14573054 15003147 15454067 15924293 16413449 16923446
35403A6923446N35665N68827O10975O61799P19269P80324Q41896R01733R58810
$$ 16923446 17459111 18027938 18638913 19300712 20019981 20800305 21642201 22543934 23502744
35394B3502744J013347J066623J120739J178331J242189J314944J399058J497000
$$ 23502744 24516091 25582714 26703453 27881784 29123973 30438917 31837975 33334975
35386C3334975J611238J743786J895727K067286K258585K470469K704832K964429
$$ 33334975 34946213 36689999 38585726 40653012 42911597 45382066 48086898 51051327
35378E1051327L252518L572695L928865M325173M765820N254928N796496O394581
$$ 51051327 54303845 57876540 61805405 66130578 70896398 76151326 81947822 88342403
35370H8342403P053489P777752Q571716R438773J0380298J1394245J2473377J3603097
$$ 88342403 95395892 103173644 111745360 121184133 131564431 142958676 155432053 169035150
35362A69035150J4758997J5904161J6986157J7933326J8650634J9016590J8884449
$$ 169035150 183794147 199698308 216684465 234617791 253268425 272285015 291169464
35355B91169464J8092105J6484901J3953052J0478961O179650J322022l707267
$$ 291169464 309261569 325746470 339699522 350178483 356358133 357680155 353972888
35348C53972888q476434j2602400j5826804j8047436j9302545j9725912j9496119
$$ 353972888 345496454 332894054 317067250 299019814 279717269 259991357 240495238
35341B40495238j8796083j7788354j6604362j5342915j4073562j2841886j1675320
$$ 240495238 221699155 203910801 187306439 171963524 157889962 145048076 133372756
35334A33372756j0588740r588972q677685p852975p110321o443534n845636n309615
$$ 133372756 122784016 113195044 104517359 96664384 89554063 83110529 77264893 71955278
35326G1955278m828905m397604m010379l662256l348581l065197k808727k576698
$$ 71955278 67126373 62728769 58718390 55056134 51707553 48642356 45833629 43256931
35318D3256931k367477k180020k013426j866448j737199j623145j521341j428663
$$ 43256931 40889454 38709434 36696008 34829560 33092361 31469216 29947875 28519212
35310B8519212j342095j259170j178542j100263j025441r55398q90907q31846
$$ 28519212 27177117 25917947 24739405 23639142 22613701 21658303 20767396 19935550
35302A9935550p77321p25969o76382o27666n79932n34354m92677m56473m26681
$$ 19935550 19158229 18432260 17755878 17128212 16548280 16013926 15521249 15064776 14638095
35293A4638095m03570l86968l76406l71125l70070l71898l75162l78523l80888
$$ 14638095 14234525 13847557 13471151 13100026 12729956 12358058 11982896 11604373 11223485
35284A1223485l81355l79096l73313l63401l49196l31201l10643k89341k69289
$$ 11223485 10842130 10463034 10089721 9726320 9377124 9045923 8735280 8445939 8176650
35275H176650k52044k38278k27605k18795k10172k00149j87831j73387j58028
$$ 8176650 7924606 7686328 7458723 7239928 7029756 6829607 6641776 6468389 6310361
35266F310361j43447j31078j21463j14014j07318r9842r0772q0506p0638o3467
$$ 6310361 6166914 6035836 5914373 5800359 5693041 5593199 5502427 5421921 5351283 5287816
35256E287816o1234o5257p5317q9602j05389j20073j31945j40359j45320j46898
$$ 5287816 5226582 5161325 5086008 4996406 4891017 4770944 4638999 4498640 4353320 4206422
35246D206422j44856j38647j27828j12601r4195p4697n6410m1048k9246k0667
$$ 4206422 4061566 3922919 3795091 3682490 3588295 3513598 3457188 3416140 3386894 3366227
35236C366227j4506j0062p000n337n229o754r766j3837j8264k2164k4693k5329
$$ 3366227 3351721 3341659 3334659 3329322 3324093 3317339 3307573 3293736 3275472 3253308 3228615 3203286
35224C203286k4087k1426j7945j4136j0337o793l569m17L186P777J3657K0807
$$ 3203286 3179199 3157773 3139828 3125692 3115355 3108562 3104993 3104576 3107762 3115539 3129196 3150003
35212C150003K8952L7523M5549N1504N3397M9139L7192J7283r097l8679o7071
$$ 3150003 3178955 3216478 3262027 3313531 3366928 3416067 3453259 3470542 3461445 3422766 3355695
35201C355695r0069j05142j12354j14106j13809j14347j17059j21475j25650j26889
$$ 3355695 3265626 3160484 3048130 2934024 2820215 2705868 2588809 2467334 2341684 2214795
35191B214795j22694j11649r3931p1350m6940k4090n337Q562J8530K6044L1879
$$ 2214795 2092101 1980452 1886521 1815171 1768231 1744141 1738804 1747366 1765896 1791940 1823819
35180A823819L5740L6865L4794K9586K1573J1033j891j7101l4381n3216p2620
$$ 1823819 1859559 1896424 1931218 1960804 1982377 1993410 1991519 1974418 1940037 1886821 1814201
35169A814201r1104j06796j17708j22081j18800j07771r0149o8181m4679k2294
$$ 1814201 1723097 1616301 1498593 1376512 1257712 1149941 1059792 991611 946932 924638
35159I24638k886J2771K4910L4295M1561M6705M9079M7929M3063L5181K5745J6553
$$ 924638 921752 934523 959433 993728 1035289 1081994 1131073 1179002 1222065 1257246 1282991 1299544
35147A299544R314N254M788P283J1052J3810J3550R504K569n136j1345j4633j4769
$$ 1299544 1308858 1314112 1318900 1326183 1337235 1351045 1364595 1374099 1376668 1371532 1360187 1345554 1330785
35134A330785j2530r252o343m819n056o897j0048j4446k0217k7374l5400m3089
$$ 1330785 1318255 1309003 1302660 1297841 1292785 1285888 1275840 1261394 1241177 1213803 1178403 1135314
35122A135314m8704n0523m7563m0046k9269j6864l957R178K2659L6154M8359N7411
$$ 1135314 1086610 1036087 988524 948478 919209 902345 898388 907566 930225 966379 1014738 1072149
35110A072149O2001O2400O0624N9552O1624O7773P7100Q7301R5544R9433R7730
$$ 1072149 1134150 1196550 1257174 1316726 1378350 1446123 1523223 1610524 1706068 1805501 1903231
35099A903231R0552P9087O4996M9875L4928K0857P931l818j4307k3266l0376l5628
$$ 1903231 1993783 2072870 2137866 2187741 2222669 2243526 2251457 2247639 2233332 2210066 2179690 2144062
35087B144062l9539m2938m6488n0203n3327n4592n2772m7313l8764k8829j9928
$$ 2144062 2104523 2061585 2015097 1964894 1911567 1856975 1804203 1756890 1718126 1689297 1669369
35076A669369j4511j4438k0575l2633m9125o7534q4793r8008j05160j05461r9211
$$ 1669369 1654858 1640420 1619845 1587212 1538087 1470553 1385760 1287752 1182592 1077131 977920
35065I77920q7299p0790n0796k8708o429J3753K9736M0162M4656M3612L7935K8988
$$ 977920 890621 819831 769035 740327 733898 747651 777387 817549 862205 905817 943752 972740
35053I72740J8567Q715J218k924l761k262J79K300L275K709N57k981p599j3216
$$ 972740 991307 1000022 1001240 998316 994555 992293 992472 994772 998047 1000756 1001313 998332 990733 977517
35039I77517k0093k8536l8258m8119n6534o2225o4742o4445o2211n9120n6189
$$ 977517 957424 928888 890630 842511 785977 723752 659010 594565 532354 473234 417045
35028D17045n4097n2994n2516n1996n0806m8579m5343m1634l8551l7417l8971
$$ 417045 362948 309954 257438 205442 154636 106057 60714 19080 -19471 -56888 -95859
35017i5859m2557m6055m6885m3377l5533k4725j2802j245R259J8707K7246L4664
$$ -95859 -138416 -184471 -231356 -274733 -310266 -334991 -347793 -349038 -339779 -321072 -293826 -259162
35005b59162M0386M4031M5985M7451M9858N4051N9658O4939O7330O4621N6113
$$ -259162 -218776 -174745 -128760 -81309 -31451 22600 82258 147197 214527 279148 335261
34994C35261M2919K7208J1120l874j6944k7692l6028m2121m6213m8404m8628m6781
$$ 335261 378180 405388 416508 412634 395690 367998 331970 289849 243636 195232 146604 99823
34982I9823m2946l7538l1294k5097j9705j5552j2767j1330j1094j1604j1928j0801
$$ 99823 56877 19339 -11955 -37052 -56757 -72309 -85076 -96406 -107500 -119104 -131032 -141833
34970a41833p082k60R330K0600L2055M2224N0032N5001N7168N6852N4520N0811
$$ -141833 -148915 -149175 -139845 -119245 -87190 -44966 5066 60067 117235 174087 228607 279418
34958B79418M6577M2735L9916L8306L7740L7988L8934M0536M2632M4747M5989
$$ 279418 325995 368730 408646 446952 484692 522680 561614 602150 644782 689529 735518
34947G35518M5222M1534L4847K6144J7128R471M107R49r74l068o537j1838j8427
$$ 735518 780740 822274 857121 883265 900393 909864 913971 914920 913946 910878 904341 892503 874076
34934H74076k4971k9839l1697l0012k5333j9200j3549r890q636r028r667r274
$$ 874076 849105 819266 787569 757557 732224 713024 699475 689585 680949 671921 662254 652980
34922F52980p274l922k12K354K117k250j1147k3830l8658n3623o6827p6817q2744
$$ 652980 645706 641784 641572 643926 646043 643793 632646 608816 570158 516535 449708 372891 290147
34909B90147q4416q2094p6284o7643n7066m5673l4634k4939j7267j1990r081q037
$$ 290147 205731 123637 47353 -20290 -77356 -123029 -157663 -182602 -199869 -211859 -220940 -228977
34897b28977p889p437n667k165K671P775J1934J4416J5372J5720J6600J8579K1216
$$ -228977 -236866 -244303 -249970 -252135 -249464 -241689 -229755 -215339 -199967 -184247 -167647 -149068 -127852
34884a27852K3123K2668J8730J1236J189r582j8894k4726k5723k1466j2416M13
$$ -127852 -104729 -82061 -63331 -52095 -50906 -60488 -79382 -104108 -129831 -151297 -163713 -163300
34872a63300J5811L2518M9103O3820P4792Q0578Q0765P6180O8501N9571N0842
$$ -163300 -147489 -114971 -65868 -2048 72744 153322 234087 310267 378768 438339 489181
34861D89181M3171L6929L2176K8780K6404K4617K3025K1322J9169J6085J1709
$$ 489181 532352 569281 601457 630237 656641 681258 704283 725605 744774 760859 772568
34850G72568O300R75k741l723j916J665N425P731P352L687l082j2063k2058l2133
$$ 772568 778868 779843 777102 773379 771463 773128 778553 786284 793636 797323 794241 782178 760120 727987
34836G27987m2041n2071o2387p2361q0469q4886q4306p8522o8436n5654m2015
$$ 727987 685946 633875 571488 499127 418658 333772 249466 170944 102508 46854 4839
34825D839k9108j7948q793j321M901J0016J3767J5763J5705J3517R303L397l484
$$ 4839 -24269 -42217 -51010 -52331 -47430 -37414 -23647 -7884 7821 21338 30641 34038 30554
34812C0554j0067j4492j4711r340J425J5471K9458M0080M5245M4584L9260L1247
$$ 30554 20487 5995 -8716 -18056 -16631 -1160 28298 68378 113623 158207 197467 228714
34800B28714K2384J3681N249l189j1688j9825k6926l2418l6048l7844l7860l5930
$$ 228714 251098 264779 270028 266839 255151 235326 208400 175982 139934 102090 64230 28300
34788B8300l1712k4989j5880m924O993J8610K8331L4682L6987L5679L1880K6595
$$ 28300 -3412 -28401 -44281 -49205 -42212 -23602 4729 39411 76398 112077 143957 170552
34776A70552K0266J2945M799l619j1393j7492k1174k2362k1862k1116k1573k3929
$$ 170552 190818 203763 208562 204943 193550 176058 154884 132522 110660 89544 67971 44042
34764D4042k7721l1470l3348l1942k6767j8239p304M912J7152K7988L5986M0232
$$ 44042 16321 -15149 -48497 -80439 -107206 -125445 -132749 -127837 -110685 -82697 -46711 -6479
34752f479M0839L9007L6486L4849L4933L6668L9208M1234M1547L9683L6291L2765
$$ -6479 34360 73367 109853 144702 179635 216303 255511 296745 338292 377975 414266 447031
34740D47031L0351K9259K8442K6221K1416J4224O319l4l222l127j023J353K840
$$ 447031 477382 506641 535083 561304 582720 596944 603263 603229 600007 596880 595857 597210 600050
34727F00050L401L854N127P529J0561J3250J4808J5113J4803J4893J6080J8121
$$ 600050 603451 607305 612432 619961 630522 643772 658580 673693 688496 703389 719469 737590
34715G37590J9660J8769J3959N085o348j7776k6720l1943l3899l4278l4924l6888
$$ 737590 757250 776019 789978 795063 788715 770939 744219 712276 678377 644099 609175 572287
34703E72287m0059m3452m5828m6271m4401m0198l3695k4851j3685l90J4719L1267
$$ 572287 532228 488776 442948 396677 352276 312078 278383 253532 239847 239457 254176 285443
34691B85443M8612O5471P9754Q9029R1352Q6094P4270N8242M0860K4431R999k697
$$ 285443 334055 399526 479280 568309 659661 745755 820025 878267 919127 943558 953557 950860
34679I50860j4583k6433l8262m9327n8549o5065o8595o9509o8616o6745o4376
$$ 950860 936277 909844 871582 822255 763706 698641 630046 560537 491921 425176 360800
34668C60800o1435n7497n2214m5606l7987k9656k0750j1368j756P785J7020K5754
$$ 360800 299365 241868 189654 144048 106061 76405 55655 44287 42531 50316 67336 93090
34656I3090L3548L9591M2870M2650L8812L1905K2959J3197L803m296j0618j5220
$$ 93090 126638 166229 209099 251749 290561 322466 345425 358622 362425 358129 347511 332291
34644C32291j8602k1423k4207k7207l0417l3677l6699l9066m0327m0077l8068
$$ 332291 313689 292266 268059 240852 210435 176758 140059 100993 60666 20589 -17479
34633a7479l4278k8990k2886j6894j1699p184k272M563J4338K6844M0620N3570
$$ -17479 -51757 -80747 -103633 -120527 -132226 -139410 -141682 -137119 -122781 -95937 -55317 -1747
34621a747O3707O9667P0838O7327N9829M9465L7519K5123J2991J389r637j9895
$$ -1747 61960 131627 202465 269792 329621 379086 416605 441728 454719 456108 446471 426576
34609D26576k8888l5966m0643m2839m2868m1242l8476l4991l1158k7381k4063
$$ 426576 397688 361722 321079 278240 235372 194130 155654 120663 89505 62124 38061
34598C8061k1477j9659j8465j7754j7529j7856j8636j9394j9196j6850j1411k821
$$ 38061 16584 -3075 -21540 -39294 -56823 -74679 -93315 -112709 -131905 -148755 -160166 -162987
34586a62987P695J7913K5500K9082K8842K6358K3827K3194K5479L0509L7060M3369
$$ -162987 -155292 -137379 -111879 -82797 -53955 -27597 -3770 19424 44903 75412 112472 155841
34574A55841M7856M9726M9098M6679M3239L9261L4930L0385K5961K2223J9658
$$ 155841 203697 253423 302521 349200 392439 431700 466630 497015 522976 545199 564857
34563E64857J8244J7334J6034J3816J0811P623M799K430J52k488n536q425j0281
$$ 564857 583101 600435 616469 630285 641096 648719 653518 655948 656100 653612 648076 639651 629370
34550F29370j0471q968o338l483j399r12k330n240q689j1696j3698j4625j4748
$$ 629370 618899 609931 603593 600110 598711 597799 595469 590229 581540 569844 556146 541521 526773
34537E26773j4495j4320j4566j5293j6273j7061j7180j6231j4026j0641o396j720
$$ 526773 512278 497958 483392 468099 451826 434765 417585 401354 387328 376687 370291 368571
34525C68571L026P619J1878J5531J8124J9090J7908J4193P781j138j1881k3222
$$ 368571 371597 379216 391094 406625 424749 443839 461747 475940 483721 482583 470702 447480
34513D47480l3685m1992m7440m9959m9914m7848m4364m0063l5486l0937k6321
$$ 447480 413795 371803 324363 274404 224490 176642 132278 92215 56729 25792 -529
34502e29k1276j5557r491m063n42J05k364p398j3910k0667k6542l0509l1536k8673
$$ -529 -21805 -37362 -46853 -50916 -51458 -51353 -53717 -61115 -75025 -95692 -122234 -152743 -184279 -212952
34488b12952k1426j0182L747J8512L2297M3766N2245N7679O0415O0944N9717N7137
$$ -212952 -234378 -244560 -240813 -222301 -190004 -146238 -93993 -36314 24101 85045 144762 201899
34476B01899N3584M9368M4701L9659L4269K8603K2807J7118J1839P233L344j03
$$ 201899 255483 304851 349552 389211 423480 452083 474890 492008 503847 511080 514424 514321
34464E14321l597p530j2043j7139k2932k9617l7081m4513n0454n3380n2421m7773
$$ 514321 510724 503194 491151 474012 451080 421463 384382 339869 289415 236035 183614 135841
34452A35841m0497l1882k2705j3039k786P400J5619J9266J6350O652q019k4556
$$ 135841 95344 63462 40757 27718 24932 32332 47951 67217 83567 90219 82200 57644
34440E7644l9542m9933n3423m8875l6969k0457l512R836J7218J8629J5907J1506
$$ 57644 18102 -31831 -85254 -134129 -171098 -191555 -195067 -185231 -168013 -149384 -133477 -121971
34428a21971P278L918J201j308l630n268n522l950o59L662P997J1532J4191J6687
$$ -121971 -114693 -110775 -109574 -110882 -114512 -119780 -125302 -129252 -129911 -126249 -118252 -106720 -92529 -75842
34414g5842J9996K4590L0085L5575M0360M4375M7999N1467N4483N6379N6664N5368
$$ -75842 -55846 -31256 -1171 34404 74764 119139 167138 218605 273088 329467 386131 441499
34402D41499N2921M9775M6162M2161L7956L4045L1306L0772L3025L7590M2848
$$ 441499 494420 544195 590357 632518 670474 704519 735825 766597 799622 837212 880060
34391H80060M6689M7376M3999L6271K4248Q444r976k9271m7618o3574p6108q4391
$$ 880060 926749 974125 1018124 1054395 1078643 1087087 1077111 1047840 1000222 936648 860540 776149
34379G76149q7752q6035q0093p1879o3744n7355n3053n0246m8399m7686m8691
$$ 776149 688397 602362 522269 450390 386646 329291 276238 225992 177593 129907 81216
34368H1216n1596n5587n9009n9962n7008m9707l8784k5904j3121k248N548R879
$$ 81216 29620 -25967 -84976 -144938 -201946 -251653 -290437 -316341 -329462 -331710 -326162 -316283
34356c16283J1046R879P461M852K861J878J903K614L431L532J899k407r815j9817
$$ -316283 -305237 -295358 -287897 -283045 -280184 -278306 -276403 -273789 -270358 -266826 -264927 -267334 -277149 -296966
34342b96966l0868m0821m7763n0890n0845m9339m8263m8873n1410n5182n8917
$$ -296966 -327834 -368655 -416418 -467308 -518153 -567492 -615755 -664628 -716038 -771220 -830137
34331h30137o1164o0687n6749m9362l9353k8270j7951r951n051l120l294m370
$$ -830137 -891301 -951988 -1008737 -1058099 -1097452 -1125722 -1143673 -1153624 -1158675 -1161795 -1165089 -1169459
34319a169459n294n595n609o191q078j1201j4429j5917j3864p239L833J8171L3913
$$ -1169459 -1174753 -1180348 -1185957 -1192148 -1200226 -1211427 -1225856 -1241773 -1255637 -1262876 -1259043 -1240872 -1206959
34306a206959M8989O1620P0777P6420P9377Q0847Q1933Q3346Q5331Q7581Q9282
$$ -1206959 -1157970 -1096350 -1025573 -949153 -869776 -788929 -706996 -623650 -538319 -450738 -361456
34295c61456Q9327Q6800Q1344P3221O3023N1444L9321K7891J8700J3041J1173
$$ -361456 -272129 -185329 -103985 -30764 32259 83703 123024 150915 169615 182656 193829
34284A93829J2068J3888J4871J3871J0479M935j977r102j5374k0222k3781k6702
$$ 193829 205897 219785 234656 248527 259006 263941 261964 252862 237488 217266 193485 166783
34272A66783k9766l3390l7175l9781l9441l4925k6238j4717k427Q486J6317K0030
$$ 166783 137017 103627 66452 26671 -12770 -47695 -73933 -88650 -91077 -82591 -66274 -46244
34260d6244J9324J4691P364p95p829j2465j4596j4990j4342j2570q934k824N514
$$ -46244 -26920 -12229 -4865 -5660 -13489 -25954 -40550 -55540 -69882 -82452 -91386 -94210 -88696
34247h8696J4831K3189K8631K9886K6990K1401J5383J0907Q684P990P313N281
$$ -88696 -73865 -50676 -22045 7841 34831 56232 71615 82522 91206 99196 106509 111790
34235A11790J328m096r722j3858j4948j2173n812K705J1110J6871J7877J3149
$$ 111790 113118 109022 99300 85442 70494 58321 52509 55214 66324 83195 101072 114221
34223A14221L180j0266k4813l8207m8719n5230n7131n4335m7264l6819k4157j0482
$$ 114221 117401 107135 82322 44115 -4604 -59834 -116965 -171300 -218564 -255383 -279540 -290022
34211b90022K989J5021K4377L0102L1827K9848K5011J8506J1678N780J684l91
$$ -290022 -287033 -272012 -247635 -217533 -185706 -155858 -130847 -112341 -100663 -94883 -93199 -93590
34199i3590r38r66j588l594p146j1749j6515k0526k3165k4364k4632k4838k5684
$$ -93590 -94528 -95494 -97082 -100676 -107822 -119571 -136086 -156612 -179777 -204141 -228773 -253611 -279295
34186b79295k7130k8091k6736k1243j0622M803K3409M2592N9267P0452P3968O9051
$$ -279295 -306425 -334516 -361252 -382495 -393117 -388314 -364905 -322313 -263046 -192594 -118626 -49575
34174d9575N6535L8518J7682l322k2348l8024m9777n7637o1983o3416o2793o1162
$$ -49575 6960 45478 63160 59838 37490 -534 -50311 -107948 -169931 -233347 -296140 -357302
34162c57302n9461n8080n6662n4292n0006m3271l4303k3975j3362l095O970J7446
$$ -357302 -416763 -474843 -531505 -585797 -635803 -679074 -713377 -737352 -750714 -753809 -746839 -729393
34150g29393K8659M0091N0454N8254O2334O2114N7659M9794M0196L1163K4997
$$ -729393 -700734 -660643 -610189 -551935 -489601 -427487 -369828 -320034 -279838 -248675 -223678
34139b23678K3173K5768L1534L8537M4945M9431N1141M9502M4162L5144K3088
$$ -223678 -200505 -174737 -143203 -104666 -59721 -10290 40851 90353 134515 169659 192747
34128A92747R330m337j6233k5333l1396l4556l4921l2551k7784k1416j4530q227
$$ 192747 202077 197740 181507 156174 124778 90222 55301 22750 -5034 -26450 -40980 -49207
34116d9207l510j282k198o374j3161k1228k8970l5030l8663l9731l8469l5228
$$ -49207 -52717 -53999 -56197 -62571 -75732 -96960 -125930 -160960 -199623 -239354 -277823 -313051
34104c13051l0526k5195k0333j6851j4914j3698j1765p827j423O871J5806K4015
$$ -313051 -343577 -368772 -389105 -405956 -420870 -434568 -446333 -454160 -455583 -448712 -432906 -408891
34092d08891L0466L4562L6055L4980L1648K6633K0637J4234P646O43p309j6727
$$ -408891 -378425 -343863 -307808 -272828 -241180 -214547 -193910 -179676 -172030 -171387 -178696 -195423
34080a95423k7646l9290n0079n8086o1732o0311n4039m3773l0629j5737p2J5624
$$ -195423 -223069 -262359 -312438 -370524 -432256 -492567 -546606 -590379 -621008 -636745 -636817 -621193
34068f21193L0775M4763N6765O5841P1237P2639P0212O4442N5978M5481L3533
$$ -621193 -590418 -545655 -488890 -423049 -351812 -279173 -208961 -144519 -88541 -43060 -9527
34057i527K0592P059o585j9641l1132l9902m5077m6657m5767m4159m3176m3043
$$ -9527 11065 18124 11539 -8102 -39234 -79136 -124213 -170870 -216637 -260796 -303972 -347015
34045c47015m2979m1956l9365l5159k9608k3062j5907q646j931L620P648J0074
$$ -347015 -389994 -431950 -471315 -506474 -536082 -559144 -575051 -583697 -585628 -582008 -574360 -564286
34033e64286J0842R707O418J272m572r430j1897j1499q689m359O38N577R738J2426
$$ -564286 -553444 -543737 -537319 -536047 -540619 -550049 -561946 -573445 -582134 -586493 -585855 -580278 -570540 -558114
34019e58114J3288J2597J1275J0598J1875J6243K4434L6495N1585O7993Q3389
$$ -558114 -544826 -532229 -520954 -510356 -498481 -482238 -457804 -421309 -369724 -301731 -218342
34008b18342R5187J01030R9354Q9817P3255N1336K6203L35k3585m3109n6675o4009
$$ -218342 -123155 -22125 77229 167046 240301 291637 317840 318175 294590 251481 194806 130797
33996A30797o6024o4191n9824n3570m5424l5232k3386j1158l91P273J1052J1283
$$ 130797 64773 582 -59242 -112812 -158236 -193468 -216854 -228012 -228403 -221130 -210078 -198795
33984a98795R172O390M543M658O826J0241J3645J5891J6346J4957J2151Q650N255
$$ -198795 -189623 -183233 -178690 -174032 -167206 -156965 -143320 -127429 -111083 -96126 -83975 -75325 -70070
33971g0070K653J416K033M851R793J6138K2740K8572L3170L6505L8529L8814L6710
$$ -70070 -67417 -66001 -63968 -59117 -49324 -33186 -10446 18126 51296 87801 126330 165144 201854
33958B01854L1865K4705J6443Q570K022l306q426j4492k1998l0470l8801m5879
$$ 201854 233719 258424 274867 283437 285459 282153 273727 259235 237237 206767 167966 122087
33946A22087n0974n3676n3603n0364m3904l4951k5009j5844q912n140n004q509
$$ 122087 71113 17437 -36166 -86530 -130434 -165385 -190394 -206238 -215150 -220290 -225294 -233803
33934b33803j4925k2561k9060l2141l0393k3603j2663O96J4278K5941L4285L9098
$$ -233803 -248728 -271289 -300349 -332490 -362883 -386486 -399149 -398453 -384175 -358234 -323949 -284851
33922b84851M1267M2184M2961M3850M4082M2198L6907K8036J6933N960k680q043
$$ -284851 -243584 -201400 -158439 -114589 -70507 -28309 8598 36634 53567 59527 56847 48804
33910D8804j0841j2968j6476k2541l0939m0144m7993n2519n2679m8667m1650l3030
$$ 48804 37963 24995 8519 -14022 -44961 -85105 -133098 -185617 -238296 -286963 -328613 -361643
33898c61643k3810j4426n171L347J0134J4189J5029J2971Q976M123r11n996j1265
$$ -361643 -385453 -399879 -405050 -401703 -391569 -377380 -362351 -349380 -340404 -336281 -337192 -343188 -354453
33885c54453j6710k2006k6613k9969l1572l1015k8097k3020j6588j0161n329l402
$$ -354453 -371163 -393169 -419782 -449751 -481323 -512338 -540435 -563455 -580043 -590204 -595533 -598935
33873e98935m888r246j4996k0224k3325k3660k1713j8681j5671j3050j0299o418
$$ -598935 -603823 -613069 -628065 -648289 -671614 -695274 -716987 -735668 -751339 -764389 -774688 -781106
33861g81106o07P166J6050K4720L2010L7485M1630M5546N0233N5879O1677O6303
$$ -781106 -781713 -774547 -758497 -733777 -701767 -664282 -622652 -577106 -526873 -470994 -409317 -343014
33849c43014O8695O8463O5771O0858N3677M3909L1262J5944r71j7511l1239m0049
$$ -343014 -274319 -205856 -140085 -79227 -25550 18359 49621 65565 64594 47083 15844 -24205
33837b4205m2949m0347l3731k4905j5446o682P6L596L272k82n251r358j0826q935
$$ -24205 -67154 -107501 -141232 -166137 -181583 -188265 -188189 -184593 -181321 -181603 -186854 -196212 -207038 -215973
33823b15973l958L212J1465J9648K6706L1821L4530L4701L2362K7644K0944J3168
$$ -215973 -219931 -216719 -205254 -185606 -158900 -127079 -92549 -57848 -25486 2158 23102 36270
33811C6270N642l49m154n937o286n633m027j324K407O755J1098J4741J7040J7463
$$ 36270 41912 41563 37409 31472 25186 19553 15526 14202 16609 23364 34462 49203 66243 83706
33797H3706J5728J1885O212r37r114j7589k5060k9718k9738k4174j3790j132J0279
$$ 83706 99434 111319 117531 116594 107480 89891 64831 35113 5375 -18799 -32589 -33721 -23442
33784b3442J7380J8725J4797P414j261r566j6594k1915k5158k6065k4919k2886
$$ -23442 -6062 12663 27460 34874 33613 24047 7453 -14462 -39620 -65685 -90604 -113490
33772a13490k1704k2815k6536l1769l6382l8086l5521k8971k0252j1785n478k111
$$ -113490 -135194 -158009 -184545 -216314 -252696 -290782 -326303 -355274 -375526 -387311 -392789 -394900
33760c94900j400k448m221n958p353q446r385j0169j0629j0442r236o679k651
$$ -394900 -396300 -398748 -402969 -408927 -416280 -424726 -434111 -444280 -454909 -465351 -474587 -481266 -483917
33747d83917K737R249J6707K5025L4178M4203N5206O7190P9708R1626J01295J07151
$$ -483917 -481180 -471931 -455224 -430199 -396021 -351818 -296612 -229422 -149714 -58088 43207 150358
33735A50358J08304J04857R7686Q7955P6546O3767M9365L2939J4543m826k3243
$$ 150358 258662 363519 461205 549160 625706 689473 738838 771777 786320 781494 758251
33724G58251l8502m9083n4811n6837n6957n6846n7533n9240o1423o2924o2336
$$ 758251 719749 670666 615855 559018 502061 445215 387682 328442 267019 204095 141759
33713A41759n8537n1342m1767l1778k3468j8254j6374j7046j9042k1286k3140
$$ 141759 83222 31880 -9887 -41665 -65133 -83387 -99761 -116807 -135849 -157135 -180275
33702a80275k4291k4589k4042k2962k1917k1432k1610k2069k2181k1428j9542
$$ -180275 -204566 -229155 -253197 -276159 -298076 -319508 -341118 -363187 -385368 -406796 -426338
33691d26338j6357j1613m953L773J4148K5048L4887M2121M5729M5538M2147L6533
$$ -426338 -442695 -454308 -459261 -455488 -441340 -416292 -381405 -339284 -293555 -248017 -205870 -169337
33679a69337K9434K0923J0574j862j5748k9344m0361m6858m7986m4191l6855k7701
$$ -169337 -139903 -118980 -108406 -110268 -126016 -155360 -195721 -242579 -290565 -334756 -371611 -399312
33667c99312j8188r207j052O268J2577J7253J9256J7524J1483J383j1678k6007
$$ -399312 -417500 -426707 -427759 -421491 -408914 -391661 -372405 -354881 -343398 -342015 -353693 -379700
33655c79700l9767n1308n9344o2987o1791n5824m5690l2433j7328j715J3135K6044
$$ -379700 -419467 -470775 -530119 -593106 -654897 -710721 -756411 -788844 -806172 -807887 -794752 -768708
33643g68708L5987M2266M4750M3973M0892L6420L1100K5165J8852J2535O586J162
$$ -768708 -732721 -690455 -645705 -601732 -560840 -524420 -493320 -468155 -449303 -436768 -430182 -429020
33631d29020l775q314j2502j6335j9702k2288k3496k2522j8509j0713J351J7645
$$ -429020 -432795 -441109 -453611 -469946 -489648 -511936 -535432 -557954 -576463 -587176 -585825 -568180
33619e68180L7308N8533P8779R5392J06364J10833J09088J02160R1385P8134O3721
$$ -568180 -530872 -472339 -393560 -298168 -191804 -80971 28117 130277 221662 299796 363517
33608C63517M9367L6110K4771J5878R585N612L364K203J652J338P78p04l783q778
$$ 363517 412884 448994 473765 489643 499228 504840 508204 510407 512059 513397 514175 513471 509688 500910
33594E00910j5392k2762k9782l5552l9624m1985m2789m2104l9849l5871l0050
$$ 500910 485518 462756 432974 397422 357798 315813 273024 230920 191071 155200 125150
33583A25150k2332j2856k223Q283J6840K1682K1763J7229R458P64o218r324p582
$$ 125150 102818 89962 87739 96022 112862 134544 156307 173536 182994 183758 177540 168216 160634
33570A60634j584O663J4261J8219J6314P766o605k4673m3538o0027p1290p5596
$$ 160634 159050 165713 179974 198193 214507 222273 215668 190995 147457 87430 16140 -59456
33558e9456p2960o5147n4826m4350l4965k6813j9635j3455q732n968n211n893
$$ -59456 -132416 -197563 -252389 -296739 -331704 -358517 -378152 -391607 -400339 -406307 -411518 -417411
33546d17411p035p503o301k898K459Q810J5043K0560K5508L0375L5362M0117M3899
$$ -417411 -424446 -431949 -438250 -441148 -438689 -429879 -414836 -394276 -368768 -338393 -303031 -262914 -219015
33533b19015M6077M6504M5588M3998M2218M0275L7859L4832L1613K9038K7778
$$ -219015 -172938 -126434 -80846 -36848 5370 45645 83504 118336 149949 178987 206765
33522B06765K7858K8822L0330L2627L6346M1878M8861N6191O2395O6135O6563
$$ 206765 234623 263445 293775 326402 362748 404626 453487 509678 572073 638208 704771
33511G04771O3503N7388M9047L9394K9143J8715Q372j488j0171j6897k1310k3855
$$ 704771 768274 825662 874709 914103 943246 961961 970333 968845 958674 941777 920467 896612
33499H96612k5715k8238l2312l8082m5119n2828o0707o8359p5382q1360q5919
$$ 896612 870897 842659 810347 772265 727146 674318 613611 545252 469870 388510 302591
33488C02591q8781q9816q9121q7054q4055q0254p5254o8350n9069m7648l5157
$$ 302591 213810 123994 34873 -52181 -136236 -216490 -291744 -360094 -419163 -466811 -501968
33477e01968k3225j3428o511j892K093P229J4426K3450L3436M3673N4014O4668
$$ -501968 -525193 -538621 -545132 -547024 -544931 -537702 -523276 -499826 -466390 -422717 -368703 -304035
33465c04035P5538Q5621R2957R5285R1028P9968O3324M3333K2574L229j3477k7271
$$ -304035 -228497 -142876 -49919 45366 136394 216362 279686 323019 345593 348822 335345 308074
33453C08074l8284m6445n1366n2705n0513m5290l7813k9025j9972j1729n208r35
$$ 308074 269790 223345 171979 119274 68761 23471 -14342 -43367 -63339 -75068 -80276 -81211
33441h1211J049J071m27l084o601j0515j4082j6430j6921j5424j2289q029k893
$$ -81211 -80162 -79091 -79518 -82602 -89203 -99718 -113800 -130230 -147151 -162575 -174864 -182893 -185786
33428a85786L293J0935K0274L1085M2746N4434O5300P4415Q0655Q2839Q0172P2790
$$ -185786 -182493 -171558 -151284 -120199 -77453 -23019 42281 116696 197351 280190 360362 433152
33416D33152O1971M9700L7868K7637J9308J2618P116K424j691n375q801j2089
$$ 433152 495123 544823 582691 610328 629636 642254 649370 651794 650103 644728 635927 623838
33404F23838j5111j7292j7757j5781j1209m650K592Q813J2433J2611R588M421
$$ 623838 608727 591435 573678 557897 546688 542038 544630 553443 565876 578487 588075 592496
33392E92496j729q181j4792k1541k8159l4169l9214m3324m6833n0113n3355n6511
$$ 592496 590767 582586 567794 546253 518094 483925 444711 401387 354554 304441 251086 194575
33380A94575n9268o1038o0994n8291n2364m3155l1186j7413k937J1306K4640L6421
$$ 194575 135307 74269 13275 -45016 -97380 -140535 -171721 -189134 -192071 -180765 -156125 -119704
33368a19704M5715N1232N1736M6712L6767K3394Q365o835k1069l3282m2265m6847
$$ -119704 -73989 -22757 28979 75691 112458 135852 144217 137382 116313 83031 40766 -6081
33356f081m6427m1419l3231k3700j4346n995J045O486R818J0535Q655N062J287
$$ -6081 -52508 -93927 -127158 -150858 -165204 -171199 -170154 -163668 -153850 -143315 -134660 -129598 -128311
33343a28311j126j417l4J601J940K29l103o811r548j0384q902n044J000Q879J8168
$$ -128311 -129437 -130854 -130888 -129287 -127347 -127118 -130221 -137032 -146580 -156964 -165866 -170910 -169910 -161031 -142863
33328a42863K8454L9242M9702N8546O4338O6087O3737N8124N0506M2106L3962
$$ -142863 -114409 -75167 -25465 33081 97419 163506 227243 285367 335873 377979 411941
33317D11941K7049K2344K0610K1994K5728L0310L4062L5789L5058L2108K7547
$$ 411941 438990 461334 481944 503938 529666 559976 594038 629827 664885 696993 724540
33306G24540K2074J6232J0119L325m667j3747k2739k9751l3083l2136k7700k1717
$$ 724540 746614 762846 772965 776290 771623 757876 735137 705386 672303 640167 612467 590750
33294E90750j6638j4579j6537k2041k9473l6790m2268m4874m4332m0959l5386
$$ 590750 574112 559533 542996 520955 491482 454692 412424 367550 323218 282259 246873
33283B46873k8299k0287j1941l967K897Q072J1274J2468J1769R477O141K517p07
$$ 246873 218574 198287 186346 182379 185276 193348 204622 217090 228859 238336 244477 246994 246287
33270B46287l199n072o661q160r283r254p167k467M724J3665K3227L2037L8504
$$ 246287 243088 238016 231355 223195 213912 204658 197491 195024 199748 213413 236640 268677 307181
33257C07181M1049L8621L1219J9991O809o368j8008k7274l4171l9529m4693n0928
$$ 307181 348230 386851 418070 438061 444870 438502 420494 393220 359049 319520 274827 223899
33245B23899n8659o7023p4026p7301p5157o7275n4692l9140k2248n125J1553K7298
$$ 223899 165240 98217 24191 -53110 -128267 -195542 -250234 -289374 -311622 -316747 -305194 -277896
33233b77896M1606N4043O4477P3260Q1223Q9267R7822J06536J14420J20323J23355
$$ -277896 -236290 -182247 -117770 -44510 36713 125980 223802 330338 444758 565081 688436
33222F88436J22992J18960J10942R8368Q0415N6456K6716p235m2503p5457j02563
$$ 688436 811428 930388 1041330 1139698 1220113 1276569 1303285 1296050 1253547 1178090 1075527
33211A075527j21168j29932j28856j19105j02783q2742o2163m3875k9678k0023
$$ 1075527 954359 824427 695571 576466 473683 390941 328778 284903 255225 235202
33201B35202j4168j0634p834m650q09L223O739R274J0814J1638J2064J2190J1874
$$ 235202 221034 210400 202566 197916 197107 200330 207069 216343 227157 238795 250859 263049 274923
33188B74923J0942R615Q746R652J3525K0741L0527M1013M9792N4633N4190M8367
$$ 274923 285865 295480 304226 313878 327403 348144 378671 419684 469476 524109 578299 626666
33176F26666L8269K5738J2804J130q283j5132j9604k2107k3071k2848k1744k0084
$$ 626666 664935 690673 703477 704607 696324 681192 661588 639481 616410 593562 571818 551734
33164E51734j8211j6493j5262j4712j4802j5211j5452j5187j4527j4122j4838
$$ 551734 533523 517030 501768 487056 472254 457043 441591 426404 411877 397755 382917
33153C82917j7279k1354k6266l0787l3705l4151l1748k6652j9436j0991k316N692
$$ 382917 365638 344284 318018 287231 253526 219375 187627 160975 141539 130548 128232 133924
33141A33924J2516J8169K2963K6921K9232K8318K2577J1387m360k2346l9554n3190
$$ 133924 146440 164609 187572 214493 243725 272043 294620 306007 301647 279301 239747 186557
33129A86557o1589o4644o3596o0348n6680n3800n2204n1750n1855n1801n1091
$$ 186557 124968 60324 -3272 -63620 -120300 -174100 -226304 -278054 -329909 -381710 -432801
33118d32801m9502m6844m2554l5698k5487j2024L281J7954K9234L4981L4384K8197
$$ -432801 -482303 -529147 -571701 -607399 -632886 -644910 -641629 -623675 -594441 -559460 -525076 -496879
33106d96879J8519Q266M99k282J149J0266K2973L6393M7923N5885N9504N8571
$$ -496879 -478360 -470094 -469595 -471877 -470728 -460462 -437489 -401096 -353173 -297288 -237784 -179213
33094a79213N3167M3702L1138J7095L731o737j2710j3840j1181o724k397P89L024
$$ -179213 -126046 -82344 -51206 -34111 -30380 -37117 -49827 -63667 -74848 -81572 -83969 -83180 -80156
33081h0156N347R091J5490K5309L8377N3210O7153P7209Q1080P7912O8411N4467
$$ -80156 -74809 -65718 -50228 -24919 13458 66668 133821 211030 292110 370022 438433 492900
33069D92900L8488K2693Q598l143j2571k0043k5820k9854l1838l1467k8656k3577
$$ 492900 531388 554081 562679 559536 546965 526922 501102 471248 439410 407943 379287 355710
33057C55710j6630q456q5P056J1433J1856P915J86r917k0544k9884l6555l9782
$$ 355710 339080 330624 330539 337595 349028 360884 368799 368985 359068 338524 308640 272085 232303
33044B32303l9423l5971l0491k4465j9408j6362j5529j6295j7609j8449j8145
$$ 232303 192880 156909 126418 101953 82545 66183 50654 34359 16750 -1699 -19844
33033a9844j6453j3565j0047o725m402l495l735m236l887j891J907O988J2364
$$ -19844 -36297 -49862 -59909 -66634 -71036 -74531 -78266 -82502 -86389 -88280 -86373 -79385 -67021
33020f7021J6857J9439J9509J6986J2159N402k851j2024k1303k9736l6409m0641
$$ -67021 -50164 -30725 -11216 5770 17929 23331 20480 8456 -12847 -42583 -78992 -119633
33008a19633m2075m0725l6866l0894k3216j4288m720M705J3139J9837K4261K6064
$$ -119633 -161708 -202433 -239299 -270193 -293409 -307697 -312417 -307712 -294573 -274736 -250475 -224411
32996b24411K4995K0868J3733M096p003j8263k8404l6291m0899m1439l7668l0063
$$ -224411 -199416 -178548 -164815 -160719 -167722 -185985 -214389 -250680 -291579 -333018 -370686 -400749
32984d00749j9589p347N553J7841K8082L5098L8594L9365L8836L8240L8087L8145
$$ -400749 -420338 -427685 -422132 -404291 -376209 -341111 -302517 -263152 -224316 -186076 -147989 -109844
32972a09844L7811L6389L3246K7948K0459J1329J707o844j2698j4641j2380o814
$$ -109844 -72033 -35644 -2398 25550 46009 57338 59045 52201 39503 24862 12482 5668
32960E668K14O612J0795J2007J0204N699j106r834k0028l0958m1491n0250n6056
$$ 5668 5882 12494 23289 35296 45500 51199 50093 40259 20231 -10727 -52218 -102468 -158524
32947a58524n8392n7518n4162m9061m2675l5150k6439j6406m985P653K0874L3588
$$ -158524 -216916 -274434 -328596 -377657 -420332 -455482 -481921 -498327 -503312 -495659 -474785 -441197
32935d41197M4522N2793N8404O2272O5743O9796P4407P8304P9212P4524O2300
$$ -441197 -396675 -343882 -285478 -223206 -157463 -87667 -13260 65044 144256 218780 281080
32924B81080M2143J5564j4534m4861p2651r6019j13840j25435j30376j28447j19692
$$ 281080 323223 338787 324253 279392 206741 110722 -3118 -128553 -258929 -387376 -507068
32913e07068j04533q3902n9311l2777o647J6656L4958M6707N1433N0020M4609
$$ -507068 -611601 -695503 -754814 -787591 -794238 -777582 -742624 -695917 -644484 -594464 -549855
32902e49855L7874L1997K7912K5326K3426K1691K0187J9250J9005J9117J8936
$$ -549855 -511981 -479984 -452072 -426746 -403320 -381629 -361442 -342192 -323187 -304070 -285134
32891b85134J7774J5215J1319O686K314q19k167j897p98Q0j23j821n015r537j5246
$$ -285134 -267360 -252145 -240826 -234140 -231826 -232645 -234812 -236709 -237507 -237427 -237550 -239371 -244386 -253923 -269169
32876b69169k1943k9112l5718m0353m1769l9479l4027k6686j8827j1330m353K538
$$ -269169 -291112 -320224 -355942 -396295 -438064 -477543 -511570 -538256 -557083 -568413 -572766 -570228
32864e70228R963J8180K6616L3879L8364L9098L6192L0674K3948J7379J2026Q450
$$ -570228 -560265 -542085 -515469 -481590 -443226 -404128 -367936 -337262 -313314 -295935 -283909 -275459
32852b75459O530N426L883P91m200j0363j6148j9914k0692j8454j3816p541k84
$$ -275459 -268929 -263503 -259620 -258829 -263029 -273392 -289540 -309454 -330146 -348600 -362416 -369957 -370241
32839c70241P339J4512K0111K2930K2164J7912J1379M588k96j727O96O250J3522
$$ -370241 -362902 -348390 -328279 -305349 -283185 -265273 -253894 -249306 -249602 -251329 -250633 -244383 -230861
32826b30861K0985K7251L1162L1918K9453K4595J8711J2847P059M42q242j9748
$$ -230861 -209876 -182625 -151463 -119545 -90092 -65497 -46786 -33939 -26880 -26438 -34680 -54428
32814e4428l3914m9730o5698q0189r1636r8682j00366r6342q6924p2955n5627
$$ -54428 -88342 -138072 -203770 -283959 -375595 -474277 -574643 -670985 -757909 -830864 -886491
32803h86491l6376j6789J558J7342K9619L7781M1503M0904L6921L1515K7286K6499
$$ -886491 -922867 -939656 -938098 -920756 -891137 -853356 -811853 -770949 -734028 -702513 -675227 -648728
32791f48728L0155L7688M7527N7955O7759P6319Q3274Q8084Q9869Q7829Q1961
$$ -648728 -618573 -580885 -533358 -475403 -407644 -331325 -248051 -159967 -70098 17731 99692
32780I9692P3475O4410N6576N0663M6077M1633L6486L0681K4973K0054J5805J1148
$$ 99692 173167 237577 294153 344816 390893 432526 469012 499693 524666 544720 560525 571673
32768E71673M731m006j4280k4349l2544l8169m1567m3455m4177m3561m1424l8186
$$ 571673 576404 572398 558118 533769 501225 463056 421489 378034 333857 290296 248872 210686
32756B10686l4900l2643l1750l1623l1208k9754k7212k4161k1352j9292j7968
$$ 210686 175786 143143 111393 79770 48562 18808 -8404 -32565 -53917 -73209 -91177
32745i1177j6926j5571j3434j0154n355J295R692J9022K7980L5361M0604M3856
$$ -91177 -108103 -123674 -137108 -147262 -152617 -151322 -141630 -122608 -94628 -59267 -18663 25193
32733B5193M5685M6678M7234M7522M7550M7239M6350M4432M0954L5620K8692K1117
$$ 25193 70878 117556 164790 212312 259862 307101 353451 397883 438837 474457 503149 524266
32721E24266J4480J0580J0664J4556K0344K4975K5492K0307R914l163j5182k2486
$$ 524266 538746 549326 559990 574546 594890 619865 645357 665664 675578 672415 657233 634747
32709F34747k2756j5535j935J6076L6291N6629P5351R1215J03521J12010J16661
$$ 634747 611991 596456 594521 610597 646888 703517 778868 870083 973604 1085614 1202275
32698A202275J17437J14031J05810R2079P2575M8017K0305p760l3217n3823o8633
$$ 1202275 1319712 1433743 1539553 1631632 1704207 1752224 1772529 1764769 1731552 1677729 1609096
32687A609096p8027q3222q5571q6041q5011q2353p7745p1050o2636n3460m4767
$$ 1609096 1531069 1447847 1362276 1276235 1191224 1108871 1031126 960076 897440 843980 799213
32676G99213l7632l2574k9387k7329k5490k3285k0782j8587j7389j7539j8924
$$ 799213 761581 729007 699620 672291 646801 623516 602734 584147 566758 549219 530295
32665E30295k1151k3579k5345k5599k4046k1295j8516j6571j5313j3695j0473
$$ 530295 509144 485565 460220 434621 410575 389280 370764 354193 338880 325185 314712
32654C14712n038K204R989J6673K0753K1167J7500J0150M47r466j7215k1022k0398
$$ 314712 309674 311878 321867 338540 359293 380460 397960 408110 408557 399091 381876 360854 340456
32641C40456j6223j0198l950J608O261R955J2193J1917P863p89j3816k9626m5431
$$ 340456 324233 314035 310085 311693 317954 327909 340102 352019 359882 359093 345277 315651 270220
32628B70220n8027o5075o6087o2494n6563n0075m3638l6946k9525k1196j2273
$$ 270220 212193 147118 81031 18537 -38026 -88101 -131739 -168685 -198210 -219406 -231679
32617b31679l482M073R180J0950R279M914q28o563j1197j4165j5457j5477j4697
$$ -231679 -235161 -231088 -221908 -210958 -201679 -196765 -197593 -204156 -215353 -229518 -244975 -260452 -275149
32604b75149j3370j1453q831n583k065J195L678M964M740K747j187o979j4113
$$ -275149 -288519 -299972 -308803 -314386 -316451 -315256 -311578 -306614 -301874 -299127 -300314 -307293 -321406
32591c21406k1642k8495l3881l7443l9184l9267l7949l5608l2650k9359k5736
$$ -321406 -343048 -371543 -405424 -442867 -482051 -521318 -559267 -594875 -627525 -656884 -682620
32580f82620k1543j6443j0194k708O021J6045K7517M0483N4573O8713Q1251R0558
$$ -682620 -704163 -720606 -730800 -733508 -727487 -711442 -683925 -643442 -588869 -520156 -438905 -348347
32568c48347R5729R6933R5081R1059Q5247P7609O8202N7491M6247L5273K5195
$$ -348347 -252618 -155685 -60604 30455 115702 193311 261513 319004 365251 400524 425719
32557D25719J6501R579M562J138j530m435q203j2828j7876k3009k8230l3672l9162
$$ 425719 442220 451799 456361 457499 455969 451534 443331 430503 412627 389618 361388 327716 288554
32544B88554m4026m7397m8805m8535m7484m6569m6238m6424m6739m6683m5625
$$ 288554 244528 197131 148326 99791 52307 5738 -40500 -86924 -133663 -180346 -225971
32533b25971m2904l8121l1398k3345j4782o563M32N272P201O020K358k453o909
$$ -225971 -268875 -306996 -338394 -361739 -376521 -383084 -382652 -377380 -370179 -364159 -361801 -364254 -371163
32520c71163j0063j1951j3434j5612j9262k4559l1024l7472m2119m3100l9330
$$ -371163 -381226 -393177 -406611 -422223 -441485 -466044 -497068 -534540 -576659 -619759 -659089
32509f59089l1119k0098q416K123J0512J6482K0181K1838K1590J9564J6142J2162
$$ -659089 -690208 -710306 -718722 -716599 -706087 -689605 -669424 -647586 -625996 -606432 -590290 -578128
32497e78128Q806P193P916J0908J5638K1417K7533L3217L7633M0032M0008L7558
$$ -578128 -569322 -562129 -554213 -543305 -527667 -506250 -478717 -445500 -407867 -367835 -327827 -290269
32485b90269L2889K6185J7579P380l718j4648k4198l1331l5474l6628l5262l2103
$$ -290269 -257380 -231195 -213616 -206236 -209954 -224602 -248800 -280131 -315605 -352233 -387495 -419598
32473d19598k7974k3744k0196j7779j6475j5891j5457j4493j2186p783j033P466
$$ -419598 -447572 -471316 -491512 -509291 -525766 -541657 -557114 -571607 -583793 -591576 -592609 -585143
32461e85143J6369K4151K9691L2605L3170L2060L0028K7676K5401K3465K2122
$$ -585143 -568774 -544623 -514932 -482327 -449157 -417097 -387069 -359393 -333992 -310527 -288405
32450b88405K1579K1796K2233K1871J9603J4797P606j147j0384j9145k6674l2277
$$ -288405 -266826 -245030 -222797 -200926 -181323 -166526 -158920 -160067 -170451 -189596 -216270 -248547
32438b48547l5098l4175k8744j8710m855J1341K8121M3815N6943O6363P1452P2330
$$ -248547 -283645 -317820 -346564 -365274 -370129 -358788 -330667 -286852 -229909 -163546 -92094 -19764
32426a9764O9814O5190N9900N5279N2185N0625M9711M8167M5048M0061L3301K4755
$$ -19764 50050 115240 175140 230419 282604 333229 382940 431107 476155 516216 549517 574272
32414E74272J4195J482j2983k8044m1863n2312n7653n7251n2056m4444l7378l3259
$$ 574272 588467 589949 576966 548922 507059 454747 397094 339843 287787 243343 205965 172706
32402A72706l3062l6191m1001m5548m8100m7472m3255l5943k6739j7010p676J066
$$ 172706 139644 103453 62452 16904 -31196 -78668 -121923 -157866 -184605 -201615 -209291 -208225
32390b08225R561J8223K7044L5444M2564M7785N1039N2717N3237N2756N1191M8413
$$ -208225 -198664 -180441 -153397 -117953 -75389 -27604 23435 76152 129389 182145 233336 281749
32378B81749M4445L9490L3881K8043K2527J7991J5042J3941J4442J5816J7041
$$ 281749 326194 365684 399565 427608 450135 468126 483168 497109 511551 527367 544408
32367E44408J6978J4555R139R54q723j7934k4836k8483k9166k8143k6969k6752
$$ 544408 561386 575941 585080 586034 577311 559377 534541 506058 476892 448749 421780 395028
32355C95028k7729k9260l0165k9244k5782j9955j2928o506k398j465l448p253
$$ 395028 367299 338039 307874 278630 252848 232893 219965 213459 211061 209596 206148 198895
32343A98895j1611j5554j8604k0625k1623k1594k0541j8650j6510j5156j5840
$$ 198895 187284 171730 153126 132501 110878 89284 68743 50093 33583 18427 2587
32332B587j9497k6201l4958m3928n1004n4352n2791m5938l4344j9523l819J0040
$$ 2587 -16910 -43111 -78069 -121997 -173001 -227353 -280144 -326082 -360426 -379949 -383768 -373728
32320c73728J9611K3467K1725J6150R749N832O900J3789K5550M0065N4983O8367
$$ -373728 -354117 -330650 -308925 -292775 -283026 -277194 -270294 -256505 -230955 -190890 -135907 -67540
32308f7540P8839Q5390Q7220Q3810P5259O2632M8124L4651K4900K0225K0137K2688
$$ -67540 11299 96689 183909 267719 342978 405610 453734 488385 513285 533510 553647 576335
32296E76335K5494K6694K5519K2339J8380J5181J3918J4693J6268J6473J3206
$$ 576335 601829 628523 654042 676381 694761 709942 723860 738553 754821 771294 784500
32285G84500N481o155j9993l4037m6912n8326o8968p9786r1247j02890j13500
$$ 784500 789981 783826 763833 729796 682884 624558 555590 475804 384557 281667 168167
32274A68167j21642j26209j26733j23424j16988j08327r8367q7959p7805o8255
$$ 168167 46525 -79684 -206417 -329841 -446829 -555156 -653523 -741482 -819287 -887542
32264h87542n9119m9699l9057k6330j0976P030K7047M7827O7775Q5388R9623J10137
$$ -887542 -946661 -996360 -1035417 -1061747 -1072723 -1065693 -1038646 -990819 -923044 -837656 -738033 -627896
32252f27896J17230J21518J23505J23276J20588J15199J07169R6934Q5259P3230
$$ -627896 -510666 -389148 -265643 -142367 -21779 93420 200589 297523 382782 456012
32242D56012O2142N3234M7137M3508M1118L8449L4431K8708K1430J2789K825q395
$$ 456012 518154 571388 618525 662033 703151 741600 776031 804739 826169 838958 841783 833388
32230H33388k0388l2143m2374m9950n4165n4751n1769m5524l6544k5553j3495
$$ 833388 813000 780857 738483 688533 634368 579617 527848 482324 445780 420227 406732
32219D06732j665Q294J4664J6213J2657M727o188j8558l1072m2811n3131o1485
$$ 406732 405067 413361 428025 444238 456895 461622 455434 436876 405804 362993 309862 248377
32207B48377o7294p0078o9757o6856o2293n6727n0046m1500l0554j7788n086N098
$$ 248377 181083 111005 41248 -25608 -87901 -144628 -194674 -236174 -266728 -284516 -289602 -284504
32195b84504J0832J1421P460M55p657j4947j9945k1964k1162j8173j3587p764
$$ -284504 -273672 -262251 -254791 -254336 -261993 -276940 -296885 -318849 -340011 -358184 -371771 -379535
32183c79535j066N793J1862J6472J9662K2040K4202K6313K8168K9624L0829L1985
$$ -379535 -380601 -374808 -362946 -346474 -326812 -304772 -280570 -254257 -226089 -196465 -165636 -133651
32171a33651L2904L2861L0965K6769K0605J3517O944K480J577N059J2647K2851
$$ -133651 -100747 -67886 -36921 -10152 10453 23970 30914 33394 34971 40030 52677 75528
32159G5528L3496M2594M8962N2264N2619N0232M5264L7915K8485J7477N762n306
$$ 75528 109024 151618 200580 252844 305463 355695 400959 438874 467359 484836 490598 485292
32147D85292j4107j9254k0158j7294j2122o682k970k235m630r417j5680k2917
$$ 485292 471185 451931 431773 414479 402357 395675 392705 390470 385840 376423 360743 337826
32135C37826l0978l9474m7249n2516n3626m9908m1950l1214j9338p595L257J2851
$$ 337826 306848 267374 220125 167609 113983 64075 22125 -9089 -28427 -36022 -32765 -19914
32123a9914K0944K7277L1532L3508L3303L1465K9045K7375K7618L0259L4855M0303
$$ -19914 1030 28307 59839 93347 126650 158115 187160 214535 242153 272412 307267 347570
32111C47570M5356M9108N1164N1720N1567N1881N3681N7158O1418O4855O5850
$$ 347570 392926 442034 493198 544918 596485 648366 702047 759205 820623 885478 951328
32100I51328O3362N7120M7499L5249K1348O928o700j8240k6822l2458l6168l9588
$$ 951328 1014690 1071810 1119309 1154558 1175906 1182834 1176134 1157894 1131072 1098614 1062446 1022858
32088A022858m4284n1096n9924o9979q0298r0065r8598j05122j08865j09326j06483
$$ 1022858 978574 927478 867554 797575 717277 627212 528614 423492 314627 205301 98818
$$ [...]
##END NTUPLES=NMR SPECTRUM
##END=
