##TITLE=31Pdec_Bay 97-2024
 CDCl3, 24 sc
 27.11.2024
##JCAMPDX= 6.0         $$ Bruker NMR JCAMP-DX V2.0
##DATA TYPE= NMR SPECTRUM
##DATA CLASS= NTUPLES
##ORIGIN= UXNMR, Bruker Analytische Messtechnik GmbH
##OWNER= root
$$ XWIN-NMR		Version 3.5
$$ Wed Nov 27 16:40:33 2024 Russian Standard Time (UT+4h)  she@DPX200
##.OBSERVE FREQUENCY= 81.013821
##.OBSERVE NUCLEUS= ^31P
##.ACQUISITION MODE= SIMULTANEOUS
##.ACQUISITION SCHEME= undefined
##.AVERAGES= 24
##.DIGITISER RES= 17
##SPECTROMETER/DATA SYSTEM= spect
##.PULSE SEQUENCE= zgpg30
##.SOLVENT NAME= CDCl3
##.SHIFT REFERENCE= (INTERNAL, CDCl3, 0, 198.062)
##AUDIT TRAIL= $$ (NUMBER, WHEN, WHO, WHERE, WHAT)
$$ ##TITLE= Audit trail, XWIN-NMR		Version 3.5
$$ ##JCAMPDX= 5.01
$$ ##ORIGIN= Bruker BioSpin GmbH
$$ ##OWNER= she
$$ F:/spectra/data/she/nmr/P31/2/pdata/1/auditp.txt
$$ ##AUDIT TRAIL=  $$ (NUMBER, WHEN, WHO, WHERE, WHAT)
(   1,<2024-11-27 16:39:41.25 +0400>,<she>,<DPX200>,
      <created by zg, POWCHK disabled, PULCHK disabled
       configuration hash MD5:
       00 E9 B6 7A A2 85 ED C7 34 08 36 98 17 FE 4E 26
       data hash MD5: 32K
       F3 FF EC 17 A2 43 E5 DE 63 FB A0 01 0C D7 8C DE>)
(   2,<2024-11-27 16:39:43.85 +0400>,<she>,<DPX200>,
      <Start of raw data processing
       efp BC_mod = 2 LB = 1.5 FT_mod = 6 PKNL = 1 PHC0 = 2274.471 PHC1 = 272.4883 SI = 64K 
       data hash MD5: 64K
       9E 39 24 3A 54 D1 74 F4 36 BB 26 05 4F 59 3C 56>)
(   3,<2024-11-27 16:39:56.21 +0400>,<she>,<DPX200>,
      <pk PHC0 = -54.22519 PHC1 = 0 
       data hash MD5: 64K
       E7 15 21 9A CD 39 F2 76 78 68 15 3B CE 48 C3 C1>)
$$ ##END=
$$ 
$$ hash MD5
$$ BD FB A4 7C 9F BD F4 DC 81 AC DB A2 F0 D2 3F AE
##$RELAX= 
##$RELAX= 
##$RELAX= 
##$RELAX= 
##$RELAX= 
##$RELAX= 
##$RELAX= 
##$RELAX= 
$$ Bruker specific parameters
$$ --------------------------
##$DU= <F:/spectra>
##$EXPNO= 2
##$NAME= <P31>
##$PROCNO= 1
##$TYPE= <nmr>
##$USER= <she>
##$AMP= (0..31)
100 100 100 100 100 100 100 100 100 100 100 100 100 100 100 100 100 100 
100 100 100 100 100 100 100 100 100 100 100 100 100 100 
##$AQSEQ= 0
##$AQ_mod= 1
##$AUNM= <au_zg>
##$AUTOPOS= <>
##$BF1= 81.014009
##$BF2= 200.13
##$BF3= 200.13
##$BF4= 200.13
##$BF5= 200.13
##$BF6= 200.13
##$BF7= 200.13
##$BF8= 200.13
##$BYTORDA= 1
##$CFDGTYP= 0
##$CFRGTYP= 5
##$CHEMSTR= <none>
##$CNST= (0..31)
1 1 145 1 1 1 1 1 1 1 1 1 1 1 1 1 1 1 1 1 1 1 1 1 1 1 1 1 1 1 1 1 
##$CPDPRG= <waltz16>
##$CPDPRG1= <>
##$CPDPRG2= <waltz16>
##$CPDPRG3= <>
##$CPDPRG4= <mlev>
##$CPDPRG5= <mlev>
##$CPDPRG6= <mlev>
##$CPDPRG7= <mlev>
##$CPDPRG8= <mlev>
##$CPDPRGB= <>
##$CPDPRGT= <>
##$D= (0..31)
0 1 0 0 0 0 0 0 0 0.06 0 0.03 2e-05 3e-06 0 0 0.0002 0 0 0 0 0 0 0 0 0 
0 0 0 0 0 0 
##$DATE= 1732711180
##$DBL= (0..7)
120 120 120 11 120 120 24 19 
##$DBP= (0..7)
150 150 150 150 150 150 150 150 
##$DBP07= 0
##$DBPNAM0= <>
##$DBPNAM1= <>
##$DBPNAM2= <>
##$DBPNAM3= <>
##$DBPNAM4= <>
##$DBPNAM5= <>
##$DBPNAM6= <>
##$DBPNAM7= <>
##$DBPOAL= (0..7)
0.5 0.5 0.5 0.5 0.5 0.5 0.5 0.5 
##$DBPOFFS= (0..7)
$$ [...]
##$SUBNAM2= <"">
##$SUBNAM3= <"">
##$SUBNAM4= <"">
##$SUBNAM5= <"">
##$SUBNAM6= <"">
##$SUBNAM7= <"">
##$SUBNAM8= <"">
##$SUBNAM9= <"">
##$SW= 400.765351723535
##$SWIBOX= (0..15)
0 1 3 0 0 0 0 0 0 0 0 0 0 0 0 0 
##$SW_h= 32467.5324675325
##$TD= 32768
##$TD0= 1
##$TE= 0
##$TE2= 300
##$TE3= 300
##$TEG= 300
##$TL= (0..7)
0 120 53 12 22 120 120 120 
##$TP= (0..7)
150 150 150 150 150 150 150 150 
##$TP07= 0
##$TPNAME0= <>
##$TPNAME1= <>
##$TPNAME2= <>
##$TPNAME3= <>
##$TPNAME4= <>
##$TPNAME5= <>
##$TPNAME6= <>
##$TPNAME7= <>
##$TPOAL= (0..7)
0.5 0.5 0.5 0.5 0.5 0.5 0.5 0.5 
##$TPOFFS= (0..7)
0 0 0 0 0 0 0 0 
##$TUNHIN= 0
##$TUNHOUT= 0
##$TUNXOUT= 0
##$USERA1= <user>
##$USERA2= <user>
##$USERA3= <user>
##$USERA4= <user>
##$USERA5= <user>
##$V9= 5
##$VALIST= <valist>
##$VCLIST= <CCCCCCCCCCCCCCC>
##$VD= 0
##$VDLIST= <DDDDDDDDDDDDDDD>
##$VPLIST= <PPPPPPPPPPPPPPP>
##$VTLIST= <TTTTTTTTTTTTTTT>
##$WBST= 1024
##$WBSW= 4
##$XGAIN= (0..3)
0 0 0 0 
##$XL= 0
##$YL= 0
##$YMAX_a= 4861
##$YMIN_a= -8883
##$ZGOPTNS= <>
##$ZL1= 120
##$ZL2= 120
##$ZL3= 120
##$ZL4= 120
##$ABSF1= 0
##$ABSF2= 0
##$ABSG= 0
##$ABSL= 0
##$ALPHA= 0
##$AQORDER= 0
##$ASSFAC= 0
##$ASSFACI= 0
##$ASSFACX= 0
##$ASSWID= 0
##$AUNMP= <proc_1d>
##$AZFE= 0.1
##$AZFW= 0.5
##$BCFW= 0
##$BC_mod= 2
##$BYTORDP= 0
##$COROFFS= 0
##$CY= -3
##$DATMOD= 1
##$DC= 0
##$DFILT= <>
##$DTYPP= 0
##$F1P= 0
##$F2P= 0
##$FCOR= 1
##$FTSIZE= 65536
##$FT_mod= 6
##$GAMMA= 0
##$GB= 0
##$INTBC= 1
##$INTSCL= 9.790993e-09
##$ISEN= 30
##$LB= 1.5
##$LEV0= 0
##$LPBIN= 0
##$MAXI= 10000
##$MC2= 0
##$MEAN= 0
##$ME_mod= 0
##$MI= 50
##$NCOEF= 0
##$NC_proc= -7
##$NLEV= 6
##$NOISF1= 182.463
##$NOISF2= 159.3651
##$NSP= 0
##$NTH_PI= 0
##$NZP= 0
##$OFFSET= 198.0616
##$PC= 4
##$PHC0= 2220.246
##$PHC1= 272.4883
##$PH_mod= 1
##$PKNL= yes
##$PPARMOD= 0
##$PSCAL= 0
##$PSIGN= 0
##$REVERSE= no
##$SF= 81.0140089999434
##$SI= 65536
##$SIGF1= 159.3651
##$SIGF2= -187.1042
##$SINO= 113.3802
##$SIOLD= 16384
##$SREGLST= <1H.CDCl3>
##$SSB= 0
##$STSI= 65536
##$STSR= 0
##$SW_p= 32467.5324675325
##$SYMM= 0
##$S_DEV= 0
##$TDeff= 32768
##$TDoff= 0
##$TI= <>
##$TILT= no
##$TM1= 0
##$TM2= 0
##$TOPLEV= 0
##$USERP1= <user>
##$USERP2= <user>
##$USERP3= <user>
##$USERP4= <user>
##$USERP5= <user>
##$WDW= 1
##$XDIM= 65536
##$YMAX_p= 310196225
##$YMIN_p= -35334693
$$ End of Bruker specific parameters
$$ ---------------------------------
##NTUPLES= NMR SPECTRUM
##VAR_NAME=  FREQUENCY,     SPECTRUM/REAL,   SPECTRUM/IMAG
##SYMBOL=    X,             R,               I
##VAR_TYPE=  INDEPENDENT,   DEPENDENT,       DEPENDENT
##VAR_FORM=  AFFN,          ASDF,            ASDF
##VAR_DIM=   65536,         65536,           65536
##UNITS=     HZ,            ARBITRARY UNITS, ARBITRARY UNITS
##FACTOR=    0.49542278885378, 1,            1
##FIRST=     16045.7642231865, 0,            0
##LAST=      -16421.768244346, 0,            0
##MIN=       -16421.768244346, -35334693,    0
##MAX=       16045.7642231865, 310196225,    0
$$ Real data points
##PAGE= N=1
##DATA TABLE= (X++(R..R)), XYDATA
$$ [...]
44782 -445598 -135067 -330742 -400902 135395 738253 668394 -102932 -1222674 -2477248 -3577904
44772 -3577904 -4104246 -4104390 -4146502 -4356036 -4045229 -2815127 -1390809 -665471 -392228 372362
44762 372362 1783115 2969943 3243355 2833883 2341062 2041328 1915418 1860457 1632160
44753 1632160 971695 60374 -463120 -220803 422136 884891 1132929 1502366 1909083
44744 1909083 1790460 993690 263517 472288 1600566 2875258 3778205 4426847 4903508
44735 4903508 4740381 3451193 1345888 -540787 -1290691 -725497 590993 1684644 1717387
44726 1717387 686878 -380549 -342667 805070 1894801 1964673 1379717 1328561 2394054
44717 2394054 3900430 4614562 3889571 2146734 406283 -605533 -926637 -975563 -856358
44708 -856358 -324383 543792 1069230 695499 -231159 -816956 -696628 -368340 -415716 -766756
44698 -766756 -898193 -528742 89805 452673 266380 -260887 -578388 -430934 -330185 -1060622
44688 -1060622 -2599312 -3888785 -3937865 -2849037 -1462719 -315250 600125 1288163 1579634
44679 1579634 1516295 1410771 1426916 1461082 1435911 1297849 777895 -266032 -1218665 -1112277
44669 -1112277 87863 1263044 1560546 1360444 1336914 1273439 597701 -434451 -1037603
44660 -1037603 -1094049 -1102312 -1093745 -634797 62391 135302 -501025 -740181 121006 1210694
44650 1210694 1282440 521337 289634 1314823 2888992 3820882 3561462 2336898 721454
44641 721454 -681059 -1450376 -1544170 -1268165 -951937 -609445 58950 1199171 2276683
44632 2276683 2307237 976015 -670199 -1203714 -474654 306734 216674 -372323 -705865
44623 -705865 -811398 -1161956 -1715259 -1968927 -1676567 -951833 44411 961907 1105991 78786
44613 78786 -1559777 -2806365 -3232618 -3027617 -2355027 -1345159 -471684 -110339 200158
44604 200158 1212238 2631534 3187380 2280743 795716 -75707 -143977 46832 169824
44595 169824 238813 202721 -3557 -194077 -147708 32973 82861 -37160 -157385 -172030
44585 -172030 -98277 5990 45711 -40954 -148141 -158194 -259858 -760438 -1477114 -1740073
44575 -1740073 -1246414 -538538 -329399 -671230 -1108058 -1323481 -1245690 -810041 -122327 308726
44565 308726 39073 -618055 -828351 -229347 708145 1392032 1764556 2051379 2237343 2142958
44555 2142958 1803734 1376269 745854 -354674 -1774255 -2908054 -3433289 -3675814 -3888882
44546 -3888882 -3586207 -2254942 -523570 254246 -289328 -1109912 -1370885 -1549084 -2247992
44537 -2247992 -2806484 -2213472 -896836 -341910 -1081214 -2249134 -3108836 -3752716 -4084509
44528 -4084509 -3443233 -1828046 -382934 93597 223441 850425 1586389 1481704 545923
44519 545923 -340232 -626340 -379985 245952 1011334 1368068 1038283 560888 549490 733636
44509 733636 506126 57916 59162 492357 793303 965921 1489336 2178734 2282260 1850809
44499 1850809 1880026 2735881 3457583 3138329 2156173 1455756 1276841 1163902 712476 -187615
44489 -187615 -1394376 -2386373 -2543096 -1910617 -1229544 -909141 -530730 306226 1289781
44480 1289781 1966884 2330185 2314356 1433156 -351805 -2015764 -2564435 -2252927 -1854671
44471 -1854671 -1238098 209215 2043849 2942579 2485443 1594792 960936 180057 -1071023
44462 -1071023 -2080790 -2088425 -1427973 -853300 -344180 481222 1200282 895655 -455665
44453 -455665 -1840314 -2534598 -2735761 -2718102 -2250813 -1273738 -381061 2110 373676 1371704
44443 1371704 2622763 3161402 2798479 2242043 1877744 1299495 276669 -612244 -747507
44434 -747507 -259011 399086 1080598 1625375 1517998 654036 24853 704286 2306321
44425 2306321 3355199 3169320 2452354 1904418 1272547 207165 -859563 -1388117 -1621485
44416 -1621485 -2006582 -2155403 -1229331 766357 2760039 3707401 3449604 2544118 1683804
44407 1683804 1239246 996550 420291 -509032 -947283 -148908 1407731 2416658 2161693
44398 2161693 981835 -510079 -1884201 -2546056 -1859618 -25445 1843539 2959728
44390 2959728 3572054 4018043 3827728 2569198 1035086 535372 1144834 1632695 1228467
44381 1228467 544876 442102 786178 848068 336300 -542709 -1598112 -2608305 -3093817
44372 -3093817 -2809446 -2293158 -2278264 -2649900 -2655656 -2138736 -1787406 -1947726 -1950366 -1089115
44362 -1089115 318647 1447084 2124058 2811847 3667893 4328340 4586631 4633686 4501521
44353 4501521 3815821 2343379 437455 -1234016 -2141403 -2052842 -1146239 -65885 549654
44344 549654 756629 1133631 1799127 2130498 1742609 1192941 1237432 1831048 2426838 2860085
44334 2860085 3210417 3081158 1971289 423812 -147242 809410 2148834 2502530 2040474
44325 2040474 2040822 2998322 3976595 3900331 2808879 1548437 721401 353563 300560 482772
44315 482772 728431 751705 410793 -187898 -884119 -1566678 -2027838 -1968655 -1363150 -695668
44305 -695668 -594349 -1202208 -2035677 -2482851 -2368935 -2043980 -1973696 -2229551 -2397369 -2109644
44295 -2109644 -1630661 -1585778 -1970207 -1875931 -670768 878561 1375418 619320 -151052
44286 -151052 -51467 257061 -261143 -1333155 -1728534 -983953 113309 741262 926376
44277 926376 1038771 1132598 1151495 1236942 1386236 1204109 477472 -275210 -345573 184051
44267 184051 482645 17335 -843691 -1380039 -1332764 -970346 -567923 -95461 584683 1365880
44257 1365880 1834044 1613650 833111 182034 326716 1194792 1956309 1813708 758655
44248 758655 -485123 -1146204 -959904 -214116 552166 950055 1011794 1042583 1125607 962199
44238 962199 433044 77103 521600 1498693 2039151 1785504 1458540 1675380 1992017 1760037
44228 1760037 1353909 1600705 2260176 2151918 909359 -361745 -526655 255761 1068585
44219 1068585 1407397 1325068 1002016 728843 853523 1225578 1128534 272378 -615799 -755055
44209 -755055 -364380 -67114 273635 1247562 2737959 3999996 4718289 5047567 4745438
44200 4745438 3382136 1507740 443815 539163 697772 151931 -390618 -177063 41805
44191 41805 -838028 -2152201 -1995197 63583 2101822 2208012 774795 -325445 -235553
44182 -235553 182574 -12489 -510639 -506325 -114083 -194623 -885489 -1177547 -348188 826386
44172 826386 992032 24662 -909907 -1059519 -936353 -1158197 -1308807 -669096 464526
44163 464526 1094279 972572 844443 1134319 1256221 682565 19794 262616 1281308
44154 1281308 1901042 1553332 1037061 1230070 1730379 1536137 697750 318360 875330
44145 875330 1525181 1484014 1231671 1623270 2436623 2716797 2214886 1523896 931443 154724
44135 154724 -678518 -783816 144368 1302898 1735724 1341494 579125 -163938 -439640
44126 -439640 324227 2008364 3366057 3214427 1893925 863143 926548 1486045 1544940
44117 1544940 865099 -2480 -387979 -27289 781690 1395271 1365078 818252 205502 -211938
44107 -211938 -427192 -402773 -67539 416716 696009 618849 422511 474200 895472 1394570
44097 1394570 1434585 744684 -239578 -701234 -396100 12935 -112818 -415295 2062 1254535
44087 1254535 2366066 2402098 1502529 579025 271580 463595 683844 701384 647668 694948
44077 694948 812990 916752 1083722 1392691 1618441 1393450 711596 -17131 -459727 -577919
44067 -577919 -308705 490081 1523445 1926882 1081032 -628899 -2153466 -2712128 -2248794
44058 -2248794 -1292572 -580612 -457792 -424684 293798 1509734 2015809 1181987 -71474
44049 -71474 -549256 -382108 -460243 -800828 -652647 -25897 137961 -507595 -1133790 -1070536
44039 -1070536 -772001 -909582 -1274436 -1265722 -971143 -1059749 -1783802 -2590168 -2687086 -1752568
44029 -1752568 -185888 1185077 1775080 1716112 1556437 1564838 1601787 1583065 1635815 1749790
44019 1749790 1693937 1404442 1122358 1045816 1131895 1284502 1453077 1545396 1515184 1465184
44009 1465184 1402704 1116607 659345 588115 1133229 1486186 735366 -724414 -1648589 -1658195
43999 -1658195 -1445835 -1327182 -825584 108628 738788 808933 954747 1357667 1275511 587124
43989 587124 433930 1317566 1849181 741365 -982098 -1303850 2803 1513723 2524749
43980 2524749 3495621 4315399 4000385 2488988 1183765 1063872 1417788 1097839 94040
43971 94040 -788887 -1079872 -868990 -478337 -412788 -1115050 -2301619 -2987771 -2589825 -1638700
43961 -1638700 -1098417 -1365928 -2184797 -3070780 -3497239 -3090369 -2019199 -919689 -229443
43952 -229443 59968 -103906 -988466 -2383330 -3305067 -2924448 -1488044 89020 1233174
43943 1233174 1912138 2191095 2166193 2169855 2476798 2819932 2676760 2092642 1777438 2203360
43933 2203360 2939138 3161569 2675659 2136690 2234979 2880458 3363930 3262601 3000560 3439650
43923 3439650 4972679 7001180 8214120 7510228 4989261 2098594 446391 295471
43915 295471 531410 218771 -343266 -419551 -24605 406639 1066235 2486012 4259767
43906 4259767 5048728 4170810 2438734 1020768 94909 -835894 -1743780 -1889952 -842787
43897 -842787 755969 1675496 1328297 424540 233289 1159310 2341507 2809950 2580364
43888 2580364 2190800 1674591 786299 -39652 54945 1075223 2018572 2153685 1661169
43879 1661169 892832 -29155 -576037 135306 1984484 3414686 3170606 1823538 797075
43870 797075 533546 552787 739376 1348321 1922220 1445444 -167887 -1672445 -1983316
43861 -1983316 -1415273 -1014779 -1147278 -1246801 -755806 130305 728962 688540 374840 387441
43851 387441 836095 1351669 1759051 2313892 3117289 3712362 3575405 2743691 1718925
43842 1718925 1022760 1006464 1671538 2425669 2499667 1933744 1618849 1983567 2319980 1995879
43832 1995879 1576866 1830795 2265082 1869269 935842 750134 1505215 1953838 1422372
43823 1422372 791246 879172 1125113 804399 533881 1350249 2857224 3533848 2765335
43814 2765335 1555302 1131596 1631783 2343521 2619318 2296972 1634267 1076967 898277
43805 898277 1003367 1220980 1610546 2157291 2377793 1790760 769491 324373 844437
43796 844437 1559626 1536408 783711 34481 -197654 57832 524827 820065 541009 -225022
43786 -225022 -615975 161651 1717882 2850541 3095046 3154134 3548383 3717619 3072421
43777 3072421 2174705 1949440 2213052 2051709 1416847 1172700 1528004 1641316 1139158
43768 1139158 884080 1586743 2592000 2851952 2387130 1939226 1779486 1776248 2138322 3036812
43758 3036812 3767596 3380855 2129703 1320664 1587552 2152720 2025786 1229132 557473
43749 557473 651799 1513334 2503700 2764993 2099076 1381253 1521394 2105489 1853537 462659
43739 462659 -932664 -1409859 -1431472 -1841530 -2505396 -2714709 -2412706 -2185566 -2263664 -2247904
43729 -2247904 -1790852 -1007388 -176775 547287 1039965 1107719 649904 -136014 -795287 -989925
43719 -989925 -913536 -1128909 -1765229 -2148408 -1662309 -730746 -314752 -573609 -780883 -524371
43709 -524371 -79918 510912 1642408 2997148 3300983 2031771 511512 302772 1108313
43700 1108313 1300375 145926 -1558324 -2870981 -3627539 -3859087 -3240449 -1584303 542123
43691 542123 2042892 2115369 971552 -154582 -69446 1079380 2022710 2133228 2179120
43682 2179120 2732351 2808153 1316225 -763524 -1222189 449099 2457479 3245529 3220963
43673 3220963 3471900 4041673 4262790 3876036 3040908 1931940 960937 712175 1055809
43664 1055809 1057645 431898 308440 1699631 3839737 4996245 4483612 3004655 1483122
43655 1483122 554301 780254 2146072 3443417 3307258 1956475 895940 814638 884299
43646 884299 380615 -182911 -108220 305433 400837 231790 182589 105961 -309752 -743976
43636 -743976 -682981 -370203 -454845 -858641 -869479 -336522 104038 126441 206526 733331
43626 733331 1369594 1693586 1843642 2059555 2139143 1892646 1672254 1839370 2058616 1762499
43616 1762499 1062418 555335 438191 499851 800813 1527941 2222291 2109848 1406523 1334375
43606 1334375 2386598 3468445 3447581 2773389 2606827 2901125 2542919 1262438 180650
43597 180650 136731 450850 -46375 -1367485 -2382959 -2151636 -727831 1105833 2403613
43588 2403613 2501535 1444647 89882 -528977 -83822 901275 1729812 2134096 2211391
43579 2211391 2085010 1849503 1702497 1847924 2219225 2492806 2490584 2406883 2436445 2303864
43569 2303864 1508479 98740 -1126865 -1387865 -672958 420125 1286712 1520496 917737
43560 917737 -198307 -846841 -193700 1447420 2860872 3218650 2701504 1864665 1012747
43551 1012747 389572 331955 777337 1074575 811909 528478 1041453 2217481 2971692
43542 2971692 2522739 1224525 54283 -408150 -363756 -376610 -732693 -1194719 -1387269
43533 -1387269 -1361204 -1535272 -1996802 -2215784 -1765430 -1038748 -770659 -968219 -854840 36762
43523 36762 1184610 1725220 1477499 1049233 1066011 1521863 1893404 1798837 1472759 1488689
43513 1488689 2011033 2567035 2712012 2610578 2626670 2647381 2352005 1938211 1859629 1881630
43503 1881630 1260983 81722 -506217 86970 850498 549017 -520515 -1150449 -1136973
43494 -1136973 -1330909 -1872602 -1731744 -432608 877887 831225 -413222 -1560516 -1814145
43485 -1814145 -1404449 -858082 -459166 -260001 -65538 430860 1068739 1113517 276687 -549901
43475 -549901 -345097 527681 758777 -57048 -997869 -1351960 -1533409 -2023930 -2293707 -1502961
43465 -1502961 199573 1709161 2069265 1201705 -141905 -867655 -369105 815661 1535994
43456 1535994 1412088 1155688 1293815 1359984 883935 392549 578086 1056432 953486 367844
43446 367844 186307 569211 664793 -57072 -1077824 -1648618 -1606360 -1171753 -599029 -242092
43436 -242092 -358890 -616386 -334149 553625 1271977 1159924 440165 -119684 36662 853583
43426 853583 1623390 1453431 301716 -617944 -175670 1056237 1405272 305704 -1101853
43417 -1101853 -1710587 -1678486 -1575360 -1434665 -1253704 -1427915 -1948306 -2025245 -1268217 -439295
43407 -439295 -255645 -250862 310192 1193456 1863671 2598879 3738332 4452501 3625484 1611498
43397 1611498 -190565 -1269207 -2209699 -3155139 -3472869 -3033094 -2488182 -2045402 -1168608
43388 -1168608 236607 1525501 2497310 3638578 4768337 4747336 3232659 1543925 907981
43379 907981 855403 328882 -559062 -1068923 -1409866 -2370111 -3665766 -4022442 -3022882 -1778716
43369 -1778716 -1449710 -1918206 -2302475 -2149168 -1690345 -1337152 -1328490 -1668984 -2112756 -2297328
43359 -2297328 -2061322 -1575413 -1093903 -660247 -122913 586870 1216313 1281698 538669 -598465
43349 -598465 -1295333 -1104167 -417780 14528 -93084 -382764 -393262 -77692 234122 270664
43339 270664 160185 341157 1113086 2253778 3066733 2819269 1300705 -796751 -2124599
43330 -2124599 -1784975 -388552 472000 136954 -290510 409232 1712088 2112786 1371027
43321 1371027 733820 906657 1170042 945431 918578 1727236 2554007 2170643 779099
43312 779099 -330787 -646290 -869405 -1548265 -2225433 -2128732 -1058766 556631 1995692
43303 1995692 2562611 2043348 961154 90074 -275464 -354415 -401560 -546403 -878617 -1268109
43293 -1268109 -1296382 -795482 -238896 -145364 -351578 -401644 -385823 -741679 -1396448 -1794333
43283 -1794333 -1706400 -1381123 -962534 -406535 66010 75742 -364297 -954351 -1596936 -2117539
43273 -2117539 -1786874 -115365 1949099 2720509 1829805 555603 -45148 -148045 -15628
43264 -15628 736447 1973916 2435544 1396011 -25418 -378597 116215 331253 241130
43255 241130 644828 1326281 1170244 91602 -734464 -811979 -1001207 -1787217 -2290989 -1776141
43245 -1776141 -943476 -779955 -1099402 -1275168 -1578441 -2528790 -3477116 -3235124 -1950877
43236 -1950877 -1034606 -1099400 -1184179 -364730 949570 1864196 2203834 2161801 1535491 246636
43226 246636 -842205 -636968 749505 2071081 2480177 2290399 2144283 2127630 1959410
43217 1959410 1492644 710094 -331014 -1233399 -1348086 -519004 548263 1045108 982951
43208 982951 1004183 1448885 2017629 2324334 2410182 2571853 2851598 2871789 2267650 1283671
43198 1283671 712323 991432 1582043 1710209 1554874 1939780 2783111 2845730 1534176
43189 1534176 26191 -290210 196454 21212 -1087494 -1913338 -1650106 -818112 -73986
43180 -73986 674057 1475814 1751534 1235435 697244 918593 1546149 1745649 1484721 1305738
43170 1305738 1200241 686924 -75391 -190975 727111 1900394 2346557 2100241 2109019 3067625
43160 3067625 4625845 5787817 5993528 5660162 5540541 5693205 5414730 4178939 2253085
43151 2253085 335091 -951617 -1121031 -63799 1403306 1861648 758159 -881554
43143 -881554 -1739968 -1709663 -1473231 -1177854 -519698 212386 360232 132908 457996 1409283
43133 1409283 1936715 1587877 1368264 2137564 3089324 2857314 1555113 605676 777896
43124 777896 1448450 1840042 1996933 2199643 2212310 1700631 954888 575687 576776 337676
43114 337676 -459207 -1251117 -1241658 -455430 200837 981 -760293 -1228242 -1119472 -1022120
43104 -1022120 -1519381 -2351524 -2678384 -2029367 -804420 111168 140686 -473983 -868174
43095 -868174 -365597 830228 1857197 2114839 1749990 1182910 507574 -361892 -1211062
43086 -1211062 -1607776 -1426548 -975219 -587123 -331632 -121852 140227 530450 958051
43077 958051 1039749 412417 -740087 -1736449 -2088339 -1895640 -1456416 -843694 -153391 147238
43067 147238 -367846 -1347009 -1796088 -1132624 157708 1091729 1226627 961195 962025 1500576
43057 1500576 2291141 2792664 2663146 2043366 1422962 1170333 1198580 1125180 714077 116234
43047 116234 -266960 -113944 531569 1221291 1424550 989950 263454 -254891 -262325 290819
43037 290819 1175468 1778531 1412999 129697 -1020894 -1041568 -227703 151029 -577746
43028 -577746 -1769432 -2444260 -2440860 -2284005 -2340507 -2519631 -2564196 -2296194 -1748221 -1277898
43018 -1277898 -1295879 -1652789 -1646439 -961481 -207042 -48156 -177872 181303 982560 1375245
43008 1375245 1057875 807364 1349276 2332257 2868471 2644125 2003700 1236941 335340
42999 335340 -601013 -1156350 -915870 181280 1790119 3307424 4149421 4111406 3479207
42990 3479207 2673552 1854981 1044182 507060 650692 1422394 2122949 2095407 1460602 906341
42980 906341 854436 1157443 1541468 1867781 1851862 1100153 -177601 -986475 -701374 -78014
42970 -78014 -340564 -1414745 -1972366 -1314130 -237879 319952 562067 1109358 1773129
42961 1773129 1877260 1312714 488906 -364431 -1088351 -1202947 -506917 226785 94296
42952 94296 -561553 -554442 430969 1462966 1726119 1354609 831169 458763 545838 1187738
42942 1187738 1690054 1174780 5475 -422453 298523 835793 -18594 -1692298 -2795630
42933 -2795630 -2923561 -2636302 -2286246 -1810793 -1335750 -1154282 -1248159 -1362062 -1344891 -1064743
42923 -1064743 -371971 504526 1008950 1045375 1124214 1409513 1426230 1146998 1338643 2096165
42913 2096165 2140007 672163 -1064752 -1474282 -1038833 -1405693 -2553024 -2731599 -1201612
42904 -1201612 720659 1616193 1420138 579851 -713981 -1876460 -1901756 -771736 221867
42895 221867 305578 324715 1211855 2349203 2450321 1359759 22602 -798749 -913311
42886 -913311 -287683 869914 1894023 2272854 2285373 2494869 2912336 3185361 3246709 3173788
42876 3173788 2728183 1696867 522082 13526 473550 1436003 2106764 1839869 543433
42867 543433 -1053150 -1891948 -1656322 -963659 -291902 627713 1960945 3089876 3439105
42858 3439105 3308410 3120493 2483671 925695 -967863 -2161568 -2514024 -2507753 -2072691
42849 -2072691 -884460 471042 1024365 1071237 1852094 3379610 4059383 3015303 1450124
42840 1450124 882730 1145386 1089316 380954 -459806 -1120120 -1476592 -1016886 517104
42831 517104 2105224 2228577 776358 -764700 -1194753 -800146 -395065 -65962 492376
42822 492376 988257 731359 -270454 -1077360 -873921 119204 1020594 1327076 1264258 1185306
42812 1185306 1018467 529976 -105831 -381107 -110794 310339 442942 354824 457793 980722
42802 980722 1817330 2750065 3551618 3907007 3515909 2387685 930712 -306379 -942058
42793 -942058 -882575 -326613 287247 495530 155070 -399020 -624734 -271536 377515 763498
42783 763498 544530 -161725 -970164 -1574237 -1868992 -1808988 -1281612 -226039 1100895
42774 1100895 2060699 1997488 786792 -1000415 -2540694 -3320249 -3246707 -2447600 -1245717
42765 -1245717 -215383 158111 -17570 -183948 -63747 102752 174885 499855 1354940
42756 1354940 2378508 2973219 2984113 2546578 1585530 71835 -1405509 -2023193 -1737452
42747 -1737452 -1348090 -1441462 -1743872 -1613630 -740543 648246 1762356 1485761 -582261
42738 -582261 -3145997 -4107396 -2874840 -1061677 -386006 -668172 -686988 -268205 -302326
42729 -302326 -984101 -1378219 -970073 -522409 -845076 -1551307 -1730619 -1282194 -806456 -486491
42719 -486491 119813 1176719 2129754 2393315 2060224 1656818 1429417 1139741 502188
42710 502188 -354296 -915754 -795228 -243317 -32123 -628021 -1506090 -1566806 -352424 1387953
42700 1387953 2523094 2691864 2354297 1929848 1402605 806300 527555 772873 1092206
42691 1092206 896200 291056 -73574 11474 -61156 -917009 -2318336 -3323095 -3192967
42682 -3192967 -1968668 -242748 1428047 2828763 3922329 4589930 4737578 4614722 4657931
42673 4657931 4796930 4280467 2680156 858561 249244 1083131 2021178 1886853 1137056
42664 1137056 1028664 1791267 2449419 2330069 1866723 1648804 1399282 476307 -969172
42655 -969172 -1969056 -1852620 -938365 -51467 270170 -32555 -742087 -1434069 -1583102 -1004893
42645 -1004893 -149879 369043 511467 728716 1188408 1575168 1777857 2188221 2957815
42636 2957815 3503795 3330310 2908908 2978033 3240168 2724624 1496424 978888 2109643
42627 2109643 3956613 4823195 4219819 3063326 2275472 1930881 1685084 1341630 842596
42618 842596 177592 -456740 -656126 -178716 724035 1399153 1268679 375039 -519640 -620796
42608 -620796 9260 521675 357076 -146454 -482733 -844882 -1713638 -2843054 -3321423
42599 -3321423 -2681192 -1449117 -479647 -117183 -128928 -128999 125751 687137 1486092 2394940
42589 2394940 3125357 3133610 2047911 419205 -425896 193222 1356061 1663054 1112583
42580 1112583 1040350 2143577 3461204 3741586 3134415 2866386 3567617 4559426 4779649
42571 4779649 3981136 2899086 2402997 2543317 2452359 1316654 -569673 -1992994 -2144704
42562 -2144704 -1430616 -755701 -361212 189084 1037310 1618249 1407286 705081 321411
42553 321411 610318 1190491 1658416 2161266 2941606 3592789 3317929 1977282 397107
42544 397107 -553301 -791399 -724225 -585239 -421217 -321139 -201007 288617 1147532 1678904
42534 1678904 1352274 668530 426175 400425 -345418 -1936876 -3458314 -4318511 -4830340
42525 -4830340 -5174905 -4835656 -3599063 -2239931 -1549811 -1381388 -1289088 -1394557 -1823009
42516 -1823009 -1906599 -915533 773937 2132087 2815342 3170281 3166155 2396241 1162228
42507 1162228 481247 664440 744623 -176968 -1640450 -2447310 -2161693 -1424245 -965976
42498 -965976 -836682 -647837 -208895 287281 608766 804890 1053264 1279576 1201832 820508
42488 820508 532659 519528 339931 -447588 -1447656 -1733484 -1017229 -81576 102484 -584935
42478 -584935 -1361780 -1328631 -245681 1301524 2473706 2988255 3230173 3450812 3218370
42469 3218370 2101613 631795 -106865 110244 317229 -273328 -1109460 -981355 407966
42460 407966 2021378 2604432 1921799 844761 395857 797720 1419229 1543455 1015622
42451 1015622 103398 -958806 -1934389 -2277206 -1421986 428901 2178046 2794632 2283223
42442 2283223 1543009 1391383 1855762 2318259 2217421 1612948 1067835 952439 992174 677217
42432 677217 8886 -449992 -259424 458575 1313899 2071685 2630906 2833794 2556158 1938644
42422 1938644 1364361 1139981 1171163 967897 119439 -1121271 -1865230 -1381942 201660
42413 201660 2079928 3430359 3757766 2979011 1630328 766738 1088469 2168118 2952947
42404 2952947 2952959 2496406 1976193 1476520 1113208 1054684 1106086 912131 655270 831880
42394 831880 1226452 1003002 119296 -328088 278041 1080509 1177133 1132740 1923034 3045934
42384 3045934 3114614 2094048 1474735 2036173 2769615 2515165 1546306 835327 659400
42375 659400 795252 1420582 2806254 4405450 5179883 4822841 3964614 3169827 2414313
42366 2414313 1651376 1197453 1212032 1286189 977896 485008 402226 943711 1696514 2056345
42356 2056345 1714148 870998 198043 391189 1444367 2487373 2662645 2027288 1235994
42347 1235994 565515 -142657 -701275 -611655 -98041 -201146 -1255698 -2030450 -1240356
42338 -1240356 575068 1640480 1148444 -105556 -1183635 -2025805 -2811098 -3271968 -3101997
42329 -3101997 -2394165 -1330320 -39567 987528 1098104 492321 301934 1125289 2153313
42320 2153313 2364689 1960818 1865639 2300311 2705572 2812741 3003383 3671020 4752810
42311 4752810 5743796 5803486 4287852 1767473 60143 443024 2091979 3055415 2516008
42302 2516008 1277263 282505 -344824 -833866 -1310229 -1913139 -2566656 -2627418 -1622847
42293 -1622847 -312702 23122 -544441 -603392 395079 1171128 513820 -933580 -1694897
42284 -1694897 -1466192 -1102895 -1140670 -1327699 -1362382 -1226971 -878591 -272457 364244 759087
42274 759087 948608 1014793 751140 46176 -705956 -1069958 -1136147 -1131339 -847955 -70980
42264 -70980 782835 1142997 1087886 939931 425847 -803473 -2040856 -2053749 -829208 310779
42254 310779 594874 708751 1358963 2036405 2030891 1805975 2283907 3247806 3570734 2887246
42244 2887246 2012097 1605100 1346710 776142 212833 318398 1149402 2103003 2575462
42235 2575462 2370687 1727273 1255549 1529042 2284456 2283481 592816 -2032325 -3682214
42226 -3682214 -3375304 -2039100 -1158564 -1073518 -1140107 -1038386 -1047294 -1133523 -635336 848747
42216 848747 2763122 4072016 4153283 3160024 1886271 1300033 1677396 2083119 1317034
42207 1317034 -408939 -1433238 -687012 914648 1711273 1282777 408573 -403920 -1275652
42198 -1275652 -2045960 -2132472 -1483283 -791421 -500724 -344460 -135309 -247347 -882066 -1493497
42188 -1493497 -1478897 -1012345 -716289 -835541 -1149045 -1418343 -1563533 -1637909 -1888389 -2530525
42178 -2530525 -3234396 -3253767 -2369847 -1243662 -462397 213447 1097322 1619555 961090
42169 961090 -610109 -1867116 -2016019 -1227403 125776 1863629 3478473 4101734 3457130
42160 3457130 2282945 1396121 819012 233380 -200074 -62457 543410 1002130 941039
42151 941039 593523 407850 570175 941118 1293779 1570632 1896853 2253685 2258125 1609009
42141 1609009 743493 551906 1232629 1909338 1728776 903658 222650 -66790 -287231
42132 -287231 -518777 -448342 35906 711910 1472123 2298646 2756051 2187924 662086 -835648
42122 -835648 -1470343 -1388541 -1189972 -1030622 -694912 -237956 -14555 -125141 -249365 -116201
42112 -116201 107005 30159 -427552 -837669 -685069 46842 924517 1722142 2600118 3356420
42102 3356420 3095883 1407018 -507630 -949115 46294 744726 215117 -511673 -425808
42093 -425808 -338164 -1449910 -3067289 -3341718 -1931199 -378480 167524 146239 209588
42084 209588 40362 -757771 -1627971 -1797830 -1432299 -1262251 -1436549 -1405748 -731623 488928
42074 488928 1827189 2736594 2717441 1649388 -51435 -1756197 -3022847 -3684800 -3828032
42065 -3828032 -3753503 -3689127 -3507114 -3013826 -2424221 -2079793 -1785492 -1085747 -217924 19483
42055 19483 -436393 -609846 94287 994248 1265874 1232566 1722865 2684517 3313642 3236398
42045 3236398 2740510 2055954 1220206 570259 593603 1191250 1647948 1435221 670402 -178395
42035 -178395 -671692 -585479 -113677 188104 -34976 -560647 -964454 -1021435 -499033 839748
42025 839748 2489678 3102989 2013575 464916 352660 1933146 3695471 4348451 3927706
42016 3927706 2983420 1824382 865628 732290 1493717 2433861 2966336 3219382 3421317
42007 3421317 3305416 2524717 1259537 130363 -229506 466351 1769215 2557333 2116108
41998 2116108 1097416 686991 934029 872784 289242 128365 820353 1481890 1422578 1239596
41988 1239596 1503448 1442073 156076 -1623107 -2348092 -1823037 -1255453 -1319356 -1443499
41979 -1443499 -1118643 -716574 -604684 -382313 398519 1313461 1455947 531700 -798737
41970 -798737 -1573533 -1358286 -542573 66081 -6332 -534370 -980583 -1082772 -908623 -504098
41960 -504098 221889 1255334 2296587 2881634 2682704 1744565 408548 -1033772 -2423765
41951 -2423765 -3325428 -2952207 -1095682 1092682 2036909 1491680 625454 337469 435356
41942 435356 649234 1271429 2192010 2410087 1444126 388513 526644 1544926 2206630
41933 2206630 2242170 2339812 2584914 2212459 945626 -501820 -1431959 -1846834 -2017102
41924 -2017102 -2086138 -2179287 -2297417 -2116236 -1428653 -620820 -158197 71656 262156 47110
41914 47110 -751244 -1294552 -845447 -263220 -935044 -2455689 -2997100 -2007689 -833231
41905 -833231 -394567 -51049 644541 873670 218499 -188727 587739 1703255 2002268
41896 2002268 1903345 2348521 2822336 2055162 154998 -1458515 -1901357 -1318309 35286
41887 35286 1787845 2815156 2103207 256205 -1127675 -1558161 -1859016 -2340094 -2283137
41878 -2283137 -1523659 -1047743 -1404604 -1802818 -1546630 -1253686 -1718090 -2471170 -2544216 -2042900
41868 -2042900 -1840256 -2005870 -1617582 -181189 1592919 2652081 2704945 2250481 1863853
41859 1863853 1669428 1372024 695180 -216477 -926969 -1255059 -1431720 -1569020 -1303504
41850 -1303504 -321434 975840 1787533 1864835 1731131 1878491 2140834 2084166 1705108 1370882
41840 1370882 1190135 882930 393734 230675 805569 1619309 1633373 572951 -610542
41831 -610542 -911567 -561227 -655275 -1636369 -2700471 -2816402 -1889762 -693579 23451
41822 23451 76074 -272844 -609726 -590083 -142900 433286 669598 321144 -371274 -783347
41812 -783347 -369880 816096 2083287 2733911 2712005 2450697 2182099 1787436 1359277
41803 1359277 1355503 1845039 2080777 1427573 420436 111810 416792 55988 -1493688
41794 -1493688 -2887051 -2537481 -782344 576969 681463 496865 1164261 2481985 3479401
41785 3479401 3685103 3205674 2180028 903621 97644 311760 1237670 2145821 2717308
41776 2717308 2914228 2475105 1335781 224156 -84513 95925 -48938 -273774 493182
41767 493182 2267042 3659008 3813814 3447733 3338654 3034607 2035757 1188294 1597080
41758 1597080 2802626 3377212 3006367 2709932 3092731 3567678 3463460 2922248 2446677
41749 2446677 2300554 2528786 2901590 2752867 1604543 91692 -471954 320675 1487489
41740 1487489 1997800 1923798 1937559 2305145 2828830 3290277 3469071 3072524 2098717 1042638
41730 1042638 376294 -5355 -524905 -1249057 -1732600 -1485626 -475787 779704 1620658
41721 1620658 1855392 1889901 2075190 2115944 1497446 377756 -425357 -356041 386838 1267779
41711 1267779 1863199 1890462 1334278 671270 493345 777872 962798 788932 536218 378976
41701 378976 170876 16717 297259 804819 636755 -498859 -1515670 -1173056 352957
41692 352957 1759518 2150791 1682361 953002 373082 6829 -420108 -1191329 -1946211
41683 -1946211 -1762926 -414896 922940 1024588 379549 649941 2386517 4273329 4902853
41674 4902853 4391523 3708903 3145409 2251882 969613 -4603 -83671 492619 1012516
41665 1012516 1088215 913479 883015 1135304 1454691 1543833 1378831 1270837 1479537 1742916
41655 1742916 1395062 208310 -962142 -810635 891688 2708501 2891358 1204530 -1007494
41646 -1007494 -2484972 -3219309 -3814194 -4288681 -4056924 -2884322 -1311825 2055 1038957
41637 1038957 2238668 3610628 4359197 3723309 2096997 793821 482216 423880 -211756
41628 -211756 -830459 -160936 1679211 2991975 2614494 1234590 159539 -284205 -437030
41619 -437030 -205953 745392 2102149 3094871 3457213 3504385 3385155 2896051 1999763 1011475
41609 1011475 286724 54943 356032 779267 610923 -243101 -827482 -267825 951004
41600 951004 1547768 1074154 226505 -297051 -391173 -52234 755411 1573603 1683073 1197010
41590 1197010 1146900 2049508 3076064 3199421 2632834 2472495 3183323 4047976 4091496 3140217
41580 3140217 1890294 1148096 1111722 1370899 1499195 1402695 1015351 88400 -1278763
41571 -1278763 -2223343 -1900116 -594584 601750 1226701 1830767 2784113 3488828 3221735
41562 3221735 2206589 1345270 1219128 1749003 2534210 3115366 3094416 2375384 1290360
41553 1290360 380276 97041 582194 1413927 1684336 839168 -533700 -1282563 -1100035
41544 -1100035 -729353 -669415 -473251 285436 1071042 1000670 -61565 -1525439 -2787185
41535 -2787185 -3479860 -3420347 -2751511 -1802548 -546981 1250771 3070277 3663012 2675818
41526 2675818 1432123 1222036 1564744 1294472 722935 1208835 2762093 3660971 2764702
41517 2764702 883845 -643645 -1565760 -2235575 -2533299 -2160481 -1358762 -517836 447225
41508 447225 1582204 2213084 1642251 318915 -487710 -193324 526429 704407 131871
41499 131871 -617433 -808680 -128147 1035318 1840823 1754127 1026158 238349 -425035 -1103924
41489 -1103924 -1649410 -1597053 -778648 459409 1707355 2783592 3526296 3710833 3314941
41480 3314941 2534464 1459645 135950 -976348 -1176551 -483348 84986 -308886 -1205311
41471 -1205311 -1455777 -687974 454722 1375302 2070982 2525442 2310239 1227898 -107329
41462 -107329 -832482 -800552 -633041 -933214 -1729596 -2612349 -3169838 -3299389 -3217434 -3146101
41452 -3146101 -2994754 -2502022 -1674443 -819870 -128074 431586 740921 539492 -9705
41443 -9705 -293664 -131161 -142490 -743533 -1299242 -983657 -80748 429152 359760 453763
41433 453763 1041008 1524242 1431692 1129684 1106782 1242522 1208591 1027236 841878 658110
41423 658110 662404 1230644 2229620 2908180 2940841 2940323 3350855 3514457 2683726 1424835
41413 1424835 946654 1291746 1350027 720045 384197 1095376 2083638 2140727 1371434 961501
41403 961501 1428517 1976471 1716781 814420 30190 -369017 -647931 -786347 -347092 710502
41393 710502 1719071 2156498 2292458 2520205 2553359 1964905 1105601 597904 183571 -850495
41383 -850495 -2174077 -2611921 -2078284 -1949768 -2885920 -3589775 -2726772 -950477 229399
41374 229399 663310 1160723 1578455 1077226 30826 -155422 658385 927977 -150474
41365 -150474 -1308073 -1139550 -132299 305347 -43923 -234968 176243 583019 338520
41356 338520 -478634 -1361585 -1944591 -2224774 -2463023 -2818812 -3033957 -2744367 -2119512 -1709733
41346 -1709733 -1537113 -936925 416890 1921962 2860953 3250203 3452964 3491895 3234889
41337 3234889 2769298 2115667 1101780 10211 -314796 307676 724387 -103991 -1521945
41328 -1521945 -2047311 -1357392 -271843 834925 2167621 3175110 2726825 1007094 -284809
41319 -284809 -322530 -346498 -1492277 -2711998 -2277920 -481756 809991 901981 908262 1611764
41309 1611764 2273695 2055363 1328648 852144 624425 331486 145791 251838 197290 -424043
41299 -424043 -1113391 -1135738 -644961 -264970 71195 810523 1515558 1118756 -412955 -1770594
41289 -1770594 -2013206 -1628063 -1443417 -1393811 -981655 -222956 548506 1241642 1738953 1606118
41279 1606118 719721 -288729 -829352 -1106196 -1466524 -1581004 -1035373 -211284 267833
41270 267833 493183 798147 863293 341035 -129501 203584 681604 31025 -1475947 -2230974
41260 -2230974 -1751574 -1287854 -1605158 -1848739 -1341463 -918565 -1383492 -1945022 -1485497
41251 -1485497 -405204 138258 119993 446713 1316263 2003825 2047230 1645344 1106027 750962
41241 750962 1034326 1878529 2251735 1326436 -282997 -1352170 -1690868 -1908917 -1994180
41232 -1994180 -1469871 -787259 -1105312 -2497653 -3656058 -3693977 -3100055 -2548498 -1920539
41223 -1920539 -1058575 -474492 -598149 -1046113 -1242806 -1161965 -979689 -637901 -207874 -2889
41213 -2889 143671 946918 2410586 3274626 2544384 958594 10178 -40465 -174480 -916432
41203 -916432 -1702080 -1957727 -1831517 -1611457 -1228360 -708159 -467195 -681174 -803327 -192496
41193 -192496 1051633 2281874 3067309 3296090 2735708 1182983 -805934 -1976058 -1650504
41184 -1650504 -600171 -77143 -167382 204066 1575130 3030123 3397302 2750693 2073491
41175 2073491 1811047 1534646 941796 425477 463441 974620 1514416 1764454 1696014 1555690
41165 1555690 1745090 2374965 2915641 2692049 1770167 902090 508282 230971 -294494
41156 -294494 -722945 -411100 753452 2202224 3114230 2856524 1415550 -317580 -1074376
41147 -1074376 -448767 586536 765832 -10113 -649408 -239840 888114 1557326 1031401
41138 1031401 -238283 -1182184 -1316219 -1114400 -1114842 -1098350 -587592 190169 555280 503415
41128 503415 790166 1731005 2659564 2899156 2602369 2203019 1664676 849695 132098 -49828
41118 -49828 32968 -266019 -996002 -1558465 -1595124 -1395792 -1325621 -1245776 -705180 439915
41108 439915 1712467 2338905 1949927 925343 -91373 -882626 -1529221 -1754848 -1050940
41099 -1050940 398868 1579991 1796265 1428030 1161817 1023947 702603 321962 203660
41090 203660 157088 -298012 -1106117 -1627563 -1371180 -384430 943863 2074985 2479984
41081 2479984 2027587 1143167 356316 -86846 -27075 651435 1504633 1609424 788170 176734
41071 176734 771972 1910820 2159552 1337793 527558 244279 -151978 -1090748 -2030026
41062 -2030026 -2443315 -2541044 -2496642 -1853740 -353402 1359105 2561516 3458736 4633474
41053 4633474 5847972 6147828 5097467 3345440 1879201 1071771 592975 83962 -275891
41044 -275891 -11065 867628 1659670 1810717 1608780 1578638 1496788 726956 -581770 -1460339
41034 -1460339 -1405358 -944362 -698863 -599248 -329793 117556 687709 1440337 2121062 2166205
41024 2166205 1514911 797677 341787 -273293 -1157138 -1429685 -409830 1173979 2111608
41015 2111608 2353930 2672845 3031419 2551497 1153578 27432 55463 700244 1011293
41006 1011293 975137 1125816 1316171 798415 -482517 -1440580 -1047448 430338 1828247
40997 1828247 2522922 2935838 3541052 4018362 3903900 3628120 4047911 4985807 5158267
40988 5158267 3917900 2316488 1863266 2760020 3985644 4698438 4834056 4572650 3996215
40979 3996215 3314554 2871777 2811563 3011500 3235133 3072770 2057924 350222 -986391
40970 -986391 -1054900 -328929 -93089 -754088 -1465523 -1475701 -1023965 -637611 -303102 188585
40960 188585 626723 661064 394708 263153 518059 1118336 1874336 2393628 2156840 1060149
40950 1060149 -234712 -863867 -680337 -350622 -498327 -974086 -1139426 -809669 -647359
40941 -647359 -1344932 -2514396 -2903226 -1954290 -627742 -145918 -365041 -191283 647370
40932 647370 1285269 1243938 1148339 1453397 1467270 458380 -977341 -1617802 -1283076 -858404
40922 -858404 -839680 -774651 -179801 800689 1827195 2784477 3531490 3795991 3613153 3434913
40912 3434913 3522672 3595350 3343881 2940208 2697795 2492373 1930831 1032389 397535 567680
40902 567680 1330272 1815599 1404288 507081 181094 818805 1536588 1247110 101208
40893 101208 -676916 -275207 1021257 2595780 4110141 5095152 4848502 3423597 2059796
40884 2059796 1769511 1928264 1218181 -293470 -1140171 -597569 279680 209848 -643952
40875 -643952 -1227343 -1154445 -918811 -925339 -1088032 -1247410 -1336850 -1168241 -572703 265233
40865 265233 1029838 1712781 2365135 2582949 1877138 529444 -594833 -1182424 -1735904
40856 -1735904 -2505248 -2898318 -2405708 -1507792 -1055021 -1131557 -1134526 -712352 -15623 813923
40846 813923 1754555 2502971 2569668 1969789 1390713 1420458 1867911 2069895 1715766 1158785
40836 1158785 925163 1039848 970312 335492 -460955 -647402 -190613 -34871 -918362 -2308614
40826 -2308614 -2975596 -2413460 -1235786 -335070 -156196 -669758 -1468389 -1876663 -1524666
40817 -1524666 -894992 -805343 -1311951 -1694491 -1580699 -1367319 -1296366 -898423 136832 1179683
40807 1179683 1426928 1025634 736524 755892 586413 -33433 -733568 -1061269 -890237 -263350
40797 -263350 674659 1546051 1997772 2127573 2230324 2171499 1588804 746583 468963 943525
40787 943525 1271505 702791 -227614 -449077 108053 464772 -20148 -917361 -1463253 -1405330
40777 -1405330 -891579 -67478 824190 1307899 1099113 519737 150930 194387 482800 948322
40767 948322 1632369 2284314 2481497 2298905 2372733 2985055 3483318 3062488 1869152 796552
40757 796552 298382 17113 -328447 -338304 403850 1533747 2322829 2642395 2904947 3100358
40747 3100358 2571496 1030543 -709654 -1503699 -1151446 -467891 -205857 -400134 -791526
40738 -791526 -1338110 -2005157 -2433932 -2241072 -1494228 -591683 147605 478597 122633 -792234
40728 -792234 -1365840 -713965 812328 1884870 1862429 1492800 1662207 2242646 2723855
40719 2723855 3203360 3906552 4327579 3871012 2956333 2382606 1859386 439568 -1610737
40710 -1610737 -2768196 -2404539 -1668482 -1663307 -2007489 -2005744 -2040471 -2658618 -3237816 -2923070
40700 -2923070 -2236658 -2294566 -2796978 -2341057 -698176 729333 1007662 842962 1090398
40691 1090398 1291641 560218 -876488 -1932502 -2060950 -1710422 -1646901 -2307553 -3546522
40682 -3546522 -4594259 -4550620 -3333156 -1911749 -1271392 -1389850 -1529276 -1216780 -564295
40673 -564295 117499 618114 873553 978247 1010808 750992 -71453 -1077038 -1292753 -294288
40663 -294288 1143073 2009842 2303550 2764384 3689564 4647229 5202008 5299941 4987710 4319901
40653 4319901 3556435 2949944 2309923 1237070 -191452 -1428034 -2161896 -2525978 -2531714
40644 -2531714 -1849966 -408994 1200089 2231166 2476894 2261038 1957268 1703022 1414390
40635 1414390 897701 31563 -1056282 -2043480 -2663641 -2859574 -2761329 -2590746 -2450735
40626 -2450735 -2113089 -1268868 -188030 212158 -645072 -2186380 -3290709 -3443384 -2828041
40617 -2828041 -1680306 -350642 256527 -614961 -2318497 -3260935 -2874354 -2117249 -1640420
40608 -1640420 -679272 1358057 3255589 3273901 1573806 44909 -158122 269744 200017
40599 200017 -513869 -1368016 -2035218 -2351948 -2116597 -1423195 -805353 -647042 -727522 -608835
40589 -608835 -184904 339852 674235 466216 -476025 -1711676 -2301025 -1774991 -706112
40580 -706112 11959 205884 398708 954063 1641057 1984641 1729143 952159 -57329
40571 -57329 -999186 -1730009 -2204404 -2273003 -1756386 -791576 152669 736080 956014 775988
40561 775988 -36279 -1354889 -2342746 -2206002 -1208849 -456334 -633026 -1302718 -1456682
40552 -1456682 -433761 1632691 3823368 4840784 3936568 1738235 -142653 -603717
40544 -603717 17906 639783 731139 603010 655369 818550 793129 497903 99085 -247279
40534 -247279 -525424 -791144 -1089463 -1447247 -1868116 -2252361 -2310952 -1683117 -321740 1220336
40524 1220336 2088932 1870585 958299 66515 -505633 -963539 -1498970 -1984627 -2199171
40515 -2199171 -2046832 -1447836 -355062 854405 1331879 620562 -505837 -647078 589012
40506 589012 2039002 2399490 1763306 1249414 1440814 1914844 2252815 2666227 3286177
40497 3286177 3527716 2792821 1454210 506315 373579 616798 743998 716016 580003
40488 580003 209387 -301793 -436941 162234 1171931 1983170 2427404 2771669 3131391
40479 3131391 3248561 2839462 1907613 738889 -205145 -496171 -153009 205341 -15903
40470 -15903 -584932 -659798 71362 874996 860004 51729 -760221 -989681 -660900 -19973
40460 -19973 772085 1544222 2114586 2455394 2549005 2098850 824568 -868625 -2008699
40451 -2008699 -2096256 -1617063 -1228218 -859308 -59273 1102508 2044446 2441442 2475444 2367618
40441 2367618 2112403 1668244 1015445 48326 -1203380 -2308244 -2831534 -2940596 -3099371
40432 -3099371 -3205180 -2687752 -1569990 -688560 -500939 -307603 803870 2651476 4117497
40423 4117497 4357416 3437466 2026739 876438 406603 413779 303516 -140527 -437340
40414 -437340 -92752 694641 1296001 1316881 735259 -229802 -1061452 -1211903 -832106 -739830
40404 -739830 -1196154 -1350075 -605383 130961 -372061 -1687544 -2207258 -1474306 -684640
40395 -684640 -661153 -691421 -631 762638 483070 -629811 -1175152 -286007 1440110 2666105
40385 2666105 2559278 1387925 161048 -334351 -172358 95265 186226 62240 -487076
40376 -487076 -1455623 -1989776 -1163099 499391 1314313 572000 -633026 -1085313 -842383
40367 -842383 -374879 452841 1586280 2047072 1230198 132770 -11277 350035 -23863
40358 -23863 -875088 -730868 629507 1689860 1491954 908722 1022852 1487770 1334955
40349 1334955 547408 -7180 294785 1371935 2686966 3512312 3355236 2475064 1602225
40340 1602225 972020 211287 -627574 -742139 195645 1225443 1260133 556477 192365
40331 192365 375677 195051 -896725 -2159927 -2507303 -1906706 -1362496 -1584933 -2085796
40322 -2085796 -1845512 -734606 149774 -217239 -1477962 -2309782 -1994219 -1054954 -340576
40313 -340576 -22174 327455 1112088 2400301 3867222 4823231 4650305 3503904 2367247
40304 2367247 2173751 2984379 4071425 4564361 3965761 2382545 459430 -1088414 -1990301
40295 -1990301 -2403314 -2544732 -2614842 -2870731 -3298719 -3340826 -2514008 -1245911 -473404 -412689
40285 -412689 -400392 8152 539231 913413 1243989 1513209 1491167 1449270 2028296 2982890
40275 2982890 3038280 1625060 -135042 -896382 -694456 -296034 147049 749658 991737
40266 991737 453419 -42404 658192 2234438 3232126 3074209 2542403 2326457 2321762 2446514
40256 2446514 2940261 3597847 3806375 3652586 3942904 4748923 4977280 3925784 2376053
40247 2376053 1552571 1747558 2510027 3420526 4034923 3751974 2495435 1077761 264323
40238 264323 -105759 -526490 -853379 -596492 161492 782650 807258 229407 -635205 -1123465
40228 -1123465 -515978 1049707 2327340 2262129 1228773 332470 -154174 -815583 -1771614
40219 -1771614 -2309123 -1949439 -1063914 -174793 677653 1540842 2076013 1903306 1134972
40210 1134972 281450 -199979 -180948 45040 -103517 -954010 -2128556 -2953276 -3275681
40201 -3275681 -3429283 -3441826 -2943737 -2003416 -1312050 -1163469 -941098 -168962 552263 404168
40191 404168 -321912 -635283 -306028 51330 266189 896266 1957029 2385269 1411605
40182 1411605 -206394 -1039622 -679636 62611 353524 77325 -477385 -1038847 -1394588
40173 -1394588 -1435279 -1241881 -923085 -486334 -116761 -330558 -1414980 -2862354 -3805071
40164 -3805071 -3917925 -3498431 -2847460 -2105629 -1585117 -1658525 -2279192 -3054929 -3708354 -4005873
40154 -4005873 -3514454 -2175562 -911361 -702373 -1091367 -643748 1014571 2760622 3766453
40145 3766453 4380963 4752734 4082458 2214504 622340 475324 784492 -10755 -1455533
40136 -1455533 -1823192 -940782 -398591 -997726 -1755133 -1708951 -1121625 -424471 597212
40127 597212 1901467 2659301 2377720 1666432 1263312 1089991 819227 617720 802836
40118 802836 1436709 2629808 4469967 6326181 7160426 6945253 6747771 6922979 6442606
40109 6442606 4786592 3219252 3009130 3460271 3163490 2383326 2500115 3490610 3781320
40100 3781320 2744829 1720456 1984139 2921082 2975480 1639308 -220692 -1554488 -2036149
40091 -2036149 -1979826 -1787199 -1541052 -1107554 -621849 -586535 -1227273 -2056175 -2479216 -2530342
40081 -2530342 -2501396 -2211598 -1385953 -509197 -374321 -780793 -631742 456889 1549428
40072 1549428 1789333 1565633 1664175 1927236 1582364 554876 -388707 -739830 -734677 -604103
40062 -604103 -24713 1263589 2748346 3634722 3864559 4017091 4169691 3618982 2161055
40053 2161055 952413 1222602 2449743 2855863 1757972 377369 -2593 362259 521971
40044 521971 324606 171148 5049 -396802 -587461 2771 932361 1217834 816089 602425
40034 602425 896148 1082461 845237 712026 1013742 1223596 817230 69449 -468907 -666904
40024 -666904 -565463 -42820 803727 1464944 1660485 1703508 1836431 1753536 1267884 881282
40014 881282 1027410 1198063 619151 -448905 -938154 -507799 -48297 -384886 -1122526
40005 -1122526 -1264022 -593123 138898 295909 32854 -263453 -637014 -1176562 -1353775
39996 -1353775 -531981 877998 1620971 1275697 932408 1603806 2658684 2696816 1508954
39987 1508954 172544 -546494 -826230 -884276 -549329 58998 413616 469556 775688 1337636
39977 1337636 1311199 390578 -367492 109688 1364763 2043327 1655224 878004 341463
39968 341463 -64381 -625929 -1169856 -1189158 -319023 1374298 3376844 4980662 5685571
39959 5685571 5396590 4335366 2946983 1773659 1053773 464804 -370225 -1199546 -1450937
39950 -1450937 -1144528 -867725 -846250 -776279 -642949 -819718 -1116736 -690829 637745 1881330
39940 1881330 2270759 2266540 2507441 2679877 2387819 2338671 3430633 5126083 6003435 5768870
39930 5768870 5553116 6169090 7119960 7542063 7258818 6591134 5791445 5008211 4389432
39921 4389432 3990983 3819259 3933997 4214700 4210594 3685287 3163279 3393789 4317392 5074051
39911 5074051 5057096 4536855 4198401 4356957 4629694 4266317 3022002 1759945 1659943
39902 1659943 2616308 3155985 2391948 1208839 816883 1081569 1362582 2108369 4069222
39893 4069222 6421942 7403024 6768881 6043944 6200499 6650551 6815558 7086981 7662977
39884 7662977 7925907 7746103 8058467 9229381 10062204 9497366 8300036 7923402 8505559
39875 8505559 9143732 9491616 9899825 10442827 10949552 11691477 12996311 14397376 15114378
39866 15114378 15193309 15295358 15577633 15715982 15887415 16758795 18495936 20639610 22957943
39857 22957943 25557674 28142882 30143718 31802811 34201451 37773599 41546174 44394289
39849 44394289 46513832 49119567 53066854 58262069 64154156 70329568 76769896 83933965
39841 83933965 92531123 102882360 114509555 126640741 139188492 153001722 168998220
39834 168998220 187187266 206776460 227170950 248375344 269944568 289691525 304071824
39827 304071824 310196225 307328890 296548220 279698501 259088720 237437887 216943801
39820 216943801 198187324 180513758 163595978 148098876 134704899 123139433 112582831
39813 112582831 102630251 93354222 84704699 76506264 69094290 63296500 59325120 56042052
39805 56042052 51981040 47112699 42928179 40449732 38780157 36298679 32888103 30010716
39797 30010716 28575692 27748625 26282697 24168312 22261115 20853300 19449339 17731607
39789 17731607 16040763 14941439 14776600 15495157 16462524 16685278 15809550 14717401 14490940
39780 14490940 14911906 14715288 13312495 11463306 10077537 9155036 8299950 7590295 7333833
39771 7333833 7366847 7192857 6652072 6019356 5565010 5377082 5496845 5868610 6194109 6127415
39761 6127415 5624295 4944338 4412916 4351000 5013140 6206008 7049207 6593109 4849459
39752 4849459 2901497 1802406 1624925 1802492 2064680 2557547 3169119 3359610 2914541
39743 2914541 2445872 2755176 3900890 5223889 6116294 6411977 6197143 5710241 5383961
39734 5383961 5505860 5792739 5747916 5479692 5629902 6342892 6887472 6632116 5918610 5578879
39724 5578879 5980554 6940508 8175834 9339894 9916683 9629269 8819980 8031640 7407160
39715 7407160 6864868 6550962 6599431 6686559 6397272 5867789 5492632 5153355 4398153 3333062
39705 3333062 2637218 2591305 2710596 2519265 2145687 1928433 1908848 1993520 2263933 2835373
39695 2835373 3588078 4188617 4280006 3722726 2867348 2438878 2792744 3390779 3397086 2686197
39685 2686197 1881913 1586864 2016283 3083340 4186833 4220601 2719257 883124 422328
39676 422328 1302323 1737794 677718 -875116 -1514164 -1230001 -783286 -300359 482346
39667 482346 1303170 1770277 2182857 2987333 3819174 3998594 3584122 3031900 2284954 1280052
39657 1280052 906458 2069329 3910663 4422387 3086157 1585084 1431726 2100373 2186321
39648 2186321 1367997 346383 -379462 -729453 -546246 221997 1118874 1666121 1993347
39639 1993347 2362059 2398259 1560178 185395 -707096 -656097 -151317 219567 377303 419947
39629 419947 295363 13323 -253007 -416561 -441854 -50608 997294 2247534 2827502
39620 2827502 2628893 2545159 3093554 3446932 2549410 792387 -259317 259258 1629046
39611 1629046 2610561 2773106 2557231 2491026 2650730 2688114 2243789 1451479 952990 1167648
39601 1167648 1716239 1971920 1980373 2209055 2494922 2100744 997388 208413 445724 1188530
39591 1188530 1672502 2006351 2526833 2752382 2042736 896522 460335 880684 1231034
39582 1231034 1100341 1145204 1791292 2405788 2281193 1677191 1298088 1264988 1144807 634219
39572 634219 -218826 -1194353 -1977348 -2287374 -2117466 -1616521 -771580 325650 954666
39563 954666 273954 -1411741 -2612653 -2271330 -846537 525111 1291530 1531122 1431056
39554 1431056 1222527 1061248 582918 -713569 -2246957 -2492283 -1042917 457696 429089
39545 429089 -525319 -840265 -468233 -504430 -854252 -200561 1626866 3076324 3182180
39536 3182180 2869820 3160678 3407037 2409575 428124 -1040197 -1086962 -161663 739743
39527 739743 1032705 827152 623629 618151 316708 -709183 -1761405 -1555335 -23793
39518 -23793 1354094 1456580 823890 481286 440418 248926 176914 707910 1378962 1298648
39508 1298648 543277 -18168 -64419 72499 448651 1444521 2604929 2767533 1714645
39499 1714645 665985 618483 1048875 860526 -62902 -901115 -1027017 -504710 228832
39490 228832 718758 789123 807677 1315562 2101881 2116212 749267 -1212652 -2429028 -2457279
39480 -2457279 -1838981 -1117105 -480725 -167696 -401627 -879079 -1020993 -877690 -1148338
39471 -1148338 -2085613 -2988171 -3125153 -2677817 -2375188 -2574412 -3069302 -3458520 -3331593
39462 -3331593 -2461176 -1262088 -703649 -1204598 -1905627 -1700107 -763311 -240133 -483350
39453 -483350 -606319 -72387 278400 -500901 -1893613 -2563882 -2220655 -1861077 -2186622
39444 -2186622 -2708216 -2727022 -2479644 -2755943 -3709117 -4548779 -4383082 -3101335 -1411459
39435 -1411459 -128752 549517 1065284 1806731 2555060 2782669 2337800 1544556 732686
39426 732686 38879 -372514 -361367 -199672 -457516 -1237316 -1853859 -1602346 -651675 125461
39416 125461 128395 -365382 -507997 308849 1838585 3092515 3203381 2231098 959995
39407 959995 -52525 -885519 -1697081 -2273930 -2426957 -2407213 -2491090 -2443084 -1880731 -992906
39397 -992906 -372275 -200603 -141172 -99728 -526627 -1660690 -2868207 -3176896 -2340884 -996179
39387 -996179 228818 1346342 2541217 3421739 3287674 2195990 1197687 1099889 1363227
39378 1363227 854950 -437859 -1210660 -556729 814242 1544093 1315913 962198 1153421
39369 1153421 1658692 1954724 2039058 2377879 3239813 4253187 4649005 4028322 2915399
39360 2915399 2347715 2805251 3764852 4418267 4483983 4084525 3247903 2004492 723217
39351 723217 -177509 -766816 -1411925 -2125531 -2533274 -2470278 -2213659 -2088735 -2134887 -2148094
39341 -2148094 -1839697 -1099891 -359768 -432365 -1593058 -3045806 -3749901 -3539588 -2949346
39332 -2949346 -2298020 -1676048 -1535090 -2281758 -3272449 -3219113 -1846659 -275875 534465
39323 534465 851062 1280396 1706693 1720774 1425250 1206350 1253790 1765529 2927509 4143881
39313 4143881 4115380 2492471 706166 171998 329030 -336684 -1814880 -2567127 -1887231
39304 -1887231 -786348 -243691 75248 746819 1337997 1088203 179427 -465918 -292202
39295 -292202 529850 1480998 1950847 1500120 383084 -469937 -426060 170988 658397 977906
39285 977906 1409795 1750597 1483899 682729 80347 152103 622825 983213 1048285 868233
39275 868233 505846 144899 132199 638825 1393614 1906232 1868848 1284171 382632 -436253
39265 -436253 -714942 -222070 819270 1882527 2590558 3006248 3421644 3865448 3946729
39256 3946729 3310650 2165357 1153972 714187 775309 1061789 1343464 1270573 383384
39247 383384 -1332065 -3100834 -3953655 -3620460 -2620731 -1632404 -1026392 -774107 -406354
39238 -406354 715531 2538962 3873929 3529275 1984125 1163344 2189341 4002287 4735876
39229 4735876 3943555 2791863 2385744 2682935 3006700 2896383 2255262 1204431 118523
39220 118523 -481193 -353784 205883 592914 309180 -696876 -1861700 -2339466 -1885943
39211 -1885943 -1290205 -1428298 -1951787 -1595262 40712 1715281 1977426 812269 -661755
39202 -661755 -1641952 -2087529 -2052809 -1461265 -608192 -156474 -341324 -630905 -423013 274048
39192 274048 1063712 1719399 2238513 2568814 2594614 2368246 2199819 2465792 3240985 4018194
39182 4018194 3960360 2733549 1036060 -19513 -24330 552518 1204746 1859140 2430237
39173 2430237 2533560 1998829 1232370 687413 309306 -153358 -645549 -1004992 -1319027
39164 -1319027 -1645704 -1722074 -1459322 -1370404 -1818829 -2081906 -1004568 1384242 3692281
39155 3692281 4779167 4840096 4628486 4366675 3962556 3710403 4006375 4552908 4489806 3373565
39145 3373565 1656126 187823 -458387 -217379 542981 1212919 1279594 639417 -416180
39136 -416180 -1478994 -2262279 -2699475 -2916632 -3010759 -2814373 -2103102 -1149094 -724738 -1196379
39126 -1196379 -1841388 -1587935 -448373 307852 -318783 -1711356 -2234311 -1084056 857799
39117 857799 2131429 2320859 2223886 2524577 2807293 2190330 634594 -875705 -1446520
39108 -1446520 -1123246 -515557 -14915 338171 571985 799758 1341628 2379126 3482937
39099 3482937 3854752 3168255 1967831 1136236 1093363 1569324 2038537 2262418 2384964
39090 2384964 2541494 2546220 2169443 1629904 1455491 1790594 2213290 2375742 2401125 2419979
39080 2419979 2222792 1791777 1680360 2236188 2821437 2570511 1702632 1239555 1495914
39071 1495914 1762257 1582481 1378564 1468623 1384871 754785 119224 140620 514334 433968
39061 433968 -183361 -667384 -611365 -265948 -21805 -106868 -757748 -2081288 -3606341 -4406832
39051 -4406832 -3870963 -2189045 -127429 1451354 1968218 1402481 260134 -881999 -1753622
39042 -1753622 -2278814 -2415158 -2340830 -2448417 -2790094 -2862454 -2371122 -1837853 -1865596 -2126016
39032 -2126016 -1819471 -951876 -306045 -137648 223102 1219010 2252720 2415619 1526613
39023 1526613 134633 -1070344 -1579386 -1237037 -419727 221916 354651 51255 -609125
39014 -609125 -1485785 -1982498 -1513428 -562258 -439444 -1568710 -2785422 -2877992 -2088023
39005 -2088023 -1386525 -948849 -284993 546216 881590 517663 -13752 -250589 -198346 59971
38995 59971 463566 630832 81483 -1027105 -1909812 -2068930 -1779904 -1563094 -1586512 -1689294
38985 -1689294 -1611668 -1132795 -354804 140632 -128702 -769513 -822243 42889 1169833 1943335
38975 1943335 2587903 3547140 4545143 4862835 4381482 3808470 3805848 4272457 4634198 4573240
38965 4573240 4221489 3754164 3133606 2385481 1840205 1758238 1858959 1680896 1397265 1686055
38955 1686055 2579370 3053001 2220658 486194 -976211 -1444952 -820722 839310 3028661
38946 3028661 4352700 3521454 960622 -1391835 -2103687 -1408475 -315641 566060 1063159
38937 1063159 1144912 1082848 1346127 1977081 2543914 2869834 3147621 3178891 2405214 1082137
38927 1082137 451596 1087807 1944459 1869578 1271557 1256339 1752830 1725717 916137 113174
38917 113174 -247226 -563471 -997749 -1021949 -407393 213605 225056 -223973 -751559 -1354023
38907 -1354023 -1994787 -2191664 -1679796 -1122820 -1461174 -2630415 -3504405 -3229412 -2233217
38898 -2233217 -1704785 -2261886 -3358777 -3992009 -3768187 -3098622 -2495287 -2074541 -1830708
38889 -1830708 -1903243 -2186761 -2044712 -975112 602682 1789567 2343910 2753383 3167060
38880 3167060 3005906 1940818 633846 7980 156357 451897 469673 312381 184398
38871 184398 163417 417248 1201602 2444292 3561712 3890504 3257869 2068955 902671
38862 902671 87456 -360581 -481191 -183006 586229 1535333 2102912 1982214 1499538 1295392
38852 1295392 1585146 1873370 1543837 669525 -14556 -65434 -4384 -689469 -2105054 -3233814
38842 -3233814 -3264756 -2496682 -1756715 -1319889 -889042 -414775 -322630 -854909 -1659077 -2225080
38832 -2225080 -2428985 -2474958 -2561587 -2810919 -3323438 -4027050 -4515925 -4288310 -3285715 -2135094
38822 -2135094 -1683857 -2175124 -2957078 -3162014 -2612806 -1846553 -1323496 -995741 -711711
38813 -711711 -572930 -624488 -582384 -222900 249792 559138 781512 1072508 1313723 1448659
38803 1448659 1786970 2429065 2768785 2306654 1713387 2202068 3818919 5175827 5087367
38794 5087367 3833553 2607738 2300812 3012634 4159805 4787794 4265006 2929163 1688420
38785 1688420 935965 366884 -151324 -303229 -117067 -206646 -790839 -1172392 -718345 227906
38775 227906 957725 1383362 1820272 2246373 2414186 2351501 2152233 1594559 598676 -191810
38765 -191810 34912 1184138 2249504 2350549 1437295 144100 -682735 -541283 205294
38756 205294 546600 -55945 -1021239 -1527372 -1690389 -2266602 -3397462 -4316651 -4294657 -3369633
38746 -3369633 -2155875 -1329285 -1193869 -1338526 -869746 578167 2252580 3167508 3314954
38737 3314954 3387055 3532806 3174327 2021708 513611 -829373 -1811854 -2249540 -1953403
38728 -1953403 -1187746 -507829 -13834 570295 1015029 697328 -108121 -78020 1307453
38719 1307453 2583143 1955249 -325685 -2281501 -2709752 -2312840 -2196412 -2282638 -1848697
38710 -1848697 -1008820 -757211 -1518960 -2307313 -1698052 565945 3250219 4862551 4957464
38701 4957464 4194379 3418981 2946611 2624472 2280372 1969038 1826548 1757090 1401022 601251
38691 601251 -164140 -174138 604713 1383723 1595123 1643000 2191745 3077271 3503595 3091424
38681 3091424 2123250 939109 -188549 -679898 -43746 1155068 1561135 684996 -372069
38672 -372069 -349002 593335 1326599 1331226 1061526 925345 673926 -27208 -927837 -1383811
38662 -1383811 -1030532 -114310 755151 1120230 1015822 864255 1077340 1785127 2827511
38653 2827511 3809582 4218649 3774261 2738942 1682081 919386 415057 175408 311965
38644 311965 615603 525919 -200760 -1112919 -1613147 -1599490 -1309175 -841798 -187455 496323
38634 496323 996147 1297550 1442881 1288021 703324 -92801 -679157 -842444 -654110 -272941
38624 -272941 138528 477077 879749 1615657 2560711 3077230 2778554 2134141 1841777 1839173
38614 1839173 1566332 1105497 1279937 2395440 3558394 3698842 2824656 1774489 1084820
38605 1084820 712231 680628 1228633 2115897 2417569 1499033 -98363 -1200671 -1277468
38596 -1277468 -757947 -220602 156336 282734 -53892 -707039 -935055 -165082 1220699
38587 1220699 2313091 2737635 2848710 2980649 3000675 2646015 1927507 1134652 665478
38578 665478 740234 1013054 734436 -234140 -860814 -99292 1571478 2636633 2567078 2325734
38568 2325734 2598417 2647884 1631835 156723 -466349 11176 729359 1137170 1475229
38559 1475229 1888254 1946642 1273817 63212 -1230121 -2284941 -2865581 -2767964 -2010659
38550 -2010659 -888852 232667 1076216 1510680 1637855 1684365 1639487 1238980 534278
38541 534278 132167 456536 1036510 1010714 167649 -975232 -1942306 -2610377 -2862463 -2530028
38531 -2530028 -1754416 -967720 -456939 -278402 -510930 -1126619 -1639926 -1414256 -456996
38522 -456996 467562 652659 136596 -427652 -354041 536518 1685240 2246751 2052400 1865889
38512 1865889 2315892 2972553 3086087 2834304 2926888 3171775 2549755 883762 -612804
38503 -612804 -885264 -297032 136780 23061 -439496 -1066414 -1604744 -1588738 -962619 -435655
38493 -435655 -563942 -839264 -367645 834700 1929117 2440335 2617251 2662354 2330377
38484 2330377 1451820 310975 -698872 -1409426 -1731995 -1551828 -939724 -181683 539847
38475 539847 1226038 1711246 1582058 746317 -116098 -63419 1073465 2403058 2882558
38466 2882558 2409480 1820168 1833644 2255006 2354583 1806213 988071 482980 574840 1153346
38456 1153346 1768525 1809529 1040204 34016 -332831 24471 222732 -416588 -1397807
38447 -1397807 -1641857 -814567 338422 871375 475990 -532789 -1683156 -2613444 -3041163
38438 -3041163 -2716352 -1577716 -798 1277020 1728883 1538827 1331564 1423424 1583195
38429 1583195 1499468 1139011 607081 52100 -174989 294607 1259048 1922624 1772144 1177559
38419 1177559 819340 813999 747875 309526 -494776 -1532940 -2536336 -3045742 -2792811 -2095831
38409 -2095831 -1545321 -1327969 -1123587 -597222 262642 1208164 1897517 2116930 2065467 2239422
38399 2239422 2770891 3126106 2832648 2255822 2127996 2447096 2468086 1837031 1116105 941015
38389 941015 1159961 1184966 879563 676654 913725 1390038 1660915 1624149 1675995 2185092
38379 2185092 2831111 2743372 1567364 204744 32268 1339578 2961414 3594127 3049077
38370 3049077 1959086 735015 -604322 -1777704 -2151037 -1534234 -576481 23926 419493
38361 419493 1273460 2647508 3755069 3946209 3486614 3061975 2845829 2489365 1873410
38352 1873410 1381490 1356903 1650875 1872731 1885766 1924804 2310898 3057166 3676052 3499761
38342 3499761 2374252 882803 -357342 -1385169 -2494474 -3401263 -3442675 -2541394 -1295121
38333 -1295121 -63198 1290373 2570868 3008209 2302755 1256928 815031 975782 1163413
38324 1163413 1176591 1191513 1226591 1167769 1017322 711248 121985 -399094 -147760 753646
38314 753646 1137026 536555 254165 1512025 3323170 3730751 2672941 1848409 1906380
38305 1906380 1760760 987139 802783 1752069 2315589 1269444 -49407 372629 2037915
38296 2037915 2590508 1259624 -274870 -591360 -361289 -842751 -1854007 -2191095 -1357198
38287 -1357198 -32187 884814 1131089 1110736 1377523 1977192 2250931 1598770 465033
38278 465033 63641 918272 2170225 2660838 2238902 1551120 956470 309064 -333078
38269 -333078 -474985 172120 1245717 2109048 2385531 2038429 1284559 604875 498536
38260 498536 951850 1383869 1353373 1043050 736261 149422 -1146283 -2748644 -3525739
38251 -3525739 -2900069 -1590077 -840732 -1257545 -2567882 -4067606 -4929253 -4466204 -2709482
38242 -2709482 -710776 174534 -530461 -2096356 -3428276 -4073203 -4380810 -4781402 -5024018
38233 -5024018 -4350783 -2605274 -854207 -323226 -804295 -911031 -73026 684799 472246
38224 472246 40849 559926 1620968 1794350 878092 192053 540769 1201596 1328328
38215 1328328 1183356 1336895 1598987 1542350 1396459 1594211 1877743 1614425 721139 -354296
38205 -354296 -1314134 -2070890 -2348862 -1872686 -921437 -199655 -148439 -728730 -1770933 -3084591
38195 -3084591 -4217580 -4551025 -3847012 -2548295 -1421956 -916959 -814924 -475848 460515
38186 460515 1572479 1990654 1264933 -253853 -1844861 -2929007 -3159196 -2450622 -1163329
38177 -1163329 8608 541424 352024 -386389 -1337003 -1909675 -1605538 -651537 159541
38168 159541 473412 742206 1340711 1876566 1826043 1396914 1197644 1324734 1312317 841394
38158 841394 58367 -709029 -1189006 -1211686 -832610 -356355 -36990 142550 269951 284662
38148 284662 109089 -195912 -508576 -685101 -555346 -204353 -133894 -595309 -865821 9204
38138 9204 1691990 2736774 2573583 2245127 2646498 3152630 2849952 2123430 1891486 2038382
38128 2038382 1859317 1494318 1591419 1912237 1634721 874539 552663 722742 328283 -1143616
38118 -1143616 -2876806 -3860755 -3851120 -3034208 -1779925 -983708 -1569237 -3179250 -4234964
38109 -4234964 -3736529 -2234457 -710618 568347 1629267 2188535 2160264 2033468 2059776
38100 2059776 1697762 559578 -643408 -852962 1163 1061627 1619226 1523238 816009
38091 816009 -339828 -1393304 -1592403 -612084 1124549 2729870 3485556 3418505 3225938
38082 3225938 3365147 3386851 2648367 1465840 778782 751350 695409 499806 966288 2277072
38072 2277072 3304373 3200618 2612874 2350127 1850814 306097 -1391265 -1409751 454542
38063 454542 2383862 2856786 2177462 1445141 1103130 979092 906797 756153 408442 89816
38053 89816 221444 662345 679918 -27659 -903628 -1478422 -2033580 -2780093 -3097753 -2451580
38043 -2451580 -1557065 -1544538 -2129354 -1796647 -44769 1665910 1805837 717419 -175266
38034 -175266 -381954 -458837 -532668 -77537 776603 1072299 635715 641209 1786040 2960270
38024 2960270 2803302 1756767 1274460 1540954 1444327 622995 23069 233373 646750
38015 646750 705597 762531 1117787 1267581 817000 260733 127585 105021 -256324 -648912
38005 -648912 -570747 -192154 69901 296098 656494 796361 412753 -28150 44166 340406
37995 340406 243960 -45841 238749 1288083 2598187 3732153 4409841 4167053 2900976
37986 2900976 1583518 1371565 1946000 1741246 83998 -1773619 -2168491 -924507 692009
37977 692009 1442481 1116869 342355 -225426 -495698 -761975 -972910 -537633 822424
37968 822424 2344514 2871672 2107727 783923 -270118 -746805 -742868 -625031 -951651
37959 -951651 -1931028 -2910301 -2916197 -1793985 -414349 279045 75368 -600287 -1198416 -1453546
37949 -1453546 -1541312 -1739315 -1805940 -1109099 315885 1417547 1440224 1047070 1326162 2127851
37939 2127851 2390863 1854108 1344599 1407349 1718656 1975674 2368948 2930256 3271048 3224290
37929 3224290 3014372 2652006 1937858 1170310 990777 1370864 1615466 1501024 1450603 1419409
37919 1419409 732270 -597568 -1506141 -1381176 -919282 -901851 -1119464 -1182150 -1382978 -1919027
37909 -1919027 -2177625 -1745054 -1301497 -1482363 -1602499 -695445 752779 1377592 886152
37900 886152 167572 -353399 -1148858 -2271748 -2858295 -2394326 -1554352 -1218037 -1275687 -981454
37890 -981454 -138307 594997 531146 -211032 -824410 -756171 -374345 -426516 -933969 -1186028
37880 -1186028 -965620 -1023447 -1822166 -2529305 -2133240 -1088569 -764342 -1391798 -1714068
37871 -1714068 -922316 97501 24748 -1150056 -2387901 -3140524 -3753873 -4422992 -4617267
37862 -4617267 -3928126 -2911575 -2433404 -2372397 -1720653 -149702 1237675 1255221 221564
37853 221564 -541444 -499419 -313493 -525816 -795745 -669308 -256128 231579 891980 1698878
37843 1698878 2328620 2783727 3453842 4155440 3977037 2677289 1354943 919290 726399
37834 726399 -227622 -1464780 -1674883 -836780 -334019 -957104 -2000523 -2563712 -2694700
37825 -2694700 -2822783 -2856740 -2384908 -1353874 -168745 703676 1128955 1431042 1970016
37816 1970016 2401739 1765001 -220124 -2321271 -2904697 -1652410 369929 1978926 2527052
37807 2527052 1779259 179673 -956675 -602356 610712 1145858 683880 399098 972317
37798 972317 1545044 1181616 357164 205843 910331 1588510 1480033 709908 27503 77361
37788 77361 777514 1329565 1081792 353801 58907 593611 1547857 2401562 2945022 3072196
37778 3072196 2755828 2215100 1597338 668437 -576958 -1325990 -840590 316226 949654
37769 949654 884909 776491 542791 -425072 -1464995 -915148 1279924 3029094 3031059 2527393
37759 2527393 2930877 3370729 2306987 345114 -543529 80854 916504 1228018 1470406
37750 1470406 1627198 753616 -1347521 -3367022 -3995779 -3242330 -1859831 -382028 821723
37741 821723 1338864 1141258 782415 814328 1303115 1978029 2421484 2134100 1002226 -243622
37731 -243622 -655581 -270614 -63525 -521010 -924026 -438818 582324 946949 148412
37722 148412 -864333 -624116 1179075 3148984 3584601 2363562 945458 446615 470213
37713 470213 234059 -38527 254356 736395 518137 -243341 -458731 186099 737859 394851
37703 394851 -545230 -1402427 -1853881 -1645968 -503634 1175516 2308809 2354597 1933142
37694 1933142 1760803 1629743 1025847 172104 -239385 19998 664000 1461331 2275978
37685 2275978 2810352 2928519 3092586 3874402 5021849 5526653 4786041 3379447 2479272
37676 2479272 2589108 3016539 2670804 1349781 27145 -283268 318959 938864 1082399
37667 1082399 952064 696512 176905 -348149 -120943 1047597 2194226 2252677 1305798
37658 1305798 305451 -87401 138478 799645 1677646 2348857 2444962 2119066 1846860
37649 1846860 1769471 1605427 1218964 912905 1058043 1642304 2235823 2286574 1517470 180000
37639 180000 -1150146 -2108669 -2712509 -2949942 -2588198 -1680359 -900016 -863591 -1272993 -1242216
37629 -1242216 -453287 479211 831548 490663 -274221 -1282341 -2360297 -3097374 -3095935
37620 -3095935 -2415104 -1493772 -649356 115664 807256 1221950 1194436 882648 583072 345614
37610 345614 5310 -453391 -864413 -1235044 -1757128 -2290626 -2208736 -1095650 635671
37601 635671 2139723 2930354 2984922 2409861 1485418 731665 308706 -387919 -1756061
37592 -1756061 -2803909 -2002766 473967 2404686 1985350 -85891 -1578680 -1193472 533276
37583 533276 2235949 2915392 2442865 1511208 985465 1019222 1122363 1232341 1966247 3347169
37573 3347169 4149329 3378849 1738625 604404 112307 -510799 -1128913 -744358 564759
37564 564759 1254095 391093 -1041326 -1585120 -1130745 -591889 -515036 -785572 -1170737 -1407964
37554 -1407964 -1134658 -391045 107504 -218317 -1011594 -1529899 -1659485 -1712269 -1457596 -200153
37544 -200153 2043767 4107740 4778448 4050017 3018885 2671948 2969053 3094700 2469833
37535 2469833 1362764 455582 41887 -31179 227774 1043457 2213057 2877958 2361477
37526 2361477 985374 -250243 -607415 -67928 799496 1177232 585341 -527649 -1114618
37517 -1114618 -760003 -146215 87150 353994 1303762 2508436 2947581 2586275 2413668
37508 2413668 2861154 3220969 2917309 2387941 2214438 2199842 1931167 1586529 1478780 1322540
37498 1322540 714859 -33177 -324358 -284615 -549669 -1143663 -1340777 -696127 450320
37489 450320 1584383 2492401 2989082 2829285 2186238 1684335 1618042 1573329 1140332 557534
37479 557534 266108 246936 278958 491427 1052727 1530702 1272364 458893 129179 884753
37469 884753 2042343 2448779 1850225 1032895 718745 778867 692718 435275 487125 985781
37459 985781 1328428 937475 129941 -289123 -217902 -407635 -1236325 -1980650 -1802010 -985334
37449 -985334 -540941 -833237 -1295600 -1392085 -1137344 -624244 229911 1239012 1875572 1953161
37439 1953161 1874912 1926338 1864487 1557002 1450588 1880564 2377663 2267068 1624771 1040299
37429 1040299 730759 558308 678339 1357999 2187421 2295690 1539282 774693 656689
37420 656689 773293 373177 -516176 -1144013 -906690 215806 1835207 3379099 4295981
37411 4295981 4381442 3872389 3096637 2211023 1381760 860175 605596 179969 -603061 -1240102
37401 -1240102 -1225301 -892345 -946226 -1331162 -1348420 -938413 -945550 -1720457 -2286735 -1624580
37391 -1624580 -206002 668095 751031 1007660 1869376 2471606 2111240 1501121 1732145
37382 1732145 2598613 2935160 2336133 1565032 1302654 1423631 1634160 1899774 1935276 1171828
37372 1171828 -244282 -1201499 -1033131 -505308 -619160 -1034928 -688803 414351 1176874
37363 1176874 1100172 885068 1188861 1816300 2450733 3192503 3880100 3796594 2749818 1714822
37353 1714822 1613829 2020760 1893519 1110883 361415 -147670 -826885 -1654178 -2036680
37344 -2036680 -1865892 -1767508 -2007797 -2009979 -1373606 -579518 -114449 407815 1518347 2795707
37334 2795707 3307629 2841046 1912843 818934 -420503 -1285308 -1008732 129357 738292
37325 738292 62131 -1010575 -1306468 -984761 -946172 -1243004 -1198867 -811082 -771801 -1009961
37315 -1009961 -461912 1236729 2886346 3261560 2704739 2363458 2469133 2328341 1663736
37306 1663736 997035 779733 910632 1065478 849942 -217016 -2084906 -3621697 -3583466
37297 -3583466 -2254969 -1271754 -1570351 -2324028 -2253982 -1216050 8647 848116 1278502
37288 1278502 1488481 1744907 2282271 2943134 3244918 3039055 2624958 1988220 642185
37279 642185 -1321070 -2789800 -2954926 -2439477 -2288987 -2401114 -1930642 -816361 204624
37270 204624 849756 1380861 1536500 673870 -797274 -1382756 -467269 698267 650639
37261 650639 -471998 -1526998 -2076046 -2572730 -3249424 -3763688 -3890201 -3824086 -3708199
37252 -3708199 -3385009 -2740704 -1948715 -1284142 -895648 -725135 -493278 68449 743431
37243 743431 824891 -39733 -1154321 -1360450 -291268 1325475 2564289 3068850 2923783
37234 2923783 2323452 1647104 1432833 1819307 2199083 1884023 1091204 808223 1507427
37225 1507427 2386734 2267887 1054455 -168013 -483784 -102800 253491 472978 1076311
37216 1076311 2288511 3582644 4220269 3932092 2993674 1882768 945725 231441 -380709
37207 -380709 -811385 -731086 -137870 277893 -103644 -766409 -428208 1293788 3144413
37198 3144413 3540100 2243266 369821 -936739 -1408903 -1460219 -1567290 -1865052 -2101344
37189 -2101344 -1960374 -1472601 -964070 -595634 -241022 149586 495395 998577 2032872
37180 2032872 3326095 3886824 3262833 2292998 1922141 1805682 1017480 -233992 -762395
37171 -762395 -240689 323687 245609 157271 749024 1494539 1507484 984725 798714 1059837
37161 1059837 1136853 968100 1257361 2127129 2512609 1453446 -577873 -2208182 -2682364
37152 -2682364 -2331147 -1777740 -1284888 -883288 -615325 -451916 -268356 -46658 146325
37143 146325 457411 1156891 2048165 2378565 1768740 941656 924525 1591309 1663004 356206
37133 356206 -1540750 -2607854 -2383731 -1570595 -962900 -705842 -507374 -92091 616469
37124 616469 1453526 2110402 2458885 2692618 2959291 3071818 2897196 2764763 2991856 3186435
37114 3186435 2645103 1417610 335468 -82472 -78265 126113 745510 1644136 1890717
37105 1890717 839909 -786003 -1668274 -1510722 -1141418 -1109299 -1005818 -388338 297952
37096 297952 179000 -963475 -2419673 -3242982 -3013142 -2033382 -980094 -367987 -272141
37087 -272141 -498159 -888823 -1351038 -1685717 -1599637 -923415 248450 1575976 2579668
37078 2579668 2913017 2716140 2554285 2792453 3174913 3248796 2983298 2609799 2066753 1155848
37068 1155848 192084 -147221 217194 558177 396855 205560 587588 1212301 1205526 371619
37058 371619 -619494 -1184719 -1316196 -1061821 -217552 1113174 2174728 2292287 1702354
37049 1702354 1187618 1046535 941125 732397 840502 1471368 1960555 1454649 123123
37040 123123 -861693 -682002 222906 855230 873785 688194 596599 451068 247910 441024
37030 441024 1266303 2107795 2061221 1073734 96635 19793 772707 1628480 2142630 2529917
37020 2529917 3159159 3875718 3974018 2950672 1294924 290546 728911 1899995 2274788
37011 2274788 1276803 -89763 -647074 -561694 -826732 -1518751 -1497702 -81240 1781915
37002 1781915 2617279 2221183 1631657 1541926 1548778 1045609 103008 -881320 -1828744 -2778581
36992 -2778581 -3403464 -3270982 -2467183 -1555244 -994167 -896441 -1174779 -1528012 -1447545 -745650
36982 -745650 -18891 -54325 -769369 -1326036 -1377610 -1499557 -2086782 -2552472 -2230345 -1537620
36972 -1537620 -1438017 -1978462 -2161367 -1292273 224711 1565936 2372349 2747401 2890548
36963 2890548 3039251 3401315 3839396 3895085 3387947 2760766 2595518 2977703 3518209 3785484
36953 3785484 3538126 2772640 1774306 963121 537972 438915 686370 1385646 2267598 2706105
36943 2706105 2500774 2198805 2252108 2326739 1996107 1674621 2079626 2976858 3305926 2589202
36933 2589202 1472888 731249 412154 193878 -17269 -151464 -181066 -21880 375464
36924 375464 711334 585748 147580 -82343 -121056 -500562 -1123553 -1050557 91022 1374100
36914 1374100 1928291 2180486 2854872 3524638 3327432 2557319 2200229 2185218 1536085 228754
36904 228754 -597405 -543243 -581048 -1211737 -1407924 -346714 959831 988526 -106911 -891155
36894 -891155 -739725 -258361 140379 743853 1490456 1613720 811077 -97990 -273507 -46438
36884 -46438 -415423 -1667408 -3010584 -3454923 -2705329 -1278216 -51239 314207 -219257
36875 -219257 -1094848 -1676137 -1823577 -1951780 -2459396 -3139056 -3343192 -2841505 -2249778 -2265755
36865 -2265755 -2690347 -2783668 -2526220 -2693445 -3396410 -3486671 -2184893 -587118 -437545
36856 -437545 -1723295 -2701540 -2350949 -1584960 -1643572 -2372119 -2814604 -2710314 -2513294 -2406527
36846 -2406527 -2204723 -2041974 -2333104 -3026476 -3542926 -3542250 -3195704 -2595934 -1500199 24799
36836 24799 1197505 1310456 774661 848936 2180722 3954294 4764953 4173574 3058088
36827 3058088 2444050 2393071 2267613 1765897 1270432 1260536 1762855 2395954 2643842 2093109
36817 2093109 778333 -618603 -1265523 -1034342 -597729 -574177 -877372 -1029420 -772384
36808 -772384 -164763 631156 1409503 1960771 2217908 2208247 1871043 1257407 869633 1210567
36798 1210567 1848423 1647770 342169 -829453 -723466 50887 -51702 -1395298 -2838448
36789 -2838448 -3404907 -3258212 -2855784 -2105876 -851310 483906 1308550 1551361 1483632
36780 1483632 1143511 367670 -754683 -1806959 -2389742 -2382526 -1970347 -1537454 -1410094
36771 -1410094 -1584271 -1781510 -1788262 -1610099 -1313883 -909839 -407503 132689 522835 330345
36761 330345 -835264 -2567429 -3553333 -2865695 -1212921 -195635 -373802 -870901 -939329
36752 -939329 -944792 -1451691 -2257822 -2907477 -3371445 -3558241 -2917920 -1391670 -122306 -181048
36742 -181048 -971063 -965325 167964 1266014 1481308 1292597 1461268 1948539 2332256 2580673
36732 2580673 2893718 3232411 3393204 3206278 2468353 1127282 -307641 -1105482 -1293948
36723 -1293948 -1659086 -2406014 -2508499 -1007823 1547177 3653834 4505276 4387576 3712902
36714 3712902 2530152 1063149 -26696 -278367 38489 288180 161223 -107483 -42410
36705 -42410 552197 1195159 990672 -345189 -1799866 -1905750 -366517 1613664 2771779
36696 2771779 3030411 2992879 2769876 1994337 769402 -177011 -414213 -269532 -106774
36687 -106774 283647 1092916 1736934 1435815 466206 67472 845374 1893652 1968369 1078958
36677 1078958 290154 197763 343377 172370 -167867 -322204 -449728 -897048 -1418458 -1302608
36667 -1302608 -295005 1036544 1995286 2505766 2944762 3403609 3461117 2801754 1825122
36658 1825122 1307091 1423840 1468362 797704 -218072 -641361 -247888 187914 -12728
36649 -12728 -597815 -937578 -950347 -1010191 -1208424 -1248991 -1045090 -965318 -1339180 -1957190
36639 -1957190 -2224209 -1781408 -963700 -611307 -1302530 -2762349 -4177664 -5024607 -5276368
36630 -5276368 -4891611 -3720230 -2121217 -1005086 -765210 -687553 -15198 872198 1078357
36621 1078357 607705 267889 350388 377687 172028 198781 652947 1131324 1530957 2348856
36611 2348856 3566906 4073893 2953730 814767 -895420 -1548364 -1657737 -1817416 -1960863
36602 -1960863 -1605340 -417352 1366904 2863796 3204547 2544809 1969055 2038825 2022198
36593 2022198 1144073 -77 -165755 754051 1638060 1738905 1452350 1405502 1620479
36584 1620479 1819737 1879086 1695434 1137291 373904 -170139 -331093 -265231 37351 752376
36574 752376 1628595 1969307 1429119 389814 -589493 -1228957 -1347435 -799537 187134
36565 187134 1063539 1486122 1370270 489319 -1254263 -3075265 -3663103 -2593146 -687225
36556 -687225 1192780 2793706 3683910 3072546 1159428 -430338 -578647 -181883 -651860
36547 -651860 -1732765 -2121417 -1621387 -1157034 -969092 -385610 612403 1124588 887982
36538 887982 729593 1082038 1323958 1086904 987583 1410537 1687687 1270003 726606 721186
36528 721186 875283 576072 119418 28718 -57453 -658103 -1166524 -610084 577875 899704
36518 899704 -51376 -1041013 -1087796 -763727 -1047959 -1784315 -2034187 -1445749 -561996 3072
36508 3072 144895 103464 100646 149232 40851 -425899 -1108196 -1522621 -1282033 -452912 508599
36497 508599 1026266 702047 -307076 -1159123 -965539 214423 1294227 1336623 607271
36488 607271 174257 612750 1452034 1880057 1642942 1108042 689676 458283 219604 -267113
36478 -267113 -1150206 -2324067 -3333375 -3680792 -3380522 -2974605 -2808801 -2594392 -2015791
36469 -2015791 -1414343 -1283367 -1348166 -970361 -391993 -546498 -1410894 -1716180 -931308 -387184
36459 -387184 -1340575 -2846135 -3025612 -1921102 -1386451 -2190583 -2967787 -2488252 -1383153
36450 -1383153 -766151 -443577 377097 1521100 2196296 2318506 2341262 2169165 1389201
36441 1389201 387771 113281 673607 1128608 842935 226139 -84322 -33123 151606
36432 151606 439821 835532 1188845 1441108 1655820 1620322 890521 -507662 -1856195
36423 -1856195 -2514898 -2531644 -2230076 -1663120 -899444 -452286 -830127 -1789522 -2529166 -2615185
36413 -2615185 -2348627 -2249378 -2541332 -3145130 -3792121 -4048454 -3567487 -2497939 -1406253
36404 -1406253 -642550 -29133 629934 1021036 693965 -162117 -788122 -783451 -521030 -395722
36394 -395722 -80854 991448 2639115 3999632 4572100 4613733 4389822 3683946 2441869
36385 2441869 1341084 1071710 1328727 1194043 428909 -288539 -471698 -465563 -668730 -719598
36375 -719598 -44578 1048491 1450385 534468 -990933 -1712359 -901501 782047 1896214
36366 1896214 1488379 -149971 -1871437 -2706014 -2485636 -1611357 -499390 602927 1439793
36357 1439793 1704995 1312861 598954 79207 -22683 94178 168685 183338 170853 -57539
36347 -57539 -626263 -1119054 -882671 44316 770661 625083 -1583 -279986 -54382 183549
36337 183549 162831 39610 -151872 -569965 -1019359 -981924 -410274 54039 -58570 -413099
36327 -413099 -400633 78291 663432 1026389 1004818 562345 -52352 -366803 -213808 53423
36317 53423 162620 411393 1130114 1911179 1924567 980317 -181995 -776713 -847857 -1115907
36307 -1115907 -2066867 -3267630 -3628625 -2499063 -518671 900644 1072889 694748 785109
36298 785109 1363288 1634536 1232088 681410 606871 948027 1122693 695500 -240553 -1194714
36288 -1194714 -1741162 -1917832 -2067598 -2213736 -1875399 -771361 555108 1224119 1002362
36279 1002362 419020 32930 24113 428673 1250188 2218865 2815076 2682443 1849945 634243
36269 634243 -414879 -685020 -95249 598003 622877 231626 296999 930213 1314287 1077075
36259 1077075 954391 1627205 2624052 2989970 2507391 1628072 657569 -292742 -890039
36250 -890039 -877985 -627108 -700393 -964189 -791665 -111433 422647 386049 92108 1364
36240 1364 188196 607227 1374112 2461646 3458745 3900757 3616673 2665282 1293795 80332
36230 80332 -340383 36784 541286 718336 865150 1367280 1957485 2145607 2058533 2231739
36220 2231739 2691929 2836527 2232848 1036427 -410455 -1889770 -3128211 -3812057 -3975435
36211 -3975435 -3968599 -3883546 -3455696 -2712752 -2165674 -2003207 -1658607 -740618 69747 -183598
36201 -183598 -1281545 -2014912 -1788728 -1188317 -793734 -336961 480244 1080568 663481
36192 663481 -642203 -1970558 -2803556 -3200103 -3151478 -2502037 -1558310 -1031400 -1100934 -1101890
36182 -1101890 -483878 362359 628750 115724 -679400 -1277642 -1573425 -1549510 -1073773 -106505
36172 -106505 1126973 2274205 3005143 2984091 1974177 255557 -1165354 -1198605 199628
36163 199628 1746764 2056105 1087196 -27303 -582691 -1082599 -2100100 -3046121 -2857663
36154 -2857663 -1578007 -331224 243597 590566 1071853 1198884 617854 71412 497645
36145 497645 1573596 2040334 1358771 258325 -406952 -642804 -941089 -1476621 -2020570
36136 -2020570 -2356158 -2492085 -2568061 -2642431 -2477061 -1620687 13957 1693277 2352727
36127 2352727 1646336 242320 -953122 -1519010 -1434078 -795974 50522 500628 287150
36118 287150 -65304 182756 1001327 1587014 1389328 746950 298638 62107 -519704 -1628520
36108 -1628520 -2503831 -2101737 -321280 1631191 2290326 1338233 -169007 -972446 -788600
36099 -788600 -225110 161132 313418 286852 -23770 -513821 -671394 -230402 212350 -190680
36089 -190680 -1332112 -2141488 -1930932 -1189791 -749110 -701081 -630026 -474658 -515222 -735487
36079 -735487 -834344 -745438 -547982 -29363 907629 1471445 561997 -1619426 -3400700 -3527707
36069 -3527707 -2505327 -1557836 -978357 -228586 856219 1784062 2082057 1635071 609051
36060 609051 -426635 -673944 -28184 568427 391005 75930 582979 1466743 1449700 582312
36050 582312 390988 1567759 2860881 2904863 1999791 1207411 641394 -234996 -1228131
36041 -1228131 -1534985 -1045131 -491474 -281969 -42776 519699 1028928 1028840 702207 678830
36031 678830 1345409 2511793 3600086 4076316 3828904 3197512 2623242 2344279 2406622
36022 2406622 2689990 2800889 2288856 1257438 471617 496165 964106 1108996 809593
36013 809593 593456 706772 765186 427102 -95801 -441260 -642394 -959554 -1360697 -1480671
36003 -1480671 -1103446 -514443 -283736 -700771 -1473075 -2053820 -2228508 -2225200 -2254236 -2195487
35993 -2195487 -1852511 -1267899 -613550 -5249 364352 171686 -627157 -1475982 -1629397
35984 -1629397 -843014 521136 1923869 2977442 3541050 3745388 3766132 3412817 2277415
35975 2277415 560181 -712351 -811525 -283761 -182205 -642534 -985290 -978438 -1012588 -1034979
35965 -1034979 -413875 809978 1577588 1338931 1074078 1950874 3541956 4315789 3629731
35956 3629731 2346403 1517101 1263868 1146391 998329 1030671 1396405 1921929 2193090
35947 2193090 1880466 1109341 454388 377998 733240 1027490 1083971 1158990 1441294 1746710
35937 1746710 1765817 1371801 624041 -299577 -1067856 -1291020 -845245 -92434 326569 33666
35927 33666 -630851 -724873 473818 2606208 4375654 4769160 4027202 3216998 2995265
35918 2995265 3051056 2666529 1537289 65564 -932641 -879383 -40175 605401 374005
35909 374005 -338715 -610559 -199380 284521 410421 561053 1296598 2521262 3608168
35900 3608168 4064737 3775561 2822489 1402340 -141724 -1393228 -1961726 -1617979 -639285
35891 -639285 57963 -310147 -1359115 -1892009 -1546662 -1327002 -1969337 -2609311 -2019221
35882 -2019221 -548255 408043 547130 830696 1475888 1333350 -172552 -1855734 -2409536
35873 -2409536 -2127034 -1943307 -1732588 -852749 306079 759348 555066 564598 862993 799418
35863 799418 663154 1645242 3749635 5285388 5148588 4243804 3728348 3126181 1444048
35854 1444048 -808329 -2187209 -2371995 -2250856 -2236033 -1869966 -1095558 -639536 -875903
35845 -875903 -1302436 -1401066 -1169438 -627575 302280 1186071 1260146 560348 -8262 -123509
35835 -123509 -631133 -2071933 -3493040 -3585418 -2409671 -1099340 -268976 353619 951074
35826 951074 1249947 1189471 1141552 1225699 1003809 151941 -965958 -1654225 -1560043 -858368
35816 -858368 -44056 315225 -100519 -1039363 -1771619 -1674475 -734126 500718 1338734 1343795
35806 1343795 559437 -481897 -1051803 -735342 219965 1085408 1316260 1122992 1271638
35797 1271638 2167223 3243028 3506705 2637164 1224995 -56775 -1064796 -1806183 -1950285
35788 -1950285 -1192743 108006 1123555 1374474 1067163 668346 439205 376639 334860
35779 334860 149182 -178460 -395018 -249107 165871 449851 280018 -316167 -1013665 -1442946
35769 -1442946 -1485011 -1384213 -1437940 -1529467 -1212064 -384857 421990 707360 687274 964551
35759 964551 1683505 2408186 2748640 2700349 2379112 1842557 1296232 1147339 1629946 2485963
35749 2485963 3132410 3140640 2618252 2188689 2455723 3343703 4105533 4134940 3588263 3029089
35739 3029089 2717471 2511811 2175686 1418242 -40321 -1915109 -3139032 -2882946 -1683464
35730 -1683464 -836595 -703421 -453389 380414 1067167 913510 518219 979972 2294667
35721 2294667 3368564 3470423 2943380 2445842 2102412 1626301 913233 255201 46602
35712 46602 342468 725483 774056 700886 1175691 2282177 3072518 2673994 1580268 1179142
35702 1179142 2019631 3214159 3725084 3599232 3530575 3701463 3656656 3136713 2468432 2083072
35692 2083072 2069945 2349655 2968607 3966984 5072783 5752836 5638901 4889068 4117310
35683 4117310 3907495 4323085 4917650 5252749 5267030 5030693 4404943 3336175 2334426
35674 2334426 2035764 2165996 1652595 222978 -775832 34103 2076015 3458528 3476626
35665 3476626 3284098 3828166 4382625 3904781 2827685 2362820 2622865 2678535 2222159
35656 2222159 1904651 1929182 1502907 132563 -1439057 -2176828 -2036345 -1780655 -1959893
35647 -1959893 -2526581 -3091420 -3138665 -2310375 -904867 120622 -2032 -1128724 -2491780
35638 -2491780 -3440033 -3712074 -3345088 -2651006 -2059855 -1727664 -1497170 -1369419 -1629144
35629 -1629144 -2267659 -2713289 -2504049 -1866886 -1239599 -592889 280849 1126831 1481694
35620 1481694 1414722 1435530 1696541 1794847 1387077 553627 -488077 -1601015 -2553195 -2994536
35610 -2994536 -2787041 -2155554 -1438010 -877506 -672634 -966560 -1658581 -2368796 -2697306
35601 -2697306 -2489009 -1852569 -974973 72655 1289452 2420017 2852416 2220736 1099010
35592 1099010 591958 1037468 1592402 1410635 748183 442367 703348 999014 881260
35583 881260 353732 -410101 -1158736 -1473338 -1094135 -284563 512850 1202346 1792192 1919208
35573 1919208 1241563 145307 -568943 -592286 -129091 725447 1838265 2479423 1939539
35564 1939539 762531 317144 895877 1268300 509341 -785629 -1698486 -2332693 -3036130
35555 -3036130 -3162681 -1879137 178036 1303729 813561 -261450 -738573 -668629 -786441
35546 -786441 -1234538 -1391815 -744959 464438 1470282 1731085 1419489 1107141 971667
35537 971667 597068 -232349 -874563 -461860 905490 2128588 2378576 1942976 1591562
35528 1591562 1518430 1340768 933758 696548 835208 840683 128759 -989866 -1558999 -1290536
35518 -1290536 -1002764 -1327324 -1534384 -437624 1747945 3379100 3380471 2458924 1955204
35509 1955204 2181418 2449300 2225805 1591548 822846 133990 -262550 -317264 -320805 -567130
35499 -567130 -909123 -945776 -576182 -145839 -143234 -843551 -1976944 -2663879 -2170599 -966038
35489 -966038 -418671 -1018514 -1591067 -969939 226573 512161 -249790 -826461 -671332
35480 -671332 -565009 -887576 -645290 930583 2794682 3189412 1886920 375608 -14699
35471 -14699 638940 1460787 1884122 1888602 1605623 1104025 521840 171555 318929 794743
35461 794743 1013980 636286 92429 82174 587950 865222 497464 -76115 -324233 -387880
35451 -387880 -676998 -1113429 -1258354 -924819 -213980 815901 2021692 2878492 2829927
35442 2829927 1916654 667877 -559468 -1722145 -2659923 -3049029 -2878237 -2542123 -2320079
35433 -2320079 -2115315 -1838654 -1689519 -1858426 -2245445 -2679335 -3144930 -3550338 -3511482 -2702683
35423 -2702683 -1336705 -25245 813169 1198767 1291354 1121878 717602 286562 65528
35414 65528 12417 -178633 -675501 -1212092 -1320849 -846725 -88044 618004 1271243 1990301
35404 1990301 2527442 2312880 1128756 -414645 -1273256 -856012 544075 2151884 3407231
35395 3407231 4228123 4721779 4838661 4415826 3487717 2381699 1420571 630978 -99320
35386 -99320 -603483 -419054 612424 1831564 2151327 1101444 -683583 -2174857 -2974415
35377 -2974415 -3380097 -3605413 -3441079 -2812120 -2168390 -1931506 -1872420 -1512350 -950715 -753321
35367 -753321 -1059893 -1347225 -1158649 -569001 182442 966632 1472441 1260168 496699 56487
35357 56487 342426 541505 -197747 -1273009 -1311024 -218570 551059 26135 -1020194
35348 -1020194 -1386240 -1129680 -1074785 -1238826 -865154 87551 559297 -167958 -1386703
35339 -1386703 -1842488 -1256770 -420854 11930 226314 637159 1064989 929241 149783
35330 149783 -567443 -529392 132908 763777 1106735 1446880 1849334 1906676 1570053 1618274
35320 1618274 2624296 3803122 3728998 2169934 393218 -525139 -881730 -1425832 -2002698
35311 -2002698 -1846997 -832342 343162 1115005 1551721 1871545 2012139 1836069 1389004
35302 1389004 803176 187166 -325361 -638511 -831209 -1046003 -1284058 -1487546 -1675002
35293 -1675002 -1737891 -1328157 -362557 546033 688681 190127 -236524 -378593 -628552 -922414
35283 -922414 -430528 1268407 3335885 4479959 4177951 2782047 998753 -296659 -361403
35274 -361403 635673 1563754 1650436 1395577 1552078 1797566 1362391 535221 350192 877243
35264 877243 1056077 460730 88905 861195 2218055 2880672 2406456 1350426 334766
35255 334766 -385783 -683492 -483678 74257 710621 1206195 1422074 1327606 1137755 1179057
35245 1179057 1501292 1875505 2201857 2511636 2503685 1656162 84762 -1231368 -1503418
35236 -1503418 -1042968 -720757 -848355 -1036427 -940504 -729220 -878730 -1696490 -2909770
35227 -2909770 -3689344 -3423588 -2519620 -1956246 -1977133 -1896370 -1354658 -856593 -617441 101613
35217 101613 1664091 2957998 2783524 1719350 1293093 1667858 1597798 616822 -224595
35208 -224595 -115971 354641 348723 -29333 -337534 -627678 -912707 -605865 651417 2161590
35198 2161590 2971735 3082806 3147411 3365185 3428549 3249722 2958946 2365216 1184426 -237801
35188 -237801 -1099010 -1066087 -493817 230702 949479 1321938 853092 -370018 -1441807
35179 -1441807 -1479250 -464334 897526 1844959 1941091 1209652 262320 27775 873446
35170 873446 1994486 2067428 688783 -1058521 -1694921 -900722 250464 592950 103705
35161 103705 -311357 21083 947168 1927157 2612837 2876158 2660457 2088554 1507844 1151088
35151 1151088 854119 325670 -380718 -862380 -803437 -281872 310341 551165 290467 -164897
35141 -164897 -195407 651011 2252436 3964356 5032085 5006664 3951920 2384394 984309
35132 984309 292819 583852 1775800 3269234 4092710 3647700 2362106 1296494 1077107
35123 1077107 1532178 2322292 3364346 4424011 4825937 4031719 2279571 325456 -1261968
35114 -1261968 -2296251 -2695933 -2350710 -1252063 314454 1644241 1923134 1152680 606178
35105 606178 1535313 3314964 3886613 2474212 750067 484187 1133806 1075304 379632
35096 379632 571274 1866202 2556060 1576791 98854 -221512 656894 1695386 2397180
35087 2397180 2864441 2956535 2472292 1799628 1493726 1466655 1323467 1184182 1385332 1614452
35077 1614452 1187283 103283 -956928 -1676200 -2351807 -2963695 -2776538 -1333908 582284
35068 582284 1496886 730364 -850070 -1617889 -767996 870835 1727320 1169292 -35612
35059 -35612 -970858 -1626579 -2260964 -2383606 -1335446 332917 1095161 266986 -1199195
35050 -1199195 -2022691 -1993437 -1694286 -1513956 -1530769 -1896673 -2617276 -3133784 -2776103 -1664081
35040 -1664081 -676700 -446689 -796879 -1303775 -1998847 -3147423 -4513357 -5288425 -4910663
35031 -4910663 -3719387 -2554293 -1801663 -1135547 -233673 605969 821827 358890 -235232
35022 -235232 -429658 -176277 213083 433798 445513 538640 1098370 2141929 3199333 3854248
35012 3854248 4240386 4697863 5077858 4793233 3548859 1693902 -96989 -1146323 -923392
35003 -923392 551474 2368603 3318376 3029046 2175641 1506242 1118803 763214 270856
34994 270856 -516928 -1656154 -2650541 -2700345 -1802302 -1029802 -1214815 -1869962 -2009673 -1566231
34984 -1566231 -1250588 -1308616 -1220746 -599514 263366 825868 859765 594098 570453 1172832
34974 1172832 2043124 2343871 1955200 1829313 2547879 3204906 2708304 1633538 1451685
34965 1451685 2170682 2295808 1292204 499596 1031038 2220512 3028639 3675089 4685715
34956 4685715 5380979 4784169 3400345 2589691 2473830 1939459 690874 -176120 20977
34947 20977 489863 357762 87627 605912 1662044 2050081 1303269 368707 439239 1590571
34937 1590571 2827286 3264192 2994717 2759559 2960464 3272338 3239720 2901815 2594843
34928 2594843 2433759 2334695 2290855 2178134 1519093 59123 -1497450 -2042971 -1512167
34919 -1512167 -1089202 -1623724 -2442688 -2293043 -1063629 116038 385242 108482 158472
34910 158472 738662 1308121 1474648 1504627 1802783 2188666 2052816 1201701 180505 -394295
34900 -394295 -512830 -537056 -577917 -492063 -323243 -293155 -390677 -396247 -337775 -495782 -855138
34889 -855138 -961788 -526187 143248 531511 514224 362928 337251 477617 698280 902455
34879 902455 999748 885626 487883 -38288 -186502 509335 1771284 2597517 2330032 1423757
34869 1423757 756254 509408 309435 152071 348501 636619 281123 -735214 -1435380
34860 -1435380 -1095704 -97313 781423 1253923 1366895 1160689 950586 1298430 2161903
34851 2161903 2629226 2041808 845000 -230604 -1248774 -2623015 -4078975 -4874735 -4788905
$$ [...]
##END NTUPLES=NMR SPECTRUM
##END=
