##TITLE=31Pdec_Baulin-Fin
  CDCl3
  24 sc
 3.10.2023
##JCAMPDX= 6.0         $$ Bruker NMR JCAMP-DX V2.0
##DATA TYPE= NMR SPECTRUM
##DATA CLASS= NTUPLES
##ORIGIN= UXNMR, Bruker Analytische Messtechnik GmbH
##OWNER= root
$$ XWIN-NMR		Version 3.5
$$ Tue Oct  3 13:54:24 2023 Russian Standard Time (UT+4h)  she@DPX200
##.OBSERVE FREQUENCY= 81.013821
##.OBSERVE NUCLEUS= ^31P
##.ACQUISITION MODE= SIMULTANEOUS
##.ACQUISITION SCHEME= undefined
##.AVERAGES= 24
##.DIGITISER RES= 16
##SPECTROMETER/DATA SYSTEM= spect
##.PULSE SEQUENCE= zgpg30
##.SOLVENT NAME= CDCl3
##.SHIFT REFERENCE= (INTERNAL, CDCl3, 0, 248.564)
##AUDIT TRAIL= $$ (NUMBER, WHEN, WHO, WHERE, WHAT)
$$ ##TITLE= Audit trail, XWIN-NMR		Version 3.5
$$ ##JCAMPDX= 5.01
$$ ##ORIGIN= Bruker BioSpin GmbH
$$ ##OWNER= she
$$ F:/spectra/data/she/nmr/P31/1/pdata/1/auditp.txt
$$ ##AUDIT TRAIL=  $$ (NUMBER, WHEN, WHO, WHERE, WHAT)
(   1,<2023-10-03 13:53:23.93 +0400>,<she>,<DPX200>,
      <created by zg, POWCHK disabled, PULCHK disabled
       configuration hash MD5:
       00 E9 B6 7A A2 85 ED C7 34 08 36 98 17 FE 4E 26
       data hash MD5: 32K
       CE 8E 9B 43 90 DC E2 90 B9 48 E4 89 9C 79 FD D7>)
(   2,<2023-10-03 13:53:26.14 +0400>,<she>,<DPX200>,
      <Start of raw data processing
       efp BC_mod = 2 LB = 5 FT_mod = 6 PKNL = 1 PHC0 = -10578.43 PHC1 = -92.71359 SI = 64K 
       data hash MD5: 64K
       6C EB AF 80 EE 2B D3 67 BD B1 E6 62 D6 65 2D BB>)
(   3,<2023-10-03 13:53:44.87 +0400>,<she>,<DPX200>,
      <pk PHC0 = -146.8755 PHC1 = 340.8 
       data hash MD5: 64K
       DC 63 44 BB F3 B9 D3 A1 E7 9B D7 07 2C B5 2C 23>)
(   4,<2023-10-03 13:53:47.84 +0400>,<she>,<DPX200>,
      <abs ABSG = 5 
       data hash MD5: 64K
       E4 D0 1F E5 49 34 20 1B 1C B8 05 11 78 7F 9D 10>)
$$ ##END=
$$ 
$$ hash MD5
$$ 60 53 9A 5A 19 AC 48 CE F8 5C EB A4 0B 04 14 66
##$RELAX= 
##$RELAX= 
##$RELAX= 
##$RELAX= 
##$RELAX= 
##$RELAX= 
##$RELAX= 
##$RELAX= 
##$RELAX= 
$$ Bruker specific parameters
$$ --------------------------
##$DU= <F:/spectra>
##$EXPNO= 1
##$NAME= <P31>
##$PROCNO= 1
##$TYPE= <nmr>
##$USER= <she>
##$AMP= (0..31)
100 100 100 100 100 100 100 100 100 100 100 100 100 100 100 100 100 100 
100 100 100 100 100 100 100 100 100 100 100 100 100 100 
##$AQSEQ= 0
##$AQ_mod= 1
##$AUNM= <au_zg>
##$AUTOPOS= <>
##$BF1= 81.014009
##$BF2= 200.13
##$BF3= 200.13
##$BF4= 200.13
##$BF5= 200.13
##$BF6= 200.13
##$BF7= 200.13
##$BF8= 200.13
##$BYTORDA= 1
##$CFDGTYP= 0
##$CFRGTYP= 5
##$CHEMSTR= <none>
##$CNST= (0..31)
1 1 145 1 1 1 1 1 1 1 1 1 1 1 1 1 1 1 1 1 1 1 1 1 1 1 1 1 1 1 1 1 
##$CPDPRG= <waltz16>
##$CPDPRG1= <>
##$CPDPRG2= <waltz16>
##$CPDPRG3= <>
##$CPDPRG4= <mlev>
##$CPDPRG5= <mlev>
##$CPDPRG6= <mlev>
##$CPDPRG7= <mlev>
##$CPDPRG8= <mlev>
##$CPDPRGB= <>
##$CPDPRGT= <>
##$D= (0..31)
0 1 0 0 0 0 0 0 0 0 0 0.03 2e-05 3e-06 0 0 0 0 0 0 0 0 0 0 0 0 0 0 0 0 
0 0 
##$DATE= 1696326803
##$DBL= (0..7)
120 120 120 11 120 120 24 19 
##$DBP= (0..7)
150 150 150 150 150 150 150 150 
##$DBP07= 0
##$DBPNAM0= <>
##$DBPNAM1= <>
$$ [...]
##$SUBNAM3= <"">
##$SUBNAM4= <"">
##$SUBNAM5= <"">
##$SUBNAM6= <"">
##$SUBNAM7= <"">
##$SUBNAM8= <"">
##$SUBNAM9= <"">
##$SW= 501.771253377433
##$SWIBOX= (0..15)
0 1 3 0 0 0 0 0 0 0 0 0 0 0 0 0 
##$SW_h= 40650.406504065
##$TD= 32768
##$TD0= 1
##$TE= 0
##$TE2= 300
##$TE3= 300
##$TEG= 300
##$TL= (0..7)
0 120 53 12 22 120 120 120 
##$TP= (0..7)
150 150 150 150 150 150 150 150 
##$TP07= 0
##$TPNAME0= <>
##$TPNAME1= <>
##$TPNAME2= <>
##$TPNAME3= <>
##$TPNAME4= <>
##$TPNAME5= <>
##$TPNAME6= <>
##$TPNAME7= <>
##$TPOAL= (0..7)
0.5 0.5 0.5 0.5 0.5 0.5 0.5 0.5 
##$TPOFFS= (0..7)
0 0 0 0 0 0 0 0 
##$TUNHIN= 0
##$TUNHOUT= 0
##$TUNXOUT= 0
##$USERA1= <user>
##$USERA2= <user>
##$USERA3= <user>
##$USERA4= <user>
##$USERA5= <user>
##$V9= 5
##$VALIST= <valist>
##$VCLIST= <CCCCCCCCCCCCCCC>
##$VD= 0
##$VDLIST= <DDDDDDDDDDDDDDD>
##$VPLIST= <PPPPPPPPPPPPPPP>
##$VTLIST= <TTTTTTTTTTTTTTT>
##$WBST= 1024
##$WBSW= 4
##$XGAIN= (0..3)
0 0 0 0 
##$XL= 0
##$YL= 0
##$YMAX_a= 3178
##$YMIN_a= -3179
##$ZGOPTNS= <>
##$ZL1= 120
##$ZL2= 120
##$ZL3= 120
##$ZL4= 120
##$ABSF1= 248.5645
##$ABSF2= -253.2056
##$ABSG= 5
##$ABSL= 3
##$ALPHA= 0
##$AQORDER= 0
##$ASSFAC= 0
##$ASSFACI= 0
##$ASSFACX= 0
##$ASSWID= 0
##$AUNMP= <proc_1d>
##$AZFE= 0.1
##$AZFW= 0.5
##$BCFW= 0
##$BC_mod= 2
##$BYTORDP= 0
##$COROFFS= 0
##$CY= -3
##$DATMOD= 1
##$DC= 0
##$DFILT= <>
##$DTYPP= 0
##$F1P= 0
##$F2P= 0
##$FCOR= 1
##$FTSIZE= 65536
##$FT_mod= 6
##$GAMMA= 0
##$GB= 0
##$INTBC= 1
##$INTSCL= 6.047779e-11
##$ISEN= 30
##$LB= 5
##$LEV0= 0
##$LPBIN= 0
##$MAXI= 10000
##$MC2= 0
##$MEAN= 0
##$ME_mod= 0
##$MI= 50
##$NCOEF= 0
##$NC_proc= -7
##$NLEV= 6
##$NOISF1= 182.463
##$NOISF2= 159.3651
##$NSP= 0
##$NTH_PI= 0
##$NZP= 0
##$OFFSET= 248.5645
##$PC= 4
##$PHC0= -10725.31
##$PHC1= 248.0864
##$PH_mod= 1
##$PKNL= yes
##$PPARMOD= 0
##$PSCAL= 0
##$PSIGN= 0
##$REVERSE= no
##$SF= 81.0140089999694
##$SI= 65536
##$SIGF1= 159.3651
##$SIGF2= -187.1042
##$SINO= 113.3802
##$SIOLD= 16384
##$SREGLST= <1H.CDCl3>
##$SSB= 0
##$STSI= 65536
##$STSR= 0
##$SW_p= 40650.406504065
##$SYMM= 0
##$S_DEV= 0
##$TDeff= 32768
##$TDoff= 0
##$TI= <>
##$TILT= no
##$TM1= 0
##$TM2= 0
##$TOPLEV= 0
##$USERP1= <user>
##$USERP2= <user>
##$USERP3= <user>
##$USERP4= <user>
##$USERP5= <user>
##$WDW= 1
##$XDIM= 65536
##$YMAX_p= 313136744
##$YMIN_p= -19291513
$$ End of Bruker specific parameters
$$ ---------------------------------
##NTUPLES= NMR SPECTRUM
##VAR_NAME=  FREQUENCY,     SPECTRUM/REAL,   SPECTRUM/IMAG
##SYMBOL=    X,             R,               I
##VAR_TYPE=  INDEPENDENT,   DEPENDENT,       DEPENDENT
##VAR_FORM=  AFFN,          ASDF,            ASDF
##VAR_DIM=   65536,         65536,           65536
##UNITS=     HZ,            ARBITRARY UNITS, ARBITRARY UNITS
##FACTOR=    0.620285442955139, 1,           1
##FIRST=     20137.2065510682, 0,            0
##LAST=      -20513.1999529968, 0,           0
##MIN=       -20513.1999529968, -19291513,   0
##MAX=       20137.2065510682, 313136744,    0
$$ Real data points
##PAGE= N=1
##DATA TABLE= (X++(R..R)), XYDATA
$$ [...]
38033a95296k7186j9857l7038k4779r51k4656j06794j90080k22918k15675k04496
38022a269726j89912j43519n8875M1415J47309K72468M08728M98138M79545L56533
38012E42104J99039Q0643L0169L7591P8107J20114J32942J07596O0265J481q3472
38001A306579k01338l10919l52048l20499k83152l01487l61629l99252l75196
37992a598941l02831k15085j35762q1502o1541o4185o1782m0048j0138J6038M8440
37981b507337J03587J72768K17206J97142J07210r332q1517o0647L8583J51464
37971a670873K24757K59314K87152L19480L34222L10191K53882J88067J29649
37962F35841Q7897P1938Q5036J15417J45419J68968J88356J93956J63455R0737
$$ y = [-195296, -222482, -242339, -279377, -304156, -305107, -329763, -436557, -626637, -849555, -1065230, -1269726, -1459638, -1603157, -1662032, -1620617, -1473308, -1200840, -792112, -293974, 185571, 542104, 741143, 821786, 851955, 889546, 967653, 1087767, 1220709, 1328305, 1388570, 1390051, 1306579, 1105241, 794322, 442274, 121775, -161377, -462864, -824493, -1223745, -1598941, -1901772, -2116857, -2252619, -2334121, -2395662, -2459847, -2521629, -2561677, -2571815, -2555777, -2507337, -2403750, -2230982, -2013776, -1816634, -1709424, -1718756, -1800273, -1860920, -1822337, -1670873, -1446116, -1186802, -899650, -580170, -245948, 64243, 318125, 506192, 635841, 723738, 795676, 880712, 996129, 1141548, 1310516, 1498872, 1692828, 1856283, 1947020]
37952A947020M070n9283r2109j16582j46624j69120j68649j53020j37784j14824
37942G93095n8054L5287J24683J59779J30458P5580M0856L2546J6795l5166j06577
37931A209282j47295j26841o6598j3718Q629J4311K2560K8487R213n0351j42309
37920G45370k38062l01280l07874k61673j85999r5303J4897J38768K31320K33127
37910b6709J30950k3412j66124k76944l63169m03226l45408j76740L5211J96043
37900a419528K66068K63148K01735P7625p6213j68025j25170K2478J73980K63997
37890e19905L01212L05783K61479J56212L3685l5892k4550M3330J35413K27552
37880H84319K79597K42181J09941n9892k05131l14024m00089m45147m08266k89803
$$ y = [1947020, 1951090, 1891807, 1799698, 1683116, 1536492, 1367372, 1198723, 1045703, 907919, 793095, 735041, 770328, 895011, 1054790, 1185248, 1260828, 1301684, 1334230, 1351025, 1315859, 1209282, 1061987, 935146, 868548, 854830, 863459, 877770, 900330, 928817, 938030, 887679, 745370, 507308, 206028, -101846, -363519, -549518, -644821, -629924, -491156, -259836, -26709, 104241, 80829, -85295, -362239, -725408, -1128634, -1474042, -1650782, -1615571, -1419528, -1153460, -890312, -688577, -610952, -687165, -855190, -980360, -957882, -783902, -519905, -218693, 87090, 348569, 504781, 538466, 502574, 478024, 521354, 656767, 884319, 1163916, 1406097, 1516038, 1456146, 1251015, 936991, 536902, 91755, -316511, -606314]
37870f06314j50092n2425j1208o533k3073n3425q0758q4409n9071j2223N1434
37859a088097J26477J93991K32107K38162K23884J92120J40286Q7332O9473R5378
37849E11113J25366J13145N6924n728m2389m7509k9756k360J1867j1764p3128
37838F05781j37082j62287j39923r8003o7300m8494j6413M5879J23927J85551
37828B91636K11852K08481J91416J72519J56491J36655R0192m200j29290k20864
37818A104888k17264j21601l973O3190O6677M7263M0194L1933j6341j06029j80075
37807G08862j81197j24373q8342j29290k22657l00249l24381l06462k68629k15803
37797a452521j45951o5762J1860P6116J22332J56103J91743K35541K70645K68677
$$ y = [-606314, -756406, -808831, -820039, -826572, -849645, -903070, -983828, -1068237, -1127308, -1139531, -1088097, -961620, -767629, -535522, -297360, -73476, 118644, 258930, 346262, 415735, 511113, 636479, 749624, 806548, 800820, 758431, 710922, 681166, 678806, 690673, 678909, 605781, 468699, 306412, 166489, 68486, 1186, -47308, -63721, -17842, 106085, 291636, 503488, 711969, 903385, 1075904, 1232395, 1369050, 1459242, 1455042, 1325752, 1104888, 887624, 766023, 762050, 825240, 891917, 939180, 979374, 1011307, 994966, 888937, 708862, 527665, 403292, 314950, 185660, -36997, -337246, -661627, -968089, -1236718, -1452521, -1598472, -1664234, -1652374, -1576258, -1453926, -1297823, -1106080, -870539, -599894, -331217]
37787c31217K17549J31962M0977k6499n2937m7061m6290q6120j60204k19437k12958
37776g92235j26072J1388J35854J75695R7260n8098j95008k35185j68899m5209
37766a200509O9052J22035R9677L6970o349J75L1882M5222K9237Q770N825J5306
37754g42707J9979J7731K7365O5588J16996J33842P9407k7116j22000j55539j26992
37743g13446o5349k359K9327O560m9338p2971k4808N2284Q0714M4058j658r620
37731g26606P800K0927L2107N6387Q2547Q6882P1040N5638M3068J3596m2763j11340
37719d10717j67293j84436j35356j4818J27270K05204J73713P3733j4940n6234
37709d03874p4997j02628j34373j45119j22949p2817k967P5190J43032J87449
$$ y = [-331217, -113668, 18294, 59271, 32772, -20165, -67226, -113516, -199636, -359840, -579277, -792235, -918307, -906919, -771065, -595370, -498110, -556208, -751216, -986401, -1155300, -1200509, -1131457, -1009422, -909745, -872775, -879124, -878949, -847067, -801845, -772608, -763838, -758013, -742707, -722728, -704997, -677632, -612044, -495048, -361206, -281799, -308915, -430915, -586454, -713446, -778795, -781154, -751827, -745267, -794605, -867576, -892384, -840100, -759386, -715328, -716986, -726606, -718806, -697879, -665772, -609385, -526838, -439956, -368916, -313278, -270210, -256614, -299377, -410717, -578010, -762446, -897802, -912620, -785350, -580146, -406433, -332700, -347640, -403874, -478871, -581499, -715872, -860991, -983940, -1056757, -1059724, -984534, -841502, -654053]
37699f54053K11744K17264J81815Q3545m9410j43158j53126j17132j07835j42484
37689f72830j69162j40741o9512K080N3870Q7620R7701P7710N1562O4189J30632
37678d86881K14541K66688K68677K31617J72454J07444N1994M776n8747j53230
37668F19333k46666k80494k30449j27238j1820J04969K22323L11229L27195K60372
37658I48754J50568M7527k7612p7145j02658j00631p2228k3317L9371R9316J25273
37647A007218R7136L9893J0259L6741Q8518J19417J26875J40916J62051J46001
37637A975025O3014n4473j44322j77419j66265j27061o5109L804M8021M7696J0405
37626A413316m9068j27684k20460k99448l21625k58680j17707O1618K30136L60298
$$ y = [-654053, -442309, -225045, -43230, 40315, -9095, -152253, -305379, -422511, -530346, -672830, -841992, -982733, -1052245, -1050165, -996295, -908675, -810974, -733264, -681702, -617513, -486881, -272340, -5652, 263025, 494642, 667096, 774540, 826534, 831310, 772563, 619333, 372667, 92173, -138276, -265514, -277334, -172365, 49958, 361187, 688382, 948754, 1099322, 1146849, 1119237, 1042092, 939434, 838803, 766575, 743258, 782629, 881945, 1007218, 1104354, 1144247, 1154506, 1191247, 1279765, 1399182, 1526057, 1666973, 1829024, 1975025, 2038039, 1983566, 1839244, 1661825, 1495560, 1368499, 1303390, 1307194, 1355215, 1402911, 1413316, 1364248, 1236564, 1016104, 716656, 395031, 136351, 18644, 80262, 310398, 670696]
37616F70696M59053N43509O04618O07392N29920L90544K33846J01624J6394k7641
37606D129955o4184j24319j92850k11761j41643o637J31295K22575K40603J71582
37596D154616K9757j27946k39012k91616l21540l54322l75642l60769l06950k28832
37586A577744j44681p7447m8529n4425o2217m3568p602J0524r134m8290o8082
37575A024293m7796m723L0186N6440J05897J85154K32683J66209k2245k40940
37565A485158l75668l78571k83017j57573n6307O262M8035Q2312Q9876M6236k6527
37554D80216o8603n5056k5877k0503j4163M2628J40378K12608K21595K01093J99335
37543A313651K09435J78931P4963p7962k19096k97229k97536k34453j27840N493
$$ y = [670696, 1129749, 1673258, 2277876, 2885268, 3415188, 3805732, 4039578, 4141202, 4157596, 4129955, 4065771, 3941452, 3748602, 3536841, 3395198, 3388561, 3519856, 3742431, 3983034, 4154616, 4184373, 4056427, 3817415, 3525799, 3204259, 2849937, 2474295, 2113526, 1806576, 1577744, 1433063, 1355616, 1307087, 1252662, 1190445, 1146877, 1139275, 1149799, 1140665, 1092375, 1024293, 976497, 971774, 1001960, 1058400, 1164297, 1349451, 1582134, 1748343, 1726098, 1485158, 1109490, 730919, 447902, 290329, 234022, 240284, 288319, 370631, 460507, 506743, 480216, 411613, 356557, 330680, 310177, 296014, 338642, 479020, 691628, 913223, 1114316, 1313651, 1523086, 1702017, 1776980, 1699018, 1479922, 1182693, 885157, 650704, 522864, 528357]
37533E28357J35235K08479J79989N7216r6272k07674k40475k00218j17544l5095
37523B11998Q229L778j5398k515O1608J61756K77454M01371N22565O07326O16167
37512B854339N41977M19488K90902J69006M1085r7056k24903l19089l80490m28342
37502B866917m71199m97145m94841m68856m22446l37211j92640q660J50659K27584
37492C52162K16297J54343Q5325L9020K4746J8683k7515j32048k40020k68768
37482B22225k00658r9029k5128K3191P2501J13024J12485O7597N507n3285j01795
37471A36635j27978j21768r3102n3490R335J03281J87989K03382J44835O9241
37461D58360K0075j1307l8627m1640j85O8993J38679K03959K57933K64636J97383
$$ y = [528357, 663592, 872071, 1052060, 1109276, 1013004, 805330, 564855, 364637, 247093, 211998, 220227, 224005, 208607, 206092, 267700, 429456, 706910, 1108281, 1630846, 2238172, 2854339, 3396316, 3815804, 4106706, 4275712, 4316797, 4219741, 3994838, 3675749, 3295259, 2866917, 2395718, 1898573, 1403732, 934876, 512430, 175219, -17421, -26081, 124578, 352162, 568459, 722802, 808127, 847147, 871893, 890576, 863061, 731013, 490993, 222225, 21567, -77462, -102590, -79399, -6898, 106126, 218611, 286208, 291715, 238430, 136635, 8657, -113111, -206213, -259703, -250368, -147087, 40902, 244284, 389119, 458360, 478435, 467128, 428501, 386861, 386676, 455669, 594348, 798307, 1056240, 1320876, 1518259]
37450A518259Q7900k317n1439q3647j15170j34989j40177j48270j59874j43725
37440F26551q2734j1408J9352J093l4043o4049r3329j14693r0351J703J18437
37429B76529J83451J72240J37949J38402J61304J47445P5407p843m2843j8513
37419A223528L3284Q6203J45734K28274L20080L63980L02749J46806j7074j08148
37409B725416j35263j72215k55576l42478l75826l53261l09476k58602j85164
37400C37555q0020M1290J53482K37246K81179K80966K40748J76216J19680J10712
37390A899054J57595K06011J74902M1439j24616k24261k15182j30257l3432K9478
37380A780731N6321Q1980J32519J77922J54239M6277p8915j41816j29124q1632
$$ y = [1518259, 1606159, 1603842, 1552403, 1468756, 1353586, 1218597, 1078420, 930150, 770276, 626551, 543817, 532409, 551761, 552854, 518811, 454762, 361433, 246740, 156389, 158092, 276529, 459980, 632220, 770169, 908571, 1069875, 1217320, 1292727, 1284884, 1242041, 1223528, 1256812, 1343015, 1488749, 1717023, 2037103, 2401083, 2703832, 2850638, 2833564, 2725416, 2590153, 2417938, 2162362, 1819884, 1444058, 1090797, 781321, 522719, 337555, 257535, 298825, 452307, 689553, 970732, 1251698, 1492446, 1668662, 1788342, 1899054, 2056649, 2262660, 2437562, 2479001, 2354385, 2130124, 1914942, 1784685, 1751253, 1780731, 1837052, 1919032, 2051551, 2229473, 2383712, 2429989, 2351074, 2209258, 2080134, 1998502]
37370A998502l4465l121k102l1208n4462l6511K937J0268k8648p7846j16921j70811
37358A455612k55786l34474l54317l09209k37294j72158j19175o9969j7113M3675
37348c70208J08362J59732J80253J73258J61886J60781J54827J16865M8431r494
37338H84693j9452M740J2416j9397n7442n9460l0632j4346l9471r5835j51283
37327D14531j72150j36747n5921K0862M5918K5265J0206L3432P6416J07850J27085
37316D96747J47698J57521J29367P1550L4612M8505P4208M9116k3594o7172k9812
37305A088746L7707L5879o3661j86814k44616k17036j39718m2276P1706J95609
37295E35526K95442L22206K52845J26040K5542L702K5995J9967k5969n3716k9111
$$ y = [1998502, 1964037, 1960916, 1958814, 1927606, 1873144, 1836633, 1839570, 1849838, 1821190, 1743344, 1626423, 1455612, 1199826, 865352, 511035, 201826, -35468, -207626, -326801, -396770, -413883, -370208, -261846, -102114, 78139, 251397, 413283, 574064, 728891, 845756, 894187, 884693, 865241, 869981, 882397, 863000, 805558, 746098, 715466, 701120, 661649, 565814, 414531, 242381, 105634, 49713, 70575, 116493, 141758, 151964, 185396, 261812, 369662, 496747, 644445, 801966, 931333, 1002883, 1037495, 1086000, 1160208, 1209324, 1185730, 1118558, 1088746, 1126453, 1162332, 1098671, 911857, 667241, 450205, 310487, 268211, 339917, 535526, 830968, 1153174, 1406019, 1532059, 1557601, 1561303, 1587298, 1607265, 1581296, 1527580, 1498469]
37284A498469Q108J1874l11J6058O1196R8062J03423P0222j4411j42469k51405
37273A458816k70183j99191j04199l3741J7069O3109R6709J11295J22559J49302
37263A411545J92568K39439K69814K62379K17039J67060J42012J22881O4856l6556
37253C053037j35854j97401k31200k59329k77863k69657k36087k01725j96191
37244A047730k31705k82944k90274k03313k7358J81090L56645M52801M53700L95665
37234A852037L64622M23265N29500N61385M37595J92028p2121k70298l72669l92389
37224C252955l65655l26421k80486k11816j21069m2758j3292l1647n9511n5153
37214A745147o962N7938R8277R7115P2367N0546N0074R6255K16050L85098N07025
$$ y = [1498469, 1506577, 1518451, 1518140, 1534198, 1595394, 1693456, 1796879, 1867101, 1852690, 1710221, 1458816, 1188633, 989442, 885243, 851502, 868571, 931680, 1028389, 1139684, 1262243, 1411545, 1604113, 1843552, 2113366, 2375745, 2592784, 2759844, 2901856, 3024737, 3089593, 3053037, 2917183, 2719782, 2488582, 2229253, 1951390, 1681733, 1445646, 1243921, 1047730, 816025, 533081, 242807, 39494, 12136, 193226, 549871, 1002672, 1456372, 1852037, 2216659, 2639924, 3169424, 3730809, 4168404, 4360432, 4288311, 4018013, 3645344, 3252955, 2887300, 2560879, 2280393, 2068577, 1947508, 1904750, 1891458, 1859811, 1800300, 1745147, 1738185, 1796123, 1894400, 1991515, 2063882, 2114428, 2164502, 2260757, 2476807, 2861905, 3368930]
37203C368930M95091L72206K51588K17128K55531L04000L24277L19444L11678
37194F219873L22338L55511L86701L74458K86917J18980r7605k89733l76686l39511
37184F961243k42230j59289j02652m8293l291J906l0695p1081j13028j71046k29200
37173E792344k43632k02256j41753j00173q5067q5397q0512m3315K9459R7051
37163D936749J19684J12968J21747J54920J84991J93998J79348J38234R2741J01026
37153F336406J87724K92637L50123L84682M51321N13984M79983L44656K08127
37144I549643J48049J61036K28440L49328M99825O42490P85681R61385J147677
37135A4473554J289726J388350J488164J596724J702884J847442K075155K349860
$$ y = [3368930, 3864021, 4236227, 4487815, 4704943, 4960474, 5264474, 5588751, 5908195, 6219873, 6542211, 6897722, 7284423, 7658881, 7945798, 8064778, 7967173, 7677440, 7300754, 6961243, 6719013, 6559724, 6457072, 6408779, 6405488, 6407394, 6376699, 6305618, 6192590, 6021544, 5792344, 5548712, 5346456, 5204703, 5104530, 5019463, 4934066, 4853554, 4810239, 4839698, 4936749, 5056433, 5169401, 5291148, 5446068, 5631059, 5825057, 6004405, 6142639, 6235380, 6336406, 6524130, 6816767, 7166890, 7551572, 8002893, 8516877, 8996860, 9341516, 9549643, 9697692, 9858728, 10087168, 10436496, 10936321, 11578811, 12364492, 13325877, 14473554, 15763280, 17151630, 18639794, 20236518, 21939402, 23786844, 25861999, 28211859]
37127B8211859K629487K982547L496914M119732M744051N408122O231995P208460
37119F5033167Q263347R462481J0903762J2461999J3962953J5592056J7772283
37112A53452048K0626451K3888625K7109728K9109268K7185247J8294241K372052
37105C02037660j5850163k9610563l5149435l3721297k9056858k3949971j9427165
37098A15272208j5807116j3264628j1570372j0183839q813347p548169o472818
37091D1611919n505390m614422l885573l333240k865885k450349k123889j850031
37083A4983140j538845j204807r47474p87761o69605o00879o37739p38883p83688
37074G073459p38149o72072o12357n08307l50909k07473j22147q1584q3611j38563
$$ y = [28211859, 30841346, 33823893, 37320807, 41440539, 46184590, 51592712, 57824707, 65033167, 73296514, 82758995, 93662757, 106124756, 120087709, 135679765, 153452048, 174078499, 197967124, 225076852, 254186120, 281371367, 299665608, 302037660, 286187497, 256576934, 221427499, 187706202, 158649344, 134699373, 115272208, 99465092, 86200464, 74630092, 64446253, 55632906, 48084737, 41611919, 36106529, 31492107, 27606534, 24273294, 21407409, 18957060, 16833171, 14983140, 13444295, 12239488, 11292014, 10504253, 9834648, 9233769, 8596030, 7857147, 7073459, 6335310, 5663238, 5050881, 4542574, 4191665, 3984192, 3862045, 3780461, 3696850, 3558287]
37064C558287j95359j66589m5851Q0812J49884J70784J59176J01085l249j24360
37054C684620k38364l23650l37013k58134j43448o9193m0151k4651m6186j40340
37044B063490k36855k01703j8750J65591K10127J16014k4297j32901j67350j12301
37034A661065l794Q1555J00696P9659O2443O7920J10087K04516L19767L61226
37024C045140K43715k8228l61046o34122p62759p35810o10157m57181l13660j89145
37014h03253r1757j5144P3160J84977K72030K82463K40376K12007K01648J44903
37004G01410J2614j34497k10922j85699q8889K1386Q9624R4003N3958r831j01079
36993B42078k01006k33097j40248K0800J33223J62229J74144K19017K73651L08170
$$ y = [3558287, 3362928, 3196339, 3150488, 3231300, 3381184, 3551968, 3711144, 3812229, 3808980, 3684620, 3446256, 3122606, 2785593, 2527459, 2384011, 2314818, 2274667, 2250016, 2203830, 2063490, 1826635, 1624932, 1606182, 1771773, 1981900, 2097914, 2073617, 1940716, 1773366, 1661065, 1657271, 1738826, 1839522, 1919181, 1981624, 2049544, 2159631, 2364147, 2683914, 3045140, 3288855, 3260627, 2899581, 2265459, 1502700, 766890, 156733, -300448, -614108, -803253, -895010, -910154, -836994, -652017, -379987, -97524, 142852, 354859, 556507, 701410, 714024, 579527, 368605, 182906, 94017, 115403, 205027, 299030, 352988, 343157, 242078, 41072, -192025, -332273, -311473, -178250, -16021, 158123, 377140, 650791, 958961]
36983I58961L26160L18280K56505J65937J26775J64829K08528J98394J70425J74400
36973C069194J71581Q7794o8114k09044k74729k75153k42746j94265j38263q1885
36963A844370k9584M821R49k9719l1660L4284J33461J91979J76320J11614L7526
36952B444361k0914m9736m6766k4229R999O4220J36517J92621J96858J51863P9584
36941C134378k2743j71162l44151m80242n34368n11800m41522l41430k20416r5831
36931b9287M757N2435K7134o4481j73645k27532j82076o1317O0973J22738J18739
36920c51562Q9112P2211P7554J01071J44844K03500K42920K21880J43172O4512
36910A009214M5390Q9553J43431J41106N0287j06497k62425l48233l39257k64620
$$ y = [958961, 1285121, 1603401, 1859906, 2025843, 2152618, 2317447, 2525975, 2724369, 2894794, 3069194, 3240775, 3328569, 3260455, 3051411, 2776682, 2501529, 2258783, 2064518, 1926255, 1844370, 1814786, 1819607, 1820556, 1790837, 1759177, 1793461, 1926922, 2118901, 2295221, 2406835, 2444361, 2423447, 2373711, 2326945, 2302716, 2312715, 2376935, 2513452, 2706073, 2902931, 3054794, 3134378, 3111635, 2940473, 2596322, 2116080, 1581712, 1069912, 628390, 286960, 66544, -29287, -24530, 27905, 55039, -9442, -183087, -410619, -592695, -654012, -593039, -470301, -351562, -262450, -190239, -112685, -11614, 133230, 336730, 579650, 801530, 944702, 1009214, 1054604, 1144157, 1287588, 1428694, 1478981, 1372484, 1110059, 761826, 422569, 157949]
36900A57949j72008r1597l2933J387J3084J3809K2159N1487R8291J38828J41415
36889C41871R2409J1744o3120j08298j26051j34965j55817j95568k29965k12508
36879g80268j23522p680N8559L8484l9754j20469j58510j29116l9818N6174R1644
36868a154276N2141p501k8347r693R057O736l962o193L049K3270N7189J00667
36856i57863J37267J49240J30926R1457M9394K6376M0020R1356J49500J54693
36846F2366N9327j17634k85192l45993k72663j22801P142M1217l1451j42015j84696
36835a332393j05157N0858J87526K43730K15276J25866J9665l5418M300R6755
36825e28992J44463J01995J9511l2651m6962o8973j35764k42759l45147l75466
$$ y = [157949, -14059, -105656, -138589, -137202, -124118, -110309, -88150, -36663, 61628, 200456, 341871, 434280, 446024, 382904, 274606, 148555, 13590, -142227, -337795, -567760, -780268, -903790, -911470, -852911, -814427, -854181, -974650, -1133160, -1262276, -1302094, -1245920, -1154276, -1102135, -1109636, -1137983, -1147676, -1138619, -1131883, -1135845, -1142038, -1138989, -1115719, -1058530, -957863, -820596, -671356, -540430, -448973, -399579, -373203, -333183, -241827, -92327, 62366, 121693, 4059, -281133, -627126, -899789, -1022590, -1015448, -974231, -1005682, -1147697, -1332393, -1437550, -1386692, -1199166, -955436, -740160, -614294, -594629, -630047, -625747, -528992, -384529, -282534, -263023, -295674, -342636, -411609, -547373, -790132, -1135279, -1510745]
36815a510745k88192j10324O9932J80738K17033K10215J81878J45241J17618R9470
36805f87136O2481j0427q7762j22619j15970j18561j66553k32720k49051j75618
36795a903936m6241O0837J05582J25945J74400K32106K29339J50601O9557O2038
36785g39772J25893K06479K56715K44198J47962j598j09090r4222K1906J44659
36775B03130K05123J99688J54457R7414N5068K9450k0291j31596k71432l53312
36765A67699l25456k09336n2866J08962K34476K63885J67411o487j54538j91091
36755B659r9348O6369K13669K63432J95730N8586o7970j23789j01992m5304n513
36744C56529L542R592L4767N9199M5252j5522r8452j76250k29041k33541j75103
$$ y = [-1510745, -1798937, -1909261, -1839329, -1658591, -1441558, -1231343, -1049465, -904224, -786606, -687136, -624655, -635082, -722844, -845463, -961433, -1079994, -1246547, -1479267, -1728318, -1903936, -1950177, -1889340, -1783758, -1657813, -1483413, -1251307, -1021968, -871367, -801810, -739772, -613879, -407400, -150685, 93513, 241475, 239877, 130787, 36565, 58471, 203130, 408253, 607941, 762398, 859812, 914880, 944330, 924039, 792443, 521011, 167699, -157757, -367093, -419959, -310997, -76521, 187364, 354775, 348288, 193750, 2659, -96689, -30320, 183349, 446781, 642511, 701097, 633127, 509338, 407346, 362042, 356529, 360071, 369663, 404430, 463629, 508881, 493359, 394907, 218657, -10384, -243925, -419028]
36733d19028p5220J8659P9017J15166J40599J47726J27613R4685P1708N7832K9709
36722C88466k2823p1519o7997R176J26891K22169K55065K30242J68834P9052l2937
36711A284619j39242j99867j95648j42174p7165m0394m9112p5589o2842J4052
36701C16638J09668J51872J15277L0213o6965j57418k18403k21059j65870r3525
36691a99572m3970k1778j0076L786K8045O8575J12558J25900Q5754P497p0292
36680H6427j14869j05381l3730P5096J54755J39270K0744j45602k93654l92683
36670f09627m45596m61060m38986l77723k85276j78487p1062L4023J35735K21699
36660b476360K73471K87147K78317K60708K29399J73437R6648J5539n6106j08519
$$ y = [-419028, -494248, -475589, -396572, -281406, -140807, 6919, 134532, 229217, 300925, 358757, 388466, 365643, 294124, 226127, 235303, 362194, 584363, 839428, 1069670, 1238504, 1317556, 1284619, 1145377, 945510, 749862, 607688, 530523, 490129, 441017, 365428, 302586, 316638, 426306, 578178, 693455, 723668, 656703, 499285, 280882, 59823, -106047, -199572, -243542, -265320, -275396, -271610, -243565, -174990, -62432, 63468, 149222, 156719, 86427, -28442, -133823, -167553, -92457, 62298, 201568, 222312, 76710, -216944, -609627, -1055223, -1516283, -1955269, -2332992, -2618268, -2796755, -2867817, -2833794, -2698059, -2476360, -2202889, -1915742, -1637425, -1376717, -1147318, -973881, -877233, -861694, -917800, -1026319]
36650a026319j30826j25195j23981j65892k41543k82579k27615r2541M2363J09046
36640b265082R6519K9767n8494j23880j14973j6459J24984K46677L34751M15642
36630a330548M89827N11591M45348L13190J70253N4172k5711p1149r1245j04396
36620C61332j21189j28739j08011o3452k1612k350k386n288J421J7605L2986M0541
36608H58M8320O9565R9867J17230J08211P7613K8258m4307j22925j60601j27709
36597I4380n2039J4537N6676R4027J29883J38546J08012O4863M5962O5275J14018
36586H74140J70833K02069J72722P4605o1705j87923k64710k72649k17362j29472
36576C60548m3039L1902R9832J40468J06721j6335j64333k31655j62740l61J51199
$$ y = [-1026319, -1157145, -1282340, -1406321, -1572213, -1813756, -2096335, -2323950, -2416491, -2374128, -2265082, -2168563, -2138796, -2197290, -2321170, -2436143, -2452602, -2327618, -2080941, -1746190, -1330548, -840721, -329130, 116218, 429408, 599661, 653833, 628122, 556973, 465728, 361332, 240143, 111404, 3393, -60059, -81671, -84021, -86407, -91695, -90274, -72669, -39683, 858, 49178, 118743, 218610, 335840, 444051, 521664, 549922, 505615, 382690, 222089, 94380, 42341, 56878, 113554, 207581, 337464, 476010, 584022, 648885, 694847, 760122, 874140, 1044973, 1247042, 1419764, 1494369, 1432664, 1244741, 980031, 707382, 490020, 360548, 317509, 349411, 449243, 589711, 696432, 680097, 515764, 284109, 121369, 121008, 272207]
36565B72207K03980J40731J5969q9606j29349j20545j18722j61029k33384k88580
36555e08328k87740k20469r5885O5560K25581L34869L71995L71921L89133M24303
36545A070940M11511K96535J11891m7927j18828j16241r9352j09845j48300j90870
36535A059514k18219k34268k58530k94041l07641k57711j44946k2573N1777O6223
36525e60415N0008K8340r88m0924o2400k5381N9753J18169Q7118l446o1721m8089
36513d59976k0532m9224j19338j48702q2494N8141K07353L05923L30260K97357
36503C18768K41277J74572Q5614j8403r8119j37806j81888k73185l77620m19554
36493f86344l76982k89018j81647n2584O7103J11452P1867L3372P5383J74558
$$ y = [272207, 476187, 616918, 632887, 543281, 413932, 293387, 174665, 13636, -219748, -508328, -796068, -1016537, -1112422, -1046862, -821281, -486412, -114417, 257504, 646637, 1070940, 1482451, 1778986, 1890877, 1842950, 1724122, 1607881, 1508529, 1398684, 1250384, 1059514, 841295, 607027, 348497, 54456, -253185, -510896, -655842, -678415, -626638, -560415, -510407, -482067, -483055, -523979, -586379, -611760, -552007, -433838, -346720, -350166, -411887, -459976, -480508, -529732, -649070, -797772, -880266, -822125, -614772, -308849, 21411, 318768, 560045, 734617, 820231, 801828, 703709, 565903, 384015, 110830, -266790, -686344, -1063326, -1352344, -1533991, -1586575, -1519472, -1408020, -1336153, -1302781, -1227398, -1052840]
36483a052840K47208K58536K48475K67974L25554L84939L89525L04903J63288
36474A537562M9968J9326L7733L2483k0229q2042j08080q3587j8887N6102R6353
36463A516702P3167M952o2994j06570j34265j61853j99149k51363l06170l27140
36453D5317k88445k10544j33470o3626J8564J05159J59079J70139J67824J64977
36443A34974J34172O4958J579j6316k0737p4834j77708k56560k55158j88357r8294
36432g52281K946J17923K15722K40056J72756O8110Q973L0416R1202J18708P8615
36421C93146J212n5158o0249l1866q454j0490k8161l9150l3474k1034j4812o970
36409H4540L1228J14870K10607K50034J89244N2658q7498j69895j77838j29005
$$ y = [-1052840, -805632, -547096, -298621, -30647, 294907, 679846, 1069371, 1374274, 1537562, 1587530, 1606856, 1644589, 1677072, 1656843, 1574801, 1466721, 1383134, 1364247, 1420349, 1516702, 1589869, 1594821, 1531827, 1425257, 1290992, 1129139, 929990, 678627, 372457, 45317, -243128, -453672, -587142, -650768, -632204, -527045, -367966, -197827, -30003, 134974, 269146, 334104, 335683, 319367, 298630, 223796, 46088, -210472, -465630, -653987, -752281, -749335, -631412, -415690, -175634, -2878, 65232, 74205, 104621, 195823, 314531, 393146, 394358, 339200, 278951, 247085, 238631, 228141, 199980, 160830, 127356, 106322, 91510, 84540, 115768, 230638, 441245, 691279, 880523, 933181, 845683, 675788, 497950, 368945]
36399C68945n4644R332L3742J7086j0588j8041p484j2036n8532j36703k03708
36388g2631k16005j59007n0401Q1131K12990L21666L74120L49882K72334J93314
36378A307393J37024Q1307O996o0812q5663p2484n3720l5596K591N6901Q5952
36367A369889O0933j024o3877j04886j09245o6239O152N9239O5905O0082R6418
36356A373347J77797K44396K28666J05709r6007l07307m48786m78358m15873l09553
36346G4031j87493o3074K5837K6268o8235j95527k83137l08528k87538k30423
36336a497819j39780l7200M4631R8970J45856J88646J96743J49202P6355L3205
36326g41191L7101N3255M1474l611o3272j21931j65655j68006j05487P166J15452
$$ y = [368945, 314301, 323633, 357375, 374461, 363873, 345832, 338348, 326312, 267780, 131077, -72631, -288636, -447643, -498044, -416913, -203923, 117743, 491863, 841745, 1114079, 1307393, 1444417, 1525724, 1532720, 1471908, 1386245, 1313761, 1260041, 1224445, 1227036, 1283937, 1369889, 1430822, 1429798, 1365921, 1261035, 1151790, 1085551, 1091703, 1150942, 1216847, 1276929, 1373347, 1551144, 1795540, 2024206, 2129915, 2033908, 1726601, 1277815, 799457, 383584, 74031, -113462, -176536, -150699, -124431, -192666, -388193, -671330, -979858, -1267396, -1497819, -1637599, -1674799, -1630168, -1531198, -1385342, -1196696, -999953, -850751, -774396, -741191, -704090, -650835, -609361, -612972, -676244, -798175, -963830, -1131836, -1237323, -1230157, -1114705]
36315a114705J71852J77427J68178J68046J70693J67010J70479J99052K39401
36306E17433K48903J97824R5459l1384j67657l01489m01675m33521l99154l35886
36296a011147k64531j62607p842J66925K85908K96527K11421R0783k147l2901
36286d29611n166M9208R4577J14527J16258J14992J11501Q2422L273j06206j74099
36275b8324j46240o3223k5464o4141q9669n060J62705K93928L20027K80800K42374
36264H77713K17242J83199J32587P0460n579q9948j49086j46906q9619l0580k9871
36253I39612j10056k41144l63008m28752m28012l67765k49194q4070Q3433K09271
36243a039685L02262M06767N27183O08189O04144N33126M42391L50506K47264
$$ y = [-1114705, -942853, -765426, -597248, -429202, -258509, -91499, 78980, 278032, 517433, 766336, 964160, 1059619, 1028235, 860578, 559089, 157414, -276107, -675261, -1011147, -1275678, -1438285, -1446127, -1279202, -993294, -696767, -485346, -394563, -396710, -429611, -434777, -385569, -290992, -176465, -60207, 54785, 166286, 248708, 251981, 145775, -28324, -174564, -237787, -263251, -327392, -417061, -422121, -259416, 34512, 354539, 635339, 877713, 1094955, 1278154, 1410741, 1481201, 1475622, 1385674, 1236588, 1089682, 1000063, 969483, 939612, 829556, 588412, 225404, -203348, -631360, -999125, -1248319, -1332389, -1248956, -1039685, -737423, -330656, 196527, 804716, 1408860, 1941986, 2384377, 2734883, 2982147]
36234B982147J27687L972j00323j57294j61504j61277k28253l72295n16203n78621
36224H38036n50427m64066l31060j59323k529P0408N2518r62m7379q8872j32194
36213h15850j64510j79273j85004j74333j21893l3227L4913K9379l9177j06565
36203a755540j11640l4973R3959K06853K31102J45098N791r1383q9323j1300O6708
36192a344648Q3835M1309j0582k6119J436N3129J09814J52760J60044J27874Q6394
36181e64754O9384P3560P2154O1105N8060N5930J9522n3271j01372o2280N3239
36170c18723J73947K41342K43291J87733Q3256m2420j32652j36719n4268O2425
36160C07212J47156J58830R5734j0784j14431j78880j96015j81048j50261j08896
$$ y = [2982147, 3109834, 3113806, 3013483, 2856189, 2694685, 2533408, 2305155, 1932860, 1416657, 838036, 287609, -176457, -507517, -666840, -669369, -598961, -546443, -547405, -594784, -683656, -815850, -980360, -1159633, -1344637, -1518970, -1640863, -1674090, -1639177, -1609798, -1648975, -1755540, -1867180, -1902153, -1808194, -1601341, -1370239, -1225141, -1219350, -1310733, -1400056, -1411356, -1344648, -1260813, -1219504, -1230086, -1256205, -1254769, -1201640, -1091826, -939066, -779022, -651148, -564754, -495370, -421810, -349656, -288551, -230491, -174561, -155039, -208310, -309682, -371962, -318723, -144776, 96566, 339857, 527590, 610846, 568426, 435774, 299055, 244787, 307212, 454368, 613198, 708932, 698148, 583717, 404837, 208822, 27774, -122487, -231383]
36150b31383o1097j9718M863K0405M5491Q6987J32564J62447J60432J20982O0647
36139D82620J5942Q366J3906o343m2536l5790M2266J37685J66944J04113o534
36128H80639j06523j64994j79149j64936j43722j14325m5645P6002J99319K41926
36118D78592J76023N2450o3937j51700k17449k58577k67007k50287k23628j91354
36108i16874j56877j41403j66938k18949k47029k13158j29970m4722N846J6914
36098b213160K335k1843l9136l7233k5376l6449r2236j67642k06444j75528r1231
36087c103943N490Q0347J12069R5711N4442K8678L7140O1748Q0691R5417J08948
36076b343262J00983N2615j5679n6263l9630K8421J21387K01656K28679J87462
$$ y = [-231383, -292480, -312198, -307335, -286930, -241439, -154452, -21888, 140559, 300991, 421973, 482620, 498562, 506928, 520834, 514491, 471955, 436165, 478431, 616116, 783060, 887173, 880639, 774116, 609122, 429973, 265037, 121315, 6990, -38655, 37347, 236666, 478592, 654615, 707065, 643128, 491428, 273979, 15402, -251605, -501892, -725520, -916874, -1073751, -1215154, -1382092, -1601041, -1848070, -2061228, -2191198, -2235920, -2230074, -2213160, -2210825, -2232668, -2271804, -2309037, -2334413, -2370862, -2463098, -2630740, -2837184, -3012712, -3103943, -3098453, -3018106, -2906037, -2810326, -2755884, -2727206, -2690066, -2628318, -2547627, -2452210, -2343262, -2242279, -2189664, -2205343, -2261606, -2301236, -2272815, -2151428, -1949772, -1721093, -1533631]
36066a533631J08088L6757q427l5779m6225k8414J5720O3825R0813P9094K4445
36055a233734m5348p3749l1888L6496O2798M1462L0474O5196J18494J57924J95157
36044f76718K51025L06763L25048L00375K57823K13076J61539J04954O6604P1185
36034A381674J12374J41952R9907k8771j86518k88450k99558k55927k13807j99267
36024B63609k06877k16494j97741j24904j2005P9886R3535L3267l9929p1176o4755
36013d63584p4887j42312k38531k83727k30920j20144l1389J934M439l126l1687
36002a613934q2044j19560j17233r6709r8254j24853j38372j01168n991J22914
35992b375204K42453L16491L47466L75996M32796M92410M86406L67392J62115
$$ y = [-1533631, -1425543, -1388786, -1397213, -1432992, -1479217, -1507631, -1491911, -1428086, -1337273, -1258179, -1233734, -1279082, -1352831, -1384719, -1348223, -1285425, -1243963, -1213489, -1148293, -1029799, -871875, -676718, -425693, -118930, 206118, 506493, 764316, 977392, 1138931, 1243885, 1310489, 1381674, 1494048, 1636000, 1735907, 1707136, 1520618, 1232168, 932610, 676683, 462876, 263609, 56732, -159762, -357503, -482407, -494412, -414526, -320991, -287724, -327653, -398829, -463584, -538471, -680783, -919314, -1203041, -1433961, -1554105, -1585494, -1583560, -1579121, -1582247, -1613934, -1695978, -1815538, -1932771, -2029480, -2127734, -2252587, -2390959, -2492127, -2498118, -2375204, -2132751, -1816260, -1468794, -1092798, -660002, -167592, 318814, 686206, 848321]
35983H48321l5669j31542j02904q485P5519J17098J21184R0694K8615l7467p5985
35972H89379r4107j20131j45512j32701q8969q0461j47347k44184k91348k55486
35962g10867j59765n0868K0892K7145j117O814P4558J43159J51556J15441Q8682
35951b94370Q4320Q3515R2268J30236J79296K01226K00871K17916K55458K67512
35941A418248K24845J49511P6002J8783j4008j8733k4885q5565k12534l45476
35931A186188m08150l77582k83824j65451m8947M4232J00589J29240J58513K08109
35921E42917K64616K89670K59882J98351J53649J41629J23314N2338o9392j95517
35911A761457k76791k83215k10612r9152k9963o0171j56818k26596k16859j61384
$$ y = [848321, 812652, 681110, 578206, 569721, 645240, 762338, 883522, 974216, 1002831, 965364, 889379, 795272, 675141, 529629, 396928, 307959, 227498, 80151, -164033, -455381, -710867, -870632, -921500, -900608, -873463, -874580, -867766, -793208, -650049, -498493, -383052, -294370, -210050, -126535, -34267, 95969, 275265, 476491, 677362, 895278, 1150736, 1418248, 1643093, 1792604, 1868606, 1887389, 1873381, 1854648, 1829763, 1744198, 1531664, 1186188, 778038, 400456, 116632, -48819, -97766, -53534, 47055, 176295, 334808, 542917, 807533, 1097203, 1357085, 1555436, 1709085, 1850714, 1974028, 2026366, 1956974, 1761457, 1484666, 1201451, 990839, 891687, 861724, 801553, 644735, 418139, 201280, 39896]
35901C9896j24521j31554j64312j95832k08188j89820j32092k7915J23024K94835
35891g16479M26387M56380L78240K48907J38138P5405L9982j2601j08742k20691
35881G04926k75266k21905r3531K0677O2625M5238J2551n962J488L1957N4693
35870C37491K5215o1303j48081j70844j23061n0766M112L5341N7794Q5968J29639
35859A21505J94123K74791L53191M02628M03247L57928K90983K23190J49721N1508
35849B822815p4000k04108l09813l70872l76517l30832k60554k00433j64193j41211
35839C90282j22791j15639j24916j39586j42160j23513q6884n0070m2955q4185
35829f42417j54876k10466k22277j93147j33749m8713M6057J17090J41535J28529
$$ y = [39896, -84625, -216179, -380491, -576323, -784511, -974331, -1106423, -1134338, -1011314, -716479, -290092, 166288, 544528, 793435, 931573, 1006978, 1046960, 1034359, 925617, 704926, 429660, 207755, 114224, 134901, 197526, 242764, 255315, 249353, 250841, 282798, 337491, 362706, 301403, 153322, -17522, -140583, -191349, -187237, -151896, -94102, -8134, 121505, 315628, 590419, 943610, 1346238, 1749485, 2107413, 2398396, 2621586, 2771307, 2822815, 2748815, 2544707, 2234894, 1864022, 1487505, 1156673, 896119, 695686, 531493, 390282, 267491, 151852, 26936, -112650, -254810, -378323, -465207, -515277, -558232, -642417, -797293, -1007759, -1230036, -1423183, -1556932, -1605645, -1559588, -1442498, -1300963, -1172434]
35819a172434J01938P4905M8006J4824l7957j13147j73242j54297l4495J25970
35809a319929K34847K44436J62553J6463j51738k66838k55476j24312K7999J04473
35799a327522J00277Q1604R5203J29575J54794J59844J39580P9231k0233j18573
35789e26220j67849j63001j37141j11539p8718l5443P06J8742K8802L5075K5083
35778a111503O163J9623Q7100J71488K30457K81916L61028M25072L69792J61068
35768A002204r8892k67076k93320k39159j93955j98079k27063k23330j51357l7973
35758i28000M7992O2228K0602l0490n7121m8266j1778K7134M5458N0787O8593
35747g52861R6441J03097Q4529Q2570J23796J72828J77293J34904Q8054P5803
$$ y = [-1172434, -1070496, -995591, -947585, -932761, -970718, -1083865, -1257107, -1411404, -1445899, -1319929, -1085082, -840646, -678093, -661630, -813368, -1080206, -1335682, -1459994, -1431995, -1327522, -1227245, -1145641, -1050438, -920863, -766069, -606225, -466645, -387414, -407647, -526220, -694069, -857070, -994211, -1105750, -1184468, -1219911, -1219205, -1200463, -1171661, -1136586, -1111503, -1105340, -1085717, -998617, -827129, -596672, -314756, 46272, 471344, 841136, 1002204, 903312, 636236, 342916, 103757, -90198, -288277, -515340, -738670, -890027, -928000, -880008, -817780, -797178, -827668, -884789, -933055, -944833, -917699, -872241, -821454, -752861, -656420, -553323, -468794, -386224, -262428, -89600, 87693, 222597, 310651, 386454]
35737C86454J17108K09437L04904L15978J97357J2877j23887j70391j77150k00168
35727H72519k42082k80436l00042k81711k06071r3781o640J8120Q622J2126L5972
35716d63404O0542Q5041J25142J77751K20850K44086K51569K36358J81481R4237
35706A213653J5182k4533m3969r4397k01738l37466m47821n01082m97443m40207
35696a359821l18894j34250P0681K25518K83763K49558J56171L8760o3146j01791
35686i53451n3428M3754J11476J08146P0706O2163Q5627P4998k3743j83976l26093
35675i83821l97515m02605l62983k83414j71848o8521k3614m2302o9731m3658
35665b850012L8984J16343J30054R7251R8787J84356L03029L51220K85687J62832
$$ y = [386454, 503562, 712999, 1017903, 1333881, 1531238, 1544115, 1420228, 1249837, 1072687, 872519, 630437, 350001, 49959, -231752, -437823, -531604, -538244, -520124, -511502, -499376, -463404, -402862, -317821, -192679, -14928, 205922, 450008, 701577, 937935, 1119416, 1213653, 1228835, 1204302, 1160333, 1065936, 864198, 526732, 78911, -422171, -919614, -1359821, -1678715, -1812965, -1742284, -1516766, -1233003, -983445, -827274, -788514, -851660, -953451, -1006879, -963125, -851649, -743503, -672797, -610634, -525007, -450009, -473752, -657728, -983821, -1381336, -1783941, -2146924, -2430338, -2602186, -2670707, -2694321, -2736623, -2806354, -2850012, -2811028, -2694685, -2564631, -2467380, -2368593, -2184237, -1881208, -1529988, -1244301, -1081469]
35655a081469O4607J8254L658N545K3646M7444N8528N8498O6700Q7020J01921
35644e45648J06513J25736J82929K63575L22931L23858K60351J52496L0674p4717
35634A148698j36944j36518o9070M7563J78115K85863L44867L42696K84567J98735
35624B488572J23854P8013M2905j6358j19547k55808l82596m38284l83231k46901
35614H90619j15234m9987l5600k3774n403m602k0876k3184K984M6389J07072J92859
35602I61263K69225K67536J73276O2303J0041k010m5024j33863k12438k38800
35592A111509k32002k27615k33285k47432k84102l47792m01518l88659k83758
35583a534654j07342J01136L04864M63866N29414M66995K94516R0988n0312r0363
$$ y = [-1081469, -1016862, -998608, -994950, -989405, -965759, -918315, -859787, -801289, -734589, -647569, -545648, -439135, -313399, -130470, 133105, 456036, 779894, 1040245, 1192741, 1223415, 1148698, 1011754, 875236, 806166, 853729, 1031844, 1317707, 1662574, 2005270, 2289837, 2488572, 2612426, 2690439, 2733344, 2716986, 2597439, 2341631, 1959035, 1520751, 1137520, 890619, 775385, 725398, 689798, 666024, 660621, 656019, 635143, 611959, 614943, 661332, 768404, 961263, 1230488, 1498024, 1671300, 1733603, 1743644, 1741634, 1696610, 1562747, 1350309, 1111509, 879507, 651892, 418607, 171175, -112927, -460719, -862237, -1250896, -1534654, -1641996, -1540860, -1235996, -772130, -242716, 224279, 518795, 609783, 559471, 469108]
35573D69108o3519k3959J4354O9423J36270J72411J45628P1279j1437p9180j22821
35562G77557j27853q7512k9241K864j516p779J6941O6018J12894J48171J77066
35551A047610J91041J67042R9635J9047l1158l0627K766K6158J3q3043j86551
35540A221933k51480k40960j70059r1244n0890n9876r9082j40557j60445j47302
35530a89962j16755j14408j79765k94485l81726l73982k73136j30358J5299J48063
35520a891215K37225K38029J51600M8888K958J5037L2753K1066j7011p1554j32295
35509a364519j64790j22658K354J69346L34068M76081N72765N84558M93515L36989
35499A317709J80268O6554K959k7239n4502j00377j41970j21325j7997J05272
$$ y = [469108, 405589, 381630, 395984, 465407, 601677, 774088, 919716, 990995, 979558, 900378, 777557, 649704, 562192, 532951, 535815, 534299, 526520, 543461, 609479, 722373, 870544, 1047610, 1238651, 1405693, 1505328, 1524375, 1493217, 1462590, 1465356, 1491514, 1491527, 1408484, 1221933, 970453, 729493, 559434, 468190, 417300, 357424, 258342, 117785, -42660, -189962, -306717, -421125, -600890, -895375, -1277101, -1651083, -1924219, -2054577, -2039278, -1891215, -1653990, -1415961, -1264361, -1215473, -1212515, -1197478, -1164725, -1143659, -1160670, -1232224, -1364519, -1529309, -1651967, -1649613, -1480267, -1146199, -670118, -97353, 487205, 980720, 1317709, 1497977, 1564531, 1567490, 1540251, 1485749, 1385372, 1243402, 1122077, 1104080, 1209352]
35489A209352J59974J22390L7968m8825j28148j92958k19665j97348j47287r5408
35479E00045m2316K7075J16401K05061K49593K01596N1007j41693k81627l21853
35469E63289k94887k58927k37884k22745k00072j56829q1888J0274P6568R4122
35459g08979R4635J15891J31232O9591r0036k79638m09063m44501m09880l39732
35449b270480k51680j46908j6388J43521L07401M24399M59709M21847L38373K23946
35439c66260R2563j9121p7036r6092j28840j99688k72958k92167k29685r4998
35429a684282P5073K19930K81012K56163K14926K28969K88368L09085K25955O3995
35419D79194q2028j26812n8468N7964J35955J34413P1983j9202j28526k38637
$$ y = [1209352, 1369326, 1491716, 1529684, 1480859, 1352711, 1159753, 940088, 742740, 595453, 500045, 457729, 484804, 601205, 806266, 1055859, 1257455, 1308462, 1166769, 885142, 563289, 268402, 9475, -228409, -451154, -651226, -808055, -889943, -879669, -803101, -708979, -614344, -498453, -367221, -297630, -387666, -667304, -1076367, -1520868, -1930748, -2270480, -2522160, -2669068, -2685456, -2541935, -2234534, -1810135, -1350426, -928579, -590206, -366260, -273697, -292818, -369854, -465946, -594786, -794474, -1067432, -1359599, -1589284, -1684282, -1609209, -1389279, -1108267, -852104, -637178, -408209, -119841, 189244, 415199, 479194, 397166, 270354, 211886, 269850, 405805, 540218, 612201, 592999, 464473, 225836]
35409B25836k90232k22084n1473J21244K06310K04907J88106K17716K98781L86365
35399A285476M18744L58120K20398O3157o3992j51134k09192k39121k34538k03016
35389A244902j69616j63743k06074k92250l79682m09791l61859k71683j80185
35380a189981q1308N2101K02049L00020K93660J96199O5306m4962j05968j15809
35370d28693r9273r2220j04709j03761n0268M6943J30370J53101J24906Q7004
35360c36600N1858q946j13762k31133l07901l22835k92248k33370j50037n3317
35350a998291L4023J03771J69764K37061K84311K91293K65523K25807J77105J20213
35340h9420O9584L7773J2302k8625q3086j29636j60876j90844k26568k48994k27658
$$ y = [225836, -64396, -286480, -337953, -216709, -10399, 194508, 382614, 600330, 899111, 1285476, 1704220, 2062340, 2282738, 2345895, 2281903, 2130769, 1921577, 1682456, 1447918, 1244902, 1075286, 911543, 705469, 413219, 33537, -376254, -738113, -1009796, -1189981, -1271289, -1219188, -1017139, -717119, -423459, -227260, -161954, -206916, -312884, -428693, -527966, -620186, -724895, -828656, -878924, -831981, -701611, -548510, -423604, -336600, -284742, -293688, -407450, -638583, -946484, -1269319, -1561567, -1794937, -1944974, -1998291, -1964268, -1860497, -1690733, -1453672, -1169361, -878068, -612545, -386738, -209633, -89420, -19836, 17937, 30239, 1614, -81472, -211108, -371984, -562828, -789396, -1038390, -1266048]
35329a266048j47605k5056R5345J67160J80430J68762J66002J64548J35379Q2821
35319b78262N1634P1077J12365J19158P4460K3169K5452R5680J95070K80638L44060
35308A114501L91419M01961L35877J83683j6594k13739l68707m45094m16672l08221
35298F58414j95991j34160j00444m3426L7603R5431J01899P3146L4932N31j7352
35287E10583p762J7883L1202J8067j3387n1994q7490r8659o3699J5903J20762
35276C91409K34902L35586L73148L04095J53572J0542n5861n3259l0727j3326
35266A650081J1005N7804J19093J65914J71720J38327R6387O9257L9826l2328
35256B487086j61999l17908m46713n08005m98449m57148m32551m24220l74449
$$ y = [-1266048, -1413653, -1438709, -1343364, -1176204, -995774, -827012, -661010, -496462, -361083, -278262, -226628, -155551, -43186, 75972, 150432, 173601, 199053, 294733, 489803, 770441, 1114501, 1505920, 1907881, 2243758, 2427441, 2410847, 2197108, 1828401, 1383307, 966635, 658414, 462423, 328263, 227819, 184393, 221996, 317427, 419326, 492472, 527404, 527935, 510583, 502821, 520704, 551906, 569973, 556586, 504592, 417102, 318443, 254744, 270647, 391409, 626311, 961897, 1335045, 1639140, 1792712, 1803254, 1747393, 1694134, 1663407, 1650081, 1661086, 1718890, 1837983, 2003897, 2175617, 2313944, 2410331, 2479588, 2519414, 2487086, 2325087, 2007179, 1560466, 1052461, 554012, 96864, -335687, -759907, -1134356]
35247a134356k42403o6855P7020J62920K14033K37488K14610J53720R5657N6840
35237b31326J7069k4142l0757J0692O3848J00413J41272K07666K68203K71332
35227G94270K06961J07428J1190m6797l3666N6031J80795K79880L15641K83474
35217B155207K03184J15004O0922M9931N6328O2113P8617J14403J47991J50181
35207C193881J12630M0853n7793j64904k52692l07091l27768l02708k19061j06954
35197A608393k5170J8115Q0477J85201K52931J89535J9061j26737j48402o7092
35187A986312K6685P5361R4222J30935K00861K64731K71233K12074J19119J8741
35177C400274p8455j46774j49403q6851m468O2697J16774J57572J61619J24217
$$ y = [-1134356, -1376759, -1443614, -1366594, -1203674, -989641, -752153, -537543, -383823, -288166, -231326, -214257, -238399, -269156, -258464, -194616, -94203, 47069, 254735, 522938, 794270, 1001231, 1108659, 1119849, 1073052, 1039386, 1095417, 1276212, 1556092, 1871733, 2155207, 2358391, 2473395, 2534317, 2584248, 2640576, 2702689, 2781306, 2895709, 3043700, 3193881, 3306511, 3347364, 3289571, 3124667, 2871975, 2564884, 2237116, 1934408, 1715347, 1608393, 1583223, 1601338, 1681815, 1867016, 2119947, 2309482, 2328543, 2201806, 2053404, 1986312, 2012997, 2088358, 2182580, 2313515, 2514376, 2779107, 3050340, 3262414, 3381533, 3400274, 3321819, 3175045, 3025642, 2938791, 2934323, 2997020, 3113794, 3271366, 3432985, 3557202]
35167C557202Q3919Q0054J16134J76612K37020K47962J70970N7329K6857J25713
35157D879772K61846L27761L29903L41085L81598M19169M44901M71302M76926
35148H334263M23002L16836K07600J31179R6705J00999J16434J00151O2250Q7977
35138I977396K41816M86302P43152R86833J220852J417016J556901J695656J908704
35129B0234628K203196K543086K921762L350998L832563M405656N153599O085951
35121E0731439P095055Q127644R320565J0864720J2828383J5222528J8102794
35114A32293128K1438467K4988936K8397247L1037959L1382323K6974315J6168331
35107C12680706M56038j5470103k6717195l1426612l1100580k8334765k4819098
$$ y = [3557202, 3641121, 3721175, 3837309, 4013921, 4250941, 4498903, 4669873, 4727202, 4754059, 4879772, 5141618, 5469379, 5799282, 6140367, 6521965, 6941134, 7386035, 7857337, 8334263, 8757265, 9074101, 9281701, 9412880, 9509585, 9610584, 9727018, 9827169, 9889419, 9977396, 10219212, 10705514, 11448666, 12435499, 13656351, 15073367, 16630268, 18325924, 20234628, 22437824, 24980910, 27902672, 31253670, 35086233, 39491889, 44645488, 50731439, 57826494, 65954138, 75274703, 86139423, 98967806, 114190334, 132293128, 153731595, 178720531, 207117778, 238155737, 269538060, 296512375, 312680706, 313136744, 297666641, 270949446, 239522834, 208422254, 180087489, 155268391]
35100A55268391k1189674j7759279j4795289j2376602j0419357q850878p622363
35093F2254949o638142n805472n099775m502700l948194l398042k897404k493988
35085B7471232k170964j907151j722626j610146j500552j355968j223810j137128
35077A4842887j033942q48248o22374m52917l67255l23766l00553l12916l58382
35068A0222534m03232m22193m17316m05490m08323m35542m60495m37659l60257
35059F472027k68472j86732r7776l449L9638j1281j16586j99523k35510k57412
35049E134924k95097l48788m02927m27832l83021k58755j09071j2685j510m3576
35039B851662q3829q3771l8211K2027N3759M6501L1951L2736J9880n4758j93258
$$ y = [155268391, 134078717, 116319438, 101524149, 89147547, 78728190, 69877312, 62254949, 55616807, 49811335, 44711560, 40208860, 36260666, 32862624, 29965220, 27471232, 25300268, 23393117, 21670491, 20060345, 18559793, 17203825, 15980015, 14842887, 13808945, 12960697, 12338323, 11885406, 11518151, 11194385, 10893832, 10580916, 10222534, 9819302, 9397109, 8979793, 8574303, 8165980, 7730438, 7269943, 6832284, 6472027, 6203555, 6016823, 5919047, 5915598, 5955236, 5943955, 5827369, 5627846, 5392336, 5134924, 4839827, 4491039, 4088112, 3660280, 3277259, 3018504, 2909433, 2896748, 2895238, 2851662, 2767833, 2684062, 2645851, 2667878, 2721637, 2768138, 2800089, 2832825, 2852705, 2797947, 2604689]
35028B604689l37084m10093l67325k21127l8310J01367J62313J65852J47886J26737
35018A934905J15433J27859J49999J35132N7317n0488j37760j95191k43353k81360
35008A612493k82157k32919j52831p3909k3243j4675l5403m7284k2512K4791N5490
34997H07841M5418j290o0074q9871n1874M4151J22785J04580j2720j52760k36918
34986E19268k45508k10953j73249j44341j04791l7372L3756N5700J0831n3860
34976c50519q1900p0455n2473l9399k0313k614n417j1961K4086J09035J82332
34965c19598J83583J26321Q5611J23285K33972L49368L86134L07269J53832J1392
34955A641169o3583q1521q6921j03327j17830j08246p3556l7950k7484m2609n8244
$$ y = [2604689, 2267605, 1857512, 1490187, 1269060, 1230750, 1332117, 1494430, 1660282, 1808168, 1934905, 2050338, 2178197, 2328196, 2463328, 2520645, 2470157, 2332397, 2137206, 1893853, 1612493, 1330336, 1097417, 944586, 870677, 847434, 832759, 797356, 750072, 727560, 752351, 807841, 853259, 851969, 791895, 702024, 650150, 694301, 817086, 921666, 908946, 756186, 519268, 273760, 62807, -110442, -254783, -359574, -396946, -363190, -307490, -296659, -350519, -432419, -502874, -555347, -594746, -615059, -617673, -623090, -635051, -610965, -501930, -319598, -136015, -9694, 75917, 199202, 433174, 782542, 1168676, 1475945, 1629777, 1641169, 1577586, 1496065, 1409144, 1305817, 1187987, 1079741, 1006185, 968235, 940751, 898142, 839898]
34944H39898n4320l6573j8422L551L5890N9040L9374k6283r9296j36407j20302
34933D86150n5266L7574J11122J09494K0003j04940j94927k18226j80108r1277
34923h0401K8551J28109J49643R1475J9645j521K4940M9270M7600M8840Q8626
34912E94777J58108K09415K01022J28701K2836p0822j15936j12026r8346j13272
34902H04457j44489j39432p6988p887l94n8409j21917j43808j32505j11700p3826
34891b06898m33R1191J53347J56510J10283L8974l9536j07562j44630j43794j17252
34880b09800p6477k1402M0542Q4134R7001J07915J55089K26472K60187K13699
34870H77360J09862K434q0304j37941j65613j51614j02068l9535K5016R4737J57806
$$ y = [839898, 785578, 749005, 730583, 734134, 770024, 829064, 868438, 842155, 742859, 606452, 486150, 430884, 468458, 579580, 689074, 709077, 604137, 409210, 190984, 10876, -80401, -51850, 76259, 225902, 317377, 337022, 335501, 360441, 409711, 457311, 506151, 594777, 752885, 962300, 1163322, 1292023, 1314859, 1244037, 1128101, 1016075, 917729, 804457, 659968, 520536, 443548, 435661, 435267, 376858, 254941, 111133, -21372, -133072, -206898, -207331, -116140, 37207, 193717, 304000, 342974, 303438, 195876, 51246, -92548, -209800, -286277, -307679, -267137, -183003, -86002, 21913, 177002, 403474, 663661, 877360, 987222, 989656, 909352, 771411, 605798, 454184, 352116, 312581, 337597, 432334, 590140]
34859E90140J81953J51794R4056N0364L4944K9440P450m7778j37515k40486l15095
34848C99267l25890k73446j92090j16854n6277M500P9771J63392K29760K52637
34838A64770K21916J44428L8573o5115j30142j39081j09837p1039k5731L8632
34828F7374J06347J30668Q5931k199r0083j53254j76607j42085n6872L1272Q3696
34817a15812J18469J68496K05450J57385J0752j48621k18009j75650q1842q703
34807h8085J1815r344m2776p2106j09704j72241k39507k59526k05477j06384o283
34796a299618Q5343J80263K67488L14831L09937K71307K16257J43821N7623j8376
34786E28876o4989r4412j29658j60692j44242n8560N6227J32823J51234J58295
$$ y = [590140, 772093, 923887, 1017943, 1068307, 1103251, 1132691, 1140141, 1092363, 954848, 714362, 399267, 73377, -200069, -392159, -509013, -565290, -560790, -481019, -317627, -87867, 164770, 386686, 531114, 569687, 504572, 374430, 235349, 125512, 54473, 28742, 67374, 173721, 304389, 390320, 388121, 298038, 144784, -31823, -173908, -230780, -199508, -115812, 2657, 171153, 376603, 533988, 544740, 396119, 178110, 2460, -79382, -88085, -76270, -85614, -128390, -200496, -310200, -482441, -721948, -981474, -1186951, -1293335, -1299618, -1214275, -1034012, -766524, -451693, -141756, 129551, 345808, 489629, 547252, 528876, 463887, 369475, 239817, 79125, -65117, -123677, -67450, 65373, 216607, 374902]
34776C74902K02809K69204K98716K69459K24866K11772K14512J74602O7279o5332
34766B242789j60647j98588k10127k32964k69478k87958k59867j93418j30273
34757B99469j08010j24900j41849j19143n0705L6235J09047J50042J51309J06026
34747C07521K2470n6642p2645o306R1310J37202Q8536k3361j20493j33617m7176
34736A86799Q8227J89685K07152J61473J12492R5982J03701J13879J15015R9746
34726A474151O2456J2441l0665o2214r2642j15153j00126l8572L2245O8510O6353
34715A276784M5995J0167m7840j05637j20429q1998k8554j889q943l3425o0323
34704H43908p7178p2822n2740m3918p0598j31822k07212k69804k86976k32812
$$ y = [374902, 577711, 846915, 1145631, 1415090, 1639956, 1851728, 2066240, 2240842, 2308121, 2242789, 2082142, 1883554, 1673427, 1440463, 1170985, 883027, 623160, 429742, 299469, 191459, 66559, -75290, -194433, -245138, -208903, -99856, 50186, 201495, 307521, 329991, 273349, 200704, 194398, 285708, 422910, 511446, 488085, 367592, 233975, 186799, 275026, 464711, 671863, 833336, 945828, 1041810, 1145511, 1259390, 1374405, 1474151, 1536607, 1549048, 1518383, 1456169, 1363527, 1248374, 1148248, 1109676, 1141921, 1210431, 1276784, 1322779, 1332946, 1285106, 1179469, 1059040, 977042, 948488, 946599, 937656, 904231, 843908, 766730, 693908, 641168, 597250, 526652, 394830, 187618, -82186, -369162, -601974]
34694f01974j22368k0558Q900l8106j15021j83274k36053k66492k49212j75528
34684a999686q6666m4007o8356j24749j62883j55585j01906j6505P6573J58133
34674b525637K32188L14649L93319M19031L58641K44844J47510J00439Q3047P1385
34664a60584P1151Q7834R8493P9979M2704O350m0351j17262j96017k08979j29345
34653d66027j1051P1971J04469J25498J62656K00237K09974J87634J51227J18439
34643H55027R5428P9649O5054M6436K2778l903l2158o0895q7713j13079j44128
34632G22496j83987k13456j94591j07148J7676J12486J32460R6114O0998O2240
34622E05288Q5566J00117R9836R8291R3755O4066K554n9112p9660n4319k1043
$$ y = [-601974, -724342, -744900, -736000, -774106, -889127, -1072401, -1308454, -1574946, -1824158, -1999686, -2086352, -2130359, -2198715, -2323464, -2486347, -2641932, -2743838, -2760343, -2683770, -2525637, -2293449, -1978800, -1585481, -1166450, -807809, -562965, -415455, -315016, -231969, -160584, -89433, -1599, 96894, 176873, 219577, 225927, 185576, 68314, -127703, -336682, -466027, -477078, -405107, -300638, -175140, -12484, 187753, 397727, 585361, 736588, 855027, 950455, 1030104, 1095158, 1141594, 1164372, 1160469, 1128311, 1067416, 979703, 866624, 722496, 538509, 325053, 130462, 23314, 40990, 153476, 285936, 382050, 443048, 505288, 590854, 690971, 790807, 889098, 982853, 1046919, 1049473, 990361, 910701, 856382, 835339]
34611H35339k3223p3292j46570j98498j92460j30091o0348m1986q3033j26596
34601b40758j12290m6924L355q592o0700r8610j02717r6414r6628q5661m2225
34590i88164K0587O8263Q8414J02451J32593J71810J92743J77458J32136P9180
34580A77471M2309L4484M9729O4607N5658K2400q103o025K8245N9433N2196J1433
34568E83837j8397J983O6614J31629J55175J23660M8927m0735j04388j04196l6472
34557H07637N5238J09268R0877R466r6542j80281k02953j56136p7968l1260m8041
34546B79305r7091j15244o8769K2791J16358J81401K02793J65704N8145j07761
34536F37632k86499m19068m65920m26316l32841k27910j38720o8620r801M0675
$$ y = [835339, 812116, 738824, 592254, 393756, 201296, 71205, 10857, -31129, -114162, -240758, -353048, -399972, -396617, -405209, -465909, -564519, -667236, -763650, -860278, -945939, -988164, -967577, -899314, -810900, -708449, -575856, -404046, -211303, -33845, 98291, 177471, 219780, 254264, 303993, 368600, 424258, 446658, 438555, 432530, 460775, 520208, 572404, 583837, 565440, 567423, 634037, 765666, 920841, 1044501, 1093428, 1052693, 948305, 844109, 807637, 862875, 972143, 1063020, 1072486, 975944, 795663, 592710, 436574, 358606, 327346, 279305, 182214, 66970, -1799, 20992, 137350, 318751, 521544, 687248, 745393, 637632, 351133, -67935, -533855, -960171, -1293012, -1520922, -1659642, -1728262, -1738063, -1697388]
34526a697388Q3657J32947K11447L21008M23875M69581M41698L67545K82052J97702
34516A234124J16468N2939K4454K2532J5093j8054o8222j23377j91142k75463
34506G89352l39911l23815k06688m0204R7905J71670J96417J94365J67115J14136
34496H20342N3486Q987j1055j1295N71N753k9282j21118k33744k99258k84087
34485a00700k18877j53995j02131l9900M4405J22813J47333Q9190l7692j83490
34475d33044k94363l42429l21482k19025k0273K40274M54133N08821L92804K06397
34465A71813N9726j6819n2265o0892k4293O4169J73171K58468K91447K57554J52158
34454A274237l449j55754k50334k70155k34482j68194q9308k1979O158l814q258
$$ y = [-1697388, -1613731, -1480784, -1269337, -948329, -524454, -54873, 386825, 754370, 1036422, 1234124, 1350592, 1403531, 1427985, 1450517, 1465610, 1447556, 1379334, 1255957, 1064815, 789352, 449441, 125626, -81062, -121266, -23361, 148309, 344726, 539091, 706206, 820342, 873828, 882815, 871760, 860465, 861036, 866789, 837507, 716389, 482645, 183387, -100700, -319577, -473572, -575703, -615603, -571198, -448385, -301052, -211862, -249554, -433044, -727407, -1069836, -1391318, -1610343, -1630616, -1390342, -936209, -427388, -34584, 171813, 231539, 214720, 162455, 101563, 77270, 141439, 314610, 573078, 864525, 1122079, 1274237, 1270788, 1115034, 864700, 594545, 360063, 191869, 102561, 80582, 86740, 82926, 74668]
34443G4668L7386J24694J98024K15223J84253J35983Q5621L8101J0274J6493L7872
34432A158592L7579J2293N77K7719O7215P6656N2233K3306P912N249K6736R6683
34420A592750K07501L00098L11905K34679J09049k7182j62947k89089l78124m08660
34410A489980m00454m02099m35574m65807m37505l34811j89324l5403J14442K39827
34400h56728K89324K23865P8983m9918r5251o8383j4681N3742J53212K71326L51353
34389C36844L46960K77511K16029K23133K93027L58536L48998K52332J26624M8561
34379B828555M6275P9538Q0650J2753j02316k00176k19805j51861n3336o149m6781
34368B267347j32702j81617j45104m6125M7303P9558M6407j0864m9016o6870j04766
$$ y = [74668, 112054, 236748, 434772, 649995, 834248, 970231, 1055852, 1093953, 1104227, 1120720, 1158592, 1196171, 1208464, 1209041, 1236760, 1303975, 1380631, 1432864, 1456170, 1464082, 1469331, 1496067, 1592750, 1800251, 2100349, 2412254, 2646933, 2755982, 2728800, 2565853, 2276764, 1898640, 1489980, 1089526, 687427, 251853, -213954, -651459, -986270, -1175594, -1210997, -1096555, -856728, -567404, -343539, -264556, -314474, -409725, -478108, -492789, -439047, -285835, -14509, 336844, 683804, 961315, 1177344, 1400477, 1693504, 2052040, 2401038, 2653370, 2779994, 2828555, 2874830, 2954368, 3035018, 3047771, 2945455, 2745279, 2525474, 2373613, 2320277, 2314128, 2267347, 2134645, 1953028, 1807924, 1761799, 1809102, 1888660, 1935067, 1924203, 1875187, 1808317, 1703551]
34357A703551j94430l14394m06418m31460l92478l05194j77311l3051O9194P8938
34347d03053Q238q2599j49971j88309j89444j25064O081J42854K08942J89207
34337e83118J37841J16640J41972J84663K04275J88215J68036J84043K21346K06876
34327A170789J01524k5349o0433J7398J12341J29709O9521j7082j13561k35636
34317A149221l71727m75070n11012m79265l93978k73168j47130m5978L0593J11044
34307a406470K11205L09828L71366L83475L67145L53641L49349L20983K27051
34298A487573P3714p4302j55300j72193j73475j84213j82585j39990n5816M7544
34288D70957J35010J61368R8650k1718j19627j40252j01922n7208k9614j2289
$$ y = [1703551, 1509121, 1194727, 788309, 356849, -35629, -340823, -518134, -551185, -481991, -403053, -394815, -477414, -627385, -815694, -1005138, -1130202, -1124121, -981267, -772325, -583118, -445277, -328637, -186665, -2002, 202273, 390488, 558524, 742567, 963913, 1170789, 1272313, 1246964, 1186531, 1203929, 1316270, 1445979, 1515500, 1498418, 1384857, 1149221, 777494, 302424, -208588, -687853, -1081831, -1354999, -1502129, -1548107, -1517514, -1406470, -1195265, -885437, -514071, -130596, 236549, 590190, 939539, 1260522, 1487573, 1561287, 1486985, 1331685, 1159492, 986017, 801804, 619219, 479229, 423413, 470957, 605967, 767335, 865985, 844267, 724640, 584388, 482466, 425258, 395644, 383355]
34278C83355r216m0628j07484j80195k32089k63721k82145k72478k10336j01178
34268a316115R007P2786Q7527R3089J21042J55828J56573J12148N8518L6677M5989
34257c66931M9069J5769m7450j06551j26431r0162o169R4464J71688J96337J61843
34246e4524Q0724k3568j17655j60976j28438m2050L2812M4285Q620q243L4842
34235c34171J17294J96804K55724K87582K65751J66055J5747j16097j83831j94635
34225D76223j68856j04565j453J03065J51024J16851L0954m8238q0881p0657m9962
34214C53505l9551k6518J0169O0651R0233Q4103O5301O4507R1182J36578J79569
34203A069729J83300J18786J1681o2814o1349l1955o3220j84011l37988m44702
$$ y = [383355, 374139, 333511, 226027, 45832, -186257, -449978, -732123, -1004601, -1214937, -1316115, -1307108, -1234322, -1146795, -1053706, -932664, -776836, -620263, -508115, -449597, -412920, -366931, -317862, -302093, -349543, -456094, -582525, -672687, -678856, -584392, -412704, -216367, -54524, 26200, 2632, -115023, -275999, -404437, -446487, -413675, -369390, -360770, -369013, -334171, -216877, -20073, 235651, 523233, 788984, 955039, 970786, 854689, 670858, 476223, 307367, 202802, 201349, 304414, 455438, 572289, 603243, 555005, 474124, 403467, 353505, 313954, 287436, 297605, 358256, 448489, 532592, 597893, 662400, 753582, 890160, 1069729, 1253029, 1371815, 1383496, 1320682, 1259333, 1227378, 1164158, 980147, 642159, 197457]
34193A97457m55708l61697j88643l30J27716J63125J38560J08929R6189Q4193
34183i0209N5133J4635j8578l5751m3298m7185m0776j6194J4393K0930j4108p2724
34171b73732j14134j08422n8775J157L1187J6589k1090n3735q3020j28304j79871
34160i72150j93810j46431o9055j1937L365k1786q6579j76161k44704k52593k13543
34149b385384j71902j39324q7541p02J00175J86804K44584K59816K20487J42876
34139a630111P1301L6922L3301L7990L8212L1574K3869L0001N4165O9000M4997
34128a158779L047k430L2762L7779m3419j67791k35926k01551j03787k985P5681
34117a767399J32008J59271J43804Q7371J8535k1476q939M3149J01289J48345
$$ y = [197457, -258251, -619948, -808591, -808921, -681205, -518080, -379520, -270591, -174402, -90209, -35076, -20441, -39019, -74770, -118068, -165253, -206029, -222223, -207830, -186900, -201008, -273732, -387866, -496288, -555063, -553906, -522719, -506130, -527220, -580955, -663975, -792279, -972150, -1165960, -1312391, -1381446, -1393383, -1390018, -1411804, -1498383, -1674544, -1919248, -2171841, -2385384, -2557286, -2696610, -2784151, -2784853, -2684678, -2497874, -2253290, -1993474, -1772987, -1630111, -1558810, -1521888, -1488587, -1450597, -1412385, -1380811, -1356942, -1326941, -1272776, -1203776, -1158779, -1155732, -1158162, -1125400, -1087621, -1131040, -1298831, -1534757, -1736308, -1840095, -1843080, -1767399, -1635391, -1476120, -1332316, -1244945, -1226410, -1247886, -1256825, -1213676, -1112387, -964042]
34107i64042J93900K45011K83122K82283K40072J78767J24077R3524R7823J38905
34097I13442K03611K61619K69993J89963J7766j98040l83842m88101m93307l97236
34087a04132k18228j9495J16100J58588J49760J31340Q9429p5j04211j57305j40391
34076i8620r7316p6426q7601j11559j21334r8730n8059m7502r4807j54366j42401
34065a188721k9830J26096K43102K78893K37752J51277O4731J0983j9545o2753
34055a88015j25855j73740j81820j74438j89590k25453k45071k22981j69050j13798
34045b009811q3241p9435p4760l5317L8527J04315J21501R5359O7715P3329J14750
34034a667068J69438K08661K16699K03793J95239J98548J89510J43866P8195M4747
$$ y = [-964042, -770142, -525131, -242009, 40274, 280346, 459113, 583190, 676714, 774537, 913442, 1117053, 1378672, 1648665, 1838628, 1856394, 1658354, 1274512, 786411, 293104, -104132, -322360, -341855, -225755, -67167, 82593, 213933, 303362, 303287, 199076, 41771, -98620, -195936, -272362, -359963, -471522, -592856, -691586, -749645, -797147, -891954, -1046320, -1188721, -1218551, -1092455, -849353, -570460, -332708, -181431, -116700, -105717, -125262, -188015, -313870, -487610, -669430, -843868, -1033458, -1258911, -1503982, -1726963, -1896013, -2009811, -2093052, -2172487, -2247247, -2282564, -2244037, -2139722, -2018221, -1922862, -1855147, -1781818, -1667068, -1497630, -1288969, -1072270, -868477, -673238, -474690, -285180, -141314, -63119, -18372]
34024a8372Q2696J79815K80386L24680K84335J71579K3467j20519k30147k87115
34014F90805k89536k53137j97353j29141n0204K1309N4321L9479P690J26K3432
34003h2209M4642K9716j8754o1224n4278J6220J32344K68049M03018N06769N27430
33992A711723M25683K25588J2276j31448j77650j46293p3304J38L1197R69o2571
33981A816308j06869j06255q2710p4427r3064j15557j11908p5785k8395M053J2129
33970A037520J908k1049n9406j18813k00233k91182l56932l51615k57064j08736
33960g25602L2927J34057J94035K10494J70263Q0306k3425j10396j71363j88392
33950c97096j26881J0670J48910J99226J50333P1209L0658M2550Q4149J31656
$$ y = [-18372, 64324, 244139, 524525, 849205, 1133540, 1305119, 1328586, 1208067, 977920, 690805, 401269, 148132, -49221, -178362, -228566, -207257, -152936, -113457, -105767, -105641, -82209, -37567, -7851, -26605, -87829, -142107, -125887, 6457, 274506, 677524, 1184293, 1711723, 2137406, 2362994, 2375270, 2243822, 2066172, 1919879, 1846575, 1846713, 1877910, 1878879, 1816308, 1709439, 1603184, 1520474, 1446047, 1352983, 1237426, 1125518, 1049733, 1021338, 1025391, 1037520, 1039428, 1018379, 958973, 840160, 639927, 348745, -8187, -359802, -616866, -725602, -692675, -558618, -364583, -154089, 16174, 96480, 73055, -37341, -208704, -397096, -523977, -513307, -364397, -165171, -14838, 56371, 87029, 129579, 213728, 345384]
33940C45384J66808J73005J41292P5341p762p2888p7180j1993O9479R8358O9801
33929I69645M5821O4987Q0029J3895j37829k90809l56316l19547k33360j57832
33919c21316j18327j08136j10899j15238j16004j08306q1083j9408P7758J78202
33909h42757K27914K00310J33076R6153J13776J33086Q4670l3739j47625j76676
33899b11812j06742K713P0846N7977j0526p5743r9289q5174n7263l4234k8816
33888e78063m7432p6766r1609r3260j16590j72314k05049j50349k5227Q2807J21812
33877a352040J28340J60105K15261K46210K26309J70216J01786L3763k0917m0928
33867a31895r817O5178J45629J75546J19351k033j22644j89582k03068j95122
$$ y = [345384, 512192, 685197, 826489, 901830, 894068, 821180, 744000, 732007, 801486, 899844, 969645, 1015466, 1080453, 1160482, 1174377, 1036548, 745739, 389423, 69876, -163484, -321316, -439643, -547779, -658678, -773916, -889920, -998226, -1079309, -1098717, -1020959, -842757, -614843, -414533, -281457, -185304, -71528, 61558, 146228, 112489, -35136, -211812, -318554, -315841, -244995, -187018, -197544, -273287, -372576, -457750, -515013, -549247, -578063, -625495, -702261, -793870, -887130, -1003720, -1176034, -1381083, -1531432, -1556659, -1473852, -1352040, -1223700, -1063595, -848334, -602124, -375815, -205599, -103813, -70050, -90967, -131895, -141712, -76534, 69095, 244641, 363992, 361959, 239315, 49733, -153335, -348457]
33857c48457j87797j89717k18293k94157m05814m97113n03727m03409k31747n3342
33847c333573Q3033J67601K16640K46065K64768K87460L35681M16545N08610N77363
33837b29807O01233N78956N18622M26823L06943J65588K2000r3499j59683j81494
33827A955682j77749j56367j17381p7092o4967q8447j21138j37779j44761j63958
33817G06043k00667k38917k54537k23514j36368j8788Q0406J40019J88811K57992
33807C00480L28883L52775L09595K20137J10408n966j13291j90215k24305k13815
33797H74686j62650r5561o5361j07115j82804k06660j37058j8289P5522J09947
33787H4657R5483N5345P471m2221j03523j79778k33846k07613r6832K2049P0823
$$ y = [-348457, -536254, -725971, -944264, -1238421, -1644235, -2141348, -2645075, -3048484, -3280231, -3333573, -3250540, -3082939, -2866299, -2620234, -2355466, -2068006, -1732325, -1315780, -807170, -229807, 371426, 950382, 1469004, 1895827, 2202770, 2368358, 2390358, 2296859, 2137176, 1955682, 1777933, 1621566, 1504185, 1427093, 1362126, 1273679, 1152541, 1014762, 870001, 706043, 505376, 266459, 11922, -211592, -347960, -366748, -286342, -146323, 42488, 300480, 629363, 982138, 1291733, 1511870, 1622278, 1616312, 1503021, 1312806, 1088501, 874686, 712036, 616475, 551114, 443999, 261195, 54535, -82523, -100812, -25290, 84657, 180140, 235485, 242956, 200735, 97212, -82566, -316412, -524025, -620857, -598808, -527985]
33776e27985N7081N1836R4168J53632J81258J59688R6328R90j08930j98815k34606
33765b75355k10133j49284q2266k3431K7077O0259M3855n1597k01953l19672l18508
33754a501008j91763j6180J18297J70112J46442P1699k9615j32449k11074k42512
33744a818051k11027j17128J4603J43813K35554K71604K46326J66256N8556l4167
33734a043661q1159q3836o3911l8541j6273j0665l9530j01623j61990j73041j14299
33723a928529q185J04018J96107K64276L09701L26700L08514K54500J70485P3677
33713G1264j414k1225R743M3643L6877p863o2773j21570j94371k62430k77233
33702g87352k18694j26259n4083j6901J358Q832M921N291L4631R2936J52446J90283
$$ y = [-527985, -470904, -419068, -324900, -171268, 9990, 169678, 266006, 266996, 158066, -40749, -275355, -485488, -634772, -717038, -740469, -713392, -653133, -609278, -660875, -862828, -1182500, -1501008, -1692771, -1708951, -1590654, -1420542, -1274100, -1202401, -1232016, -1364465, -1575539, -1818051, -2029078, -2146206, -2131603, -1987790, -1752236, -1480632, -1234306, -1068050, -1009494, -1043661, -1124820, -1208656, -1272567, -1311108, -1327381, -1338046, -1377576, -1479199, -1641189, -1814230, -1928529, -1936714, -1832696, -1636589, -1372313, -1062612, -735912, -427398, -172898, -2413, 71264, 69850, 48625, 58368, 102011, 138888, 131025, 68252, -53318, -247689, -510119, -787352, -1006046, -1132305, -1186388, -1203289, -1201931, -1193099, -1188178, -1182887, -1148256, -1055320, -902874, -712591]
33690g12591K03513J90533J42843O7123l590l7522l4527j7384j103J6391L7210
33679a49104M9737L4188k2032j11217k01912k52285k36359j60523n3736N4305
33669a048938J41632J89493J85624J38005P6386L1298J4182K2385N4685J06821
33659h8427J52340J48365P5575l5761j34567k00313k51958l08876l59542l69641
33649a372805l05551j52489O4331K69195L76056L61619K82898K08435J55174J08354
33639d783O3702R127r9059k74300m27905m38784l09978j79591j40548j22155r786
33628a934060J79370L25230L76443L97004M39552M61640M00796K67938J23521
33619A037434M181q5506j39326j48244j18136o3347Q91M3303K4453n0471j11941
$$ y = [-712591, -509078, -318545, -175702, -108579, -112169, -149691, -184218, -201602, -202705, -186314, -149104, -99367, -65179, -87211, -198428, -400340, -652625, -888984, -1049507, -1103243, -1048938, -907306, -717813, -532189, -394184, -317798, -286500, -272318, -249933, -195248, -88427, 63913, 212278, 287853, 252092, 117525, -82788, -334746, -643622, -1003164, -1372805, -1678356, -1830845, -1766514, -1497319, -1121263, -759644, -476746, -268311, -113137, -4783, 58919, 68046, -31013, -305313, -733218, -1172002, -1481980, -1661571, -1802119, -1924274, -1934060, -1754690, -1429460, -1053017, -656013, -216461, 245179, 645975, 913913, 1037434, 1041615, 956109, 816783, 668539, 550403, 487056, 487947, 531250, 555703, 505232, 393291]
33608C93291r4284p130R1300J70758K39624K97048L25093L27151L25816L12924
33598B381591K45906J14286k4769j02675j08453q1346n8152n4326p9271j35932
33588B096859k04516k50372k55161k29078j91089j50040j10906q9295j05151j55260
33578C55991j99097j89213j24527n9501m3974o5608p7027p1154r0444j52362k07501
33567i24417k01731j51160j16172j16092j12670p7502l3912j7260k4546k4954
33557a800416k221L2918O0803O6690M5138N733l0274m9874n8856o3908n6656l2683
33545a883606j6456m0371r4882j23663q2364J3008J10287J78902K22305K42196
33535a474644K22034J56533P4386J0610l4052q5555j49145j86882j49852k7826
$$ y = [393291, 299007, 291877, 383177, 553935, 793559, 1090607, 1415700, 1742851, 2068667, 2381591, 2627497, 2741783, 2717014, 2614339, 2505886, 2424540, 2366388, 2312062, 2232791, 2096859, 1892343, 1641971, 1386810, 1157732, 966643, 816603, 705697, 616402, 511251, 355991, 156894, -32319, -156846, -216347, -260321, -325929, -402956, -474110, -564554, -716916, -924417, -1126148, -1277308, -1393480, -1509572, -1622242, -1699744, -1733656, -1750916, -1775462, -1800416, -1802637, -1769719, -1708916, -1642226, -1597088, -1591355, -1621629, -1671503, -1730359, -1794267, -1850923, -1883606, -1900062, -1940433, -2035315, -2158978, -2241342, -2228334, -2118047, -1939145, -1716840, -1474644, -1252610, -1096077, -1021691, -1011081, -1045133, -1130688, -1279833, -1466715, -1616567, -1644393]
33525a644393J32120K49844K62652J72028M7675k5643j1388P2158J96740L45369
33515b02838M80868N29242M33085K18786j3408j66548k02607j39773l1026N4594
33505I60375O9195K6373j4544j7678l986m173p861J2096M6018N7321M2076M1490
33493A206702Q4859J46519J73608J39087N6236m1151j16361j40977j10970n3490
33483A344062p071O572j1030m7368q5439j02582q0567k6539K2144K4148l1090
33472A005240j16749j97828k62407l16824l52428l34855k42241j07316n55L4817
33462h91146J9843J0255M4320J21823K10850K59903K24105J09805q906m3982K4694
33451H1564J27792J66493Q8323q1947k58475l39913k73773j04574M9108Q8001
$$ y = [-1644393, -1512273, -1262429, -999777, -827749, -780074, -805717, -817105, -744947, -548207, -202838, 278030, 807272, 1240357, 1459143, 1445735, 1279187, 1076580, 936807, 905781, 960375, 1029570, 1055943, 1041399, 1023721, 1019735, 1015562, 1007701, 1019797, 1065815, 1123136, 1165212, 1206702, 1291561, 1438080, 1611688, 1750775, 1807011, 1765860, 1649499, 1508522, 1397552, 1344062, 1336991, 1343563, 1332533, 1285165, 1199726, 1097144, 1016577, 990038, 1012182, 1036330, 1005240, 888491, 690663, 428256, 111432, -240996, -575851, -818092, -925408, -925963, -891146, -871303, -861048, -816728, -694905, -484055, -224152, -47, 109758, 100852, 56870, 81564, 209356, 375849, 464172, 382225, 123750, -216163, -489936, -594510, -545402, -457401]
33441d57401J1214r6593j47253j12205j9626Q5101J67283K05662J86453J05493
33431g1872k1302j52624k33823k23130j16682M1312J72457K07197J38446L6690
33421b23331l957N5662J78259L00392L83577M12844L75773K71486J30397j894
33411A879208j02755j79131k38693k72993k70048k25585j40140k6096P4999J04730
33401F03496L7023r3482k25245l22632l81289l94505l43694k29065q7821L4380
33391a402834J20127J73521J84670J24878j1638j74111k81960k90346k24411j48183
33381a930287j04767q6468n3705K3363J36373K41150K86252K47846J48863N0924
33371a040456K0082P9495J80222K27776J61036J2573j21336j75157j66200j50371
$$ y = [-457401, -446187, -542780, -690033, -802238, -821864, -736763, -569480, -363818, -177365, -71872, -93174, -245798, -479621, -702751, -819433, -778121, -605664, -398467, -260021, -223331, -227288, -171626, 6633, 307025, 690602, 1103446, 1479219, 1750705, 1881102, 1879208, 1776453, 1597322, 1358629, 1085636, 815588, 590003, 449863, 423767, 498766, 603496, 640519, 547037, 321792, -840, -382129, -776634, -1120328, -1349393, -1437214, -1402834, -1282707, -1109186, -924516, -799638, -811276, -985387, -1267347, -1557693, -1782104, -1930287, -2035054, -2121522, -2175227, -2151864, -2015491, -1774341, -1488089, -1240243, -1091380, -1040456, -1020374, -940879, -760657, -532881, -371845, -359272, -480608, -655765, -821965, -972336]
33361i72336j48302j31754o7799M4900J75494K74152K90936K09990P6765k5314
33351b73268m3308l525R868p0733k31292l77216m08657l06799j41454Q642J21720
33340a716022K05845K39334J85571O1373n7907j15443j19617r9917n4975K7695
33330a444063J28522K06083K37529K25776J82819J31929J11493J44940K09727
33321A34755K57475K58097K05380R7062n3510j90529k42492j92329r7884l1182
33311A44843j5542k8441l8487j9834M8837J66492K87020L35712K66649J07426
33301A254675n7882j56180j77682j61500j40349j17784r7403j01881j41872j88883
33291h6741k08938k09708k21980k43431k38512j94328j39181r9542p5426o7170
$$ y = [-972336, -1120638, -1252392, -1320191, -1275291, -1099797, -825645, -534709, -324719, -247954, -273268, -316576, -320101, -310233, -380966, -612258, -989474, -1398131, -1704930, -1846384, -1837742, -1716022, -1510177, -1270843, -1085272, -1023899, -1081806, -1197249, -1316866, -1416783, -1471758, -1444063, -1315541, -1109458, -871929, -646153, -463334, -331405, -219912, -74972, 134755, 392230, 650327, 855707, 952769, 899259, 708730, 466238, 273909, 176025, 144843, 129301, 100860, 62373, 42539, 91376, 257868, 544888, 880600, 1147249, 1254675, 1196793, 1040613, 862931, 701431, 561082, 443298, 345895, 244014, 102142, -86741, -295679, -505387, -727367, -970798, -1209310, -1403638, -1542819, -1642361, -1717787, -1784957]
33281a784957q3111r9669n8568N5278J62916J67604P1641k6633n0443j7164J3737
33270a649369K4478M6273J04447J80451K22575J83940O0141r7595k11900k34424
33260a370983j75206p9006J9249J10855J93160K44781K27910J20698m9085k08568
33250i66195k89382k76322k03796j10397j1051Q7689J66694K03555J93994J52852
33240a052359J01105O1167N2200P0074P8589M7023P21O217Q7092J74330J68559
33229b05282M7422j11079k09051k08616j34750l5531M1835O4732L8748R213J2667
33218f89692K9825Q773o9394j73107k65795l36915l78878l66025k82698j56201
33208b680107l5241O1244J54000K60776L58564L96703L46716K39070J48351J33794
$$ y = [-1784957, -1868068, -1967737, -2026305, -1971027, -1808111, -1640507, -1568866, -1595499, -1645942, -1663106, -1649369, -1624891, -1578618, -1474171, -1293720, -1071145, -887205, -827064, -924659, -1136559, -1370983, -1546189, -1625195, -1605946, -1495091, -1301931, -1057150, -829240, -708542, -757627, -966195, -1255577, -1531899, -1735695, -1846092, -1857143, -1769454, -1602760, -1399205, -1205211, -1052359, -951254, -890087, -837887, -767813, -689224, -642201, -641480, -635263, -548171, -373841, -205282, -157860, -268939, -477990, -686606, -821356, -856887, -815052, -750320, -711572, -702359, -689692, -659867, -651094, -720488, -893595, -1159390, -1496305, -1875183, -2241208, -2523906, -2680107, -2715348, -2654104, -2500104, -2239328, -1880764, -1484061, -1137345, -898275, -749924, -616130]
33198f16130J91048K66995L17716L35957L21454K52180J08361q5562k65545l75619
33188D50855m01034l62613k98546k52246k56535l10993l72509l75910k78915j03946
33178b562392O3820J40796J22927Q9510J17780K06009K93957L38740L40029L00623
33168e48201K04876N2768j10440k21670k50302k11561j40440o4008P161P2474
33158a209343J29456J70588J97144K30901K95201L78424M29316L98677K81575
33149A301939J18165l3566j21637j18863m3834L6241M4065m8164j91519k95335
33139F47492k99216k20910j34407r6735r9404r6904p1013m6045m2619m4021k2151
33128e25933K2338O3767Q3158P8705N5290K5113J4086M3960J02334J46843J47302
$$ y = [-616130, -425082, -158087, 159629, 495586, 817040, 1069220, 1177581, 1092019, 826474, 450855, 49821, -312792, -611338, -863584, -1120119, -1431112, -1803621, -2179531, -2458446, -2562392, -2498572, -2357776, -2234849, -2145339, -2027559, -1821550, -1527593, -1188853, -848824, -548201, -343325, -290557, -400997, -622667, -872969, -1084530, -1224970, -1288978, -1281817, -1209343, -1079887, -909299, -712155, -481254, -186053, 192371, 621687, 1020364, 1301939, 1420104, 1386538, 1264901, 1146038, 1102204, 1138445, 1182510, 1134346, 942827, 647492, 348276, 127366, -7041, -103776, -203180, -300084, -371097, -417142, -459761, -503782, -525933, -503595, -439828, -356670, -277965, -222675, -197562, -183476, -139516, -37182, 109661, 256963]
33117B56963J14591Q3756P8846R9297J29170J48525J40601R9801L6460k9667q2632
33106A075711j16881j32041j24007q3989r238Q4603J66038K08416K09576J88507
33096A466695J63360J37050J04120O3451J7868l3482r1564j45112j72798j65325
33086A344263j38990j18096j08108r7491q3140p8217r2022j19136j56434k11597
33076A41032k77281l11526k70871j62225m0595M6486R3311J14689J17512J07969
33066d41499J07244J36621J88619K25775K10719J37468L9414l2844n1713l4578
33056D85226j8728j7100j1859J3778O1477J33223K23333K81441K25898L3713k03357
33045A207045l51697l57793k72494j76091j21680j34589k03599k60218k22569
$$ y = [256963, 371554, 455310, 534156, 633453, 762623, 911148, 1051749, 1151550, 1188010, 1158343, 1075711, 958830, 826789, 702782, 618793, 609555, 694158, 860196, 1068612, 1278188, 1466695, 1630055, 1767105, 1871225, 1934676, 1952544, 1919062, 1827498, 1682386, 1509588, 1344263, 1205273, 1087177, 979069, 881578, 798438, 720221, 628199, 509063, 352629, 141032, -136249, -447775, -718646, -880871, -921466, -874980, -781669, -666980, -549468, -441499, -334255, -197634, -9015, 216760, 427479, 564947, 604361, 571517, 519804, 485226, 466498, 449398, 437539, 451317, 512794, 646017, 869350, 1150791, 1376689, 1410402, 1207045, 855348, 497555, 225061, 48970, -72710, -207299, -410898, -671116, -893685]
33036h93685r0076M2124Q8706N8334N758n5885j44192k35925k69592k23741j45190
33025a863364q5951m6255O155Q9027J92890K89982L37786K94120J53062l7234
33015f69782k02616k86152k67640j61493o060J58958L14007M49058N33768N26389
33005C88437M26126K89999J74470Q0678j6317j04507j40392j12204o0831l2117
32995H93342l6065n6624p2209o0044j2289L7352L1444m6449j45357k02870k05598
32984A24633j73963j12313q748J26248K54786L45390L87939L77602L11457K06847
32974A839878J00883K0893l4311q1096j29360j73069j91855j67496j12978p7040
32964I94449r8457j59807k08453k18100k01473j65330r2327J9152J30951K03097
$$ y = [-893685, -983761, -941637, -852931, -794597, -788839, -844724, -988916, -1224841, -1494433, -1718174, -1863364, -1949315, -1995570, -1989415, -1900388, -1707498, -1417516, -1079730, -785610, -632548, -669782, -872398, -1158550, -1426190, -1587683, -1593743, -1434785, -1120778, -671720, -137952, 388437, 814563, 1104562, 1279032, 1359710, 1343393, 1238886, 1098494, 986290, 925459, 893342, 857277, 800653, 728444, 668400, 656111, 693463, 724907, 678458, 533101, 330231, 124633, -49330, -161643, -170391, -44143, 210643, 556033, 943972, 1321574, 1633031, 1839878, 1940761, 1961654, 1927343, 1846247, 1716887, 1543818, 1351963, 1184467, 1071489, 994449, 895992, 736185, 527732, 309632, 108159, -57171, -149498, -130346, 605, 203702]
32954B03702K31162K24305J69779M8807j23046k93881m04699m06921k75134l7965
32944f63891K10583L65784L88209L13088J93833O3879n0489j20169j37050j24444
32934D39333r9399l6922J01747L02704M80958N41391M54161K64988M1815j68970
32924B321806l33704m11830l80186k73099j65219j02558p2695n3260o1153j27762
32914C40340k40313l35213l49072k66454j29814j5271J9781j1278l4987j4O4370
32903i57925R2273O4096J5811j5168j2445L7621J32537K15976K05538Q3058p5896
32892b14524j83445k21703k26567k22355k00274j39620k5090J38833L08736M17281
32882e68728M33284L92768L48270L05166K36133J42981O6053L1011J6751j3149
$$ y = [203702, 434864, 659169, 828948, 877755, 754709, 460828, 56129, -350792, -625926, -663891, -453308, -87524, 300685, 613773, 807606, 871485, 820996, 700827, 563777, 439333, 339934, 303012, 404759, 707463, 1188421, 1729812, 2183973, 2448961, 2490776, 2321806, 1988102, 1576272, 1196086, 922987, 757768, 655210, 582515, 529255, 468102, 340340, 100027, -235186, -584258, -850712, -980526, -995797, -976016, -987294, -1022281, -1022295, -957925, -865652, -801556, -785745, -800913, -813358, -775737, -643200, -427224, -221686, -138628, -214524, -397969, -619672, -846239, -1068594, -1268868, -1408488, -1433578, -1294745, -986009, -568728, -135444, 257324, 605594, 910760, 1146893, 1289874, 1355927, 1386938, 1403689, 1390540]
32872A390540o4887j10366j20749r7906p2413o8254p3652o0670l3097l2463q7617
32861E68466j80844k75840l51757l89277l54062k32134o5041Q8137K12771L23520
32851f56061L97747L77624K51141Q6401l9005j11031j57799j86721j81028j45502
32841c64234j15250j10383j07669p3948j5579K5697K9455L1506Q2443J73794K29644
32830b14524J84184N0037j05802k33073l17079l41836k78253j21075Q8654K89338
32820i99429M27855M60318L58272J41230j08896k87915l29570k34443o3335R0474
32810e45439J51509J15228M9113K6183N9014J03952J17472R4585N8532K6728j0293
32799B46584p4894j62072k22909k11937j50161j08289j15857j23097p7736l901
$$ y = [1390540, 1325653, 1215287, 1094538, 996632, 924219, 855965, 782313, 721643, 688546, 656083, 568466, 387622, 111782, -239975, -629252, -983314, -1215448, -1280489, -1192352, -979581, -656061, -258314, 119310, 370451, 456852, 417847, 306816, 149017, -37704, -218732, -364234, -479484, -589867, -697536, -771484, -787063, -761366, -731911, -700405, -617962, -444168, -214524, -30340, 19697, -86105, -319178, -636257, -978093, -1256346, -1377421, -1288767, -999429, -571574, -111256, 247016, 388246, 279350, -8565, -338135, -572578, -635913, -545439, -393930, -278702, -229589, -203406, -144392, -40440, 77032, 171617, 230149, 256877, 246584, 171690, 9618, -213291, -425228, -575389, -683678, -799535, -922632, -1000368, -1004269]
32789a004269L7846M4637O9108J25466J54321J02414l182q9530j20370j15262
32779g98821j03762r0801o1242O529J29776K98993M58040N25676M56688K85338
32769A106414J02876j3010n2022o2642r6947j65084k36651k74280k61961k11645
32759a64952j52623j08003p0476p586R4653J97929K40008J98107J07225J5064
32749C49346n8736j11400j31221j04277l4595O0021J62520K51223K92476K63368
32739I38725J82161R9809O0003P4569J25648J71851J61217O7631p9128k17101
32729A585385l06670l44620l34613k83350k34013k57851l77086n18484n77804
32720a649106n20229l92782k56001j39213n1069J2911Q0336J78569K83908L27068
$$ y = [-1004269, -966423, -921786, -852678, -727212, -572891, -470477, -473659, -563189, -683559, -798821, -902583, -993384, -1054626, -1048097, -918321, -619328, -161288, 364388, 821076, 1106414, 1209290, 1196280, 1144258, 1081616, 984669, 819585, 582934, 308654, 46693, -164952, -317575, -425578, -496054, -503640, -408987, -211058, 28950, 227057, 334282, 349346, 290610, 179210, 47989, -56288, -90883, -30862, 131658, 382881, 675357, 938725, 1120886, 1220695, 1280698, 1355267, 1480915, 1652766, 1813983, 1881614, 1802486, 1585385, 1278715, 934095, 599482, 316132, 82119, -175732, -552818, -1071302, -1649106, -2169335, -2562117, -2818118, -2957331, -3008400, -2995489, -2915153, -2736584, -2452676, -2125608]
32710b125608K72674J68966R2835O3559L8694j5788q0624j08203p2029Q705P8242
32699a678577Q2176J7136n5672o5837p801N5999O9735M1214J2718l709l3095q2293
32687a648006j09032o7783K4092R2056Q5070L5228K2381Q8020K00892L02168L59978
32676f14936L73360L48000K90335K16849J50118J04591Q2441P6685P1759N2810
32666A152012K5403J3259K3284K9472J2818k73K6590P3713P7294J7030m6344m3705
32654A360553J9326P8043Q7435N5069N992n1090j15550j74615k06610k02729j82748
32643F73076j86034k35355l02141l19674k47109j16890n609L9254L1070R953P07
32632f58752J0938M7560J11627J80570K16394K01468J57156J16698Q5105M1356
$$ y = [-2125608, -1852934, -1683968, -1591133, -1527574, -1488880, -1504668, -1585292, -1693495, -1765524, -1756819, -1678577, -1596401, -1579265, -1634937, -1700774, -1708575, -1652576, -1582841, -1541627, -1528909, -1532618, -1565713, -1648006, -1757038, -1824821, -1800729, -1708673, -1623603, -1588375, -1565994, -1477974, -1277082, -974914, -614936, -241576, 106424, 396759, 613608, 763726, 868317, 950758, 1027443, 1099202, 1152012, 1177415, 1190674, 1213958, 1243430, 1256248, 1255975, 1282565, 1356278, 1433572, 1450602, 1404258, 1360553, 1379879, 1457922, 1545357, 1600426, 1606418, 1555328, 1439778, 1265163, 1058553, 855824, 673076, 487042, 251687, -50454, -370128, -617237, -734127, -739736, -700482, -669412, -659459, -658752, -647814, -600254, -488627, -308057, -91663, 109805, 266961, 383659, 468764, 510120]
32622E10120j7277n1268j5493Q7453K06921K93189L28723L13715K49259J50351
32612B055693N6995R190J1294K8798J4520o4518k05996l58325m39129l94852k50770
32601D62900r3976n151o043n7779r5756p8657k4436P928q933k6429K3371J32328
32589B29367K15419K14292J64141J35450J41969J41715J08897O2196K4836l701
32579A434581k7175l7235l6087m8573q6921j18965r8792k6347M4585N9503Q892
32568A067466p8369j67787k38355k84909l13856l30238l23377k76166j96472j25766
32558a267829r9848j07884j09056q7922p1475q2770r5603n4518O1549K08057L10566
32547a396733L25626K63771J60771M0776q4515j90731k35770j89659o3008R7328
$$ y = [510120, 492843, 441575, 426082, 513535, 720456, 1013645, 1342368, 1656083, 1905342, 2055693, 2112688, 2121878, 2133172, 2161970, 2176490, 2111972, 1905976, 1547651, 1108522, 713670, 462900, 368924, 363773, 357730, 299951, 204195, 125538, 101102, 109030, 100097, 73668, 97039, 229367, 444786, 659078, 823219, 958669, 1100638, 1242353, 1351250, 1413446, 1438282, 1434581, 1407406, 1370171, 1334084, 1285511, 1198590, 1079625, 980833, 954486, 999071, 1058574, 1067466, 989097, 821310, 582955, 298046, -15810, -346048, -669425, -945591, -1142063, -1267829, -1367677, -1475561, -1584617, -1672539, -1744014, -1826784, -1922387, -1976905, -1915356, -1707299, -1396733, -1071107, -807336, -646565, -605789, -690304, -881035, -1116805, -1306464, -1369472, -1272144]
32537a272144K32184K92277K62650J82714J23650J22046J46681J52016J45818
32528C87892J66727K04838J94577R9583l5317j36263j71777j53307j01665m5081
32518D10207k2782n0895r6940j18547j15604j15334j19879j04361o2210k0112
32508d16457o200k5744o3371q6784n8481K6248J19250J67001J70910J68748J68826
32497A63946J49018J16195J07589J17840Q4130j8823j13972j02240J5545J43057
32487F62285K02402J99096J74951J40892P7327k0425j19831j74977j67522j21943
32477H52255p6748m2027M081P4765J46098J80037J64715J19514O7816J8067k9534
32466A479039o6251o8877j8635O3945J11892O4210p0264k21216l29947l86095
$$ y = [-1272144, -1039960, -747683, -485033, -302319, -178669, -56623, 90058, 242074, 387892, 554619, 759457, 954034, 1053617, 1018300, 882037, 710260, 556953, 455288, 410207, 387425, 336530, 239590, 121043, 5439, -109895, -229774, -334135, -396345, -416457, -422657, -448401, -511772, -598556, -657037, -630789, -511539, -344538, -173628, -4880, 163946, 312964, 429159, 536748, 654588, 738718, 719895, 605923, 503683, 519228, 662285, 864687, 1063783, 1238734, 1379626, 1456953, 1436528, 1316697, 1141720, 974198, 852255, 775507, 733480, 737561, 812326, 958424, 1138461, 1303176, 1422690, 1490506, 1508573, 1479039, 1412788, 1343911, 1325276, 1389221, 1501113, 1565323, 1495059, 1273843, 943896, 557801]
32456E57801l88004l10603j44608N8329K14356K68573K06267L2777k11817m29591
32446a46520n09670m15985k10900Q356J73432K55278K58439K23992K06360K20427
32436F3209K25591J79515R4350K1431j1661k9178o8905j25730j44412p6966N3937
32425A81181J63983J88958J43387Q4851M1273K584l0941l6493j0491J7203K8325
32414G73820M5930R8020J72532K27168K27086J59658L5538j04034k02139k35546
32404A198033k37588k50469k69850k63179k29008k01870j97705j86457j30185
32395g68278k9641P4156J31097J15838N2716J1242N1913J61358K57011K70499
32385C27911K13345J45565R3671K6080q9398k27303l19176l19277k43481j43678
$$ y = [557801, 169797, -140806, -285414, -227085, -12729, 255844, 462111, 494888, 283071, -146520, -656190, -1072175, -1283075, -1274719, -1101287, -846009, -587570, -363578, -157218, 63209, 288800, 468315, 562665, 584096, 572435, 543257, 474352, 348622, 204210, 127244, 181181, 345164, 534122, 677509, 762360, 803633, 806217, 775276, 738783, 728292, 745495, 773820, 819750, 917770, 1090302, 1317470, 1544556, 1704214, 1739752, 1635718, 1433579, 1198033, 960445, 709976, 440126, 176947, -52061, -253931, -451636, -638093, -768278, -797919, -723763, -592666, -476828, -424112, -412870, -360957, -199599, 57412, 327911, 541256, 686821, 780492, 806572, 717174, 489871, 170695, -148582, -392063, -535741]
32375e35741n5866J8174Q4092J26852J21283O8285R736o85N4914J38505J86511
32364B16060J67777J12865P6290O6216K7595q8194k47136l50983l34425k22171
32354e76106q4761L3103J19672J59128J31968N5802j1461l1140k7519n0872j08134
32343c90320j52579j37833o0843M7760J51184K16155K19881J71863J21326J19996
32333C06590J71267K26234K32734J81303J04954M6639L0549N2262Q5687J02690
32323A540909R3220O6253L0529k0297r9664k09186l29749m27064m66318m32345
32313b53712l42032k29535j13698R937J37910K36586K71483K49600K06797J55680
32303C29016P7318k6591j06328j13270n5663K0082Q4760J30938J39394R0501J4570
$$ y = [-535741, -591607, -573433, -489341, -362489, -241206, -172921, -163185, -163870, -108956, 29549, 216060, 383837, 496702, 572992, 639208, 666803, 578609, 331473, -19510, -353935, -576106, -660867, -627764, -508092, -348964, -216996, -161194, -172655, -203795, -231314, -282186, -390320, -542899, -680732, -741575, -693815, -542631, -326476, -106595, 65268, 186594, 306590, 477857, 704091, 936825, 1118128, 1223082, 1269721, 1300270, 1352532, 1438219, 1540909, 1634129, 1700382, 1730911, 1710614, 1610950, 1401764, 1072015, 644951, 178633, -253712, -595744, -825279, -938977, -929040, -791130, -554544, -283061, -33461, 173336, 329016, 406334, 379743, 273415, 160145, 104482, 124564, 209324, 340262, 479656, 570157, 584727]
32292E84727j6152L0578J06095J46178J45903J38699J32420J13069R3384J01104
32282A576005J17236Q0435k9545j57302k44339k95706l42363l72920l49220k72897
32272b90616j91620j41941j21608j17518j26185j40961j48900j49403j51973j48278
32262a729003j10419k7315P7022J69865K34811K63447K46936J92135J28522Q2269
32252d71730N4454L3731J3165j6970p1096j42163j89356j75559j08346k4709N3157
32241a045422J24020J80776K08950K12840K16092K28763K34003K14223J72424
32232G46669J21227O9997L2901L1012O8598J16312J34084J08906O0270J1742l1656
32221A470062p6290j18126j35443j08096m6442L686n938q4856j97968k95351l39267
$$ y = [584727, 568575, 599153, 705248, 851426, 997329, 1136028, 1268448, 1381517, 1474901, 1576005, 1693241, 1773676, 1744131, 1586829, 1342490, 1046784, 704421, 331501, -17719, -290616, -482236, -624177, -745785, -863303, -989488, -1130449, -1279349, -1428752, -1580725, -1729003, -1839422, -1866737, -1789715, -1619850, -1385039, -1121592, -874656, -682521, -553999, -471730, -417276, -383545, -370380, -387350, -458446, -600609, -789965, -965524, -1073870, -1098579, -1045422, -921402, -740626, -531676, -318836, -102744, 126019, 360022, 574245, 746669, 867896, 937893, 970794, 1001806, 1070404, 1186716, 1320800, 1429706, 1489976, 1501718, 1470062, 1393772, 1275646, 1140203, 1032107, 985665, 989351, 983413, 898557, 700589, 405238, 65971]
32210F5971l09641k08507p2186L7868Q0467P2282O5809Q6450J03947P4538L343
32199C41m9824l1595M6075J17175J29243Q7913L2343j5926o2120j05358j22520
32188B5747r4279l2712K7100N4312L5764k3222r7194j47691j50195j18534r5882
32177f16786j17455j78620k31674k13956r5869Q4385K40827L09013K96714K62974
32167b60447K57368K88486L35672L68381L58838K99627K13546J31678O2502k655
32157B052996o1094j01401j32000j73591k15640k15662j59623q9265m1986N182
32147H67916R1224J91377K32101J86055J08103O4368N9542N1262J0961m6947p7993
32136A737969l8136P6235K01795K42164J52742j3363j55733k13876j98553j57853
$$ y = [65971, -243670, -452177, -524363, -486495, -406028, -333746, -267937, -181487, -77540, -3002, 341, -49483, -81078, -35003, 82172, 211415, 299328, 331671, 315745, 253625, 148267, 25747, -68532, -101244, -74144, -19832, 15932, -7290, -104484, -252175, -402370, -520904, -616786, -734241, -912861, -1144535, -1358491, -1454360, -1369975, -1129148, -820135, -523421, -260447, -3079, 285407, 621079, 989460, 1348298, 1647925, 1861471, 1993149, 2055651, 2052996, 1991902, 1890501, 1758501, 1584910, 1369270, 1153608, 993985, 904720, 862734, 867916, 959140, 1150517, 1382618, 1568673, 1676776, 1741144, 1800686, 1851948, 1862909, 1815962, 1737969, 1699833, 1776068, 1977863, 2220027, 2372769, 2359406, 2203673, 1989797, 1791244, 1633391]
$$ [...]
##END NTUPLES=NMR SPECTRUM
##END=
