##TITLE=31Pdec_Bau-NOH
 DMSO, 24 sc
 10.6.2022
##JCAMPDX= 6.0         $$ Bruker NMR JCAMP-DX V2.0
##DATA TYPE= NMR SPECTRUM
##DATA CLASS= NTUPLES
##ORIGIN= UXNMR, Bruker Analytische Messtechnik GmbH
##OWNER= root
$$ XWIN-NMR		Version 3.5
$$ Fri Jun 10 14:25:16 2022 Russian Standard Time (UT+4h)  she@DPX200
##.OBSERVE FREQUENCY= 81.013821
##.OBSERVE NUCLEUS= ^31P
##.ACQUISITION MODE= SIMULTANEOUS
##.ACQUISITION SCHEME= undefined
##.AVERAGES= 24
##.DIGITISER RES= 16
##SPECTROMETER/DATA SYSTEM= spect
##.PULSE SEQUENCE= zgpg30
##.SOLVENT NAME= CDCl3
##.SHIFT REFERENCE= (INTERNAL, CDCl3, 0, 248.564)
##AUDIT TRAIL= $$ (NUMBER, WHEN, WHO, WHERE, WHAT)
$$ ##TITLE= Audit trail, XWIN-NMR		Version 3.5
$$ ##JCAMPDX= 5.01
$$ ##ORIGIN= Bruker BioSpin GmbH
$$ ##OWNER= she
$$ F:/spectra/data/she/nmr/P31/1/pdata/1/auditp.txt
$$ ##AUDIT TRAIL=  $$ (NUMBER, WHEN, WHO, WHERE, WHAT)
(   1,<2022-06-10 14:24:01.03 +0400>,<she>,<DPX200>,
      <created by zg, POWCHK disabled, PULCHK disabled
       configuration hash MD5:
       00 E9 B6 7A A2 85 ED C7 34 08 36 98 17 FE 4E 26
       data hash MD5: 32K
       6C 94 06 6C 6A 70 D0 EB C3 4B A5 53 14 03 56 A2>)
(   2,<2022-06-10 14:24:04.14 +0400>,<she>,<DPX200>,
      <Start of raw data processing
       efp BC_mod = 2 LB = 1 FT_mod = 6 PKNL = 1 PHC0 = -10596.83 PHC1 = 763.6547 SI = 64K 
       data hash MD5: 64K
       38 04 D5 76 39 1B 6F 53 C9 8F 11 DF ED 8D 5C 85>)
(   3,<2022-06-10 14:24:36.87 +0400>,<she>,<DPX200>,
      <pk PHC0 = 78.6156 PHC1 = -169.8 
       data hash MD5: 64K
       96 08 F3 06 49 7D 74 B9 26 5E B0 50 59 74 07 9D>)
(   4,<2022-06-10 14:24:40.06 +0400>,<she>,<DPX200>,
      <abs ABSG = 5 
       data hash MD5: 64K
       11 BC 8D C5 F8 79 BE 00 12 F5 82 0C 28 0F 32 C5>)
$$ ##END=
$$ 
$$ hash MD5
$$ 0F 70 65 30 12 36 32 D1 F0 03 80 20 E2 F8 E9 73
##$RELAX= 
##$RELAX= 
##$RELAX= 
##$RELAX= 
##$RELAX= 
##$RELAX= 
##$RELAX= 
##$RELAX= 
$$ Bruker specific parameters
$$ --------------------------
##$DU= <F:/spectra>
##$EXPNO= 1
##$NAME= <P31>
##$PROCNO= 1
##$TYPE= <nmr>
##$USER= <she>
##$AMP= (0..31)
100 100 100 100 100 100 100 100 100 100 100 100 100 100 100 100 100 100 
100 100 100 100 100 100 100 100 100 100 100 100 100 100 
##$AQSEQ= 0
##$AQ_mod= 1
##$AUNM= <au_zg>
##$AUTOPOS= <>
##$BF1= 81.014009
##$BF2= 200.13
##$BF3= 200.13
##$BF4= 200.13
##$BF5= 200.13
##$BF6= 200.13
##$BF7= 200.13
##$BF8= 200.13
##$BYTORDA= 1
##$CFDGTYP= 0
##$CFRGTYP= 5
##$CHEMSTR= <none>
##$CNST= (0..31)
1 1 145 1 1 1 1 1 1 1 1 1 1 1 1 1 1 1 1 1 1 1 1 1 1 1 1 1 1 1 1 1 
##$CPDPRG= <waltz16>
##$CPDPRG1= <>
##$CPDPRG2= <waltz16>
##$CPDPRG3= <>
##$CPDPRG4= <mlev>
##$CPDPRG5= <mlev>
##$CPDPRG6= <mlev>
##$CPDPRG7= <mlev>
##$CPDPRG8= <mlev>
##$CPDPRGB= <>
##$CPDPRGT= <>
##$D= (0..31)
0 1 0 0 0 0 0 0 0 0 0 0.03 2e-05 3e-06 0 0 0 0 0 0 0 0 0 0 0 0 0 0 0 0 
0 0 
##$DATE= 1654856640
##$DBL= (0..7)
120 120 120 11 120 120 24 19 
##$DBP= (0..7)
150 150 150 150 150 150 150 150 
##$DBP07= 0
##$DBPNAM0= <>
##$DBPNAM1= <>
##$DBPNAM2= <>
$$ [...]
##$SUBNAM3= <"">
##$SUBNAM4= <"">
##$SUBNAM5= <"">
##$SUBNAM6= <"">
##$SUBNAM7= <"">
##$SUBNAM8= <"">
##$SUBNAM9= <"">
##$SW= 501.771253377433
##$SWIBOX= (0..15)
0 1 3 0 0 0 0 0 0 0 0 0 0 0 0 0 
##$SW_h= 40650.406504065
##$TD= 32768
##$TD0= 1
##$TE= 0
##$TE2= 300
##$TE3= 300
##$TEG= 300
##$TL= (0..7)
0 120 53 12 22 120 120 120 
##$TP= (0..7)
150 150 150 150 150 150 150 150 
##$TP07= 0
##$TPNAME0= <>
##$TPNAME1= <>
##$TPNAME2= <>
##$TPNAME3= <>
##$TPNAME4= <>
##$TPNAME5= <>
##$TPNAME6= <>
##$TPNAME7= <>
##$TPOAL= (0..7)
0.5 0.5 0.5 0.5 0.5 0.5 0.5 0.5 
##$TPOFFS= (0..7)
0 0 0 0 0 0 0 0 
##$TUNHIN= 0
##$TUNHOUT= 0
##$TUNXOUT= 0
##$USERA1= <user>
##$USERA2= <user>
##$USERA3= <user>
##$USERA4= <user>
##$USERA5= <user>
##$V9= 5
##$VALIST= <valist>
##$VCLIST= <CCCCCCCCCCCCCCC>
##$VD= 0
##$VDLIST= <DDDDDDDDDDDDDDD>
##$VPLIST= <PPPPPPPPPPPPPPP>
##$VTLIST= <TTTTTTTTTTTTTTT>
##$WBST= 1024
##$WBSW= 4
##$XGAIN= (0..3)
0 0 0 0 
##$XL= 0
##$YL= 0
##$YMAX_a= 1700
##$YMIN_a= -3414
##$ZGOPTNS= <>
##$ZL1= 120
##$ZL2= 120
##$ZL3= 120
##$ZL4= 120
##$ABSF1= 248.5645
##$ABSF2= -253.2056
##$ABSG= 5
##$ABSL= 3
##$ALPHA= 0
##$AQORDER= 0
##$ASSFAC= 0
##$ASSFACI= 0
##$ASSFACX= 0
##$ASSWID= 0
##$AUNMP= <proc_1d>
##$AZFE= 0.1
##$AZFW= 0.5
##$BCFW= 0
##$BC_mod= 2
##$BYTORDP= 0
##$COROFFS= 0
##$CY= -3
##$DATMOD= 1
##$DC= 0
##$DFILT= <>
##$DTYPP= 0
##$F1P= 0
##$F2P= 0
##$FCOR= 1
##$FTSIZE= 65536
##$FT_mod= 6
##$GAMMA= 0
##$GB= 0
##$INTBC= 1
##$INTSCL= 5.30512e-09
##$ISEN= 30
##$LB= 1
##$LEV0= 0
##$LPBIN= 0
##$MAXI= 10000
##$MC2= 0
##$MEAN= 0
##$ME_mod= 0
##$MI= 50
##$NCOEF= 0
##$NC_proc= -8
##$NLEV= 6
##$NOISF1= 182.463
##$NOISF2= 159.3651
##$NSP= 0
##$NTH_PI= 0
##$NZP= 0
##$OFFSET= 248.5645
##$PC= 4
##$PHC0= -10518.21
##$PHC1= 593.8547
##$PH_mod= 1
##$PKNL= yes
##$PPARMOD= 0
##$PSCAL= 0
##$PSIGN= 0
##$REVERSE= no
##$SF= 81.014009
##$SI= 65536
##$SIGF1= 159.3651
##$SIGF2= -187.1042
##$SINO= 113.3802
##$SIOLD= 16384
##$SREGLST= <1H.CDCl3>
##$SSB= 0
##$STSI= 65536
##$STSR= 0
##$SW_p= 40650.406504065
##$SYMM= 0
##$S_DEV= 0
##$TDeff= 32768
##$TDoff= 0
##$TI= <>
##$TILT= no
##$TM1= 0
##$TM2= 0
##$TOPLEV= 0
##$USERP1= <user>
##$USERP2= <user>
##$USERP3= <user>
##$USERP4= <user>
##$USERP5= <user>
##$WDW= 1
##$XDIM= 65536
##$YMAX_p= 472440012
##$YMIN_p= -62287461
$$ End of Bruker specific parameters
$$ ---------------------------------
##NTUPLES= NMR SPECTRUM
##VAR_NAME=  FREQUENCY,     SPECTRUM/REAL,   SPECTRUM/IMAG
##SYMBOL=    X,             R,               I
##VAR_TYPE=  INDEPENDENT,   DEPENDENT,       DEPENDENT
##VAR_FORM=  AFFN,          ASDF,            ASDF
##VAR_DIM=   65536,         65536,           65536
##UNITS=     HZ,            ARBITRARY UNITS, ARBITRARY UNITS
##FACTOR=    0.620285442955139, 1,           1
##FIRST=     20137.2065510759, 0,            0
##LAST=      -20513.1999529892, 0,           0
##MIN=       -20513.1999529892, -62287461,   0
##MAX=       20137.2065510759, 472440012,    0
$$ Real data points
##PAGE= N=1
##DATA TABLE= (X++(R..R)), XYDATA
$$ [...]
$$ plain form
37534 4416899 6956216 3048618 -5269237 -9405099 -5620801 35380 411816 -3349401
37526 -3349401 -4670180 -1166575 2878820 3039740 -222501 -3940569 -6861170 -9188275
37518 -9188275 -10035432 -7841843 -3058521 1623739 4086771 4474157 3879383 2865876 1883144
37509 1883144 1737465 2665411 3972934 5437112 7810416 10854723 12506892 11939574 11936954
37500 11936954 15158502 18647852 15979107 6008797 -4019970 -6504485 -2076597 2637229
37492 2637229 3718289 2662391 1478162 -329885 -2945108 -4344712 -3485247 -2635278
37484 -2635278 -3887183 -5421169 -4393712 -2191770 -2982486 -7028695 -9329798 -6413472
37476 -6413472 -1354838 392648 -2001829 -4769396 -5206068 -4132135 -3159096 -2815223 -3868393
$$ packed form
37534D416899K539317l907598q317855m135862L784298N656181L76436l761217
37526c349401j320779L503605M045395J60920l262241l718068k920601k327105
37518i188275q47157K193589M783322M682260K463032L87386n94774j013507r82732
37509A883144j45679R27946J307523J464178K373304L044307J652169n67318k620
37500A1936954L221548L489350k668745r970310j0028767k484515M427888M713826
37492B637229J081060j055898j184229j808047k615223j399604Q59465Q49969
37484b635278j251905j533986J027457K201942p90716m046209k301103K916326
37476f413472N058634J747486k394477k767567m36672J073933R73039L43873j053170
$$ plain form
37467 -3868393 -7270041 -11241236 -11135606 -4730330 3780866 7511467 4048475 -2850257
37459 -2850257 -8016916 -9433185 -8459232 -7463652 -7457944 -7128599 -4717912 -1605206 -2138753
37450 -2138753 -7695815 -12864858 -11349115 -4709006 -481555 -1407245 -2179225 960915
37442 960915 3226939 -1412470 -10145451 -14659882 -12553943 -9206528 -8770979 -9459115 -8809717
37433 -8809717 -7976502 -8300477 -7994547 -5168947 -936404 3031966 6967256 10517512 11174973
37424 11174973 8457222 6541142 8663593 11446058 9543071 4102584 1113976 2056531
37416 2056531 2213514 -845389 -3046817 -639545 3728286 5392371 4368756 3570376
37408 3570376 3166024 1283064 -1340015 -2003138 -709998 -18471 -482584 -366899 58676
$$ packed form
37467c868393l401648l971195J05630O405276Q511196L730601l462992o898732
37459b850257n166659j416269R73953R95580N708L29345K410687L112706n33547
37450b138753n557062n169043J515743O640109M227451r25690p71980L140140
37442I60915K266024m639409q732981m514431K105939L347415M35549o88136O49398
37433h809717Q33215l23975L05930K825600M232543L968370L935290L550256O57461
37424A1174973k717751j916080K122451K782465j902987n440487k988608R42555
37416B056531J56983l058903k201428K407272M367831J664085j023615p98380
37408C570376m04352j882960k623079o63123J293140O91527m64113J15685M25575
$$ plain form
37399 58676 -1455571 -3903645 -2742573 2826480 6884721 4787658 385255 485129 4738914
37390 4738914 6755342 4216277 1690435 2529226 3798565 1858051 -1732713 -3445581
37382 -3445581 -3422884 -3892606 -4378794 -2672649 787899 3388809 4395234 5020397 5171179
37373 5171179 3801554 2047512 2032174 2514329 -30840 -5236859 -8041862 -5660516 -1444185
37364 -1444185 331193 -116522 -482045 -806414 -2172992 -3544919 -3352560 -2351015 -1876247
37355 -1876247 -1323343 -479923 -1850854 -6574987 -10303339 -8309005 -3362893 -2693169 -7256590
37346 -7256590 -10148854 -6811287 -754015 3235957 5697662 8457754 9155306 5267843
37338 5267843 257377 -304412 2826236 3746350 591395 -2112844 -1164425 540356 -700094
$$ packed form
37399E8676j514247k448074J161072N569053M058241k097063m402403R9874M253785
37390D738914K016428k539065k525842Q38791J269339j940514l590764j712868
37382c445581K2697m69722m86188J706145L460548K600910J006425O25163J50782
37373E171179j369625j754042j5338M82155k545169n206019k805003K381346M216331
37364a444185J775378m47715l65523l24369j366578j371927J92359J001545M74768
37355a876247N52904Q43420j370931m724133l728352J994334M946112O69724m563421
37346g256590k892264L337567O057272L989972K461705K760092O97552l887463
37338E267843n010466n61789L130648R20114l154955k704239R48419J704781j240450
$$ plain form
37329 -700094 -3564833 -4529730 -3617690 -3503053 -4408759 -3791767 -906693 1760321 2232949
37320 2232949 1201335 -695829 -4634819 -10228677 -12914495 -8623707 -353618 4003738
37312 4003738 1196203 -3637463 -4335305 -1281949 1091612 1123881 99406 -2200859 -6821127
37303 -6821127 -10875041 -9046777 -1512549 4273018 2546950 -3429796 -6251575 -3973526
37295 -3973526 -1058815 -1105409 -2530318 -1766386 2040844 6517796 8843945 8287777 6365326
37286 6365326 4662943 2935851 356037 -1897015 -1612572 603930 1423012 -25082
37278 -25082 -261842 3029037 6810826 7346433 6291201 7754381 11033546 11311493 7232454
37269 7232454 2939517 1896925 2954961 3721094 3959232 4001619 3158840 1665501 1515522
$$ packed form
37329g00094k864739r64897R12040J14637r05706O16992K885074K667014M72628
37320B232949j031614j897164l938990n593858k685818M290788Q270089M357356
37312D003738k807535m833666o97842L053356K373561L2269j024475k300265m620268
37303f821127m053914J828264P534228N785567j726068n976746k821779K278049
37295c973526K914711m6594j424909P63932L807230M476952K326149n56168j922451
37286F365326j702383j727092k579814k253052K84443K216502Q19082j448094
37278b5082k36760L290879L781789N35607j055232J463180L279165K77947m079039
37269G232454m292937j042592J058036P66133K38138M2387q42779j493339j49979
$$ plain form
37260 1515522 3574292 6178732 7989056 9665378 11261193 10793753 7374431 3184844
37252 3184844 240856 -2305691 -5395137 -7233489 -6053790 -3425460 -1764013 -645120
37244 -645120 1048372 1430454 -1644056 -5468379 -5034353 -654066 1815864 -513002 -3249628
37235 -3249628 -1148491 4596767 8316814 6939414 2471725 -1152349 -1422440 1493752
37227 1493752 4761528 4827060 1108594 -2809455 -3145285 -356349 2051460 2460812 2684919
37218 2684919 4415323 6241885 5455905 1876153 -1418399 -1325427 1847526 4693251 4627914
37209 4627914 2916948 2818867 5062193 7053301 7154350 7322679 9418918 10955389 8100215
37200 8100215 2231814 -735683 1526070 4473578 3775036 1752797 2878019 5810169
$$ packed form
37260A515522K058770K604440J810324J676322J595815m67440l419322m189587
37252C184844k943988k546547l089446j838352J179699K628330J661447J118893
37244f45120J693492L82082l074510l824323M34026M380287K469930k328866k736626
37235c249628K101137N745258L720047j377400m467689l624074k70091K916192
37227A493752L267776O5532l718466l918049l35830K788936K407809M09352K24107
37218B684919J730404J826562p85980l579752l294552R2972L172953K845725o5337
37209D627914j710966r8081K243326J991108J01049J68329K096239J536471k855174
37200H100215n868401k967497K261753K947508o98542k022239J125222K932150
$$ plain form
37192 5810169 5286696 816131 -2389091 -1860125 -1462493 -4131507 -6330897 -3956882 304833
37183 304833 1039663 -793119 1037687 8052137 13874798 12464691 5117974 -2542025
37175 -2542025 -6729002 -6505448 -2247414 3782032 7677220 7686543 6170380 5429304 3704166
37166 3704166 -1471490 -7607748 -9124308 -4900211 -251853 -190702 -3459525 -5045401
37158 -5045401 -2839169 375815 1132741 -407809 -1248801 114104 1782569 1653177 994788
37149 994788 2456513 4948411 3857310 -2362054 -8961042 -10802530 -9024065 -8443941
37141 -8443941 -10040767 -10176497 -6917235 -2883465 -825253 79835 1671675 3134479
37133 3134479 2120623 -1748419 -6185149 -8383303 -7067854 -3344441 -157645 100981
$$ packed form
37192E810169n23473m470565l205222N28966L97632k669014k199390K374015M261715
37183C04833P34830j832782J830806P014450N822661j410107p346717p659999
37175b542025m186977K23554M258034O029446L895188R323j516163p41076j725138
37166C704166n175656o136258j516560M224097M648358O1151l268823j585876
37158e045401K206232L214984P56926j540550q40992J362905J668465j29392o58389
37149I94788J461725K491898j091101o219364o598988j841488J778465N80124
37141h443941j596826j35730L259262M033770K058212R05088J591840J462804
37133C134479j013856l869042m436730k198154J315449L723413L186796K58626
$$ plain form
37125 100981 -1924881 -3254396 -1962309 1083994 3736803 4324462 1946460 -2984790
37117 -2984790 -7942859 -9897967 -8632026 -6997565 -7199142 -8350334 -8392407 -6773949 -4399814
37108 -4399814 -2554888 -2721975 -5663090 -9526734 -10594936 -7401000 -2808611 -626571
37100 -626571 -1287521 -2178084 -1269233 838046 1908963 490088 -2012394 -1847561 2925577
37091 2925577 9023932 11065680 8204500 4622342 2950143 1185330 -2156485 -4150810
37083 -4150810 -2072446 1499194 2240489 353246 -810037 -445040 -323423 -517786 521515
37074 521515 2386397 3244989 3309034 3972579 4448740 3400501 2765429 5008353 7455634
37065 7455634 5299955 261520 -411862 4987634 9300688 7051686 1967108 -46958
$$ packed form
37125A00981k025862j329515J292087L046303K652809N87659k378002m931250
37117b984790m958069j955108J265941J634461k01577j151192m2073J618458K374135
37108d399814J844926j67087k941115l863644j068202L193936M592389K182040
37100f26571o60950q90563R08851K107279J070917j418875k502482J64833M773138
37091B925577O098355K041748k861180l582158j672199j764813l341815j994325
37083d150810K078364L571640P41295j887243j163283L64997J21617j94363J039301
37074E21515J864882Q58592O4045O63545M76161j048239o35072K242924K447281
37065G455634k155679n038435o73382N399496M313054k249002n084578k014066
$$ plain form
37057 -46958 402351 -246165 -1227095 -167333 398933 -3630768 -9721455 -10824050 -5570195
37048 -5570195 59500 2044984 3078941 5858978 7318184 3567692 -3058768 -6431983
37040 -6431983 -4512614 -931915 807991 1223346 2254183 3571195 3406553 1868911
37032 1868911 1265093 2825425 4702383 4347090 1943390 -29449 -189852 628978 1626888
37023 1626888 3151721 4818104 4806252 2610046 601377 852761 1930177 1229682 -627444
37014 -627444 -566052 2109601 4500027 4271624 2692011 2416321 3834080 4845678 3468730
37005 3468730 -193369 -4133987 -6085922 -5265475 -2754489 -182194 1608572 2397340
36997 2397340 1901064 133152 -1868907 -2474082 -750947 2649427 5550191 5631450 2933850
$$ packed form
37057d6958M49309o48516r80930J059762N66266m029701o090687j102595N253855
37048e570195N629695J985484J033957K780037J459206l750492o626460l373215
37040f431983J919369L580699J739906M15355J030837J317012j64642j537642
37032A868911o03818J560332J876958l55293k403700j972839j60403Q18830R97910
37023A626888J524833J666383j1852k196206k008669K51384J077416p00495j857126
37014f27444O1392K675653K390426k28403j579613k75690J417759J011598j376948
37005C468730l662099l940618j951935Q20447K510986K572295J790766P88768
36997B397340m96276j767912k002059o05175J723135L400374K900764Q1259k697600
$$ plain form
36988 2933850 661500 1699728 4497892 4933145 2436405 785540 1708352 1946124 -677372
36979 -677372 -2604064 -310926 2887919 1552921 -2771494 -3854934 -1240868 -1059848
36971 -1059848 -5381685 -7918888 -3413594 4400514 8107228 5649334 344236 -4507060
36963 -4507060 -7177520 -6673623 -4243911 -3516605 -5754204 -7158725 -4151774 1003662
36955 1003662 3413448 2173982 -87208 -2263947 -4911907 -6661846 -5242813 -1844432
36947 -1844432 -231099 -1265240 -1979836 -377168 2347310 4772581 6984375 8494618
36939 8494618 7456783 3181599 -2512027 -6882058 -7584523 -3337867 3850976 7990501
36931 7990501 4602875 -2973643 -6759416 -4077370 -101279 379500 -1134731 -1347256
$$ packed form
36988B933850k272350J038228K798164M35253k496740j650865R22812K37772k623496
36979f77372j926692K293138L198845j334998m324415j083440K614066J81020
36971a059848m321837k537203M505294P814108L706714k457894n305098m851296
36963d507060k670460N03897K429712P27306k237599j404521L006951N155436
36955A003662K409786j239466k261190k176739k647960j749939J419033L398381
36947a844432J613333j034141p14596J602668K724478K425271K211794J510243
36939H494618j037835m275184n693626m370031p02465M246656P188843M139525
36931G990501l387626p576518l785773K682046L976091M80779j514231k12525
$$ plain form
36923 -1347256 -904413 -2070496 -4012394 -4329868 -3229374 -2749769 -3367600 -4342722 -6023982
36914 -6023982 -8948057 -11722400 -12287248 -10372817 -6938100 -2760832 660857 1146178
36906 1146178 -801895 -1145082 2256470 5992223 6384537 5448447 6725336 7712907 2882136
36897 2882136 -6549946 -12614271 -11196570 -6453176 -3027446 -31595 4337685 7811722
36889 7811722 7851371 6306307 6042751 6143462 4549187 2654803 2990038 4523575 4549546
36880 4549546 3564579 4047022 5627299 5699216 4189265 3731370 5182842 6341786 5147128
36871 5147128 1433492 -3956922 -8980019 -10195836 -6146146 -452373 1662982 -601158
36863 -601158 -4125349 -7055558 -9371562 -9478615 -5608255 -693222 -321343 -4749206 -8109674
$$ packed form
36923a347256M42843j166083j941898l17474J100494M79605o17831r75122j681260
36914f023982k924075k774343n64848J914431L434717M177268L421689M85321
36906A146178j948073l43187L401552L735753L92314r36090J276889R87571m830771
36897B882136r432082o064325J417701M743394L425730K995851M369280L474037
36889G811722L9649j545064k63556J00711j594275j894384L35235J533537K5971
36880D549546r84967M82443J580277P1917j509951m57895J451472J158944j194658
36871E147128l713636n390414n023097j215817M049690N693773K115355k264140
36863f01158l524191k930209k316004j07053L870360M915033L71879m427863l360468
$$ plain form
36854 -8109674 -6921216 -4031544 -2247313 115753 4179849 6499159 4371836 672085
36846 672085 -1062914 -2184126 -4676185 -5440225 -925424 5455658 7177880 4269340
36838 4269340 2590356 4124511 4546656 1042943 -3479659 -5613944 -5943051 -6415600 -7237978
36829 -7237978 -8122219 -9210542 -9356048 -6695261 -2067138 1303166 2347080 2936742 3531225
36820 3531225 2320014 19268 818907 5978465 10576956 9876321 5579754 2285231
36812 2285231 560696 -2443678 -7172787 -10313719 -8920392 -3470758 2776567 6048693
36804 6048693 4786532 1303977 -751727 -1297437 -3633764 -8422141 -11543222 -10203954
36796 -10203954 -7340881 -6594877 -6499447 -3953027 -288224 1329490 2082227 5119168 8582314
$$ packed form
36854h109674J188458K889672J784231K363066M064096K319310k127323l699751
36846F72085j734999j121212k492059p64040M514801O381082J722222k908540
36838D269340j678984J534155M22145l503713m522602k134285l29107m72549q22378
36829g237978q84241j088323j45506K660787M628123L370304J043914N89662N94483
36820C531225j211211k300746P99639N159558M598491p00635m296567l294523
36812B285231j724535l004374m729109l140932J393327N449634O247325L272126
36804F048693j262161l482555k055704n45710k336327m788377l121081J339268
36796a0203954K863073P46004R5430K546420L664803J617714P52737L036941L463146
$$ plain form
36787 8582314 7662595 3322145 1986764 5354271 7374645 4106569 287500 1812312
36779 1812312 6603940 8101269 4487882 -691256 -4751985 -7446495 -7658547 -3891961
36771 -3891961 1793117 4819823 3848609 1894894 1141856 460860 -807229 -614802 2000774
36762 2000774 4262239 3760413 2549436 3621180 5380097 4083495 949051 1674644
36754 1674644 7662050 12401351 9644527 1960990 -2710978 -1250237 2027241 2408653
36746 2408653 350132 -820735 617596 4148535 8229871 10316791 7836912 1321629
36738 1321629 -4857915 -6837631 -5145901 -2548035 219897 3782098 6412177 4878592
36730 4878592 -284597 -3627785 -959596 5131774 8105916 5115047 -39666 -1648465
$$ packed form
36787H582314r19719m340450j335381L367507K020374l268076l819069J524812
36779A812312M791628J497329l613387n179138m060729k694510k12052L766586
36771c891961N685078L026706r71214j953715p53038o80996j268089J92427K615576
36762B000774K261465n01826j210977J071744J758917j296602l134444P25593
36754A674644N987406M739301k756824p683537m671968J460741L277478L81412
36746B408653k058521j170867J438331L530939M081336K086920k479879o515283
36738A321629o179544j979716J691730K597866K767932L562201K630079j533585
36730D878592n163189l343188K668189O091370K974142k990869n154713j608799
$$ plain form
36722 -1648465 1592092 5634118 5834895 1872818 -2357247 -3446769 -2285874 -2543297
36714 -2543297 -5756789 -9228952 -9472087 -6784308 -4880875 -5931241 -7718431 -7040910
36706 -7040910 -4688157 -4589851 -7960743 -11053770 -10186630 -6649852 -4186830 -3377710 -1857635
36697 -1857635 673506 1489331 -603507 -3154263 -3676047 -2411121 -191116 3413381
36689 3413381 7903956 10630987 10211400 8935428 9286165 10109748 8907048 6070378 3924408
36680 3924408 3052708 2501039 2317894 2939833 3240022 2149448 1027549 1407215 1799131
36671 1799131 146981 -2130362 -2686267 -3276550 -6966737 -11144295 -9743638 -3246411
36663 -3246411 326592 -2899993 -6328901 -2740789 4664407 6992142 2214044 -3408215
$$ packed form
36722a648465L240557M042026K00777l962077m230065j089522J160895k57423
36714b543297l213492l472163k43135K687779J903433j050366j787190O77521
36706g040910K352753R8306l370892l093027Q67140L536778K463022Q09120J520075
36697a857635K531141Q15825k092838k550756n21784J264926K220005L604497
36689C413381M490575K727031m19587j275972L50737Q23583j202700k836670k145970
36680C924408q71700n51669j83145O21939L00189j090574j121899L79666L91916
36671A799131j652150k277343n55905n90283l690187m177558J400657O497227
36663c246411L573003l226585l428908L588112P405196K327735m778098n622259
$$ plain form
36655 -3408215 -5208656 -5111377 -5938820 -6131317 -2945408 2123145 4278038 1131256 -4415064
36646 -4415064 -7321930 -5857085 -3372630 -4224790 -8283218 -10842123 -8313008 -2324740
36638 -2324740 2768064 4610860 3501386 256859 -3822220 -5839006 -3428886 1524440
36630 1524440 3883413 1054564 -4005031 -6643338 -5767694 -3807826 -2632860 -1504935
36622 -1504935 952268 4446574 7503835 9338816 10098803 9448999 6190664 46659
36614 46659 -6754687 -10681375 -9917981 -5879805 -1717660 505834 1317120 2646519 4942101
36605 4942101 5860021 3015095 -1983735 -4309785 -1871850 1585844 1472189 -1318498
36597 -1318498 -2114687 556018 3486234 4346310 4700080 6054112 6399838 3263270 -1870350
$$ packed form
36655c408215j800441R7279q27443j92497L185909N068553K154893l146782n546320
36646d415064k906866J464845K484455q52160m058428k558905K529115N988268
36638b324740N092804J842796j109474l244527m079079k016786K410120M953326
36630A524440K358973k828849n059595k638307Q75644J959868J174966J127925
36622a504935K457203L494306L057261J834981P59987o49804l258335o144005
36614D6659o801346l926688P63394M038176M162145K223494Q11286J329399K295582
36605D942101R17920k844926m998830k326050K437935L457694j13655k790687
36597a318498p96189K670705K930216Q60076L53770J354032L45726l136568n133620
$$ plain form
36588 -1870350 -4655980 -2511995 3147258 8082533 7849981 1311190 -7101089 -10688221
36580 -10688221 -7758937 -3627391 -3568242 -6215962 -6765900 -4581969 -3570369 -5586769
36572 -5586769 -7597348 -6420954 -3193817 -1283107 -1585113 -1878171 -261920 2322294
36564 2322294 3400310 2150951 502444 753664 2822247 4863364 6045104 6885619
36556 6885619 6841560 4067461 -1215951 -5321762 -5135169 -2241342 -948691 -2950062 -5799910
36547 -5799910 -6251177 -3569221 81287 1293796 -1909636 -7643392 -10891191 -8196977
36539 -8196977 -1621223 2983977 1705234 -3780676 -7894920 -6397994 -720226 3062199
36531 3062199 762295 -4875239 -7678392 -6021208 -3987599 -4380110 -4915651 -3145834
$$ packed form
36588a870350k785630K143985N659253M935275k32552o538791q412279l587132
36580a0688221K929284M131546N9149k647720n49938K183931J011600k016400
36572e586769k010579J176394L227137J910710l02006k93058J616251K584214
36564B322294J078016j249359j648507K51220K068583K041117J181740Q40515
36556F885619m4059k774099n283412m105811J86593K893827J292651k001371k849848
36547e799910m51267K681956L650508J212509l203432n733756l247799K694214
36539h196977O575754M605200j278743n485910m114244J496926N677768L782425
36531C062199k299904n637534k803153J657184K033609l92511n35541J769817
$$ plain form
36523 -3145834 -813993 -174201 407686 3386110 7428523 9688941 10045391 9207576 5600792
36514 5600792 -1068371 -5881531 -4161830 901727 2159855 -1118121 -3183608 -1522737
36506 -1522737 438091 880707 2506747 5886828 6765679 3199898 -521805 -746222 -36103
36497 -36103 -1955721 -5000340 -6050773 -5792949 -6166729 -5934412 -3437013 -790643 -716914
36488 -716914 -1754303 -1107563 248517 20570 -264606 2149489 5323305 4892057 1234716
36479 1234716 -1221929 -1342332 -2100585 -3834513 -2774415 2084025 6097049 5511790 2464003
36470 2464003 748080 587479 696007 1933388 5087440 7609394 6556142 3185064
36462 3185064 989065 509392 -56185 -51413 3261947 9047249 11973858 8922282 3456062
$$ packed form
36523c145834K331841O39792N81887K978424M042413K260418L56450q37815l606784
36514E600792o669163m813160J719701N063557J258128l277976k065487J660871
36506a522737J960828M42616J626040L380081Q78851l565781l721703k24417P10119
36497c6103j919618l044619j050433K57824l73780K32317K497399K646370P3729
36488g16914j037389O46740J356080k27947k85176K414095L173816m31248l657341
36479A234716k456645j20403p58253j733928J060098M858440M013024n85259l047787
36470B464003j715923j60601J08528J237381L154052K521954j053252l371078
36462C185064k195999m79673n65577M772L313360N785302K926609l051576n466220
$$ plain form
36453 3456062 1248433 3425639 6941493 9388064 10136654 8126589 2682883 -3269260
36445 -3269260 -4793009 -1320219 1673296 -445154 -5363433 -7225989 -4241998 185145
36437 185145 2794191 3526154 3311677 1972916 -626534 -3347761 -4761298 -4369013 -2625947
36428 -2625947 -729859 -79566 -707976 -827832 665710 2263161 2293025 1894371 2739851
36419 2739851 3177262 636329 -2684400 -1351990 5234670 10929711 10760744 6578352
36411 6578352 2560317 -744646 -4564487 -7454982 -6758444 -2745769 2008549 6134333
36403 6134333 9734909 12465795 13725509 13658763 12285030 9235966 5784931 4774144
36395 4774144 6682853 8341374 7541624 5929276 5044752 3226978 -202202 -1564343
$$ packed form
36453C456062k207629K177206L515854K446571P48590k010065n443706n952143
36445c269260j523749L472790K993515k118450m918279j862556K983991M427143
36437A85145K609046P31963k14477j338761k599450k721227j413537L92285J743066
36428b625947J896088O50293o28410j19856J493542J597451K9864l98654Q45480
36419B739851M37411k540933l320729J332410O586660N695041j68967m182392
36411F578352m018035l304963l819841k890495O96538M012675M754318M125784
36403F134333L600576K730886J259714o6746j373733l049064l451035j010787
36395D774144J908709J658521p99750j612348q84524j817774l429180j362141
$$ plain form
36387 -1564343 1688409 5314114 3662544 -1451279 -3129366 564271 4818405 5918445
36379 5918445 5102225 4183565 2753224 923919 240319 403858 -1104407 -4830556 -7885448
36370 -7885448 -7484435 -3402042 2816371 8192317 8990270 4854428 912844 1242880 2059914
36361 2059914 -2603145 -10049964 -11608008 -6049877 -1462581 -1972021 -1907465 2883224 6842863
36352 6842863 3987826 -1865259 -3324640 -380415 2024800 2824999 3976004 4588634
36344 4588634 3299657 3311574 7498387 11233699 8290249 2004635 1693188 8344739 12892838
36335 12892838 9977388 4788405 3326625 3598198 989889 -3506045 -5553313 -4113796
36327 -4113796 -1390217 1093286 2619345 1804523 -1559632 -4816382 -5278785 -3225635
$$ packed form
36387a564343L252752L625705j651570n113823j678087L693637M254134J100040
36379E918445q16220r18660j430341j829305o83600J63539j508265l726149l054892
36370g885448M01013M082393O218413N375946P97953m135842l941584L30036Q17034
36361B059914m663059p446819j558044N558131M587296n09440O4556M790689L959639
36352F842863k855037n853085j459381K944225K405215Q00199J151005O12630
36344D588634j288977J1917M186813L735312k943450o285614l11447O651551M548099
36335A2892838k915450n188983j461780K71573k608309m495934k047268J439517
36327d113796K723579K483503J526059q14822l364155l256750m62403K053150
$$ plain form
36319 -3225635 -41285 4400456 9809573 12949786 10556342 4228111 -560358 -639312
36311 -639312 1730610 2456633 752016 -585354 292588 995313 -2200678 -8386044 -11712825
36302 -11712825 -8743214 -3482048 -1910617 -3657281 -3728099 -1417246 -1561331 -5975268
36294 -5975268 -9620325 -8190817 -4516709 -3449195 -4344289 -3312496 -116209 2186606
36286 2186606 2833028 3753273 5147495 5130172 3622430 2573428 2240765 1123976 -147454
36277 -147454 1059677 4440561 5886911 3296087 -89863 -244118 2613688 5930111
36269 5930111 9170075 13083390 16163699 15396483 10670192 5828437 4382891 5547907
36261 5547907 5447115 1752320 -3551974 -6310353 -5052659 -2916433 -3799705 -7366709
$$ packed form
36319c225635L184350M441741N409117L140213k393444o328231m788469p8954
36311f39312K369922P26023j704617j337370Q77942P02725l195991o185366l326781
36302a1712825K969611N261166J571431j746664p0818K310853j44085m413937
36294e975268l645057J429508L674108J067514q95094J031793L196287K302815
36286B186606O46422R20245J394222j7323j507742j049002l32663j116789j271430
36277a47454J207131L380884J446350k590824l385950j54255K857806L316423
36269E930111L239964L913315L080309p67216m726291m841755j445546J165016
36261E547907j00792l694795n304294k758379J257694K136226q83272l567004
$$ plain form
36253 -7366709 -9792477 -9219568 -7694571 -6869321 -5043768 -956251 2175272 293098
36245 293098 -4967315 -7586136 -5203505 -1835578 -1305310 -1819711 198894 3694739 4152173
36236 4152173 226478 -4276060 -5448419 -3770219 -2622639 -4053176 -7082780 -9115179
36228 -9115179 -8020809 -3572288 2067735 5437210 4336405 -116253 -4166161 -4698597
36220 -4698597 -2120202 337741 462959 -485422 -90899 1157490 43915 -4840170 -10711337
36211 -10711337 -13757771 -13064610 -10228209 -6812427 -3885304 -2513935 -2542599 -1977504 258003
36202 258003 2045020 906743 -2011005 -3607604 -3429065 -3201996 -2595626 221708 3671566
36193 3671566 3271597 -1455124 -5136605 -4038737 -1218054 -967357 -1928650 -138947 3679083
$$ packed form
36253g366709k425768N72909J524997Q25250J825553M087517L131523j882174
36245B93098n260413k618821K382631L367927N30268n14401K018605L495845M57434
36236D152173l925695m502538j172359J678200J147580j430537l029604k032399
36228i115179J094370M448521N640023L369475j100805m452658m049908n32436
36220d698597K578395K457943J25218r48381L94523J248389j113575m884085n871167
36211a0711337l046434O93161K836401L415782K927123J371369k8664N65095K235507
36202B58003J787017j138277k917748j596599J78539K27069O06370K817334L449858
36193C671566l99969m726721l681481J097868K820683K50697r61293J789703L818030
$$ plain form
36184 3679083 4886892 2074347 -984907 -655931 2627269 6018590 7228640 5755965
36176 5755965 3275289 2443960 3430370 2794249 -1650553 -6363648 -6132710 -1815097 202845
36167 202845 -3374270 -8601138 -9811956 -6017879 -642274 2334434 1113087 -2231698
36159 -2231698 -2260925 4249998 12509477 13599853 5843772 -2052965 -2095405 2766126 3601881
36150 3601881 -2294125 -9134783 -11123225 -8229390 -3577872 400420 2116337 752878
36142 752878 -2082185 -2943237 -531194 2383976 2388142 -375779 -2677110 -2104740 587162
36133 587162 2692136 2356195 266032 -1137807 -200946 2252723 4008468 3911386 2620458
36124 2620458 1211277 31632 -856257 -975223 250597 2802343 5954353 8591720
$$ packed form
36184C679083J207809k812545l059254L28976L283200L391321J210050j472675
36176E755965k480676q31329R86410o36121m444802m713095K30938M317613K017942
36167B02845l577115n226868j210818L794077N375605K976708j221347l344785
36159b231698k9227O510923Q259479J090376p756081p896737m2440M861531Q35755
36150C601881n896006o840658j988442K893835M651518L978292J715917j363459
36142G52878k835063q61052K412043K915170M166k763921k301331N72370K691902
36133E87162K104974l35941k090163j403839R36861K453669J755745r7082j290928
36124B620458j409181j179645q87889j18966J225820K551746L152010K637367
$$ plain form
36116 8591720 9646122 8792914 6916131 5279875 3929412 1681097 -1644851 -3920401
36108 -3920401 -3200582 -1205046 -2043645 -6484430 -9666781 -6806976 162731 4656774
36100 4656774 3701740 689089 -622044 -879503 -1835813 -1898873 1369573 6491861 9728826
36091 9728826 10259657 9869757 8426473 4201651 -1130178 -2539130 1642681 6787534
36083 6787534 7896713 5442524 3020146 1966581 1340599 1397231 3600853 7421178 9806192
36074 9806192 8642715 5496811 4113882 6260298 9352487 9041315 4718971 1055140
36066 1055140 2195788 5688537 5312797 -381691 -6167856 -7576139 -6296228 -6119293
36058 -6119293 -7004950 -6347027 -3766681 -1092831 1303340 4868167 9612374 12924260
$$ packed form
36116H591720J054402q53208j876783j636256j350463k248315l325948k275550
36108c920401P19819J995536q38599m440785l182351K859805O969707M494043
36100D656774r55034l012651j311133k57459r56310o3060L268446N122288L236965
36091I728826N30831l89900j443284m224822n331829j408952M181811N144853
36083F787534J109179k454189k422378j053565o25982N6632K203622L820325K385014
36074I806192j163477l145904j382929K146416L092189l11172m322344l663831
36066A055140J140648L492749l75740n694488n786165j408283J279911J76935
36058f119293q85657O57923K580346K673850K396171L564827M744207L311886
$$ plain form
36050 12924260 12206086 7598898 1950247 -1442236 -1360259 811495 3282532 5650765
36042 5650765 7333991 5998742 726255 -4329672 -3886188 764553 2913465 258004
36034 258004 -1900345 672691 5142927 7695616 9699047 12730276 12827962 6495830 -1334740
36025 -1334740 -2808066 1589635 4607163 3664136 2993588 4567626 4874793 2382995 1026092
36016 1026092 3248977 5393342 3606759 -122058 -1500718 -212704 758902 -125375
36008 -125375 -1647978 -1817765 536754 4769650 8101978 7903713 4654999 858592 -2521146
35999 -2521146 -5817299 -7547905 -5423795 -572759 3279738 5228785 7467618 9631542
35991 9631542 8021229 2111140 -3289404 -4926401 -5453777 -7892139 -10297627 -9789137
$$ packed form
36050A2924260p18174m607188n648651l392483Q1977K171754K471037K368233
36042E650765J683226j335249n272487n055927M43484M650741K148912k655461
36034B58004k158349K573036M470236K552689K003431L031229R7686o332132p830570
36025a334740j473326M397701L017528r43027o70548J574038L07167k491798j356903
36016A026092K222885K144365j786583l728817j378660J288014R71606q84277
36008a25375j522603j69787K354519M232896L332328j98265l248714l796407l379738
35999b521146l296153j730606K124110M851036L852497J949047K238833K163924
35991I631542j610313n910089n400544j636997n27376k438362k405488N08490
$$ plain form
35983 -9789137 -7945482 -7720925 -7955373 -5558304 -1125242 1930129 2423904 1715554 198859
35974 198859 -2686004 -5558825 -5729548 -2896514 79902 111895 -3557102 -8623257 -10588137
35965 -10588137 -6592266 71776 2178487 -2339403 -6830500 -4982296 -139661 -398218
35957 -398218 -6474016 -10752122 -8463759 -3721754 -2434101 -4167409 -4531240 -2599977
35949 -2599977 -1840035 -4224966 -6678435 -4727133 1514199 6756843 6515161 2407551
35941 2407551 -193857 983821 3435673 5165871 7703822 11735653 13462454 9342220
35933 9342220 2323854 -1198841 67035 1234160 -961711 -3499598 -1942642 3094907
35925 3094907 6855847 6503217 4234185 4413365 8537929 13376285 14256553 10179772 4980279
$$ packed form
35983i789137J843655K24557k34448K397069M433062L055371M93775p08350j516695
35974A98859k884863k872821j70723K833034K976416L1993l668997n066155j964880
35965a0588137L995871O664042K106711m517890m491097J848204M842635k58557
35957c98218o075798m278106K288363M742005J287653j733308l63831J931263
35949b599977P59942k384931k453469J951302O241332N242644k41682m107610
35941B407551k601408J177678K451852J730198K537951M031831J726801m120234
35933I342220p018366l522695J265876J167125k195871k537887J556956N037549
35925C094907L760940l52630k269032J79180M124564M838356Q80268m076781n199493
$$ plain form
35916 4980279 3077710 4967727 7431641 7119013 3206226 -2317717 -6136012 -6467149
35908 -6467149 -5097943 -5234525 -6966730 -6998432 -3684276 253817 1510628 236355 -1344879
35899 -1344879 -1782043 -119519 4219756 9016420 9926548 6329727 3111354 3335417 3035532
35890 3035532 -2091140 -8447382 -9040520 -3875788 592137 1111177 327718 495411 1026219
35881 1026219 2373343 5824436 8722453 6366466 -8236 -3467312 -1358943 1210296
35873 1210296 124542 -1924885 -1515045 -206373 -80602 915971 4375955 6862659 5134144
35864 5134144 2140683 2499633 5015805 5042427 2017713 -571228 -1248156 -1776651 -3206914
35855 -3206914 -4738137 -5825360 -6179745 -4806888 -1969030 -376817 -1348260 -1955904 519422
$$ packed form
35916D980279j902569J890017K463914l12628l912787n523943l818295l31137
35908f467149J369206j36582j732205l1702L314156L938093J256811j274273j581234
35899a344879m37164J662524M339275M796664R10128l596821l218373K24063k99885
35890C035532n126672o356242n93138N164732M467925N19040p83459J67693N30808
35881A026219J347124L451093K898017k355987o374702l459076K108369K569239
35873A210296j085754k049427M09840J308672J25771R96573L459984K486704j728515
35864E134144k993461L58950K516172K6622l024714k588941o76928n28495j430263
35855c206914j531223j087223l54385J372857K837858J592213r71443o07644K475326
$$ plain form
35846 519422 3802890 4436386 3735895 4848079 6190527 4002196 50661 -123348 3370793
35837 3370793 4168720 -216188 -4463426 -4234146 -2673567 -4354627 -7862699 -8942723
35829 -8942723 -7190651 -4952292 -2470576 1082622 3696328 2474325 -1248421 -2978786
35821 -2978786 -1279543 592777 -338694 -3099668 -4838226 -4389623 -2925842 -2397062 -3741435
35812 -3741435 -5801149 -6358912 -5183374 -4993299 -7732675 -11064714 -11119406 -8060978 -5770451
35803 -5770451 -5814917 -5182782 -1390409 3180677 4348659 1473407 -2677464 -5800151 -7141321
35794 -7141321 -5971476 -2251198 1386504 1577312 -1147229 -2543643 -642437 1252804
35786 1252804 -485432 -4354512 -6140515 -5164500 -4533142 -5546624 -5572428 -2462117 2032291
$$ packed form
35846E19422L283468O33496p00491J112184J342448k188331l951535j74009L494141
35837C370793P97927m384908m247238K29280J560579j681060l508072j080024
35829h942723J752072K238359K481716L553198K613706j222003l722746j730365
35821b978786J699243J872320r31471k760974j738558M48603J463781N28780j344373
35812c741435k059714n57763J175538J90075k739376l332039n4692L058428K290527
35803e770451m4466O32135L792373M571086J167982k875252m150871l122687j341170
35794g141321J169845L720278L637702J90808k724541j396414J901206J895241
35786A252804j738236l869080j786003R76015O31358j013482k5804L110311M494408
$$ plain form
35777 2032291 5068599 6580414 8037387 8974578 7485160 3652268 41981 -1458525
35769 -1458525 -1467894 -1429862 -1719006 -2030993 -2364225 -2804224 -3120989 -3154154 -2996959 -2570470
35759 -2570470 -1831136 -1512074 -2429023 -3708788 -3345583 -1467596 -1222565 -4499868 -8218485
35750 -8218485 -7708498 -3302184 -290932 -1734278 -4698234 -5375265 -4648147 -5364158 -6544855
35741 -6544855 -4797996 -636752 1527773 470919 472768 4319913 8237622 7510722 4044131
35732 4044131 3549952 6743681 8567332 6383470 3905847 4990670 7514378 6714893
35724 6714893 2319562 -1309937 -1545461 -765000 -2393597 -5775438 -6720800 -2721775 3771692
35715 3771692 7898501 7525590 4746543 2401335 865268 -614944 -1052556 1295590
$$ packed form
35777B032291L036308J511815J456973R37191j489418l832892l610287j500506
35769a458525r369L8032k89144l11987l33232m39999l16765l3165J57195M26489
35759b570470P39334L19062r16949j279765L63205J877987K45031l277303l718617
35750h218485N09987M406314L011252j443346k963956o77031P27118p16011j180697
35741f544855J746859M161244K164525j056854J849L847145L917709p26900l466591
35732D044131m94179L193729J823651k183862k477623J084823K523708p99485
35724F714893m395331l629499k35524P80461j628597l381841r45362L999025O493467
35715C771692M126809l72911k779047k345208j536067j480212m37612K348146
$$ plain form
35707 1295590 5253220 6543100 2460102 -4523104 -8919936 -7607334 -2682430 738636
35699 738636 -261505 -3081023 -2485396 2304127 5249581 821626 -7567515 -10410745
35691 -10410745 -3759344 5951773 10246063 7992675 3900421 1055237 -1092797 -3178213
35683 -3178213 -4540625 -5023472 -4904709 -3266342 513052 3751892 2310994 -3785699
35675 -3785699 -9441552 -10352165 -7400330 -4026591 -1676485 271318 1975830 2928811
35667 2928811 3396412 4055483 4683080 4914651 5814126 8727084 12561744 14131297 11718149
35658 11718149 6693825 1045958 -4725263 -9885066 -11672361 -8110280 -2047925 820073
35650 820073 -1098562 -3005232 -118931 5825957 9018471 7067719 3052802 662307
$$ packed form
35707A295590L957630J289880m082998o983206m396832J312602M924904L421066
35699G38636j000141k819518N95627M789523K945454m427955q389141k843230
35691a0410745O651401R711117M294290k253388m092254k845184k148034k085416
35683c178213j362412m82847J18763J638367L779394L238840j440898o096693
35675c785699n655853r10613K951835L373739K350106J947803J704512R52981
35667B928811M67601O59071O27597K31571Q99475K912958L834660J569553k413148
35658A1718149n024324n647867n771221n159803j787295L562081O062355K867998
35650H20073j918635j906670K886301N944888L192514j950752m014917k390495
$$ plain form
35642 662307 488128 1436344 2650961 2887793 759251 -2676192 -3855164 -1195647 2357087
35633 2357087 3419227 2775444 3046844 3468754 909657 -4245479 -7280129 -5242565 -504662
35624 -504662 3338640 6000708 8528005 9527441 7025703 2811120 913929 1624197 867453
35615 867453 -3125620 -6089322 -3472955 2457012 4934490 1317443 -4163379 -6540993
35607 -6540993 -5685259 -4537160 -4567936 -4998383 -4800970 -3586692 -1602185 -165715 -823174
35598 -823174 -2916276 -3652355 -1911790 57409 422986 714652 2419893 3262629 656664
35589 656664 -3086708 -3560944 -1217577 -587903 -2727219 -3547561 -523455 3743523 6104224
35580 6104224 6583358 5821680 3115887 -872540 -3447256 -4086748 -5418502 -8009655 -8741784
$$ packed form
35642F62307j74179R48216J214617K36832k128542l435443j178972K659517L552734
35633B357087J062140o43783K71400M21910k559097n155136l034650K037564M737903
35624e04662L843302K662068K527297R99436k501738m214583j897191P10268p56744
35615H67453l993073k963702K616367N929967K477478l617047n480822k377614
35607f540993Q55734J148099l0776m30447J97413J214278J984507J436470o57459
35598h23174k093102p36079J740565J969199L65577K91666J705241Q42736k605965
35589F56664l743372m74236K343367O29674k139316q20342L024106M266978K360701
35580F104224M79134p61678k705793l988427k574716o39492j331754k591153p32129
$$ plain form
35571 -8741784 -6869860 -6524822 -9581882 -11351875 -8254061 -4744000 -6338000 -9890912
35563 -9890912 -8182609 -1382197 3848114 5007179 5482460 6336778 4786318 1559111
35555 1559111 1435028 4451860 4488157 -409712 -3916726 -1698818 1491289 426920 -1423334
35546 -1423334 1601683 6545844 5683368 -1224802 -6372666 -5128791 -926086 1693649
35538 1693649 2756700 3743898 3788297 1760334 -969455 -2332809 -2336283 -2485207 -3833464
35529 -3833464 -6461348 -9474136 -10992736 -9648416 -6517014 -4108544 -3143425 -1821750
35521 -1821750 1439461 5945949 9537421 10200994 7224736 2428536 -198172 1704744
35513 1704744 5526054 6417121 3312720 -325333 -1742273 -1633011 -1054282 707387 3435493
$$ packed form
35571h741784J871924L45038l057060j769993L097814L510061j594000l552912
35563i890912J708303O800412N230311J159065M75281Q54318j550460l227207
35555A559111j24083L016832L6297m897869l507014K217908L190107j064369j850254
35546a423334L025017M944161q62476o908170n147864J243875M202705K619735
35538A693649J063051R87198M4399k027963k729789j363354l474j48924j348257
35529c833464k627884l012788j518600J344320L131402K408470R65119J321675
35521a821750L261211M506488L591472O63573k976258m796200k626708J902916
35513A704744L821310Q91067l104401l638053j416940J09262N78729J761669K728106
$$ plain form
35504 3435493 4490967 2531784 73424 -288004 269432 -374448 -1061796 404896 2815410
35495 2815410 3554327 3653361 6098676 9641719 9459130 4716470 644129 1415393 5080371
35486 5080371 7468474 7239882 4932931 956972 -2644071 -2075945 3157382 8121698
35478 8121698 8772227 7382425 7911064 9179729 7564407 3915922 1977739 1290815 -2117765
35469 -2117765 -8006722 -10879445 -7846878 -2417438 1132637 2633332 3505972 3571455 2536212
35460 2536212 1345974 349179 -867732 -896518 2427833 7271740 8524097 5101217 2140831
35451 2140831 3590715 6910887 7901530 6680216 5765686 6012606 7471318 10391877 12366915
35442 12366915 8954063 828652 -4390570 -1999737 2679906 2300921 -1889365 -3662938
$$ packed form
35504C435493J055474j959183k458360l61428N57436o43880o87348J466692K410514
35495B815410P38917R9034K445315L543043j82589m742660m072341P71264L664978
35486E080371K388103k28592k306951l975959l601043N68126N233327M964316
35478H121698O50529j389802N28639J268665j615322l648485j938183o86924l408580
35469b117765n888957k872723L032567N429440L550075J500695Q72640O5483j035243
35460B536212j190238r96795j216911k8786L324351M843907J252357l422880k960386
35451B140831J449884L320172R90643j221314r14530K46920J458712K920559J975038
35442A2366915l412852q125411n219222K390833M679643l78985m190286j773573
$$ plain form
35434 -3662938 -2003292 -468113 435572 2347387 2816145 -1597949 -7180748 -6669037 -787805
35425 -787805 2490317 642458 -707634 566427 -1336767 -8878017 -14501087 -11285392
35417 -11285392 -3309327 1109780 867703 -1106 -1071398 -4512443 -8177625 -7435563
35409 -7435563 -3177678 -1387390 -4221000 -6924369 -4929258 131284 3308240 2629861
35401 2629861 827099 1849662 6404998 10779782 10680474 6448332 2845769 2928745 4319419
35392 4319419 3090942 -793469 -4032140 -4282801 -1805249 1659069 3576314 1780571
35384 1780571 -2737458 -5634703 -4322148 -2029792 -3902146 -9676597 -13292150 -10258872
35376 -10258872 -3170427 1166034 -962888 -6560608 -9421416 -6868169 -2395032 -1132471
$$ packed form
35434c662938J659646J535179R03685J911815M68758m414094n582799N11711N881232
35425g87805L278122j847859j350092J274061j903194p541250n623070L215695
35417a1285392P976065M419107k42077q68809j070292l441045l665182P42062
35409g435563M257885J790288k833610k703369J995111N060542L176956o78379
35401B629861j802762J022563M555336M374784r9308m232142l602563Q2976J390674
35392D319419j228477l884411l238671k50661K477552L464318J917245j795743
35384A780571m518029k897245J312555K292356j872354n774451l615553L033278
35376a0258872P088445M336461k128922n597720k860808K553247M473137J262561
$$ plain form
35368 -1132471 -3708110 -6155976 -5080021 -611182 5187140 9827413 10392720 5681353
35360 5681353 -785755 -3430253 -1517297 158911 -1135055 -1970686 1309956 6540575
35352 6540575 8984377 7479046 3872187 -784059 -5662815 -8196287 -6711944 -3442034
35344 -3442034 -1533687 -855145 18765 51445 -1961264 -3427784 -1038959 3313255 4308063
35335 4308063 438646 -4585307 -7223683 -6944844 -4179594 297376 3837550 3752999 1190501
35326 1190501 -91757 1145592 3006339 4578711 6675633 8445024 7654284 5164732
35318 5164732 4825845 7454497 8948418 6516610 3256988 3677923 7114025 8700769
35310 8700769 5814589 923739 -2018418 -2330483 -2807685 -5375524 -7868987 -7007046 -4096982
$$ packed form
35368a132471k575639k447866J075955M468839N798322M640273N65307m711367
35360E681353o467108k644498J912956J676208j293966q35631L280642N230619
35352F540575K443802j505331l606859m656246m878756k533472J484343L269910
35344c442034J908347O78542Q73910L2680k012709j466520K388825M352214R94808
35335D308063l869417n023953k638376K78839K765250M476970L540174q4551k562498
35326A190501j282258J237349J860747J572372K096922J769391p90740k489552
35318E164732l38887K628652J493921k431808l259622M20935L436102J586744
35310H700769k886180m890850k942157l12065m77202k567839k493463Q61941K910064
$$ plain form
35301 -4096982 -4179012 -8039062 -9344646 -3516976 4174377 4984572 -972513 -5216735 -3116021
35292 -3116021 1146638 2647192 2034342 1386295 -211807 -3293811 -4928140 -3090797
35284 -3090797 -642552 -1035153 -2825066 -2292032 573661 2388725 1401433 -869404 -2226413
35275 -2226413 -1808162 -337773 157295 -1886929 -5058951 -6136480 -4701229 -3868795 -4998053
35266 -4998053 -5015189 -1489385 2774859 3551738 1189009 -732006 -796402 -137939 1090973
35257 1090973 3710026 6593849 7286469 5460697 3024386 1084814 -688928 -2257825
35249 -2257825 -3376065 -4898785 -7185329 -8005081 -5320553 -1659333 -1843048 -5947683
35241 -5947683 -8422144 -5577225 -419645 2179720 2203604 3263401 6349874 8369946
$$ packed form
35301d096982q2030l860050j305584N827670P691353Q10195n957085m244222K100714
35292c116021M262659J500554o12850o48047j598102l082004j634329J837343
35284c090797K448245l92601j789913N33034K865693J815064r87292k270837j357009
35275b226413M18251J470389M95068k044224l172022j077529J435251Q32434j129258
35266d998053j7136L525804M264244P76879k362729j921015o4396O58463J228912
35257A090973K619053K883823O92620j825772k436311j939572j773742j568897
35249b257825j118240j522720k286544q19752K684528L661220j83715m104635
35241e947683k474461K844919N157580K599365K3884J059797L086473K020072
$$ plain form
35233 8369946 6996913 4064859 2783638 3336693 3232442 1458353 -1117 452628 1197412
35224 1197412 -69041 -2308740 -2549623 -871810 -444963 -1878365 -1507686 2378393 5267280
35215 5267280 2301082 -3958114 -6401210 -3148450 441750 68886 -1863156 -887657
35207 -887657 2906801 5864206 6184144 5314804 4823714 4451266 3351985 1645287 366941
35198 366941 492468 1842279 2668791 1180949 -1814060 -2833227 334957 5191993 6841083
35189 6841083 3997031 919104 2056532 5874887 6223439 262525 -7067592 -8379929
35181 -8379929 -2650046 3764784 4969844 1682806 -1623182 -2976984 -3570185 -3800710
35173 -3800710 -2327010 744662 2936393 2970158 2955119 5259345 8723949 9951167 7718823
$$ packed form
35233H369946j373033k932054j281221N53055j04251j774089j459470M53745P44784
35224A197412j266453k239699k40883J677813M26847j433402L70679L886079K888887
35215E267280k966198o259196k443096L252760L590200l72864j932042R75499
35207h87657L794458K957405L19938q69340m91090l72448j099281j706698j278346
35198C66941J25527J349811Q26512j487842k995009j019167L168184M857036J649090
35189F841083k844052l077927J137428L818355L48552n960914p330117j312337
35181h379929N729883O414830J205060l287038l305988j353802n93201k30525
35173c800710J473700L071672K191731L3765j5039K304226L464604J227218k232344
$$ plain form
35164 7718823 4424485 3134121 4294173 5624179 4844221 2407215 1264124 3170142
35156 3170142 5474204 3382170 -3706353 -9952397 -9168135 -2159510 4334457 5635634
35148 5635634 3449491 1945954 2527848 4087193 5953820 7899756 8521501 6499930
35140 6499930 3159298 1275721 1381906 1710067 1839959 3352182 5968777 6325094 2751853
35131 2751853 -1319584 -1562659 1496120 4050171 4865447 5747386 6682568 4847013 -372125
35122 -372125 -4961566 -5101933 -2091443 -195329 -1089796 -2648840 -2479501 -662219 1094715
35113 1094715 1811104 2222925 3439824 4842191 4470176 2476659 2598603 7624686 14328759
35104 14328759 16503929 13134804 9500886 9210581 9817686 8694808 8314422 11315453
$$ packed form
35164G718823l294338j290364J160052J330006p79958k437006j143091J906018
35156C170142K304062k092034p088523o246044P84262P008625O493967J301177
35148E635634k186143j503537N81894J559345J866627J945936O21745k021571
35140F499930l340632j883577J06185L28161J29892J512223K616595L56317l573241
35131B751853m071437k43075L058779K554051Q15276Q81939R35182j835555n219138
35122c72125m589441j40367L010490J896114q94467j559044J69339J817282J756934
35113A094715P16389M11821J216899J402367l72015j993517J21944N026083O704073
35104A4328759K175170l369125l633918k90305O07105j122878l80386L001031
$$ plain form
35096 11315453 14282846 12314770 7498446 6380402 9714540 11388163 8399122 5333156
35088 5333156 6304138 8248168 6481295 2705550 2359471 6250659 9734786 9485490 6957798
35079 6957798 5025590 4535736 4852061 5375228 5756161 6059537 6775793 7433544 6057101
35070 6057101 2096171 -1024530 548389 5018279 6077359 1373276 -3712602 -3275074
35062 -3275074 1075230 3169631 1581765 1167613 4826814 8348973 6297593 170759
35054 170759 -3172088 -493066 4013299 4714642 1568713 -726759 938285 4872148
35046 4872148 7477476 7496616 6594898 6598884 7239130 6958543 5518663 4797309 6228788
35037 6228788 8128206 7209627 3020286 -914843 -1390008 651614 2166636 2436175 3103720
$$ packed form
35096A1315453K967393j968076m816324j118044L334138J673623k989041l065966
35088E333156R70982J944030j766873l775745l46079L891188L484127k49296k527692
35079F957798j932208m89854L16325N23167L80933L03376P16256O57751j376443
35070F057101l960930l120701J572919M469890J059080m704083n085878M37528
35062c275074M350304K094401j587866m14152L659201L522159k051380o126834
35054A70759l342847K679022M506365P01343l145929k295472J665044L933863
35046D872148K605328J9140r01718L986O40246k80587j439880p21354J431479
35037F228788J899418r18579m189341l935129m75165K041622J515022K69539O67545
$$ plain form
35028 3103720 4665346 5841876 6509953 8198453 10649792 10758492 6940937 2461777
35020 2461777 1938711 5759074 10299187 12731824 13031289 11725351 8729464 5169975
35012 5169975 3871937 6437446 11096109 14643343 15563693 14361731 12080980 10052966
35004 10052966 10365737 14523183 21135352 26382828 27882754 27385979 28349242 31113664
34996 31113664 32341860 30046463 27219993 28144632 32131887 34286879 32961444 32888872
34988 32888872 38978582 50093024 61897720 73226919 85660594 98691127 110322260
34981 110322260 122065470 138276167 159897116 183905372 210506231 245693626 293468535
34974 293468535 349144057 403019127 446648555 472440012 472430134 444229534 396633432
$$ packed form
35028C103720J561626J176530O68077J688500K451339J08700l817555m479160
35020B461777n23066L820363M540113K432637K99465j305938k995887l559489
35012E169975j298038K565509M658663L547234R20350j201962k280751k028014
35004A0052966L12771M157446O612169N247476J499926m96775R63263K764422
34996C1113664J228196k295397k826470R24639L987255K154992j325435p2572
34988C2888872O089710J1114442J1804696J1329199J2433675J3030533J1631133
34981A10322260J1743210J6210697K1620949K4008256K6600859L5187395M7774909
34974B93468535N5675522N3875070M3629428K5791457r878k8200600m7596102
$$ plain form
34967 396633432 343913186 294981902 251646165 214748282 185672235 162396621 140581420
34960 140581420 119890598 104188303 94246534 85266202 73535092 61130958 51796657
34953 51796657 45916345 41738008 38184666 34428399 29790293 25712880 24582041 25271867
34945 25271867 23736987 19500625 16883726 17495498 16661850 11023649 4968322 4630252
34937 4630252 9090581 12783665 13976801 15404579 18061232 19556584 18171763 14580326
34929 14580326 10130025 6598814 6344835 9392913 11926960 10993741 8709199 8163650
34921 8163650 7684981 3862672 -1890356 -5170038 -5452533 -5562662 -5456318 -2607964 1804475
34912 1804475 3374728 1642239 849308 2510857 3016889 356088 -2132004 -1110599
$$ packed form
34967C96633432n2720246m8931284m3335737l6897883k9076047k3275614k1815201
34960A40581420k0690822j5702295r941769q980332j1731110j2404134r334301
34953E1796657n880312m178337l553342l756267m638106m077413j130839O89826
34945B5271867j534880m236362k616899O11772q33648n638201o055327l38070
34937D630252M460329L693084J193136J427778K656653J495352j384821l591437
34929A4580326m450301l531211k53979L048078K534047r33219k284542n45549
34921H163650m78669l822309n753028l279682k82495j10129J06344K848354M412439
34912A804475J570253j732489p92931J661549N06032k660801k488092J021405
$$ plain form
34904 -1110599 2041302 4270670 5050405 5464514 5946601 6340420 5929703 3349409 -802005
34895 -802005 -2362808 1364122 6350326 6786333 3932068 3630358 6113154 6260505 3892889
34886 3892889 4452258 7889126 7064518 813650 -1803526 3877859 9124053 5419028
34878 5419028 -1421857 -509555 7178041 11678670 9574980 6087044 4194405 1928269
34870 1928269 -373286 439565 3190080 2832294 -1184188 -3952998 -2973821 -486175 2166579
34861 2166579 5878932 9249101 9382711 7714976 8414137 10464902 8388943 1925466
34853 1925466 -2359943 -1172840 925937 -102147 -1568754 -59717 2260661 1876614
34845 1876614 -150566 -935674 -785959 -1294843 -1425236 582157 3667669 5627207 6382871
$$ packed form
34904a110599L151901K229368P79735M14109M82087L93819m10717k580294m151414
34895h02005j560803L726930M986204M36007k854265l01710K482796J47351k367616
34886C892889N59369L436868q24608o250868k617176N681385N246194l705025
34878E419028o840885R12302P687596M500629k103690l487936j892639k266136
34870A928269k301555Q12851K750515l57786m016482k768810R79177K487646K652754
34861B166579L712353L370169J33610j667735O99161K050765k075959o463477
34853A925466m285409J187103K098777j028084j466607J509037K320378l84047
34845A876614k027180p85108J49715n08884j30393K007393L085512J959538P55664
$$ plain form
34836 6382871 6919605 6973585 6139786 5236950 4479941 2513144 -698581 -2407585 -790172
34827 -790172 2052002 3110594 2571796 2606703 3661467 4196666 3173919 1228425 7073
34818 7073 848467 3033237 3614564 927152 -2338617 -2430942 -248091 165666 -1458709
34809 -1458709 -1212568 1781033 3416590 1844284 938084 3333019 5376739 3282560
34801 3282560 -398526 -1426807 -938763 -2253816 -3911889 -2192740 1497923 2258254
34793 2258254 -166197 -1200487 438739 633050 -2595970 -4941800 -2192716 3083935
34785 3083935 4804560 1457526 -2140465 -852846 4896538 9634822 8574545 2428753
34777 2428753 -3614628 -5265167 -2576639 1548344 4312569 4064530 793197 -2969929
$$ packed form
34836F382871N36734N3980q33799r02836p57009j966797l211725j709004J617413
34827g90172K842174J058592n38798L4907J054764N35199j022747j945494j221352
34818G073Q41394K184770N81327k687412l265769r2325K182851M13757j624375
34809a458709K46141K993601J635557j572306r06200K394935K043720k094179
34801C282560l681086j028281M88044j315053j658073J719149L690663P60331
34793B258254k424451j034290J639226J94311l229020k345830K749084N276651
34785C083935J720625l347034l597991J287619N749384M738284j060277o145792
34777B428753o043381j650539K688528M124983K764225k48039l271333l763126
$$ plain form
34769 -2969929 -3660137 -708897 2525524 3092993 1640309 -80504 -2128735 -4587054
34761 -4587054 -5579747 -3983584 -1821801 -916800 503861 4370521 8213586 8175854 4841612
34752 4841612 1747156 -374772 -3108798 -5361545 -4275372 -846127 755378 -235695
34744 -235695 -569919 546852 149554 -2077035 -2253703 379008 720587 -3808976 -7747141
34735 -7747141 -5602144 -833467 -574229 -4495282 -5954660 -2976063 -822849 -2787275
34727 -2787275 -5097668 -3855114 -1752344 -3492765 -7695450 -8320199 -3261211 2881805
34719 2881805 5312261 4774524 4911193 6449137 6972875 5469945 3843845 3484669 3356004
34710 3356004 2935314 4192316 7927986 10343103 7144991 245202 -3827487 -2438094
$$ packed form
34769b969929o90208K951240L234421N67469j452684j720813k048231k458319
34761d587054r92693J596163K161783R05001J420661L866660L843065l7732l334242
34752D841612l094456k121928k734026k252747J086173L429245J601505r91073
34744b35695l34224J116771l97298k226589j76668K632711L41579m529563l938165
34735g747141K144997M768677K59238l921053j459378K978597K153214j964426
34727b787275k310393J242554K102770j740421m202685o24749N058988O143016
34719B881805K430456n37737J36669J537944N23738j502930j626100l59176j28665
34710C356004m20690J257002L735670K415117l198112o899789m072689J389393
$$ plain form
34702 -2438094 525606 1627508 2738154 6113595 8908868 7178081 2729044 866381
34694 866381 2459520 3392884 1838182 852227 2461059 3994932 2902121 1333971 2464805
34685 2464805 4838726 4129313 -728660 -6371707 -9280167 -8557999 -5169481 -1184589
34677 -1184589 577808 -1075772 -3632056 -3619314 -1423884 -672649 -2575046 -3964778 -2104622
34668 -2104622 1301261 2615296 738916 -2593834 -5222507 -5606578 -3165796 516670
34660 516670 2115539 -1010 -3704309 -5730759 -4951636 -1792882 3372402 8965175
34652 8965175 11358038 8452097 3049151 -255506 -617826 -449381 -531240 567720 2574303
34643 2574303 3155956 2084678 1959206 3700714 4890010 4009853 2860681 2827786 2090297
$$ packed form
34702b438094K963700J101902J110646L375441K795273j730787m449037j862663
34694H66381J593139R33364j554702r85955J608832J533873j092811j568150J130834
34685B464805K373921p09413m857973n643047k908460P22168L388518L984892
34677a184589J762397j653580k556284J2742K195430P51235j902397j389732J860156
34668b104622L405883J314035j876380l332750k628673l84071K440782L682466
34660E16670J598869k116549l703299k026450P79123L158754N165284N592773
34652H965175K392863k905941n402946l304657l62320J68445q1859J098960K006583
34643B574303N81653j071278j25472J741508J189296q80157j149172l2895p37489
$$ plain form
34634 2090297 -739399 -2897335 -754169 4576439 7991695 6391975 1730425 -1868626
34626 -1868626 -2578364 -2304741 -4063960 -7678420 -8750887 -3623537 5115295 10802531
34618 10802531 10541432 7605009 5352935 2936943 -799809 -3351554 -2273556 94111
34610 94111 -81904 -2075232 -2236440 -419865 -96018 -2198160 -3328373 -1118636 2178853
34601 2178853 3061418 1293426 -527977 -429173 1111114 2006580 733171 -1903901 -3501254
34592 -3501254 -3139890 -2731226 -4166711 -6370885 -6862388 -5136166 -2598308 -242678 1406877
34583 1406877 1067101 -1951048 -5652419 -7162723 -6428476 -5841410 -6462624 -7025952 -6592868
34574 -6592868 -5725514 -4727365 -2921167 -288578 1770350 1905118 253495 -1539405 -1502390
$$ packed form
34634B090297k829696k157936K143166N330608L415256j599720m661550l599051
34626a868626p09738K73623j759219l614460j072467N127350Q738832N687236
34618A0802531k61099k936423k252074k415992l736752k551745J077998K367667
34610I4111j76015j993328j61208J816575L23847k102142j130213K209737L297489
34601B178853Q82565j767992j821403R8804J540287Q95466j273409k637072j597353
34592c501254L61364M08664j435485k204174m91503J726222K537858K355630J649555
34583A406877l39776l018149l701371j510304P34247N87066o21214n63328M33084
34574f592868Q67354R98149J806198K632589K058928J34768j651623j792900L7015
$$ plain form
34565 -1502390 324630 584064 -3757544 -9505533 -8930890 -205058 8005239 7066559 -81035
34556 -81035 -4106064 -3156883 -3481785 -7151593 -8586317 -5443093 -3946681 -8460283 -13013506
34547 -13013506 -9897576 -1754235 2241870 -430504 -3499986 -2291270 374294 55124
34539 55124 -2632644 -4010395 -3084636 -2146925 -2396504 -1668914 2184814 6922013 7532993
34530 7532993 3092678 -731336 1296063 6537107 8066226 4485387 1094827 1215777
34522 1215777 2057917 875573 -393770 263910 618961 -1451260 -3201694 -1055431 3562707
34513 3562707 6707576 7641967 7842746 6795864 3520243 399244 588723 2808714 3409159
34504 3409159 2617384 3742627 6506901 6335763 1188212 -5170902 -8051552 -6700264
$$ packed form
34565a502390J827020K59434m341608n747989N74643Q725832Q210297r38680p147594
34556h1035m025029R49181l24902l669808j434724L143224J496412m513602m553223
34547a3013506L115930Q143341L996105k672374l069482J208716K665564l19170
34539E5124k687768j377751R25759R37711k49579P27590L853728M737199O10980
34530G532993m440315l824014K027399N241044J529119l580839l390560J20950
34522A215777Q42140j182344j269343O57680L55051k070221j750434K146263M618138
34513C562707L144869R34391K00779j046882l275621l120999J89479K219991O00445
34504C409159p91775J125243K764274j71138n147551o359114k880650J351288
$$ plain form
34496 -6700264 -3194933 563399 3531938 5450245 6983125 8293842 7564198 3209606
34488 3209606 -2439876 -4290349 -28157 7238485 12184971 11753433 6869567 1465328
34480 1465328 -544955 1128644 3077911 2711792 1135712 51449 -1502635 -4509294
34472 -4509294 -6717051 -5743019 -3156776 -1383912 997684 5825911 9576394 7443081
34464 7443081 1986511 682505 4869869 8223987 6927373 3972344 1793322 -1590103
34456 -1590103 -6169589 -7326672 -3894872 -1980563 -5597721 -9593794 -7660954 -1939014
34448 -1939014 1678172 2907839 4691006 5536613 2179188 -2605820 -2714083 1868828
34440 1868828 5453434 5715218 5416241 5313506 2561959 -2686256 -5487751 -2903956 2297834
$$ packed form
34496f700264L505331L758332K968539J918307J532880J310717p29644m354592
34488C209606n649482j850473M262192P266642M946486m31538m883866n404239
34480A465328k010283J673599J949267l66119j576080j084263j554084l006659
34472d509294k207757R74032K586243J772864K381596M828227L750483k133313
34464G443081n456570j304006M187364L354118j296614k955029k179022l383425
34456a590103m579486j157083L431800J914309l617158l996073J932840N721940
34448a939014L617186J229667J783167Q45607l357425m785008j08263M582911
34440A868828L584606K61784k98977j02735k751547n248215k801495K583795N201790
$$ plain form
34431 2297834 6154989 7243657 5060904 -389780 -6087298 -7703784 -5232352 -2728811
34423 -2728811 -1762788 -75210 2491728 2715155 470133 283184 3545645 5290406 2561937
34414 2561937 15518 2126235 5236616 3639911 -738149 -1859570 249457 494404
34406 494404 -1686695 -1636204 1511600 2845107 526337 -304381 4148206 9657917 10042259
34397 10042259 6107802 3812693 5602253 8061133 7603303 4734041 2061014 706040
34389 706040 -58148 -962546 -1889402 -2714473 -4032849 -6186140 -7683382 -6023063 -1187994
34380 -1187994 2849170 2118584 -2214879 -4940680 -3301133 -137272 385844 -1938611
34372 -1938611 -4094975 -4392091 -3918773 -3687239 -2591601 557073 4015753 4031021 -532358
$$ packed form
34431B297834L857155J088668k182753n450684n697518j616486K471432K503541
34423b728811R66023J687578K566938K23427k245022j86949L262461J744761k728469
34414B561937k546419K110717L110381j596705m378060j121421K109027K44947
34406D94404k181099N0491L147804J333507k318770q30718M452587N509711L84342
34397A0042259l934457k295109J789560K458880m57830k869262k673027j354974
34389G06040p64188r04398r26856q25071j318376k153291j497242J660319M835069
34380a187994M037164p30586m333463k725801J639547L163861N23116k324455
34372a938611k156364k97116M73318K31534J095638L148674L458680J5268m563379
$$ plain form
34363 -532358 -5763780 -6634066 -2998291 522699 1026628 797008 2482423 3792335 802117
34354 802117 -4895833 -6918712 -2419368 4207402 7190375 5656160 2413245 -531131
34346 -531131 -2911310 -4664642 -5666897 -5921809 -4928886 -2435726 -413481 -1621047 -5009824
34337 -5009824 -5839117 -2573415 -243068 -3447313 -8848615 -9258801 -3747724 1164036
34329 1164036 288231 -4560895 -8292828 -8187196 -4671230 429385 4784479 6595810
34321 6595810 5880408 3801866 1163059 -915934 -318353 2965842 4258882 -964325
34313 -964325 -9843775 -14453378 -11901151 -7073650 -4145804 -1212469 3886913 8284530
34305 8284530 9098210 8771471 10025979 9828026 4870562 -474997 497015 5547600 6192564
$$ packed form
34363e32358n231422q70286L635775L520990N03929k29620J685415J309912k990218
34354H02117n697950k022879M499344O626770K982973j534215l242915k944376
34346e31131k380179j753332j002255k54912R92923K493160K022245j207566l388777
34337e009824q29293L265702K330347l204245n401302m10186N511077M911760
34329A164036q75805m849126l731933J05632L515966N100615M355094J811331
34321F595810p15402k078542k638807k078993N97581L284195J293040n223207
34313i64325q879450m609603K552227M827501K927846K933335N099382M397617
34305H284530Q13680l26739J254508j97953m957464n345559R72012N050585O44964
$$ plain form
34296 6192564 1374973 -790039 3271797 6528068 3353071 -901484 911045 5655284
34288 5655284 5362137 330005 -2306528 -827804 -392320 -2447236 -1928608 2968084 6589370
34279 6589370 4998680 2148508 2332154 2926639 351618 -2390840 -1233945 179733
34271 179733 -4390614 -12105438 -13405001 -6212625 711216 642932 -2643487 -2945948 -1333153
34262 -1333153 -2355645 -5432285 -6195300 -3760320 -985626 1119891 4159050 8021821
34254 8021821 10206499 9620061 7639750 5372105 2840943 667922 -405350 -1396003
34246 -1396003 -3552602 -5403242 -4566308 -2160252 -1813168 -4256222 -6649058 -7535011 -8265541
34237 -8265541 -8594555 -5482945 1403033 6929451 6402532 1557947 -2297483 -2850035 -1513585
$$ packed form
34296F192564m817591k165012M061836L256271l174997m254555J812529M744239
34288E655284k93147n032132k636533J478724M35484k054916N18628M896692L621286
34279F589370j590690k850172J83646N94485k575021k742458J156895J413678
34271A79733m570347p714824j299563P192376O923841o8284l286419l02461J612795
34262a333153j022492l076640p63015K434980K774694K105517L039159L862771
34254H021821K184678n86438j980311k267645k531162k173021j073272r90653
34246a396003k156599j850640Q36934K406056L47084k443054k392836q85953p30530
34237h265541l29014L111610O885978N526418n26919m844585l855430n52552J336450
$$ plain form
34228 -1513585 320544 2212723 2902806 1082111 -2018959 -3435014 -2219246 -435648
34220 -435648 2782 -185131 796305 2662178 2654644 -1047490 -5899667 -6685337 -1868538
34211 -1868538 3430252 3333903 -1136622 -3829095 -2204382 392747 1735182 4334064
34203 4334064 9377749 12226397 8430530 718845 -4646078 -5767840 -4823537 -2605981
34195 -2605981 1127138 3578518 1173712 -4359575 -7426732 -6194066 -3961903 -2944493
34187 -2944493 -1951959 -842226 -1764238 -4419724 -5179276 -2948414 -1171044 -1747344 -1826440
34178 -1826440 389444 1489659 -1375955 -4616293 -3097271 1796639 4204147 2383124
34170 2383124 209282 495819 1497891 796771 -1115118 -2572271 -3497020 -4887970 -6938314
$$ packed form
34228a513585J834129J892179O90083j820695l101070j416055J215768J783598
34220d35648M38430j87913R81436J865873p534l702134m852177p85670M816799
34211a868538N298790r6349m470525k692473J624713K597129J342435K598882
34203D334064N043685K848648l795867p711685n364923j121762R44303K217556
34195b605981L733119K451380k404806n533287l067157J232666K232163J017410
34187b944493R92534J109733r22012k655486p59552K230862J777370n76300p9096
34178a826440K215884J100215k865614l240338J519022M893910K407508j821023
34170B383124k173842K86537J002072p01120j911889j457153r24749j390950k050344
$$ plain form
34161 -6938314 -8688183 -8901026 -7124896 -4566384 -3592355 -5368177 -8221139 -9254236
34153 -9254236 -7343464 -3825179 -646592 1439258 3195613 5821133 9032301 10308847
34145 10308847 7272249 839811 -5575167 -9889308 -12102962 -11495929 -6963512 -1295823
34137 -1295823 -454126 -5344097 -8372165 -2961622 6434945 9618986 4432281 -1097559
34129 -1097559 -537618 3489015 5629343 5678094 6091135 5733069 1387596 -5803696 -10022829
34120 -10022829 -7661355 -1773951 1607457 288206 -2130719 -814491 4701615 10091851
34112 10091851 11076248 7479729 2265802 -1668353 -2634919 -236631 3374257 4040527
34104 4040527 479536 -2656886 -296352 5374552 7328430 3752187 296924 925801
$$ packed form
34161f938314j749869k12843J776130K558512R74029j775822k852962j033097
34153i254236J910772L518285L178587K085850J756355K625520L211168J276546
34145A0308847l036598o432438o414978m314141k213654O07033M532417N667689
34137a295823Q41697m889971l028068N410543R396567L184041n186705n529840
34129a097559N59941M026633K140328M8751M13041l58066m345473p191292m219133
34120a0022829K361474N887404L381408j319251k418925J316228N516106N390236
34112A0091851R84397l596519n213927l934155r66566K398288L610888O66270
34104D040527l560991l136422K360534N670904J953878l576243l455263O28877
$$ plain form
34096 925801 2301171 579972 -1438900 924314 5990192 8265956 7320689 7869980 11219567
34087 11219567 12619808 8671501 2550775 -567535 196019 2210235 3654611 4277098
34079 4277098 3656767 1564257 -583671 -824575 787129 2080392 1407074 -286303 -227421
34070 -227421 3150061 7614691 8368028 3258602 -3744100 -6328017 -3083636 1335780
34062 1335780 2505129 654990 -2222400 -6056092 -10703062 -13161830 -10733883 -5476142
34054 -5476142 -1517047 1113143 5441766 10472738 10572560 4005107 -2635950 -2312994 3169022
34045 3169022 5999838 2737019 -2599496 -5277994 -5237629 -4783671 -4672824 -4611072 -5215451
34036 -5215451 -6993389 -8391424 -6889296 -2058237 3322527 5246759 1797815 -4629584
$$ packed form
34096I25801J375370j721199k018872K363214N065878K275764r45267N49291L349587
34087A1219567J400241l948307o120726l118310P63554K014216J444376O22487
34079D277098o20331k092510k147928k40904J611704J293263o73318j693377N8882
34070b27421L377482M464630P53337n109426p002702k583917L244381M419416
34062A335780J169349j850139k877390l833692m646970k458768K427947N257741
34054e476142L959095K630190M328623N030972R9822o567453o641057L22956N482016
34045C169022K830816l262819n336515k678498M0365M53958J10847O1752o04379
34036e215451j777938j398035J502128M831059N380764J924232l448944o427399
$$ plain form
34028 -4629584 -8667968 -7070337 -2557883 -776735 -3207471 -5574059 -4209900 -1020470
34020 -1020470 178985 -274085 998997 4483687 6811275 5903288 3712687 2810905 2935206
34011 2935206 2454479 1331522 921690 1940317 3980314 6276209 7924248 8058820 6770481
34002 6770481 5356330 4918538 5115612 4825630 3603572 2000413 753248 -27549 -1007398
33993 -1007398 -2824008 -4862600 -5471156 -4190720 -2920186 -3364224 -4008733 -1823163 3105344
33984 3105344 7107928 7636809 5918540 3891321 1233074 -2513350 -5170259 -4322696
33976 -4322696 -1434237 -505585 -2655999 -4728707 -3987412 -1974812 -2254750 -5620799 -9333196
33967 -9333196 -10924431 -11079809 -11736641 -12358496 -10246061 -5067696 -782973 -978187 -3826609
$$ packed form
34028d629584m038384J597631M512454J781148k430736k366588J364159L189430
34020a020470J199455m53070J273082L484690K327588r07987k190601r01782J24301
34011B935206m80727j122957m09832J018627K039997K295895J648039J34572j288339
34002F770481j414151m37792J97074k89982j222058j603159j247165p80797r79849
33993a007398j816610k038592o08556J280436J270534m44038o44509K185570M928507
33984C105344M002584N28881j718269k027219k658247l746424k656909Q47563
33976d322696K888459R28652k150414k072708P41295K012600k79938l366049l712397
33967i333196j591235j55378o56832o21855K112435N178365M284723j95214k848422
$$ plain form
33958 -3826609 -4582701 -2233992 -107263 19254 121214 1248547 1311676 -96678 658752
33949 658752 4935068 7343725 3062903 -3364559 -3158597 4021579 9580990 8662794 6207281
33940 6207281 7824399 10953808 9634681 3848030 -889920 -990753 2377828 6357390
33932 6357390 8411489 6321779 32987 -6496990 -8299966 -4669517 459001 3104303
33924 3104303 2293647 -798329 -4217178 -5822035 -4936810 -3659432 -4410410 -6101017 -5254811
33915 -5254811 -1442150 1266924 -199705 -3457315 -4123878 -2023779 -779073 -1732059
33907 -1732059 -1895255 774187 3207215 1387717 -2851366 -3155142 2671623 8962915
33899 8962915 9361149 4890661 1542492 1581708 1634833 -657530 -2718395 -1578133 1349094
$$ packed form
33958c826609p56092K348709K126729J26517J01960J127333O3129j408354P55430
33949F58752M276316K408657m280822o427462K05962P180176N559411r18196k455513
33940F207281J617118L129409j319127n786651m737950j00833L368581L979562
33932F357390K054099k089710o288792o529977j802976L630449N128518K645302
33924C104303q10656l091976l418849j604857Q85225J277378p50978j690607Q46206
33915e254811L812661K709074j466629l257610o66563K100099J244706r52986
33907a732059j63196K669442K433028j819498m239083l03776N826765O291292
33899H962915L98234m470488l348169L9216N3125k292363k060865J140262K927227
$$ plain form
33890 1349094 2868213 2801080 2967721 3121401 1464364 -1455326 -2751593 -1268014 1203059
33881 1203059 3145889 5006821 6864491 7163339 5392158 3886537 4823589 6743248
33873 6743248 6369681 3386830 1133837 2138924 4712034 5051350 1874650 -2166046
33865 -2166046 -3523421 -1397813 1780160 2895937 804244 -3184076 -6794605 -8454278
33857 -8454278 -7680437 -4462595 853895 6690803 10182176 9472296 6066720 3334698
33849 3334698 2286239 774345 -2080932 -3138665 528020 6385697 8922207 6659232
33841 6659232 2910580 -278810 -4285905 -8745356 -9257585 -3732285 2628322 3173089
33833 3173089 -1388352 -4431233 -2564600 1120075 2795730 2502892 1913210 1089925 -533433
$$ packed form
33890A349094J519119o7133J66641J53680j657037k919690j296267J483579K471073
33881A203059J942830J860932J857670K98848j771181j505621R37052J919659
33873F743248l73567k982851k252993J005087K573110L39316l176700m040696
33865b166046j357375K125608L177973J115777k091693l988320l610529j659673
33857h454278P73841L217842N316490N836908L491373p09880l405576k732022
33849C334698j048459j511894k855277j057733L666685N857677K536510k262975
33841F659232l748652l189390m007095m459451n12229N525300O360607N44767
33833C173089m561441l042881J866633L684675J675655k92838n89682q23285j623358
$$ plain form
33824 -533433 -2116369 -2198600 -510587 1884126 3419957 2894653 711545 -905977 -482687
33815 -482687 263143 -1386133 -4679276 -5756831 -3014326 541879 1498493 304012 -292169
33806 -292169 725592 2067284 2521554 2126113 1341359 297620 -1162687 -3183074 -5447918
33797 -5447918 -7070733 -7484552 -7203936 -6915294 -6344280 -5185962 -4369885 -4689183 -5066974
33788 -5066974 -4558285 -5156757 -9156319 -13919293 -13550469 -6956396 -124458 1668391 31233
33779 31233 -847804 -739760 -1545857 -1993749 665033 4914053 5902916 2262310 -2001557
33770 -2001557 -2976220 -967588 1323640 1794695 -351323 -4060355 -6121247 -4243821
33762 -4243821 -979735 -1527549 -6675187 -10986879 -9548951 -3811283 1181333 3056159
$$ packed form
33824e33433j582936q2231J688013K394713J535831n25304k183108j617522M23290
33815d82687P45830j649276l293143j077555K742505L556205R56614j194481n96181
33806b92169J017761J341692M54270l95441p84754j043739j460307k020387k264844
33797e447918j622815m13819K80616K88642N71014J158318Q16077l19298l77791
33788e066974N08689n98472l999562m762974L68824O594073O831938J792849j637158
33779C1233q79037J08044q06097m47892K658782M249020R88863l640606m263867
33770b001557r74663K008632K291228M71055k146018l709032k060892J877426
33762d243821L264086n47814n147638m311692J437928N737668M992616J874826
$$ plain form
33754 3056159 3366216 4204275 5772413 6540081 4533145 -498844 -5440171 -6205540 -2912558
33745 -2912558 -288937 -1108398 -1943035 1466054 6860014 7821404 2758127 -2926474 -4258343
33736 -4258343 -2340821 -1164060 -2178867 -4124620 -5626064 -5676935 -3538969 -324264
33728 -324264 1085985 -210901 -1330597 127258 2064111 1309797 -679901 255093 3942799
33719 3942799 5321080 1746249 -3181751 -4770082 -2876480 -450764 616050 -93631
33711 -93631 -2719298 -6177307 -7983584 -7394828 -6874827 -8115906 -8702016 -5655712 -586131
33702 -586131 1991144 452375 -2781352 -4973680 -5147245 -3422297 -1135411 -623144 -2170639
33693 -2170639 -2649687 -199166 1919115 246819 -2429887 -1145865 2484859 2594922
$$ packed form
33754C056159L10057Q38059J568138P67668k006936n031989m941327p65369L292982
33745b912558K623621q19461q34637L409089N393960R61390n063277n684601j331869
33736d258343J917522J176761j014807j945753j501444n0871K137966L214705
33728c24264J410249j296886j119696J457855J936853p54314j989698R34994L687706
33719C942799J378281l574831m928000j588331J893602K425716J066814p09681
33711i3631k625667l458009j806277N88756N20001j241079n86110L046304N069581
33702e86131K577275j538769l233727k192328j73565J724948K286886N12267j547495
33693b170639m79048K450521K118281j672296k676706J284022L630724J10063
$$ plain form
33685 2594922 -274069 1066806 8354991 13613713 10628313 3570918 -522931 -1495209
33677 -1495209 -2645421 -3239204 -1227341 717375 -1028792 -4043721 -3379688 42836
33669 42836 1141733 -801060 -1828519 -541268 670010 1145253 2708352 5025353 5713047
33660 5713047 4839551 4121130 2547009 -1404182 -4466391 -2502134 1166763 -462845
33652 -462845 -5897161 -6090458 638164 4584925 -315097 -6880005 -6326459 -1428785 -288819
33643 -288819 -3240155 -4556204 -2996416 -2136588 -2702871 -2370787 -1639891 -2818144 -4307899
33634 -4307899 -2702729 188953 -776822 -5200203 -6748033 -2621535 2381677 2844342
33626 2844342 -897823 -4803337 -5702031 -2880577 1462483 2988140 -204284 -4126790
$$ packed form
33685B594922k868991J340875P288185N258722k985400p057395m093849r72278
33677a495209j150212n93783K011863J944716j746167l014929O64033L422524
33669D2836J098897j942793j027459J287251J211278M75243J563099K317001O87694
33660E713047q73496p18421j574121l951191l062209J964257L668897j629608
33652d62845n434316j93297O728622L946761m900022o564908N53546M897674J139966
33643b88819k951336j316049J559788Q59828n66283L32084P30896j178253j489755
33634d307899J605170K891682r65775m423381j547830M126498N003212M62665
33626B844342l742165l905514q98694K821454M343060J525657l192424l922506
$$ plain form
33618 -4126790 -3766047 -357419 1001693 -159921 105989 1781963 313168 -4052285
33610 -4052285 -4276809 2500790 9103811 8410414 3346803 1019583 1907942 1555944 -707231
33601 -707231 -1890862 -1904346 -2973036 -3680410 -411608 5506390 8661203 8031261 8173703
33592 8173703 10683980 11043959 6745626 2601105 3764551 8046845 10049818 9626887
33584 9626887 10804029 14015880 14852565 10569549 3529819 -2465256 -5782970 -6217178
33576 -6217178 -4021031 -963435 449808 239775 977500 3218288 3796393 811119 -2547337
33567 -2547337 -2412193 -290545 -550728 -3089718 -3465798 -600959 935271 -1614040 -4301560
33558 -4301560 -2765206 370300 -528787 -4784414 -5805838 -822656 5110721 6499204
$$ packed form
33618d126790L60743L408628J359112j161614K65910J675974j468795m365453
33610d052285k24524O777599O603021o93397n063611k327220Q88359l51998k263175
33601g07231j183631j3484j068690p07374L268802N917998L154813o29942J42442
33592H173703K510277L59979m298333m144521J163446M282294K002973m22931
33584I626887J177142L211851Q36685m283016p039730n995075l317714m34208
33576f217178K196147L057596J413243k10033P37725K240788N78105k985274l358456
33567b547337J35144K121648k60183k538990l76080K864839J536230k549311k687520
33558d301560J536354L135506q99087m255627j021424M983182N933377J388483
$$ plain form
33550 6499204 4462749 3641469 5052866 5418366 2375772 -2456681 -5532547 -4856006 -1412392
33541 -1412392 1977503 3305625 3048899 2655287 1785961 -1197356 -5781914 -8503512 -6710141
33532 -6710141 -1558714 3687312 6754504 6994373 5087665 3425405 4573395 7626722
33524 7626722 8290495 4666212 585494 354090 2426181 2166760 -557355 -1223075 1942541
33515 1942541 5046480 4422764 1592408 64585 48221 -849969 -3303980 -5442813 -5929638
33506 -5929638 -5711366 -6247203 -7112194 -6133180 -2010898 3479571 6708893 6043648 3529509
33497 3529509 1962027 1640461 1474123 1627470 2442100 1991030 -1660785 -6021971 -6091094
33488 -6091094 -1599362 1651921 -490925 -5180035 -7484356 -7159833 -6843515 -6247365 -3011529
$$ packed form
33550F499204k036455q21280J411397L65500l042594m832453l075866O76541L443614
33541a412392L389895J328122k56726l93612q69326k983317m584558k721598J793371
33532f710141N151427N246026L067192K39869j906708j662260J147990L053327
33524G626722O63773l624283m080718k31404K072091k59421k724115o65720L165616
33515A942541L103939o23716k830356j527823j6364q98190k454011k138833m86825
33506e929638K18272n35837q64991R79014M122282N490469L229322o65245k514139
33497C529509j567482l21566j66338J53347Q14630m51070l651815m361186o9123
33488f091094M491732L251283k142846m689110k304321L24523L16318N96150L235836
$$ plain form
33479 -3011529 1607411 2874638 -588342 -3883754 -1754636 4816387 9856997 8991305
33471 8991305 3189005 -3258060 -6892272 -7207371 -5829713 -4441967 -3532509 -2745302 -1928005
33462 -1928005 -1496523 -1643479 -1305175 1269509 5718720 7749957 2822097 -6891142 -12107186
33453 -12107186 -6562420 4161264 8594633 3747028 -1908240 -899659 3753886 4858375
33445 4858375 1676448 -967011 -1003165 -905911 -2511674 -4890185 -6820141 -7543723 -5943003
33436 -5943003 -2650544 -1643350 -5478086 -10180608 -9732493 -4794623 -1611081 -2569268
33428 -2569268 -3735190 -2248808 40530 1712012 4216472 6842406 5626399 848076
33420 848076 -527742 5127593 10944375 8623067 727825 -3099391 20440 3379431
$$ packed form
33479c011529M618940J267227l462980l295412K129118O571023N040610q65692
33471H991305n802300o447065l634212l15099J377658J387746R09458P87207Q17297
33462a928005M31482j46956L38304K574684M449211K031237m927860r713239n216044
33453a2107186N544766J0723684M433369m847605n655268J008581M653545J104489
33445D858375l181927k643459l6154R7254j605763k378511j929956p23582J600720
33436e943003L292459J007194l834736m702522M48115M937870L183542r58187
33428b569268j165922J486382K289338J671482K504460K625934j216007m778323
33420H48076j375818N655335N816782k321308p895242l827216L119831L358991
$$ plain form
33412 3379431 1315629 -3993550 -7535074 -7805135 -6148137 -3817608 -1804552 -740506
33404 -740506 474094 3326759 6006044 4226051 -2548708 -8570984 -7943718 -1436502
33396 -1436502 5074274 7474151 6300035 3809984 1114815 -1333693 -2643310 -2268839
33388 -2268839 -993196 7860 637601 1411554 1872247 887229 -1249363 -2603126 -2328112
33379 -2328112 -1978567 -2645034 -2511494 297175 3754798 4117076 1564311 -15001 924424
33370 924424 1731505 654749 -488888 -554483 -1629004 -4501593 -5652065 -2631854 915333
33361 915333 112711 -3804618 -5691445 -4046826 -1496456 648914 2954883 3854276 755837
33352 755837 -4558786 -6827222 -4407802 -885912 1044648 2382059 3517091 2520405
$$ packed form
33412C379431k063802n309179l541524k70061J656998K330529K013056J064046
33404g40506J214600K852665K679285j779993o774759o022276O27266O507216
33396a436502O510776K399877j174116k490051k695169k448508j309617L74471
33388b268839J275643J001056O29741P73953M60693r85018k136592j353763K75014
33379b328112L49545o66467J33540K808669L457623L62278k552765j579312R39425
33370I24424Q07081j076756j143637o5595j074521k872589j150472L020211L547187
33361I15333q02622l917329j886827J644619K550370K145370K305969Q99393l098439
33352G55837n314623k268436K419420L521890J930560J337411J135032r96686
$$ plain form
33344 2520405 -193963 -552857 2936890 6115905 5657033 4380205 5906508 7616304
33336 7616304 4256622 -3274673 -8060037 -5981860 -248057 3429766 2856218 -359739
33328 -359739 -3820073 -6017081 -6297565 -4624314 -1535693 1846909 4181844 5113387 6021557
33319 6021557 8219109 10272384 9087685 4475056 495875 706194 3829980 6009241
33311 6009241 5778041 4577560 3574007 2645073 2116010 2928248 4705937 5597487 4678270
33302 4678270 3150013 2528221 2585733 1673998 -1370222 -5788001 -8972806 -8261844 -3565490
33293 -3565490 1668194 3046960 -533573 -5633886 -7950401 -7097797 -6642040 -8898849
33285 -8898849 -11217819 -9454778 -4408854 -1647818 -4079852 -7933569 -8274437 -5640206
$$ packed form
33344B520405k714368l58894L489747L179015m58872j276828J526303J709796
33336G616304l359682p531295m785364K078177N733803L677823n73548l215957
33328c59739l460334k197008k80484J673251L088621L382602K334935R31543R08170
33319F021557K197552K053275j184699m612629l979181K10319L123786K179261
33311F009241k31200j200481j003553r28934n29063Q12238J777689Q91550r19217
33302D678270j528257o21792N7512r11735l044220m417779l184805P10962M696354
33293c565490N233684J378766l580533n100313k316515Q52604M55757k256809
33285h898849k318970J763041N045924K761036k432034l853717l40868K634231
$$ plain form
33277 -5640206 -4045236 -4719712 -5742569 -6212313 -6320656 -4363991 1243715 7132114 7425371
33268 7425371 1808980 -3778531 -5387505 -4690087 -3265107 302646 4854690 4785651 -1575727
33259 -1575727 -7234681 -5835804 -1138633 -827346 -4610125 -5901160 -3160362 -1599051
33251 -1599051 -3710483 -5471800 -3558084 -388337 362841 -1115850 -2356661 -2070920
33243 -2070920 -455026 1284512 972492 -2166083 -4960079 -3434487 1255505 3736124
33235 3736124 1738830 -1478527 -2871247 -3490340 -5032885 -6516521 -6551597 -5606896 -4061199
33226 -4061199 -1281768 1466815 853895 -3247764 -5788277 -2915998 2607371 5526055
33218 5526055 4840378 2986402 966722 -1488924 -2848234 -1498060 370149 -903488
$$ packed form
33277e640206J594970o74476j022857m69744j08343J956665N607706N888399K93257
33268G425371n616391n587511j608974O97418J424980L567753M552044o9039o361378
33259a575727n658954J398877M697171L11287l782779j291035K740798J561311
33251a599051k111432j761317J913716L169747P51178j478691j240811K85741
33243b070920J615894J739538l12020l138575k793996J525592M689992K480619
33235C736124j997294l217357j392720o19093j542545j483636l5076R44701J545697
33226d061199K779431K748583o12920m101659k540513K872279N523369K918684
33218E526055o85677j853976k019680k455646j359310J350174J868209j273637
$$ plain form
33210 -903488 -4364448 -4999874 -1051332 3055824 2476708 -2313203 -7011607 -8324846 -5842138
33201 -5842138 -1162534 3053281 4355213 2273330 -1649752 -5863016 -9695598 -12155624
33193 -12155624 -11772124 -8538686 -4464522 -1257046 1075089 2498956 1833230 -1022288
33185 -1022288 -3369292 -2364168 1472774 5194850 6960531 6746051 4621045 910211
33177 910211 -2389391 -3146015 -2220362 -2501969 -4566296 -6072657 -6054652 -6652775 -9207419
33168 -9207419 -11614477 -11489671 -9301493 -6328114 -2424279 1522585 1994394 -2522523
33160 -2522523 -7690896 -8331538 -5339433 -3055004 -1751803 1413221 5110817 4538043
33152 4538043 8248 -2371753 -703419 -739298 -5597149 -9017207 -4773891 2649472
$$ packed form
33210i03488l460960o35426L948542M107156n79116m789911m698404j313239K482708
33201e842138M679604M215815J301932k081883l923082m213264l832582k460026
33193a2155624L83500L233438M074164L207476K332135J423867o65726k855518
33185a022288k347004J005124L836942L722076J765681k14480k125006l710834
33177I10211l299602p56624R25653k81607k064327j506361J8005n98123k554644
33168i207419k407058J24806K188178K973379L903835L946864M71809m516917
33160b522523n168373o40642K992105K284429J303201L165024L697596n72774
33152D538043m529795k380001J668334l5879m857851l420058M243316P423363
$$ plain form
33144 2649472 4089326 -928559 -4455720 -2341200 1176072 1451414 -460267 -1390701
33136 -1390701 -773111 292433 993545 151853 -3124152 -6618071 -6017737 -646970 4494681
33127 4494681 4593260 931044 -1286254 300030 2887870 2690665 -423314 -3248771 -3470848
33118 -3470848 -2287734 -2130591 -2816640 -1856345 1610263 5498391 7740645 8003241 5971489
33109 5971489 1337146 -3285801 -3487115 680930 4006304 4876164 9501967 21870198
33101 21870198 34080616 34663808 24401106 15380448 14374177 15550045 11532263 3875852
33093 3875852 -1256788 -1794708 341265 3640575 6854979 7518418 4755441 1726232
33085 1726232 1998472 4741623 6029299 3982554 750231 -134545 2461645 5706816
$$ packed form
33144B649472J439854n017885l527161K114520L517272K75342j911681r30434
33136a390701O17590J065544P01112q41692l276005l493919O00334N370767N141651
33127D494681R8579l662216k217298J586284K587840j97205l113979k825457k22077
33118c470848J183114J57143o86049R60295L466608L888128K242254K62596k031752
33109E971489m634343m622947k01314M168045L325374Q69860M625803J2368231
33101B1870198J2210418N83192j0262702r020658j006271J175868m017782p656411
33093C875852n132640n37920K135973L299310L214404O63439k762977l029209
33085A726232K72240K743151J287676k046745l232323q84776K596190L245171
$$ plain form
33077 5706816 5437908 1279592 -2414997 -2575731 -1778222 -3155347 -4047764 -433504 4635849
33068 4635849 4580421 524632 373660 5633372 8333960 4181362 -248295 1542930 6010374
33059 6010374 6957110 5735198 6492317 7139940 3590155 -1223853 -1230719 2755287 5259060
33050 5259060 6098825 9323825 13437176 12048298 5090868 620186 2959763 6721528
33042 6721528 6253118 4387415 6657117 11429419 11793665 5542203 -1775962 -3973386
33034 -3973386 -873730 3298978 5714935 6715084 6498243 3336044 -2889589 -7864748
33026 -7864748 -7518411 -4561651 -5531350 -11052253 -14610623 -12565075 -9103174 -7933372
33018 -7933372 -5585748 1365392 7881840 6705634 -357708 -5095891 -4926298 -4631907
$$ packed form
33077E706816k68908m158316l694589j60734P97509j377125q92417L614260N069353
33068D635849n5428m055789j50972N259712K700588m152598m429657J791225M467444
33059F010374R46736j221912P57119O47623l549785m814008o866L986006K503773
33050E259060Q39765L225000M113351j388878o957430m470682K339577L761765
33042F721528m68410j865703K269702M772302L64246o251462p318165k197424
33034c973386L099656M172708K415957J000149k16841l162199o225633m975159
33026g864748L46337K956760r69699n520903l558370K045548L461901J169802
33018g933372K347624O951140O516448j176206p063342m738183J69593K94391
$$ plain form
33010 -4631907 -6791895 -8127925 -6330104 -3882916 -3105711 -2511898 -222180 2775900
33002 2775900 4450846 4178041 2739153 1863377 2997882 4538749 2611506 -2622107
32994 -2622107 -5189497 -2184008 263521 -3423618 -7354253 -2384355 7679447 9720715
32986 9720715 1198284 -5591261 -1904561 6003779 8571166 5971801 3178721 626953
32978 626953 -2736812 -3778414 -224045 3474355 2187405 -2009556 -4064150 -4063390 -5163464
32969 -5163464 -7131638 -7831155 -7779191 -7727769 -5322141 126969 3278968 -535868 -7498653
32960 -7498653 -10551066 -9333224 -8202030 -7496541 -4574653 -1453744 -3033292 -8163489
32952 -8163489 -10227085 -6927690 -2405065 823968 4726595 9255005 10119813 5709681
$$ packed form
33010d631907k159988j336030J797821K447188P77205N93813K289718K998080
33002B775900J674946k72805j438888q75776J134505J540867j927243n233613
32994b622107k567390L005489K447529l687139l930635M969898J0063802K041268
32986I720715q522431o789545L686700P908340K567387k599365k793080k551768
32978F26953l363765j041602L554369L698400j286950m196961k054594P60j100074
32969e163464j968174o99517N1964N1422K405628N449110L151999l814836o962785
32960g498653l052413J217842J131194P05489K921888L120909j579548n130197
32952h163489k063596L299395M522625L229033L902627M528410Q64808m410132
$$ plain form
32944 5709681 529880 -989721 556441 2890967 5516884 7391859 5755432 466979
32936 466979 -3909795 -3315113 923536 4331418 3963725 -366364 -6469510 -10060102 -7991714
32927 -7991714 -2852242 -1037192 -4486741 -7794068 -5705982 -13390 3937534 4643604
32919 4643604 4867478 6563804 8808458 10017438 9633257 7909259 5679376 3943874
32911 3943874 2730553 1183718 -615292 -1245213 -49549 1777682 2807981 2639316
32903 2639316 1376751 -202935 21551 3351025 7166472 7206414 3615989 1099985 1972346
32894 1972346 3299505 2852651 3067228 5644756 6790688 2851504 -2671578 -3540078 -77083
32885 -77083 2120722 1749932 3398756 8741699 12347981 8972333 659310 -6294357 -8324071
$$ packed form
32944E709681n179801j519601J546162K334526K625917J874975j636427n288453
32936D66979m376774N94682M238649L407882l67693m330089o103146l590592K068388
32927g991714N139472J815050l449549l307327K088086N692592L950924P06070
32919D643604K23874J696326K244654J208980l84181j723998k229883j735502
32911C943874j213321j546835j799010o29921J195664J827231J030299j68665
32903B639316j262565j579686K24486L329474L815447L9942l590425k516004Q72361
32894A972346J327159m46854K14577K577528J145932l939184n523082q68500L462995
32885g7083K197805l70790J648824N342943L606282l375648q313023o953667k029714
$$ plain form
32876 -8324071 -6119290 -2057270 1208825 1763464 527180 719705 3268676 4628912
32868 4628912 1393410 -4635011 -8449104 -7618843 -3683229 968071 4776705 6258201
32860 6258201 4586684 1289555 -838526 -921992 -440274 -497502 -597773 -322072 -213092
32851 -213092 -479640 -589678 -634443 -1302237 -2014705 -1170636 923141 1605285 -276034
32842 -276034 -2172452 -1386926 1063737 2472091 2728096 3657580 5039545 4641375 2231406
32833 2231406 315291 134402 -121135 -1860252 -3562836 -3495172 -2627880 -2570070 -2441372
32824 -2441372 -550192 1937479 2007724 -725198 -3282554 -3449831 -2227151 -1346726 -561983
32815 -561983 1114065 3024778 3536677 2435400 1181765 1028949 1953914 3127570 3329367
$$ packed form
32876h324071K204781M062020L266095N54639j236284J92525K548971J360236
32868D628912l235502o028421l814093Q30261L935614M651300L808634J481496
32860F258201j671517l297129k128081q3466M81718n7228j00271K75701J08980
32851b13092k66548j10038m4765o67794p12468Q44069K093777O82144j881319
32842b76034j896418P85526K450663J408354K56005R29484J381965l98170k409969
32833B231406j916115j80889k55537j739117j702584O7664Q67292N7810J28698
32824b441372J891180K487671P0245k732922k557356j67277J222680Q80425P84743
32815e61983J676048J910713N11899j101277j253635j52816R24965J173656K01797
$$ plain form
32806 3329367 1240040 -3149451 -7241066 -7613010 -4068801 -628276 -1033878 -4109708
32798 -4109708 -5427081 -3224988 -364516 119554 -1065999 -1661593 -1928840 -3831838 -6988197
32789 -6988197 -8332063 -6101960 -1852536 2061305 4918287 6797892 7329054 6411095
32781 6411095 4636874 2104573 -1477622 -4633883 -4402847 -570051 2523229 1068963
32773 1068963 -2625330 -2624900 2908620 9175852 10257003 5155498 -2046229 -6409865 -6130286
32764 -6130286 -3591228 -2652716 -3994881 -3755962 1605321 9616879 13237730 8520187
32756 8520187 -730147 -6573580 -4432484 2901690 7948794 5855908 -183369 -2379538
32748 -2379538 1540253 4649532 595402 -6084399 -5524832 2873735 9162738 7509485
$$ packed form
32806C329367k089327m389491m091615l71944L544209L440525m05602l075830
32798d109708j317373K202093K860472M84070j185553n95594k67247j902998l156359
32789f988197j343866K230103M249424L913841K856982J879605N31162r17959
32781F411095j774221k532301l582195l156261K31036L832796L093280j454266
32773A068963l694293M30N533520O267232J081151n101505p201727m363636K79579
32764f130286K539058R38512j342165K38919N361283Q011558L620851m717543
32756H520187r250334n843433K141096P334174N047104k092886o039277k196169
32748b379538L919791L109279m054130o679801N59567Q398567O289003j653253
$$ plain form
32740 7509485 4008775 5788593 9916951 9893690 7218898 7704706 9836970 6742321 -1048785
32731 -1048785 -4794127 -1254079 1955814 -1510004 -7235543 -7982741 -4558586 -2339217
32723 -2339217 -1954208 -539929 1141915 199970 -1741877 -598308 2396276 2067655 -1573056
32714 -1573056 -2820181 19977 1698148 -703989 -2570006 99148 3480376 2392525
32706 2392525 -778482 -78975 4149240 6225100 4556230 3413456 5142831 6777130
32698 6777130 5861185 4349938 4314966 4013683 1168330 -2928854 -5517230 -6298761 -6477537
32689 -6477537 -5624517 -2431924 2195791 5292056 5031488 2317787 -573180 -1847148
32681 -1847148 -1125210 479761 1463877 1501259 1339982 1290021 1352653 2844272 7221462
$$ packed form
32740G509485l500710J779818M128358k3261k674792M85808K132264l094649p791106
32731a048785l745342L540048L209893l465818n725539p47198L424155K219369
32723b339217L85009J414279J681844r41945j941847J143569K994584l28621l640711
32714a573056j247125K840158J678171k402137j866017K669154L381228j087851
32706B392525l171007O99507M228215K075860j668870j142774J729375J634299
32698F777130r15945j511247l4972l01283k845353m097184k588376p81531j78776
32689f477537Q53020L192593M627715L096265k60568k713701k890967j273968
32681a847148P21938J604971R84116L7382j61277m9961O2632J491619M377190
$$ plain form
32672 7221462 12112225 11550489 3093441 -7127512 -9979835 -3499135 5489249 9716783
32664 9716783 8285726 4701449 1540124 -831846 -2316397 -2541576 -1992049 -1996701 -3192337
32655 -3192337 -4565369 -4227676 -1275797 2755323 4579023 2236275 -2442843 -5458847
32647 -5458847 -4923317 -2617856 -1016638 -317398 527805 1235806 525686 -1430970 -2754192
32638 -2754192 -2283458 -785422 598313 1502519 1207232 -1761010 -7049111 -10756213 -8920860
32629 -8920860 -2599751 3099461 5411221 6396014 7862393 7325354 2208232 -4424985
32621 -4424985 -6794235 -4241068 -1574414 -1311694 -356436 3893282 8554025 9410239 6761447
32612 6761447 3726857 1361884 -775311 -1334993 1125692 4206909 3875488 501396
$$ packed form
32672G221462M890763n61736q457048j0220953k852323O480700Q988384M227534
32664I716783j431057l584277l161325k371970j484551k25179N49527m652j195636
32655c192337j373032L37693K951879M031120J823700k342748m679118l016004
32647e458847N35530K305461J601218O99240Q45203P08001p10120j956656j323222
32638b754192M70734J498036J383735R04206k95287k968242n288101l707102J835353
32629h920860O321109N699212K311760R84793J466379n37039n117122o633217
32621d424985k369250K553167K666654K62720R55258M249718M660743Q56214k648792
32612F761447l034590k364973k137195n59682K460685L081217l31421l374092
$$ plain form
32604 501396 -1464775 -331369 343535 -2566590 -7029095 -8791194 -6657417 -2977110
32596 -2977110 -494989 -63327 -267574 1191774 4303421 5303516 1130782 -4897019
32588 -4897019 -5900862 -934234 2920629 401014 -4515283 -4979835 -1118034 1917666
32580 1917666 3011930 5529319 9361536 9524549 4434645 -300689 471472 4424353
32572 4424353 6010509 4336030 2677747 2472583 2217466 1394916 1405628 2505962 3156281
32563 3156281 2931193 3285413 4661763 5235189 3612439 1027228 -152739 1092664 3904594
32554 3904594 6215629 5780849 2112921 -2382786 -4774101 -4952679 -4515026 -2802483 2246363
32545 2246363 8564479 9841160 3772404 -3369569 -4411694 -583890 1643373 778181
$$ packed form
32604E01396j966171J133406O74904k910125m462505j762099K133777L680307
32596b977110K482121M31662k04247J459348L111647J000095m172734o027801
32588d897019j003843M966628L854863k519615m916297m64552L861801L035700
32580A917666J094264K517389L832217J63013n089904m735334P72161L952881
32572D424353J586156j674479j658283k05164k55117q22550J0712J100334O50319
32563C156281k25088L54220J376350N73426j622750k585211j179967J245403K811930
32554C904594K311035m34780l667928m495707k391315j78578M37653J712543N048846
32545B246363O318116J276681o068756p141973j042125L827804K227263q65192
$$ plain form
32537 778181 1374590 5459821 9206562 9388570 7509675 5378662 1902597 -2573714 -3621148
32528 -3621148 1229935 7469021 9318359 7624300 7127933 8232810 7234016 3678251
32520 3678251 1500872 2309241 2810555 356773 -3308623 -5459499 -5657258 -3941379 311535
32511 311535 5347044 6413756 1430032 -5038954 -6545348 -2054540 3879682 6662142
32503 6662142 5008172 316738 -4507000 -6389693 -4664003 -1906537 -599406 -105722
32495 -105722 1046786 1401320 -1760581 -7454262 -10951852 -9373675 -4914637 -1664473
32487 -1664473 -1142035 -1891202 -1966324 -828380 330689 -308317 -2981048 -5344887 -4876365
32478 -4876365 -1983214 866892 2738403 4592284 5976318 4424583 -474637 -5159431
$$ packed form
32537G78181N96409M085231L746741J82008j878895k131013l476065m476311j047434
32528c621148M851083O239086J849338j694059m96367J104877r98794l555765
32520C678251k177379Q08369N01314k453782l665396k150876j97759J715879M252914
32511C11535N035509J066712m983724o468986j506394M490808N934222K782460
32503F662142j653970m691434m823738j882693J725690K757466J307131M93684
32495a05722J152508L54534l161901n693681l497590J578177M459038L250164
32487a664473N22438p49167p5122J137944J159069o39006k672731k363839M68522
32478d876365K893151K850106J871511J853881J384034j551735m899220m684794
$$ plain form
32470 -5159431 -6478834 -5959847 -7145139 -10249091 -12382398 -12093380 -10526222 -8463452
32462 -8463452 -5547749 -2750675 -2287252 -3978430 -4648272 -2705822 -722530 -1517184 -3946352
32453 -3946352 -4879098 -3577717 -1724790 -453944 363325 975468 1823456 3408756 4416535
32444 4416535 2230511 -2338721 -3837662 540465 5397373 4159049 -666224 -1050847
32436 -1050847 3863813 6754768 4536041 2937324 5618327 7477853 4247247 965320
32428 965320 3544184 8107944 7264708 2405315 563836 2201737 1856134 -743203 -321539
32419 -321539 3261975 4036132 1013474 456383 4278320 5683084 719719 -4580058 -4389449
32410 -4389449 -2747107 -5945074 -11209482 -10813850 -3767756 3824068 7710086 8495465
$$ packed form
32470e159431j319403N18987j185292l103952k133307K89018J567158K062770
32462h463452K915703K797074M63423j691178o69842J942450J983292p94654k429168
32453c946352r32746J301381J852927J270846Q17269O12143Q47988J585300J007779
32444D416535k186024m569232j498941M378127M856908j238324m825273l84623
32436a050847M914660K890955k218727j598717K681003J859526l230606l281927
32428I65320K578864M563760q43236m859393j841479J637901l45603k599337M21664
32419c21539L583514P74157l022658n57091L821937J404764m963365n299777J90609
32410d389449J642342l197967n264408L95632P046094P591824L886018P85379
$$ plain form
32402 8495465 7441137 4937024 2177591 -11966 -2706995 -5809264 -6005970 -1735188
$$ packed form
32402H495465j054328k504113k759433k189557k695029l102269j96706M270782
$$ [...]
##END NTUPLES=NMR SPECTRUM
##END=
