##TITLE=31Pdec_Bau-NOEt
 DMSO, 24 sc
 10.6.2022
##JCAMPDX= 6.0         $$ Bruker NMR JCAMP-DX V2.0
##DATA TYPE= NMR SPECTRUM
##DATA CLASS= NTUPLES
##ORIGIN= UXNMR, Bruker Analytische Messtechnik GmbH
##OWNER= root
$$ XWIN-NMR		Version 3.5
$$ Fri Jun 10 14:15:09 2022 Russian Standard Time (UT+4h)  she@DPX200
##.OBSERVE FREQUENCY= 81.013821
##.OBSERVE NUCLEUS= ^31P
##.ACQUISITION MODE= SIMULTANEOUS
##.ACQUISITION SCHEME= undefined
##.AVERAGES= 24
##.DIGITISER RES= 16
##SPECTROMETER/DATA SYSTEM= spect
##.PULSE SEQUENCE= zgpg30
##.SOLVENT NAME= CDCl3
##.SHIFT REFERENCE= (INTERNAL, CDCl3, 0, 248.564)
##AUDIT TRAIL= $$ (NUMBER, WHEN, WHO, WHERE, WHAT)
$$ ##TITLE= Audit trail, XWIN-NMR		Version 3.5
$$ ##JCAMPDX= 5.01
$$ ##ORIGIN= Bruker BioSpin GmbH
$$ ##OWNER= she
$$ F:/spectra/data/she/nmr/P31/1/pdata/1/auditp.txt
$$ ##AUDIT TRAIL=  $$ (NUMBER, WHEN, WHO, WHERE, WHAT)
(   1,<2022-06-10 14:14:06.60 +0400>,<she>,<DPX200>,
      <created by zg, POWCHK disabled, PULCHK disabled
       configuration hash MD5:
       00 E9 B6 7A A2 85 ED C7 34 08 36 98 17 FE 4E 26
       data hash MD5: 32K
       DA 24 F2 68 FA AC 01 71 BA E2 F6 08 E0 E1 99 7C>)
(   2,<2022-06-10 14:14:08.92 +0400>,<she>,<DPX200>,
      <Start of raw data processing
       efp BC_mod = 2 LB = 1 FT_mod = 6 PKNL = 1 PHC0 = -10560.12 PHC1 = 687.4547 SI = 64K 
       data hash MD5: 64K
       63 02 D7 75 2E B4 68 C6 21 5E 28 7E 0E E2 C7 A6>)
(   3,<2022-06-10 14:14:35.09 +0400>,<she>,<DPX200>,
      <pk PHC0 = -36.70979 PHC1 = 76.2 
       data hash MD5: 64K
       DA D6 51 B3 64 0F 10 19 FA ED 25 40 A9 55 14 EB>)
$$ ##END=
$$ 
$$ hash MD5
$$ 96 A8 CB E6 19 E2 4A 87 CB 49 73 5E E4 27 3A 9D
##$RELAX= 
##$RELAX= 
##$RELAX= 
##$RELAX= 
##$RELAX= 
##$RELAX= 
##$RELAX= 
##$RELAX= 
$$ Bruker specific parameters
$$ --------------------------
##$DU= <F:/spectra>
##$EXPNO= 1
##$NAME= <P31>
##$PROCNO= 1
##$TYPE= <nmr>
##$USER= <she>
##$AMP= (0..31)
100 100 100 100 100 100 100 100 100 100 100 100 100 100 100 100 100 100 
100 100 100 100 100 100 100 100 100 100 100 100 100 100 
##$AQSEQ= 0
##$AQ_mod= 1
##$AUNM= <au_zg>
##$AUTOPOS= <>
##$BF1= 81.014009
##$BF2= 200.13
##$BF3= 200.13
##$BF4= 200.13
##$BF5= 200.13
##$BF6= 200.13
##$BF7= 200.13
##$BF8= 200.13
##$BYTORDA= 1
##$CFDGTYP= 0
##$CFRGTYP= 5
##$CHEMSTR= <none>
##$CNST= (0..31)
1 1 145 1 1 1 1 1 1 1 1 1 1 1 1 1 1 1 1 1 1 1 1 1 1 1 1 1 1 1 1 1 
##$CPDPRG= <waltz16>
##$CPDPRG1= <>
##$CPDPRG2= <waltz16>
##$CPDPRG3= <>
##$CPDPRG4= <mlev>
##$CPDPRG5= <mlev>
##$CPDPRG6= <mlev>
##$CPDPRG7= <mlev>
##$CPDPRG8= <mlev>
##$CPDPRGB= <>
##$CPDPRGT= <>
##$D= (0..31)
0 1 0 0 0 0 0 0 0 0 0 0.03 2e-05 3e-06 0 0 0 0 0 0 0 0 0 0 0 0 0 0 0 0 
0 0 
##$DATE= 1654856046
##$DBL= (0..7)
120 120 120 11 120 120 24 19 
##$DBP= (0..7)
150 150 150 150 150 150 150 150 
##$DBP07= 0
##$DBPNAM0= <>
##$DBPNAM1= <>
##$DBPNAM2= <>
##$DBPNAM3= <>
##$DBPNAM4= <>
##$DBPNAM5= <>
##$DBPNAM6= <>
##$DBPNAM7= <>
##$DBPOAL= (0..7)
0.5 0.5 0.5 0.5 0.5 0.5 0.5 0.5 
##$DBPOFFS= (0..7)
0 0 0 0 0 0 0 0 
$$ [...]
##$SUBNAM2= <"">
##$SUBNAM3= <"">
##$SUBNAM4= <"">
##$SUBNAM5= <"">
##$SUBNAM6= <"">
##$SUBNAM7= <"">
##$SUBNAM8= <"">
##$SUBNAM9= <"">
##$SW= 501.771253377433
##$SWIBOX= (0..15)
0 1 3 0 0 0 0 0 0 0 0 0 0 0 0 0 
##$SW_h= 40650.406504065
##$TD= 32768
##$TD0= 1
##$TE= 0
##$TE2= 300
##$TE3= 300
##$TEG= 300
##$TL= (0..7)
0 120 53 12 22 120 120 120 
##$TP= (0..7)
150 150 150 150 150 150 150 150 
##$TP07= 0
##$TPNAME0= <>
##$TPNAME1= <>
##$TPNAME2= <>
##$TPNAME3= <>
##$TPNAME4= <>
##$TPNAME5= <>
##$TPNAME6= <>
##$TPNAME7= <>
##$TPOAL= (0..7)
0.5 0.5 0.5 0.5 0.5 0.5 0.5 0.5 
##$TPOFFS= (0..7)
0 0 0 0 0 0 0 0 
##$TUNHIN= 0
##$TUNHOUT= 0
##$TUNXOUT= 0
##$USERA1= <user>
##$USERA2= <user>
##$USERA3= <user>
##$USERA4= <user>
##$USERA5= <user>
##$V9= 5
##$VALIST= <valist>
##$VCLIST= <CCCCCCCCCCCCCCC>
##$VD= 0
##$VDLIST= <DDDDDDDDDDDDDDD>
##$VPLIST= <PPPPPPPPPPPPPPP>
##$VTLIST= <TTTTTTTTTTTTTTT>
##$WBST= 1024
##$WBSW= 4
##$XGAIN= (0..3)
0 0 0 0 
##$XL= 0
##$YL= 0
##$YMAX_a= 5917
##$YMIN_a= -5927
##$ZGOPTNS= <>
##$ZL1= 120
##$ZL2= 120
##$ZL3= 120
##$ZL4= 120
##$ABSF1= 0
##$ABSF2= 0
##$ABSG= 0
##$ABSL= 0
##$ALPHA= 0
##$AQORDER= 0
##$ASSFAC= 0
##$ASSFACI= 0
##$ASSFACX= 0
##$ASSWID= 0
##$AUNMP= <proc_1d>
##$AZFE= 0.1
##$AZFW= 0.5
##$BCFW= 0
##$BC_mod= 2
##$BYTORDP= 0
##$COROFFS= 0
##$CY= -3
##$DATMOD= 1
##$DC= 0
##$DFILT= <>
##$DTYPP= 0
##$F1P= 0
##$F2P= 0
##$FCOR= 1
##$FTSIZE= 65536
##$FT_mod= 6
##$GAMMA= 0
##$GB= 0
##$INTBC= 1
##$INTSCL= 5.30512e-09
##$ISEN= 30
##$LB= 1
##$LEV0= 0
##$LPBIN= 0
##$MAXI= 10000
##$MC2= 0
##$MEAN= 0
##$ME_mod= 0
##$MI= 50
##$NCOEF= 0
##$NC_proc= -4
##$NLEV= 6
##$NOISF1= 182.463
##$NOISF2= 159.3651
##$NSP= 0
##$NTH_PI= 0
##$NZP= 0
##$OFFSET= 248.5645
##$PC= 4
##$PHC0= -10596.83
##$PHC1= 763.6547
##$PH_mod= 1
##$PKNL= yes
##$PPARMOD= 0
##$PSCAL= 0
##$PSIGN= 0
##$REVERSE= no
##$SF= 81.014009
##$SI= 65536
##$SIGF1= 159.3651
##$SIGF2= -187.1042
##$SINO= 113.3802
##$SIOLD= 16384
##$SREGLST= <1H.CDCl3>
##$SSB= 0
##$STSI= 65536
##$STSR= 0
##$SW_p= 40650.406504065
##$SYMM= 0
##$S_DEV= 0
##$TDeff= 32768
##$TDoff= 0
##$TI= <>
##$TILT= no
##$TM1= 0
##$TM2= 0
##$TOPLEV= 0
##$USERP1= <user>
##$USERP2= <user>
##$USERP3= <user>
##$USERP4= <user>
##$USERP5= <user>
##$WDW= 1
##$XDIM= 65536
##$YMAX_p= 337690970
##$YMIN_p= -2889081
$$ End of Bruker specific parameters
$$ ---------------------------------
##NTUPLES= NMR SPECTRUM
##VAR_NAME=  FREQUENCY,     SPECTRUM/REAL,   SPECTRUM/IMAG
##SYMBOL=    X,             R,               I
##VAR_TYPE=  INDEPENDENT,   DEPENDENT,       DEPENDENT
##VAR_FORM=  AFFN,          ASDF,            ASDF
##VAR_DIM=   65536,         65536,           65536
##UNITS=     HZ,            ARBITRARY UNITS, ARBITRARY UNITS
##FACTOR=    0.620285442955139, 1,           1
##FIRST=     20137.2065510759, 0,            0
##LAST=      -20513.1999529892, 0,           0
##MIN=       -20513.1999529892, -2889081,    0
##MAX=       20137.2065510759, 337690970,    0
$$ Real data points
##PAGE= N=1
##DATA TABLE= (X++(R..R)), XYDATA
$$ [...]
38194A04297l2873j05823r8727n7584k1776O6520J83106J41749j08532k94569
38184b24212j72703R5280J88314R2288K1702J5818m7861j31388q1040N0748O6136
38173a26918j5836J5019J73211K36286J14765l0563p1003m0647K7716J28994J49268
38162E60292j5415k07934j75406J9570P7890m0399o4015R4780J75615J6398j89860
38151B51516k35038j71780r2445N3510K40400K66813Q6264l6742P1570J91612
38141F25680O2268j90998k62862j29602j5219j7704m6430n3066o6638m6759O1091
38130h0239J55943R4494m5636n5763L9555k0556k74856l50179L6523N59786N97809
38119F56881N1094m80236m59254n6494J99384J57044O9575M9722m2893j88171
$$ y = [104297, 71424, -34399, -133126, -190710, -212486, -145966, 37140, 178889, 70357, -224212, -396915, -301635, -113321, -21033, 669, 16487, -31374, -162762, -243802, -193054, -126918, -142754, -127735, 45476, 281762, 396527, 365964, 294961, 254314, 282030, 411024, 560292, 544877, 336943, 161537, 181107, 258997, 218598, 154583, 249363, 424978, 441376, 251516, 16478, -155302, -247747, -194237, 46163, 312976, 399240, 362498, 434068, 625680, 687948, 496950, 234088, 104486, 89267, 71563, 25133, -27933, -94571, -141330, -80239, 75704, 170198, 124562, 68799, 108354, 87798, -187058, -537237, -500714, 59072, 656881, 707975, 227739, -231515, -288009, -88625, 68419, 137994, 187716, 144823, -43348]
38109d3348j55564L6351O9016j07976j28849J36655K78493L1822k19402p3767
38099a76569K00119J53831n8994l0089J01381p6345l97816l38736K7009J13838
38089d82371j32918j30626K76314M91452J80998j66470q5636J41915P7592j27636
38079D2614q8996J33614J95707O978k60190m29030l30471J00501N21068M02459
38069B94254j87894n04234j38003L81814L87802j2016k66952j90278L9490K86023
38059I0006M00239J50609l37040m94270j32037J46417r9278l45007J9160N51037
38049e0164M29539j29222k05028K62349L84073j45399n42311k52368K15834K32297
38039A99600q495l4450P4796N657j33461o3977R5865M7040j43999j74447j2604
$$ y = [-43348, -198912, -162561, -93545, -201521, -330370, -193715, 84778, 116600, -102802, -176569, 23550, 177381, 118387, 88298, 189679, 113334, -284482, -623218, -596209, -482371, -615289, -745915, -469601, 21851, 202849, 36379, -49257, 92658, 170250, 42614, -46382, 87232, 282939, 289917, 29727, -399303, -729774, -629273, -108205, 294254, 106360, -397874, -535877, -154063, 233739, 221723, -45229, -235507, -196017, 90006, 490245, 640854, 303814, -190456, -322493, -176076, -275354, -620361, -601201, -50164, 379375, 250153, 45125, 307474, 691547, 546148, 3837, -248531, -32697, 199600, 191105, 156655, 231451, 237108, 103647, 39670, 135535, 182575, 38576, -135871, -148475]
38028a48475J10141R2272L7010L4962J02960K28189L09277K07322j6839j23595
38018H33224o8484q3299k40022k64869j1600K13367J03981j52928j84894j145
38008A43331J11663P3139J2715o5539k37111l69213k51326L5507K14113K22242
37998a10479J99441J38841o4177k58287j65977J05663J39805j06801j75937J38060
37988a59848L91339J84383j73544j57457J32378J79204p8595j98098l5119L4052
37978A18695j50745j76133K23701N80359L19183l34487o21856k90857J52343K24519
37968D4722J2161j65866k17030j97855r4980Q8237K32208K64737K54041K22860
37958D43235Q4353j09625j12206J33322K94335Q8480k72164l63203j32412R9769
$$ y = [-148475, -38334, 53938, 90948, 125910, 228870, 457059, 766336, 973658, 956819, 833224, 764740, 681441, 441419, 176550, 164950, 378317, 482298, 329370, 144476, 143331, 254994, 328133, 340848, 275309, 38198, -331015, -582341, -546834, -332721, -110479, 88962, 227803, 163626, -94661, -260638, -154975, -15170, -121971, -297908, -159848, 231491, 415874, 242330, 84873, 217251, 396455, 317860, 119762, 84643, 118695, -32050, -208183, 15518, 595877, 915060, 580573, -41283, -332140, -179797, 44722, 56883, -108983, -326013, -523868, -618848, -530611, -298403, -33666, 220375, 443235, 527588, 417963, 305757, 439079, 733414, 821894, 549730, 186527, 54115, 153884]
37948A53884J33428P1346L5216k510o2861p8438l5428j6355m4408l7567L1297
37937A47604O1248l1667j85406k50390j37399P9219J83514K8766k24951k30135
37927e59597Q1260L28700J75089j77769k61221L536K50340K37486J20541R3798
37917B92163Q7677k4676j67281j89745r3582K0935J06010J40396P5728o3638j28017
37906E5970j7546J55655J87460K4609j85952k60268j47959K9515R6700J1259r2694
37895a43251r5975n1371m0202K7726K65907N13406M53977P7949k34940k08763
37885E64463k1134j089j65786k60603j44894O0777J62473Q1849j03252k05246
37875c2442p9638J74528K63109O2472j76981j55495N3478J28143r900j01538J1283
$$ y = [153884, 287312, 358658, 393874, 391364, 328503, 250065, 214637, 198282, 153874, 116307, 147604, 208852, 177185, -8221, -258611, -396010, -316791, -133277, -104511, -329462, -559597, -478337, -149637, 25452, -152317, -413538, -410002, -159662, 77824, 198365, 292163, 379840, 355164, 187883, -1862, -95444, -74509, 31501, 171897, 247625, 183987, 55970, 38424, 194079, 381539, 406148, 220196, -40072, -188031, -158516, -61816, -50557, -143251, -239226, -290597, -330799, -303073, -37166, 476240, 930217, 1008166, 773226, 564463, 543329, 542240, 376454, 115851, -29043, 31734, 194207, 276056, 172804, -32442, -112080, 62448, 325557, 388029, 211048, 55553, 109031, 237174, 227274, 125736, 137019]
37864A37019J26396J5147j91242j81021P3027K77962K42407R3073J52q4187k46440
37853B62293l46138j83372J31594K45229L2665k32864k65585j05669N1378J56330
37843b54139K53177K87643J89174M2747k6152n0450j06312j06810M2108J70293
37833D41279L1669k67516l53026j22300J24182J59152J01228Q9245K8190j35896
37823I6207k00205l6756J17277J3400j70343r5568J79727K91671J42894q867l2774
37812B96663r6662k65343k96897l0036L02765L72320J75768l7053j10779o9480
37802B41266K1275R1136N5769o5625j11870p549Q1532n862j44691j11276M0890
37791H4995O1970p7094j38833j3852J23176J22761N5054o349j20800k54454j94642
$$ y = [137019, 263415, 278562, 87320, -93701, -20674, 257288, 499695, 592768, 592920, 508733, 262293, -83845, -267217, -135623, 109606, 142271, -90593, -356178, -461847, -410469, -254139, -962, 286681, 475855, 518602, 492450, 442000, 335688, 228878, 270986, 441279, 472948, 205432, -147594, -269894, -145712, 13440, 114668, 203913, 232103, 96207, -103998, -140754, -23477, -10077, -180420, -275988, -96261, 195410, 338304, 329437, 296663, 200001, -65342, -362239, -392275, -89510, 282810, 458578, 421525, 310746, 241266, 262541, 353677, 409446, 343821, 231951, 224402, 305934, 300072, 155381, 44105, 84995, 146965, 69871, -68962, -82814, 40362, 163123, 218177, 211828, 91028, -163426, -358068]
37780c58068R7010K98210J65766n4697P583K40630K09922j38224l68089k10196
37770a10153P3231J33419J1599m5389J2017O5101Q3445J11601J09730J8552q9143
37759C74010r7291k6818J9389K3178J9572k9198j68297l02605k69299n3887J72122
37748c39124K23227N6109j89360k62239k9320K95950L13771m3739l37058j70820
37738d82603K45568L81331J20870j43103j40439m9395p4732q1126R5015K55390
37728A26776J13382j95282k56979j0422J45191k6866k15877m1759L31381M06925
37718C76470Q3126k10411j53921M4371N2777o5998m0775J06376J15033l4785q3291
37707A88972M1083Q3384r0263k40646j41845O1222J19135P2159J03855J75414
$$ y = [-358068, -261058, 37152, 202918, 148221, 155804, 396434, 606356, 468132, 100043, -110153, -36922, 96497, 108096, 62707, 74724, 139825, 223270, 334871, 444601, 463153, 374010, 276719, 249901, 269290, 292468, 312040, 282842, 114545, -188060, -457359, -511246, -339124, -115897, -59788, -249148, -511387, -540707, -244757, 69014, 25275, -311783, -482603, -237035, 144296, 265166, 122063, -18376, -67771, -142503, -223629, -128614, 126776, 240158, 44876, -212103, -222525, -77334, -104200, -320077, -361836, -30455, 376470, 459596, 249185, 95264, 139635, 192412, 126414, 85639, 192015, 307048, 272263, 188972, 230055, 313439, 223176, -17470, -159315, -98093, 21042, 93201, 197056, 372470]
37697C72470J09037o8224j62932j44108j46313j63947l8631K06737L03116J15236
37687C82441j40935k06618j28852j23298k07148j79482M9242K93728L31436J87977
37677B58491P0202O3640M2366q7873k04466j42237N0577J86949K02362J62670
37667F02681P0987j05338k45118j86670m3812r0114k67614j93669J85890L77285
37657A04508P5768k78245j31229L04113L71970Q556j89911N0540K76589R0084
37647F82743k27338k27701j0572K0152j51178j75673M4135K03004R8413p3739
37637A82246o7518L3207r157j78807k15516j3958J99973J84428K2735j6905J10208
37626B30936J73859M9851p7794k5769P1296k8100k56309k97123n6521J74874J11837
$$ y = [372470, 481507, 413283, 250351, 106243, -40070, -204017, -242648, -35911, 267205, 382441, 241506, 34888, -93964, -217262, -424410, -603892, -554650, -260922, 70514, 258491, 328693, 392333, 434699, 346826, 142360, 123, 50700, 237649, 440011, 602681, 673668, 568330, 323212, 136542, 92730, 2616, -264998, -458667, -272777, 104508, 180276, -97969, -229198, 74915, 446885, 455441, 265530, 316070, 592659, 682743, 455405, 227704, 217132, 237284, 86106, -89567, -45432, 157572, 255985, 182246, 114728, 147935, 138778, -40029, -255545, -269503, -69530, 114898, 137633, 120728, 230936, 404795, 454646, 376852, 351083, 422379, 394279, 137970, -159153, -215674, -40800, 71037]
37615G1037j55661l03561j73269Q9578K39630J73523j5111j44558r6696R3754
37605b21334K71141K89148J35898n6039j33806o4922O0745J55447J97380J68231
37595H01889M0442j20598j75073j20628j25869k20732j69803J13699K70755r880
37585B84202l95476l11217J60263L77961J53941j1732J32488J49844k26860m93960
37575a80546j86000K85013K61127j24617k51425k8254J28578J14130J79700K78748
37565D76454J10258k14465k56827k3990L3276j47623j23182K03297L23545k3109
37555C57634l80284k95369K8353J59948O9759k5797p0833r0485k2619R4218O4743
37544a10732j08935j46608L1454J19869m1890j53568L3831K66349J99363n4237
$$ y = [71037, -84624, -388185, -561454, -471876, -232246, -58723, -73834, -218392, -315088, -221334, 49807, 338955, 474853, 418814, 285008, 220086, 280831, 436278, 633658, 801889, 842331, 721733, 546660, 426032, 300163, 79431, -90372, 23327, 294082, 284202, -111274, -422491, -262228, 115733, 269674, 257942, 390430, 540274, 313414, -180546, -366546, -81533, 179594, 54977, -196448, -224702, -96124, 18006, 197706, 476454, 586712, 372247, 115420, 91430, 124706, -22917, -146099, 57198, 380743, 357634, -22650, -318019, -289666, -129718, -59959, -85756, -156589, -247074, -269693, -175475, -110732, -219667, -366275, -334821, -214952, -256842, -410410, -376579, -110230, 89133, 34896]
37534C4896j55644o5331J9180M6012R6865J47430J19592M4473k6337j11916j62015
37523a2795n8124J11357Q1655j22239j23684J75966L30931M9189k66595j36842
37513B8819J93003J36991k69063m08771l8117L74439L52427K10k73110k81004
37503a84176j21779O3708K00177K31058J11437j11487k45113r2538K46897L48191
37493D46375k0237m47301l35444K07519M32802L2796l99679k88330R6451J81911
37483i3137J114l0038Q7960J5650k22171k49250n264J75749J68084K01519L36016
37472C86232K87921o6993m20244m45199j97216M5674J20449N8374l32P2005K23050
37461F3721K29864L0468r6331P6668L15065K32769j15028l23452k42360r8359
$$ y = [34896, -120748, -186079, -166899, -120887, -24022, 123408, 243000, 287473, 261136, 149220, -12795, -70919, 40438, 122093, -146, -123830, 52136, 383067, 432256, 165661, 28819, 221822, 358813, 89750, -319021, -357138, 17301, 369728, 369938, 96828, -184176, -305955, -242247, -42070, 188988, 300425, 188938, -56175, -148713, 98184, 446375, 426138, -21163, -356607, -149088, 283714, 316510, -83169, -371499, -275048, -93137, -92023, -122061, -34101, -18451, -240622, -489872, -495136, -319387, -151303, 50216, 386232, 674153, 607160, 186916, -258283, -455499, -409825, -289376, -231002, -231334, -159329, 63721, 293585, 324053, 227722, 304390, 619455, 852224, 737196, 413744, 171384, 73025]
37451G3025n4561m0833j3467r886M4573K15245K83045N445l84445m13968j03636
37440c99463O3241n1685o0200J82221K64872k3142k32132J9005L64386K67728
37430C94831j21436k63357q9672L2296Q636P0781J92380P3401k43109l17140k7861
37419b90250J79239L853k13502m9917L08323L54758K6499k54420k20029m1730
37409a97176L6369J0142j9602k8545j1557N1535R1031L808j19147n1416J87974
37398d6584K74025N3553j83639j40665K8288j646j91266k43506j06693J1629M6675
37387d99829R8648J15528j9838j17073J27749N32198N40804N9898l45880k89504
37377B02701o4063k8165k3798J81735L41011J28753k41522l32902j69863r5142
$$ y = [73025, 18464, -22369, -35836, -45722, -1149, 214096, 497141, 502586, 118141, -295827, -399463, -336222, -387907, -448107, -265886, -1014, -24156, -256288, -237283, 127103, 394831, 273395, 10038, -79634, -47338, -38702, 32079, 224459, 297860, 54751, -262389, -290250, -111011, -107158, -320660, -370577, -62254, 292504, 319003, 64583, -155446, -197176, -160807, -150665, -170267, -198812, -210369, -158834, -67803, -63995, -183142, -234558, -46584, 227441, 280994, 97355, -43310, -15022, -16668, -207934, -451440, -558133, -546504, -499829, -401181, -285653, -305491, -422564, -294815, 237383, 778187, 838085, 492205, 202701, 138638, 110473, 86675, 268410, 609421, 738174, 496652, 163750, -6113, -101255]
37367a01255j42495p2635J04780J58664J02735J47938K41799J28308j51968k78028
37357A37843j74778r0958j27269j10980J0015O0906N878L3801J80446K22607O0638
37346B08149j13222j30250l5652J07461K94445L88013J84634k13144m04152k12693
37336G3589O7105R7274p7853j87464j17717J7391O8017J1892j7542J12282K81278
37325C28252J75660k29978m70839j85645K90627L53515K531k20326r5699M0515
37315a1387l2002r7441J132Q4598N3229Q1449J81713O8834k84596m45279j77346
37304e77096J57591J94806J08972J78263K45873P6915j27666q1852L5136q6508
37294A24434k61567r4198K86547L70866P7158j56288r9839q860p9486j30468j0427
$$ y = [-101255, -243750, -316385, -211605, -52941, 49794, 197732, 439531, 567839, 415871, 137843, -36935, -127893, -255162, -366142, -356127, -295221, -289343, -255542, -75096, 147511, 208149, 94927, -35323, -70975, 36486, 330931, 718944, 903578, 690434, 286282, 73589, 140694, 237968, 160115, -27349, -145066, -127675, -59658, -47766, -65308, 46974, 328252, 503912, 273934, -196905, -382550, -91923, 261592, 264123, 43797, -51902, -11387, -43389, -140830, -139698, -55100, -1871, 79578, 261291, 330125, 45529, -399750, -577096, -419505, -224699, -115727, 62536, 308409, 385324, 257658, 175806, 210942, 124434, -137133, -231331, 55216, 426082, 503240, 346952, 247113, 238253, 158767, 28299, 17872]
37283A7872R2859j4633k00943k42400j55752p7838j685J42731K72047K37410P6648
37272A46316j2130M7924J11202L9993q1888p2480O5676J32750L0049q3749m3801
37261B79862N5684L3115n3834j1890J08045M8439k01920l20002j32182J19503
37251g5180J66679Q6145O3170M6167q4362k07705j30548P3853J80982J59744J28941
37240D07886Q1013n1444j40235m624K19268J88487j32068l76458k81421n697J66752
37229G1459J86585J45282M3490j31871k41046j39099N9677Q1938j18427k60356
37219c02368j09860J86525K93975J45955J1601P9089J80259P3476j59324k29338
37209A69990q6860J2211q5514k00581j03683J55436L33263K85977P1082j46242
$$ y = [17872, 110731, 96098, -104845, -347245, -502997, -580835, -582520, -439789, -167742, 69668, 146316, 134186, 182110, 293312, 333305, 251417, 178937, 244613, 377363, 407412, 323663, 279862, 335546, 368661, 314827, 302937, 410982, 459421, 257501, -62501, -194683, -75180, 91499, 177644, 240814, 286981, 202619, -5086, -135634, -61781, 119201, 278945, 407886, 488899, 437455, 297220, 292596, 511864, 700351, 568283, 191825, -89596, -95293, 71459, 258044, 403326, 446816, 314945, 73899, -65200, -5523, 76415, -42012, -302368, -412228, -225703, 68272, 214227, 225828, 304917, 485176, 558652, 399328, 169990, 83130, 95341, 9827, -190754, -294437, -139001, 194262, 480239, 551321, 405079]
37199D05079k08749q6688N7198K6248j46907k27040j02403Q0274J60774J58950
37189A16736J42501R4867K0428o472m980r6108k35510j87970O7845J90076k1240
37178H0173k39515p7931K70699K90074o6182l05186j47862R7896P1248j16139
37168a42725j45474j0178M5878k8423l1098J16255K07481O9268j54543k04020
37158b77579q1942k2345r8896j05680P8676K43740J69659P155L5412J62262N1720
37147A62182k66865l57623o3809K01783R5798j19486l3588K34106K60181K5894
37137A38573q6399N6079J56924J5195j73056j65337r270J17580J55363J11416
37127C17068k2472j65025j47640L6168J48362K1266j84502j93320K0418K35704
$$ y = [405079, 196330, 109642, 166840, 193088, 46181, -180859, -283262, -202988, -42214, 116736, 259237, 354104, 374532, 368060, 363080, 266972, 31462, -156508, -88663, 101413, 80173, -159342, -237273, 33426, 323500, 257318, -47868, -195730, -97834, -26586, -142725, -288199, -298377, -252499, -280922, -312020, -195765, 11716, 80984, -73559, -277579, -359521, -381866, -480762, -586442, -507766, -264026, -94367, -87212, -51800, 110462, 162182, -104683, -462306, -526115, -324332, -228534, -348020, -381608, -147502, 112679, 138573, 52174, 108253, 265177, 280372, 107316, -58021, -67291, 50289, 205652, 317068, 294596, 129571, -18069, 18099, 166461, 187727, 3225, -190095, -169677, 66027]
37117F6027K78737J65017m113j41400j79814j01296K1209Q8766Q6424N7489j1644
37106C25402j64372l15975k71580J738K45278K10565R791m3413R1157J32639m4256
37095A76974j88996r2602O6432N0212k4604N6335J53324J2196j92726p2369K66273
37084B10449K93890q1856l21115j14183J41934N0540j43731o2256J23784N2754
37074A50210j43810j05245O7823O304k02674j23606K40390L95245J53406r6561
37064C41482o1877L8513n4376k04235j83085n2728K7662Q9932J98531K40189J10991
37053D90999p7571j82527k37016k89744k31004P925K41932K41457M7565j10225
37043i8209j15100j4707J27100K50822K49446P5581j34906j92196q1389N1366
$$ y = [66027, 344764, 509781, 505668, 364268, 184454, 83158, 104367, 193133, 279557, 337046, 325402, 161030, -154945, -426525, -424787, -179509, 31056, 40847, -2566, 88591, 221230, 176974, -12022, -104624, -38192, 12020, -12584, 43751, 197075, 209271, 16545, -55824, 210449, 504339, 422483, 101368, -12815, 129119, 179659, 35928, -26328, 97456, 150210, 6400, -98845, -31022, -24718, -227392, -350998, -110608, 284637, 438043, 341482, 279605, 318118, 263742, 59507, -123578, -176306, -148644, -58712, 139819, 380008, 490999, 413428, 230901, -6115, -295859, -526863, -518938, -277006, -35549, 12016, -98209, -213309, -228016, -100916, 149906, 399352, 474933, 340027, 147831, 66442, 117808]
37033A17808J01816Q0949K4499l9597m1857Q0424K49838K65814L1216k82923l87619
37022B00368k05817K5676M8487q8367j18790M3407J79963J00693q2509j40016
37012c6905k9132J35522K69588L03614J35594j82270l58023k22797l2537q8780
37002a06126k09681j5736L41274K98631j79379l88235Q5050O43233M83063k36053
36992G16041o15030k61423K73889L56122N2382j55016q2612L1454l5090j97093
36982H3624k18403k7584J78600J46539j27303l60252l06356m1989J67219K04340
36972c01565J56126R5711K1612M994J51617L48340K95543o0172l47414k40288
36962A24504P0064J50232n1218j90638j00794O385k0191j9022J06203J21686j19773
$$ y = [117808, 219624, 300573, 325072, 285475, 243618, 324042, 573880, 839694, 870910, 587987, 200368, -5449, 20227, 68714, -19653, -138443, -95036, 84927, 185620, 103111, -36905, -66037, 69485, 339073, 642687, 778281, 596011, 237988, 15191, -17346, -106126, -315807, -331543, 9731, 308362, 128983, -259252, -174202, 469031, 952094, 716041, 101011, -160412, 113477, 469599, 521981, 366965, 284353, 315807, 280717, 83624, -134779, -162363, 16237, 162776, 35473, -324779, -631135, -673124, -505905, -301565, -145439, -49728, -28116, -23122, 128495, 476835, 772378, 712206, 364792, 124504, 194568, 344800, 293582, 102944, 2150, 8535, -11656, -30678, 75525, 197211, 77438]
36951G7438l02530r3673K52321K19508j45720k80454m368J94870l1314l24874
36941d38796k07921J70638L10592J18604n7615j1326J21667J87731J86243J26190
36931E06007K810q7235m7476K9782n787j05587j22758q3403j01107j11021J9186
36920a06589J85529J68861R889n9385j8012m6002j39522j13741J919k6455j78041
36909c21549j45695J23032K68984Q6752j35400p6241J44302K14616R3531l5056
36899B17276o3250J0173J69611L13076K65269J4973k34272l49863l78760l02758
36889c38525j7775L16261L01834r5914l70211j84191J30495J40959j8679j964
36879a37710Q7979m4148k31779q3890K65230K93185n1943k61436r5235J03428
$$ y = [77438, -225092, -318765, -66444, 153064, 7344, -273110, -277478, -82608, -113922, -438796, -646717, -476079, -165487, -46883, -104498, -115824, 5843, 193574, 379817, 506007, 508817, 421582, 374106, 403888, 398101, 292514, 169756, 86353, -14754, -125775, -106589, 78940, 247801, 257690, 198305, 180293, 134291, -5231, -118972, -117053, -143508, -321549, -467244, -344212, -75228, 11524, -123876, -200117, -55815, 158801, 252332, 217276, 154026, 164199, 333810, 646886, 912155, 927128, 692856, 342993, -35767, -338525, -356300, -40039, 261795, 165881, -204330, -388521, -258026, -117067, -135746, -137710, -49731, -93879, -325658, -409548, -144318, 148867, 96924, -164512, -259747, -156319]
36869a56319O2142k5194K5232M0051r7107j47013L7800J71719J3845j66764l1373
36858b72981K04617Q0284l33806m78254j21805L19500L95241J85306M9753P5801
36848A03656N0378j17034k19294o6244K00318K65739O8109j13271m7723J34324
36838B58958J55756j0110j58335j91386j95180j90233p2952J31762K06448N2058
36828a3214j32706j21582M3429J59023J34769L7488l1935q518Q8126J12725o5905
36817B01700l31549l96948j81731P7357J73120J60502J37590N6599p9649r6142
36807b79151N7782J35733k5269j89054q6930J23000J22776k1896M385K05304K77968
36796C24648J36913J4219K7605M1459n853p421L4935k071o1593L3506J86330J10799
$$ y = [-156319, -94177, -119371, -94139, -54088, -151195, -298208, -260408, -88689, -74844, -241608, -272981, -68364, 11920, -321886, -800140, -921945, -602445, -207204, -21898, 27855, 103656, 154034, 37000, -182294, -248538, -48220, 217519, 285628, 172357, 124634, 258958, 414714, 404604, 246269, 54883, -140297, -330530, -403482, -271720, -65272, -13214, -145920, -267502, -224073, -65050, 69719, 107207, 75272, 66754, 154880, 267605, 201700, -129849, -526797, -708528, -631171, -458051, -297549, -159959, -103360, -183009, -279151, -221369, -85636, -110905, -299959, -386889, -263889, -141113, -163009, -158624, 46680, 324648, 461561, 475780, 503385, 544844, 538991, 531570, 566505, 564434, 502841, 536347, 722677, 833476]
36784H33476j33097j66516L0855R718l52493n07291q3992M07952K68109l31393
36774b4672n66530j00109N44031P26172L64278j70470m71720l57347J4600K51378
36764B09611J41924p5893o0497J36504J91332K6849j14038q0148J1990K1239o0998
36753C47875j95725l06650k43469K4150K39997J57791p1525j11999M1419J17847
36743b89P5630J26269K54964J85621q4932j84637K4513J72151k9218l02977k48314
36732a1219L2514J19423q4601k53137j23961J84196L58368K40782k4617j46909
36722B90839k3910J07385j5366k70737k96683l4677J76887J22542m285K2803J16122
36711A90920J04318L5313K2190K2591m890M5890J87810J88684p5861l39037l07472
$$ y = [833476, 700379, 533863, 564718, 574436, 221943, -285348, -369340, 38612, 306721, -24672, -591202, -691311, -147280, 578892, 943170, 772700, 300980, -56367, -41767, 209611, 351535, 275642, 215145, 351649, 542981, 569830, 455792, 375644, 387634, 408873, 347875, 152150, -154500, -397969, -373819, -133822, 23969, -47556, -159555, -118136, -289, 75341, 201610, 456574, 642195, 557263, 372626, 397139, 569290, 540072, 237095, -11219, 21295, 140718, 56117, -197020, -320981, -136785, 221583, 462365, 437748, 290839, 266929, 374314, 358948, 88211, -208472, -243149, -66262, 56280, 51995, 74798, 190920, 295238, 330551, 352741, 375332, 370442, 416332, 604142, 792826, 716965, 377928, 70456]
36700G0456j10716o2257j43599r5350Q7062J40593k512j00286K59J47897J52960
36689H4507L6558o8849r1094k9064O6431R3918J5557l5450Q0674K47131J90218
36678E90537j14129l32344j88206J54747K85347O5435k06856j97794L0154J29219
36668B16110l5751k05664j23409R1112J53849N0910p555K2944n911r1555m6192
36657A8888J44300K52189J86115J20124J33749N1113k04852m09207l68816j78565
36647b54962J6485K07230L07706J22185k52638l76254r8146J44904N420k02412
36637c80482m5329K82118K91637O586j49987q8348p5641j33117j6038K22088K29651
36626A43138k2136j57641l2887N8094m8851j04116P0219K45818J87221L1154J1558
$$ y = [70456, -40260, -102517, -246116, -341466, -254404, -113811, -116323, -216609, -216350, -68453, 84507, 121065, 52216, -38878, -67942, -1511, 92407, 107964, 72514, 153188, 400319, 590537, 476408, 144064, -44142, 110605, 395952, 461387, 254531, 56737, 86891, 216110, 180359, -25305, -148714, -57602, 96247, 147157, 139602, 162546, 156635, 65080, 18888, 163188, 415377, 601492, 721616, 855365, 906478, 701626, 292419, -76397, -254962, -238477, -31247, 276459, 398644, 146006, -230248, -328394, -183490, -178070, -380482, -425811, -143693, 147944, 154530, 4543, -83805, -159446, -292563, -308601, -86513, 143138, 121002, -36639, -69526, -11432, -60283, -164399, -94180, 151638, 338859, 370013, 381571]
36615C81571Q7925Q4567k6166j73613l12205l40608j31965J90807K63089k2707
36605F95k58767l9706M27823N62330K02072j76798j32892J33748J03491k68623
36595E53373m48968j18896K84522J62328l34930m88318o8194L54582L07928O1480
36585B64907M2223J22957k1284k43817j84340O3807J19220k7039p5807j7705r8962
36574e5840k62127j89525J05641K68866J96189J18867Q7737q3248l14037k61388
36564c88865O7956K42506Q5169q0100j2488J13956J33283J50338J87190M8116
36554E47061k43985l36226r9786J44332J68998J49353J97711R0940k32210l86261
36544g3j30126J76427J12106j68346k41547n0799J59962K73717K86707J21993
$$ y = [381571, 469496, 554063, 527897, 354284, 42079, -298529, -430494, -239687, 23402, 695, -258072, -297778, 130045, 692375, 894447, 717649, 584757, 718505, 821996, 553373, 104405, -14491, 270031, 432359, 97429, -390889, -459083, -104501, 203427, 264907, 307130, 430087, 408803, 164986, -19354, 44453, 163673, 136634, 60827, 43122, -55840, -317967, -507492, -401851, -132985, 63204, 182071, 269808, 186560, -127477, -388865, -320909, -78403, 6766, -73334, -85822, 28134, 161417, 311755, 498945, 547061, 303076, -33150, -132936, 11396, 180394, 329747, 527458, 618398, 386188, -73, -130199, 46228, 158334, -10012, -251559, -302358, -142396, 131321, 418028, 540021]
36534E40021j80712l27122j63723K9535k4233j35869L409K67827L10275J30864
36524D50272M532r102n9041j13256J238K10318K30770Q327k02293k22130j45756
36513A53879j20075j41381j18721n195J46333J98917P2459r5638q4573O7074Q1661
36502A54740j05198k03527m5898J08185J218j73690q3493J95633K92586P8987
36492B19543k21020l71208l08484p2804K10562L52767K89982J53338K9286j50855
36482A31107l33581k44422J73266M96324L39035q3582k69476j24961L2169J7323
36472A33202p1033j51566k23263j84948M5550K72000K24593j1420j12403k6221
36462a05509k165j12261j21858Q7273K96316K71879N9940j44967k25286j65701
$$ y = [540021, 359309, 32187, -131536, -102001, -126234, -262103, -258694, 9133, 319408, 450272, 454804, 445702, 386661, 273405, 274643, 484961, 715731, 724058, 521765, 299635, 153879, 33804, -107577, -226298, -231493, -85160, 113757, 186216, 90578, 6005, 73079, 154740, 49542, -153985, -199883, -91698, -90480, -264170, -347663, -152030, 140556, 219543, -1477, -372685, -681169, -753973, -543411, -190644, 99338, 252676, 281962, 131107, -202474, -446896, -273630, 222694, 561729, 478147, 208671, 83710, 115879, 133202, 62169, -89397, -312660, -497608, -452058, -180058, 44535, 33115, -79288, -105509, -107674, -219935, -341793, -254520, 41796, 313675, 373615, 228648, 3362, -162339]
36452a62339k8711N2127P592m0822N1673K07498K48528J99673K14747K42184P4917
36441A067067k41547l71559j62668J21208J81920O4548j7977l3561q4808j43388
36431C79235p4006J00010J64272O705j97070j98819j0090J11905J7574j31159
36421A68557r7514R0009J79173M0404j76511k44014r9700J26584K40702J51599
36411C79289j5617l6927R6167J17114j09153l11210k06687J6236q591j93858j39034
36400d12271J55747K63201O3655o7277N1181J09189o3925j49091N3865K08644
36390B12918L8923j55338m3419J30553J3774j86960q9030J42596Q2414j82421
36380c5990k00959O6655K31271J48191M0132k713j03909k04292j02322J06045
$$ y = [-162339, -191050, -138923, -131331, -172153, -120480, 87018, 335546, 535219, 749966, 992150, 1067067, 825520, 453961, 291293, 412501, 594421, 658969, 640992, 607431, 522623, 379235, 305229, 405239, 569511, 576216, 379146, 180327, 170237, 282142, 299716, 168557, 71043, 161052, 340225, 380629, 204118, -39896, -139596, -13012, 227690, 379289, 363672, 326745, 422912, 540026, 430873, 119663, -87024, -70788, -79379, -273237, -412271, -256524, 6677, 70332, 3055, 54236, 163425, 99500, -49591, 4274, 212918, 251841, 96503, 53084, 183637, 197411, 10451, -78579, 64017, 146431, -35990, -236949, -170294, 60977, 209168, 249300, 246587, 142678, -61614, -163936, -57891]
36370e7891J16636m3163m1269J68761K57730P7419j36791j90319j47159o6961
36360f3007P3615J49707r965k38535j73226J51660K97864J09128n6841N5687K01841
36349D97928R3963j26489j62787j6884J12928J68504K04558J83429L0724j91913
36339G93961l33180l18533j92955o4285k5539n1870r045J26410J58610k6502j78496
36328a21424N044L63257M30921J13544j75610j33051M6794N6834o8089j02197
36318D16023r140N8267J1797r8122j90815k20201j79704j05841m2108M997L4000
36307c20847K5709J5767R0716K16789K12692L1478j02408l0829N5459o4426k25722
36296i5622j21145J75060L05941J77533K1019m4539j13068j65938n9347J21088
$$ y = [-57891, 58745, 15582, -25687, 143074, 400804, 478223, 341432, 151113, 3954, -63007, 10608, 160315, 150350, -88185, -261411, -109751, 188113, 297241, 240400, 296087, 497928, 591891, 465402, 302615, 285731, 398659, 567163, 771721, 955150, 985874, 793961, 460781, 142248, -50707, -114992, -140531, -192401, -201446, -75036, 83574, 57072, -121424, -116380, 246877, 677798, 791342, 615732, 482681, 529475, 586309, 518220, 416023, 406883, 465150, 476947, 378825, 188010, -32191, -211895, -317736, -359844, -354847, -320847, -295138, -279371, -188655, 28134, 240826, 272304, 169896, 139067, 194526, 130100, -95622, -216767, -41707, 264234, 441767, 462786, 418247, 305179, 139241, 79894, 200982]
36286B00982R6998j26294k02583J7874K51652K28568M7392q1177j49997k20434
36276F2981k16021n6671J63758K91206K84465J87526N5611l8436n1462m4567q9836
36265E48554j36611j13326p9261r1081m1763J24793J89108k9713k76370j77734
36255h3404J45090K46028P4795M37J06425N6275k09456k55617R5675L56192J06112
36244F38552l23922l71597r6533l203k20443l68159j82559J57663L64719L75898
36234b9584K82891J59259M4630l2033o7994o6089j5964N0227M6379m2530q9234
36223B39958J9992J99329K40308P4897j24799j50777j6734O5754j9623j34773
36213C93532j22253q0443j81548k84467p1185L76480N31142J47795l29445l77166
$$ y = [200982, 297980, 171686, -30897, -13023, 238629, 467197, 514589, 433412, 283415, 62981, -153040, -209711, -45953, 245253, 529718, 717244, 772855, 734419, 682957, 638390, 548554, 411943, 298617, 219356, 128275, 86512, 211305, 400413, 370700, 94330, -83404, 61686, 307714, 382509, 382946, 489371, 545646, 336190, 80573, 176248, 532440, 638552, 314630, -56967, -153500, -156703, -377146, -745305, -927864, -770201, -405482, -29584, 253307, 412566, 457196, 425163, 357169, 291080, 275116, 325343, 371722, 329192, 239958, 259950, 459279, 699587, 774484, 649685, 498908, 482174, 547928, 528305, 393532, 271279, 190836, 9288, -275179, -346364, 30116, 561258, 709053, 379608, 2442]
36203B442p9515J44857J90796K05495J37172j41089m09058l22903O774J45821
36193a19208M631r6656p211Q8545R5187J27505J67514M9839j55932j80371k5654
36182e1811K4853q3558r9823M0496J04626L0426L9066J62305J24157j41394k95804
36171a46461j21169J47006K15003J16052J3480o6510j28484j04926k37Q9920J61078
36160A74752K62070K92812J33803p6678j34133j41732k89213l88287j36229K64304
36150c8531L35696J05457J1854Q0880o4556l60509k96848J13510K27879j14964
36140a32k56045J37909M52250J59821l02961l04848J021J10074J4465k1880n0139
36129f0465j83290j91243P3355K66180J16547m4380J14935K67808O711l57489
$$ y = [2442, -77073, 67784, 258580, 464075, 601247, 460158, 51100, -271803, -265029, -119208, -114577, -211233, -218444, -129899, -34712, 92793, 260307, 310146, 154214, -26157, -51811, -26958, -110516, -210339, -169843, -65217, -34791, 4275, 166580, 290737, 149343, -146461, -267630, -120624, 94379, 210431, 223911, 157401, 28917, -76009, -76246, 13674, 174752, 436822, 729634, 863437, 786759, 652626, 510894, 221681, -166606, -302835, -38531, 297165, 402622, 414476, 495356, 430800, 70291, -226557, -113047, 114832, -132, -256177, -118268, 333982, 493803, 190842, -114006, -112985, -2911, 11554, -10326, -60465, -243755, -434998, -361643, -95463, 21084, -23296, 91639, 359447, 366158, 8669]
36119H669k70920J37829L03482J16215r0173j86158k46138j48560J89414M11246
36109B24906J83478j71275j35409J50104J65459p7712j32288L8373O1460q1656
36099B25440l5172K02239K37642N401j38828r2528j21886k38610j24659J97329
36089A16368K63210p5061l77903l19779j20838m2160L5888K42179L64750J97962
36079B84616q2926j74629l4344J71473K75095J48767j92471m39443k54318K09965
36069h8215M01290J18658j92883j03044J92786K13467j11053m07484l90544j40389
36059e07411J04828K11694J93121J26419P2226L2685k2475r8083j66226j95251
36049b48473j57644n1804N8129R7572J01121J62583K36451J63264l6630j11111
$$ y = [8669, -262251, -124422, 179060, 295275, 205102, 18944, -227194, -375754, -186340, 224906, 408384, 237109, 101700, 251804, 417263, 339551, 207263, 245636, 307096, 225440, 190268, 392507, 630149, 635550, 496722, 404194, 282308, 43698, -80961, 116368, 379578, 304517, -73386, -393165, -514003, -556163, -520275, -278096, 86654, 284616, 201690, 27061, -7283, 164190, 439285, 588052, 395581, -43862, -298180, -88215, 313075, 431733, 238850, 135806, 328592, 542059, 431006, 23522, -367022, -507411, -402583, -190889, 2232, 128651, 200877, 233562, 211087, 113004, -53222, -248473, -406117, -457921, -399792, -302220, -201099, -38516, 197935, 361199, 324569, 213458]
36039B13458M6395J88331P5064j52631j94414k5570J23593R8654p2174k69367
36029C1339l07104n1747L01764L18960o9408l43884j12006K51934J45524l14170
36019a48798m55512q0250K78617K06391m1613n6198J02789J10277q1901k24297
36009c90495j60723N515R8362O9694R866K3785J09213J67591J39769P1360J7472
35998A61409k3587l7423K3145J17267J18389J3833n5872l6833m6660j18546r2148
35987B2974Q9182K07242Q6103j33679k32039k05304j35983j3399J05179L5518
35977a74206j76930j51938K45502N34689K56414k80736l99001k8116K67187J79012
35967B71877J2424O5867J62605K3461k48482l25628j15362J52222K25307R0613
$$ y = [213458, 259853, 448184, 523248, 370617, 176203, 150633, 274226, 372880, 300706, 31339, -275765, -327512, -25748, 293212, 223804, -120080, -232086, 19848, 165372, -148798, -604310, -684560, -405943, -199552, -241165, -297363, -194574, -84297, -166198, -390495, -551218, -545703, -447341, -377647, -367781, -343996, -234783, -67192, 72577, 143937, 161409, 137822, 100399, 123544, 240811, 359200, 373033, 317161, 280328, 233668, 115122, 22974, 112156, 319398, 405501, 271822, 39783, -165521, -301504, -314903, -209724, -174206, -351136, -503074, -257572, 277117, 533531, 252795, -146206, -174322, 92865, 271877, 284301, 350168, 512773, 536234, 287752, -37876, -153238, -1016, 224291, 314904]
35957C14904n8087o3170K1032M1823j1805k6485L78m2447j26564q3035Q6028J71234
35945B23806J05020M2152J7607j08505k63909j62660J43120J99737j11516k91027
35935b06175j3349L17319K40851k1098k5593J24585O1606j45476j69005l1356
35925A32309K9847N3012J70708K08112R882j27657O6391K46247j2526l95607l13274
35914F7444P6612J28339j77022k42959P2258K65525J20908k076N4559k5568l17720
35903B0300l94387n4686L05997L28554J50540L721j25822k17043j02726J37130
35893E1578J48912j15857k57403o5763J57329J29785K551J0109J02215J46960
35883C10416J55466J24422j8754j82518j57612R488M4220q9979j44045n8080m9375
$$ y = [314904, 256817, 193647, 214679, 256502, 244697, 218212, 218590, 176143, 49579, -33456, 52572, 223806, 328826, 370978, 388585, 280080, 16171, -146489, -3369, 196368, 84852, -206175, -219524, 97795, 338646, 317548, 291955, 416540, 478146, 332670, 163665, 132309, 162156, 215168, 385876, 593988, 603870, 476213, 542604, 788851, 776325, 380718, 67444, 144056, 272395, 95373, -147586, -75328, 190197, 311105, 309029, 363588, 338020, 20300, -374087, -428773, -122776, 205778, 356318, 360039, 234217, 17174, -85552, 51578, 200490, 84633, -172770, -238533, -81204, 48581, 51132, 61241, 163456, 310416, 465882, 590304, 571550, 389032, 231420, 240908, 285128, 195149, 51104, -6976, -56351]
35872e6351j47341j02721J17754K03861K7778j27905m0142J40590K03772J54466
35862C73761N2275q6995j47961j7467J33694L8765j98453k36265o3700L0494J1608
35851a10244Q4553J66869l893k40043p9493L44644L71366r4383l56221o6673K14824
35840B31306P914l06605k13206R3809J80948J28812J95664K01626j03806m25077
35830h615l12098Q7879K54285P6274j18921j65845j88767k22243j43018N4143
35820f86926K40863L62399M14895L27831R7444r7979j22732o9722n1556j2719
35810D01798P2657O1301r2676j80110o9885M3669m1617k06043k30696j28163k6666
35799c96431O2622J54828J77110J21681R2778P0861q6233k84524k08748J20109
$$ y = [-56351, -203692, -306413, -188659, 15202, 42980, -84925, -125067, 15523, 219295, 373761, 426036, 339041, 191080, 173613, 307307, 346072, 147619, -88646, -152346, -121852, -110244, -25691, 141178, 137285, -102758, -182251, 162393, 533759, 439376, 83155, 16482, 231306, 239220, -67385, -280591, -186782, -5834, 122978, 318642, 520268, 416462, -8615, -320713, -232834, 21451, 97725, -21196, -187041, -375808, -598051, -741069, -686926, -446063, -83664, 331231, 659062, 756506, 658527, 535795, 466073, 414517, 401798, 474455, 535756, 443080, 262970, 193085, 236754, 195137, -10906, -241602, -369765, -396431, -333809, -178981, -1871, 119810, 212588, 283449, 197216, -87308, -296056, -175947]
35789a75947K25356j06176m04661j95171K67855L91681R8773j78886j77518k0195
35779b74889J37883K65159K90123J35549p6859j26117K887J22469J20902M9100
35769F46207l4607j29219k12268k22996j25609N1685J99733J76145j1766j23739
35759B13566J9154K15645J38533j28082j72692Q3307K24486j5091l42337l62633
35749a26144j14672J02015J61085J25660N4927Q631N0179R1086m3120k66255k36927
35738a93535J25002M28393L28626j7569k37020k25528j19351j6999L2857l5323
35728F9553j65296j51879O1768K40262J78866j0773r4549k3213Q5857J08935k4988
35717B74543k48082k98828j3255L13781K11106k58124m80884j44574L15365L61069
$$ y = [-175947, 49409, -56767, -461428, -656599, -388744, 2937, 101710, -77176, -254694, -274889, -137006, 128153, 418276, 553825, 476966, 350849, 353736, 476205, 597107, 646207, 611600, 482381, 270113, 47117, -78492, -26807, 172926, 349071, 337305, 213566, 232720, 448365, 586898, 458816, 286124, 369431, 593917, 578826, 236489, -126144, -240816, -138801, 22284, 147944, 202871, 211502, 261681, 352767, 309647, 43392, -193535, -68533, 359860, 688486, 670917, 433897, 208369, 89018, 72019, 104876, 69553, -95743, -247622, -185854, 54408, 233274, 222501, 127952, 104739, 190596, 299531, 274543, 26461, -272367, -285622, 28159, 239265, -18859, -499743, -644317, -328952, 32117]
35707C2117O7926j13846j3856J72706K47562J65131l0096k00967j84635j8821
35697A23221N5212o5414j94123j58532l6358L4896O1416P6542L2191o8069j15930
35686b54948p1071p067N5427J50905J96172P1970j11808j14068N5979J40082K3649
35675A35222j55300k69091k78998j17749J74439L02035Q9999j30299K7868L30629
35665A08755K65296q4796j84319J2928L1784j97626k00065J26200K76912N8968
35655B14037o6366J34891K28483o0476l13977j63397R5131Q9641k6557j4388j6723
35644A00299j43527j41379R3984K19529O5829j3947J75136K48595m5012l08623
35634B50884j93941o385p6247j27768J31731L62148J70307j64779j87586k6229
$$ y = [32117, 100043, -13803, -27659, 145047, 392609, 557740, 527644, 326677, 142042, 123221, 178433, 113019, -81104, -239636, -275994, -241098, -179682, -103140, -70949, -139018, -254948, -326019, -333086, -277659, -126754, 69418, 141388, 29580, -84488, -28509, 111573, 135222, -20078, -289169, -568167, -685916, -511477, -209442, -119443, -249742, -221874, 108755, 374051, 289255, 104936, 117864, 149648, -47978, -248043, -121843, 155069, 214037, 147671, 282562, 511045, 450569, 136592, -26805, 68326, 157967, 131410, 117022, 100299, -43228, -184607, -90623, 128906, 194735, 180788, 355924, 604519, 559507, 250884, 56943, 50558, -25689, -153457, -21726, 340422, 510729, 345950, 158364, 132135]
35624A32135k8168q1458O0812J94672M8312j29410M405K26808J31597j64133k86708
35613A08864k44158k27796j29701J63378L50030J72001o1317J6411J68896J0839
35603C27447k60849k31111q279M8406N822J11107K04560M0224j40816k9397J10896
35592A78010p0249k57908n129L29415R1758m55777m26102K48803O49523K71574
35582E53918k89486l28939J7987J83258K606k27821k33915k9664J69686J93017
35572A0647J10386J01842J08776r7717l99327l22070J98474N34270K46209k27079
35562B64411k63270L972L6133j86698k50464o6787P9596P7163L9796k4654j25546
35551d16348p4491J98617L69885J95437m9804n1270O834j20377j89933N2942K74200
$$ y = [132135, 103967, 22509, 83321, 277993, 326305, 196895, 201300, 428108, 559705, 395572, 108864, -135294, -363090, -492791, -329413, 20617, 192618, 131301, 147712, 316608, 327447, 66598, -164513, -172792, -124386, -118564, -7457, 197103, 237327, 96511, 67114, 178010, 107761, -150147, -155276, 174139, 265897, -189880, -615982, -367179, 282344, 553918, 264432, -64507, -46520, 136738, 139344, -88477, -322392, -352056, -182370, 10647, 121033, 222875, 331651, 233934, -165393, -487463, -288989, 245281, 491490, 264411, 1141, 5113, 41246, -145452, -395916, -462703, -383107, -305944, -266148, -290802, -416348, -490839, -292222, 77663, 273100, 223296, 172026, 178860, 58483, -131450, -78508, 195692]
35540A95692Q8932j93122p7837K15576J40271j96569k51274j8896L0765j54721
35530b21183j82675K207O4188l4533N801J93168K23782P1008m850Q818r3028k33700
35518b00997j49218Q6378J64557Q1377O5173R5932O675r0081J2796J77637J55929
35507D06158M1559J1412q2077l31722l65751N3995M14607J66579l04437k47740
35497b37417K04766K70979j72543m44431j96859J56964K26448J22378N5970N8877
35487D5132J48636K77707J89281k02433m76566k66374J08649J47004j9876J9869
35477b8971J33738n4335l30580j98228J90826K51139m1526j83043l9803O9133
35467b31650O3715J22956J59026K464q5574J65794L61128P24n50952n49494p8181
$$ y = [195692, 284624, 91502, 13665, 229241, 369512, 172943, -78331, -97227, -66462, -221183, -403858, -401651, -337463, -371996, -366195, -173027, 50755, 121763, 116913, 125731, 32703, -200997, -350215, -263837, -99280, -17903, 47270, 143202, 149877, 59796, 72592, 250229, 406158, 447717, 459129, 377052, 45330, -320421, -266426, 148181, 314760, 10323, -237417, -32651, 238328, 65785, -378646, -575505, -418541, -192093, -69715, -13745, 45132, 193768, 471475, 660756, 458323, -18243, -284617, -175968, -28964, -48840, -28971, 104767, 50432, -280148, -478376, -287550, -36411, -77937, -260980, -300783, -231650, -167935, -44979, 114047, 116511, 30937, 196731, 557859, 558583, 7631, -541863, -620044]
35456f20044J67883Q2824J38569L43953K52495q1090j66758l7851j46520l73414
35446d39953j75195L19150M17329P3587o8703J26942J32146j34121j36825J82300
35436B96657K25564j33924k88689j4635J52113n0455j61030Q3740K72581J23732
35426E05654m1899K1727O5005q6832j98221j15694j2652J5488N4574L9899j16715
35415A30334j64918R5365K77606l462l12369n8297L59684J61956l55456k52777
35405a22334L40839L72787k60776m81908J00498N55213K73168j30821r8737l5072
35395E12857k92939m05508l8808K80579R6189j78803n5039K01939J51071p7827
35385A93711j58575j08232k8174J39011K83070J26904k22988l16487q2449J14592
$$ y = [-620044, -452161, -369337, -230768, 113185, 365680, 284590, 117832, 79981, -66539, -439953, -615148, -295998, 121331, 194918, 126215, 253157, 385303, 251182, 114357, 296657, 522221, 388297, 99608, 84973, 237086, 186631, 25601, 109341, 381922, 505654, 463755, 485482, 550487, 463655, 265434, 149740, 137088, 152576, 207150, 247049, 130334, -34584, 60781, 338387, 334925, 22556, -35741, 323943, 485899, 130443, -122334, 218505, 591292, 330516, -151392, -50894, 504319, 777487, 646666, 547929, 512857, 219918, -185590, -224398, 56181, 152370, -26433, -81472, 120467, 271538, 193711, 35136, -73096, -101270, 37741, 320811, 447715, 224727, -91760, -174209, -59617]
35375e9617J66909K55713K39275j41181n01874k33656L48996L42943k44666m88869
35365c16027j17977J44625j2852k7871K91454L35238q2813k82790L3530K43695
35355B08212p199j94574J7330J75482n75j03263N0549L4738k20362j55027K86299
35344I1610L67789j15587l74507j0980K86078K0371k70592j02918J05264m8744
35334e2216j97852k9345J02608J134Q8108M53955M58341j08234m84764j97675
35324C4060J59533N5657j03452O7772J28052k58238n29362j83712L09033L35418
35314A4761J13417J13239K15625J22510l9614r6293j79652k73212q5711K77415
35304A82485K84087q6809k22132M8178J78247l4274j18906P2509R6038j00240
$$ y = [-59617, 107292, 363005, 602280, 461099, -40775, -274431, 74565, 417508, 172842, -316027, -434004, -289379, -302231, -330102, -38648, 296590, 213777, -69013, -35483, 208212, 201013, 6439, 23769, 199251, 198676, 95413, 145962, 180700, -39662, -194689, 91610, 459399, 343812, -30695, -41675, 244403, 264774, -5818, -108736, -3472, -52216, -250068, -279413, -176805, -175671, -87563, 366392, 824733, 716499, 231735, 34060, 193593, 249250, 145798, 213570, 341622, 83384, -445978, -629690, -320657, 14761, 128178, 241417, 457042, 579552, 539938, 443645, 263993, -9219, -94930, 182485, 466572, 379763, 157631, 205809, 384056, 349782, 230876, 303385, 399423, 299183]
35294B99183l6560K13112Q432n24156m65621K55937N88366J33792k23660L4353
35284B83178K34668p1676k87567k2011J85495L3609K8143K94998J94143l12384
35274E60596l50321K25317L99065j64892m47050M7525L73175o8863m55771j62466
35264d3685J35866p3031j44591K76636L84166j99152n07675L7855N16554J90660
35254E73603k15588k766K50451J6681j04273K61883L48032k18880n03968N877
35244D11052L37292j54806n15111M8684P07900N68934J54915J13710r442n08420
35234A154708o02329K3746L64261p7959l05145K03049L80302l38331p64136j41570
35224a03404L88715m2506m12713J03442M66316j43733o02141L2932O61652K38309
$$ y = [299183, 262623, 475735, 484167, -39989, -505610, -249673, 338693, 472485, 248825, 283178, 517846, 446170, 158603, 136592, 322087, 355696, 383839, 678837, 872980, 560596, 210275, 435592, 834657, 669765, 222715, 270240, 643415, 574552, 118781, -43685, 92181, 19150, -125441, 151195, 535361, 336209, -171466, -133611, 382943, 573603, 358015, 355249, 605700, 622381, 518108, 779991, 1128023, 909143, 405175, 411052, 748344, 593538, 78427, 127111, 835011, 1403945, 1558860, 1672570, 1663128, 1154708, 552379, 576125, 940386, 862427, 557282, 760331, 1140633, 802302, 38166, -103404, 285311, 242805, -169908, -66466, 399850, 256117, -346024, -313092, 348560, 586869]
35214E86869k53070J89865N78384q4366p46913k79133L78834Q6923l42386P8644
35204A93651M69908q6131n70728j4855M68719j84536p93681j19708P21040L56081
35194D39760k93463O1372N64323N3055n39316o9076M86468J4414m45443J53562
35184D25656N78754k85613j003039k05181O70427N2922p33041n5040Q26265K48072
35174E20182n76629m644P33122K1761p86992P238R55036J92050q31748j24191
35164A05185Q94520J61976q75668n3986J126599K98326j093022m83431Q67438
35155I47937L73684q19771j94048J048273L29917j091892m80514R76876M45962
35146A536424r95119n02639R25163N12033p34580j37997J142954M34807r15369
$$ y = [586869, 333799, 523664, 1102048, 1017682, 270769, -8364, 370470, 457393, 115007, 193651, 663559, 577428, 6700, -8155, 460564, 276028, -517653, -637361, 83679, 439760, 146297, 207669, 771992, 825047, 285731, 216655, 703123, 717537, 272094, 425656, 1004410, 718797, -284242, -489423, 181004, 233926, -499115, -554155, 272110, 520182, -56447, -61091, 672031, 693792, -93200, -85962, 869074, 1061124, 229376, 105185, 999705, 1161681, 286013, 232027, 1358626, 1656952, 563930, 80499, 947937, 1321621, 501850, 307802, 1356075, 1685992, 594100, 113586, 1090462, 1536424, 541305, 38666, 963829, 1475862, 741282, 603285, 1746239, 2181046, 1265677]
35137A265677j60710J175113K73791j082385P7496J644835L36165j446363L5594
35128B119213K193896P55105j660788k91474K285344R23625j751442j68868K953731
35119G358342J550525j555111K35213L912836K269224j311876J297769O275945
35111B0032867M134840j082495J640043Q085727N798137L32520P432155K0375616
35103F6749410J8804018J3305430L8738985Q7142908R3024675J9925544p4336447
35096B63354523j03738126o2152313j7435651j1725039k0994597j4497308j613869
35089C1197620j665676p561439m583505J584968p95434o288850m118673J416616
35081I185627O36934l251394j956457J740518N87750k723280j480905J816984
$$ y = [1265677, 1104967, 2280080, 2553871, 1471486, 1548982, 3193817, 3529982, 2083619, 2119213, 4313109, 5068214, 3407426, 3115952, 5401296, 6324921, 4573479, 4404611, 7358342, 8908867, 7353756, 7588969, 11501805, 13771029, 12459153, 13756922, 20032867, 24167707, 23085212, 24725255, 32810982, 38609119, 38941639, 46373794, 66749410, 85553428, 98858858, 137597843, 224740751, 317765426, 337690970, 263354523, 159616397, 97464084, 80028433, 68303394, 47308797, 32811489, 31197620, 29531944, 21970505, 17387000, 18971968, 18176534, 11887684, 7769011, 9185627, 9822561, 6571167, 4614710, 6355228, 6942978, 4219698, 2738793, 4555777]
35073D555777Q04108k332101j507472J527948J064509j604634j303029R94912
35065B200018P43474j145278o85499J020455K69068j594361q02033J344273R79089
35056B329206r40274p67024P90280M88769r11052m19864J031325M65132j136047
35047I30451p15361Q69170N67295r40641p12248P20081N88668o51558m40046P20753
35037I36564L88805q35580m85427Q33633N86961p38336o27042N61768M06384p83376
35027B44354o24052O43368O26477o27144q30608K03323N15027j11679r3727N14978
35017D60317K39138n82292l28127O07786M86495l69682k41154N44822K62865p37121
35007C43047o52914K55479K21990n09089k04621Q05562O23752n24442o14146L80272
$$ y = [4555777, 5359885, 3027784, 1520312, 3048260, 4112769, 2508135, 1205106, 2200018, 2943492, 1798214, 1112715, 2133170, 2402238, 807877, 5844, 1350117, 2329206, 1388932, 621908, 1412188, 1900957, 989905, 570041, 1601366, 2066498, 930451, 215090, 1084260, 1651555, 710914, -1334, 718747, 1307415, 655857, 215811, 936564, 1325369, 489789, 4362, 837995, 1424956, 686620, 59578, 621346, 1027730, 244354, -379698, 263670, 890147, 263003, -567605, -364282, 150745, 39066, -54661, 460317, 699455, 117163, -210964, 396822, 883317, 513635, 272481, 817303, 1080168, 343047, -309867, -54388, 167602, -341487, -546108, 259454, 883206, 358764, -255382, 124890]
34997A24890N01250m43889n92776L89059P48226l3901m57174O8742L71409j8205
34987F57631j86609O4066q2269m76667j38885N73902L50632n42096n76101K38776
34977a17620M02338k43264l20203L59374M69346k18950m26315J39210L09947j79896
34967A73967k16098M26383O02234R530k63823J71683M13182J35834Q2089L49678
34957A884659J30684n30305o18582o5579R0108l14015l14680K18651K98399k34262
34947E45078l79419R1714K38789j82710k87036J52773K68964j63180k84788J48396
34937A48581K98936j13670l08331K8245K33056L7624k4428J36763k6821m20910
34927a0955l03966K42739L20811j45404k82401P3002J42496j98230j81663K74568
$$ y = [124890, 626140, 182251, -410525, -21466, 726760, 692859, 235685, 304427, 675836, 657631, 471022, 535088, 452819, -23848, -162733, 411169, 761801, 219705, -356396, -117620, 284718, 41454, -278749, 80625, 549971, 331021, -95294, 43916, 353863, 173967, -42131, 384252, 986486, 996016, 732193, 903876, 1317058, 1452892, 1534981, 1884659, 2015343, 1485038, 866456, 800877, 890985, 576970, 262290, 480941, 779340, 545078, 165659, 257373, 496162, 313452, 26416, 179189, 448153, 284973, 185, 148581, 447517, 333847, 25516, 53761, 286817, 324441, 300013, 436776, 409955, -10955, -314921, -72182, 248629, 103225, -179176, -106174, 36322, -161908, -343571, -69003]
34917f9003L36047j36508k92443J05009K93113J5902p3976J91957J76095k02417
34907C43776k32444J75662K68906r3223j89835J15415J33671k03685j49791L33695
34897E02147L67272k06262m70896r1822J56918q6562j84390J36223K58076k9187
34887C51517r3322K21269K09333k85965m40526N5765L89893O6350k92239j50435
34877C1640J04051P3647P812O4880l8052k46405r3314K88262J96858l20039l83916
34866c14576J76652M72461J07447k04503k5866Q0614k46597m54360j60624J48503
34856d20849Q9459K6059K06211K36669p1467k66906j22078k8994j50131r3352
34846e95379K23478L15933N3633r0076L7874M8351r8391N520K67557J39492k47361
$$ y = [-69003, 267044, 130536, -161907, -56898, 236215, 252117, 178141, 370098, 546193, 343776, 111332, 286994, 555900, 462677, 272842, 388257, 521928, 318243, 168452, 502147, 869419, 663157, 192261, 100439, 257357, 170795, -13595, 122628, 380704, 351517, 258195, 479464, 688797, 402832, -37694, 18071, 407964, 474314, 182075, 31640, 135691, 209338, 217150, 282030, 243978, -2427, -95741, 192521, 389379, 69340, -314576, -137924, 334537, 441984, 237481, 211615, 292229, 45632, -408728, -569352, -420849, -331390, -305331, -99120, 137549, 66082, -200824, -322902, -351896, -502027, -595379, -371901, -55968, -2335, -92411, -54537, -6186, -104577, -99057, 168500, 307992, 60631]
34835F0631j67334L23427L62622j61660l74868j9538J07331k90342m35716K7884
34825e67563L49770P1297j94626o175J44480n2478p6762K96487M23028P721k74020
34814A21159k7527J62456o1367j26863K66968M57552P0195k34368l1589O1282
34804F57898l28425m76321P3939M98291Q7252m63978k75473K23502J87218j58401
34794B5502j12644J73956J31954j04197q3784J9782j51699l13385p9352K18512
34784b75355J37917j9520J66272L49514O5558l11928j98707J34854P1780k37280
34774a16895k08864J05358J91406J2812m7669O9238J33966J40708J62916K4874
34764D67850l01685l74308N2691M73364L53191m8896k05815j81427k83251l33276
$$ y = [60631, -106703, 216724, 579346, 417686, 42818, 23280, 130611, -159731, -595447, -567563, -217793, -146496, -341122, -347297, -202817, -255295, -332057, -35570, 387458, 395179, 121159, 93632, 256088, 194721, 67858, 334826, 792378, 862573, 628205, 596616, 657898, 329473, -146848, -72909, 425382, 512634, 48656, -226817, -3315, 183903, 25502, -87142, 86814, 218768, 114571, 30787, 50569, -101130, -414515, -493867, -275355, -137438, -156958, 9314, 358828, 424386, 112458, -86249, 48605, 120385, -116895, -325759, -220401, -28995, -16183, -63852, 5386, 139352, 280060, 442976, 467850, 166165, -208143, -155452, 317912, 671103, 622207, 416392, 234965, -48286, -381562]
34754c81562l4339L29676L04358M8862J2235J35610N9830j48449j44440M3594
34744B25375J13736M3785K1439L4325q085P989J38491J28963j67436m37321l64743
34733b63482j04791N8987J46827K27029J64892j7632n651K27152K28333j59964
34723E01700m20961j96278J10687O7150o9188O7134K40770J18213o4025J6834
34713C72036J19274p5316k96195j60277J23532J63094O1404O8292J8957k32268
34703A62533k94822J38394N97030M84169R191k56289l24783n01259n55620r5305
34693f36761N08865N06036m0752l16233P089L88132L40637K7524k00711k70138
34683C13688k20064l4762K01415K95711J83558k8450k21102k93588j73764K3468
$$ y = [-381562, -415901, -86225, 218133, 266995, 279230, 414840, 474670, 326221, 181781, 225375, 339111, 382896, 404335, 438660, 430575, 438564, 577055, 706018, 538582, 101261, -263482, -368273, -309286, -162459, 64570, 229462, 211830, 206179, 433331, 661664, 501700, 80739, -115539, -4852, 62298, -6890, 60244, 301014, 419227, 355202, 372036, 491310, 415994, 119799, -40478, 83054, 246148, 307552, 375844, 394801, 162533, -132289, 6105, 603135, 1087304, 1096495, 840206, 515423, 14164, -541456, -636761, -127896, 378140, 337388, 21155, 28244, 416376, 757013, 784537, 583826, 313688, 93624, 58862, 260277, 555988, 739546, 711096, 489994, 196406, 22642, 46110]
34673D6110M6937j08836j43898M1850J36453n1282k36705j35958Q7140J71505
34663a46684J69736J82753Q9886j14199j37954R4986K02501j1356j61358L7916
34653B06227K14632j6555l41212k67247N6443J59195L8767K1930J22045J17671
34643C11896L5302L1215K1213j07036j73514l5148O7127p0864j85836J050K49544
34632A44949K02638j4728q5301m9717q5997q9423M5865R4321o7947j03685J96271
34621A87246M02985J12537l05897k68056R7214K43987R9157j5507n4250j74515
34611C24901k55056j19695J8060o7931j07430J76072M23146J86195k25034k17306
34601A35922O7449M0036k62723k76755M3058J62119o3356j93864m6154N5015j9399
$$ y = [46110, 93047, -15789, -159687, -117837, 18616, -32666, -269371, -405329, -318189, -146684, 23052, 205805, 295691, 181492, 43538, 138524, 341025, 329669, 168311, 206227, 420859, 404304, 63092, -204155, -147712, 11483, 50250, 72180, 194225, 311896, 347198, 378413, 399626, 292590, 119076, 83928, 151055, 80191, -105645, -104595, 144949, 347587, 332859, 247558, 197841, 111844, 22421, 68286, 162607, 94660, -9025, 187246, 590231, 702768, 396871, 128815, 226029, 470016, 569173, 553666, 499416, 324901, 69845, -49850, -31790, -99721, -207151, -31079, 392067, 578262, 353228, 135922, 203371, 243407, -19316, -296071, -253013, -90894, -154250, -348114, -394268, -339253, -358652]
34590c58652K8126K76376L59268J04732j47343r6791Q7304R8554q3152k60040
34580H382k66606q2190J27602J28513o1365j33285L9949J64254J9399j38352k0338
34569b14037J87924J75698L2126j4574m1708j54562j32470J43261K97419N2564
34559C31641j99015l7995J98689N450l29344j94649K29787K55817j17173k36592
34549i3384N6634K43925J02340j9189L1079q435j55251r6221J23771R1716j68052
34538A08933j49545K11317L48278L0706k37839r1451J27036L0472j93081k16345
34528c1519j03529k7669P9480K36634J98720j03735k88062n4245L11434L33680
34518E51189K1565k00889j03485J08236J32146m5429j62776m4512J29904O1693
$$ y = [-358652, -330526, -54150, 305118, 409850, 262507, 165716, 253020, 351574, 268422, 8382, -258224, -340414, -212812, -84299, -145664, -278949, -239000, -74746, -55347, -193699, -214037, -26113, 149585, 181711, 167137, 125429, -29133, -161603, -18342, 279077, 331641, 132626, 94631, 293320, 298770, -30574, -225223, 4564, 260381, 143208, -93384, -36750, 207175, 309515, 290326, 321405, 312970, 157719, 61498, 185269, 276985, 108933, -40612, 170705, 518983, 549689, 311850, 220399, 347435, 377907, 184826, -31519, -135048, -162717, -83237, 153397, 352117, 248382, -39680, -93925, 217509, 551189, 572754, 371865, 268380, 376616, 508762, 463333, 300557, 256045, 385949, 447642]
34508D47642j84322k23149L2337J86849K3355r9305J09425K86695J9375l65805
34498B33097k88879J03036J91712o8571j58117M7307J42579L5332R5753L37303
34488F70552K57359k49223n58040k58340J94990J92250j59289l09747o8635K58165
34478b9958L25829P5036k58871l34559n7213K49619K39775L3839m299J27778J24082
34467D91058l5793n9898O8136J3208k87679m38060k00601J41814K47369J54572
34457I4126O1189O11o4315r4040p5634o3380m6502J7363M8837k8445p2673P4919
34445a47944K65179K51699J10789P0255O0574j09771k72616j30180J35150Q0407
34435C13542k13280k22453J22775K98995O6194j79037j28867j4797o4491q4319
$$ y = [447642, 263320, 40171, 72508, 259357, 282712, 183407, 292832, 579527, 598902, 233097, -55782, 47254, 238966, 170395, 12278, 59585, 202164, 237496, 333249, 670552, 927911, 678688, 120648, -137692, 57298, 249548, 90259, -219488, -288123, -29958, 295871, 370907, 112036, -222523, -279736, -30117, 209658, 243497, 239198, 366976, 491058, 455265, 395367, 463503, 476711, 189032, -249028, -449629, -307815, -60446, 94126, 155315, 155926, 91611, -2429, -78063, -141443, -187945, -170582, -121745, -150190, -222863, -147944, 117235, 368934, 479723, 549978, 610552, 500781, 228165, 97985, 233135, 313542, 100262, -122191, 584, 299579, 365773, 186736, 57869, 43072, -21419, -105738]
34425a05738R0308K23852J01804r2907j38997j34041j97210j76233M0976K37390
34415a50796J94725N1650N4747J63615J56094k4960k22861k63375j06432J00057
34405d7536J24210n8457j68756j4456J81269J27950m3834k4843J20765J05629
34395C01941l0458l3530L3676o2468j71959J1174K59879P7769l69780l86135J10732
34384b59159M08959J70746o7465J02911K77678L3972l06839k79543n6418l5144
34374a0302j16545R835K22687J86979m0714j31815k5705O8735N3073j7457j11758
34363H7013j76140r2675J02563J82946R0642N3146J67059K00390J9673j40012
34353D94605p9002L6796J3369l6189L1075Q9986K797j17202j47842j72159k26020
$$ y = [-105738, -15430, 208422, 310226, 217319, 78322, -55719, -252929, -429162, -388186, -150796, 43929, 95579, 150326, 313941, 470035, 445075, 222214, -41161, -147593, -47536, 76674, 18217, -150539, -164995, 16274, 144224, 100390, 75547, 196312, 301941, 271483, 237953, 271629, 209161, 37202, 48376, 308255, 386024, 16244, -369891, -259159, 149800, 320546, 253081, 355992, 633670, 667642, 360803, 81260, 24842, -10302, -126847, -117012, 105675, 292654, 251940, 120125, 94420, 163155, 216228, 198771, 87013, -89127, -181802, -79239, 103707, 194349, 247495, 414554, 614944, 634617, 494605, 415603, 452399, 465768, 429579, 460654, 550640, 553437, 436235, 288393, 116234, -109786]
34342a09786j51724O9219J76542O1288j7397J09209K18257J22759J2303N8011
34332E48681O1463j48190l19872j68466J39320K58266J63543L7876q0156k04772
34322B87693k09736m4650Q5398K8461p5034q8729j00024j16005O2961L79489L80620
34311E90444p1282m00409j16781L92562M38627N9666j58343n0824J4834j06286
34301E92208j39975Q044M0820j94230m10251l11402r125J62020O0202j35930j28625
34290d66244J63767M35779L06902j27605l28653o1654K25627P3971k74295k75189
34280c27594N3869K09294K8761j20606k1061N5152j28280l18264j38094L24727
34270c82096N93302M01160p947k28187j90500j54699k34279j87911J40418M20975
$$ y = [-109786, -261510, -192291, -15749, 45539, 28142, 137351, 355608, 478367, 490670, 548681, 610144, 461954, 142082, -26384, 112936, 371202, 534745, 572621, 492465, 287693, 77957, 33307, 118705, 147166, 72132, -16597, -116621, -232626, -169665, 209824, 590444, 519162, 118753, 1972, 394534, 833161, 892827, 734484, 683660, 698494, 592208, 452233, 460277, 501097, 306867, -103384, -414786, -423911, -261891, -201689, -337619, -466244, -302477, 133302, 440204, 312599, -16054, -77708, 147919, 221890, -52405, -327594, -273725, -64431, -35670, -156276, -177337, -122185, -250465, -568729, -706823, -382096, 211206, 612366, 604419, 376232, 185732, 31033, -203246, -391157, -250739, 170236]
34260A70236K55198j38078j58120K36146L96089j1000m49238l44465M2917J02123
34250A01808j48549j88134J01650K92223J49178m2434l987J22715O9429j39840
34240C14059k50055j13509J43477K43146M7071k49535l15289j16317L4581m4313
34230c06684j29112J7546K31502K02957l6494j83267r9205R0598K37123K58881
34220B83845R6200j87442l50667k34174K3226K02947K81104K93568J47848j56644
34210C99811l28604j40670J71867K15821J0283j13919o9791n7648j07595j6870
34200c7315K12467K75980K7352k85867l81772k72952j06632P4969K51585L00916
34190E8731J49613o1985j28443l9236L1908k5693j22279r7516O9749K34249K62096
$$ y = [170236, 425434, 287356, 129236, 365382, 761471, 750471, 301233, -43232, -315, 101808, -46741, -234875, -133225, 158998, 308176, 265742, 261755, 384470, 453899, 314059, 64004, -49505, 93972, 337118, 384189, 134654, -180635, -296952, -262371, -306684, -435796, -418250, -186748, 16209, -20285, -203552, -302757, -212159, 24964, 283845, 380045, 192603, -158064, -392238, -369012, -166065, 115039, 408607, 556455, 399811, 71207, -69463, 102404, 318225, 328508, 214589, 144798, 87150, -20445, -37315, 175152, 451132, 478484, 192617, -189155, -462107, -568739, -493770, -242185, 58731, 208344, 146359, 17916, -21320, 10588, -15105, -137384, -234900, -165151, 69098, 331194]
34179C31194J74126P5924J4522k0577k8476l9416j42629l21435l58082j16100
34169d30949J71595J74992l2643q3606R0258J62351l2534k50978k68059j56891
34159f56464L03K59869M89870L51159j22325l69653p8807K97887K17337j43498
34149B45678k35035J3262K17452K00545J05069q805j78001k57714j03210O6835
34139F6076l7390k21409o6397L11352L44132q3118l91350j61800K71362L66859
34129C98317J18784q5642q0120l4500q1529j36263q5980L8832J31676J48412J19577
34118D51564N3353r4700k92963l49742j27908J71628J86272q0397j97387O2388
34108b17892L38174K14338j29864j97351O3419K18087L5779k07640j95081J0488
$$ y = [331194, 505320, 581244, 595766, 575189, 546713, 507297, 364668, 43233, -314849, -430949, -259354, -84362, -117005, -200611, -110353, 51998, 19464, -231514, -499573, -656464, -656161, -396292, 93578, 444737, 322412, -47241, -126048, 171839, 389176, 245678, 10643, 23905, 241357, 441902, 546971, 538166, 360165, 102451, -759, 66076, 28686, -192723, -259120, 52232, 396364, 313246, -78104, -239904, 31458, 398317, 517101, 431459, 351339, 316839, 235310, 99047, 13067, 51899, 183575, 331987, 451564, 504917, 410217, 117254, -232488, -360396, -188768, -2496, -82893, -280280, -217892, 120282, 334620, 204756, 7405, 70824, 288911, 324690, 117050, -78031, -67543]
34098f7543J49784J22610J4593o7276o9928m229N8676O3796L7318Q581o6184j96888
34086a6690k63626j68610l275Q5646J09151J53230J82553J18243K4603J0877K1095
34075B53197n8525j45434n5828J71814K88559J86206K5595k3287J1980J4772m2917
34064F26132r2433o2906M2009J27866R8975j3340q9787j09891j64021k37578j75678
34053e0652L4361J51585J4834j93674k08060m8199O7550M5907l7867j02182r0198
34042d16595M0759K05994K12326L5340j00313o8488m2137j54225k18674n3678
34032e59691J61808J67489M1690P369K5079m8310q5858R8552L10207K09870q9063
34021B39142j42798J12065K57292P6255j29466p4897N9556l5930k97814l92400
$$ y = [-67543, 82241, 204851, 219444, 152168, 82240, 78011, 136687, 200483, 237801, 246382, 180198, -16690, -280316, -448926, -452201, -366555, -257404, -104174, 78379, 196622, 221225, 232102, 253197, 194672, 49238, -6590, 165224, 453783, 639989, 665584, 642297, 654277, 669049, 626132, 533699, 470793, 512802, 640668, 739643, 726303, 636516, 526625, 362604, 125026, -50652, -16291, 135294, 150128, -43546, -251606, -299805, -232255, -186348, -224215, -326397, -416595, -375836, -169842, 42484, 77824, -22489, -90977, -133114, -287339, -506013, -559691, -397883, -230394, -188704, -181335, -156256, -204566, -290424, -191872, 118335, 328205, 239142, 96344, 208409, 465701, 541956, 412490, 337593, 397149, 361219, 63405, -328995]
34011c28995j77748J44945K83155J42891r9295j78511k9720J39963J26472j2138
34001A1019q3945m8759j5608l2207m6459k4424L8542J58399K81636K55839K4375
33990E18408k42343l41816k60013r3285Q8730J83998P0442j64103k23811r305
33980d73098K19307K55494K21663K22801R4621k00842l16808n3668K22262J46445
33970C38177l3940M8698J67489n8639l47889j74272K29035J78973k46275k77169
33960a75812K00918L86855p6777m66391j83856K70341J83702k10603k27590J15668
33950a83545K40658J3260j46592l8618R6011J07867J26692J67506L5972k63341
33940A55870m16339k44814K5046Q8744m1716j08239M1412K81047L59750J92595
$$ y = [-328995, -506743, -361798, -78643, 64248, -35047, -213558, -243278, -103315, 23157, 11019, -72926, -121685, -137293, -169500, -215959, -240383, -201841, -43442, 238194, 494033, 518408, 276065, -65751, -325764, -419049, -330319, -146321, -75879, -239982, -463793, -473098, -253791, 1703, 223366, 446167, 540788, 339946, 23138, -30530, 191732, 338177, 304237, 352935, 520424, 461785, 113896, -60376, 168659, 347632, 101357, -175812, 25106, 411961, 335184, -131207, -315063, -44722, 138980, -71623, -299213, -183545, 57113, 70373, -76219, -114837, -18826, 89041, 215733, 383239, 419211, 155870, -260469, -505283, -480237, -391493, -433209, -541448, -500036, -218989, 140761, 333356]
33930C33356k8200o9761K7990K6332j23311j93597o7244N0985j4353q8618N8176
33919h8245K80989K53556K7j19920L2492J71829N2956j46972j14458J18350K27961
33908F68565O8893j51468j97628j03520m2124m9116l5970Q078J4901J1850R8709
33897B91170K24524J90889m0256k32211j93922m7664j3921p0822l3417J12031
33887A86401J73597M8232j23354j38798K2208J70775J07275j36500k85237j45213
33877a20614J06296J43531k1874o0076J26234K22594L4397j64492q6827Q6093
33867B65262L1495j64086j85622l4592L2290j2104K9235J49859J37688p710n0179
33856A91536N6785Q0986q1473k26630j66333J5426J15977M8970j04708j50917
$$ y = [333356, 305156, 235395, 263385, 289717, 166406, -27191, -94435, -43450, -57803, -146421, -88245, 192744, 446300, 446327, 326407, 358899, 530728, 583684, 436712, 322254, 440604, 668565, 737458, 585990, 388362, 284842, 242718, 193602, 157632, 165710, 180611, 192461, 291170, 515694, 706583, 666327, 434116, 240194, 192530, 178609, 107787, 74370, 186401, 359998, 408230, 284876, 146078, 168286, 339061, 446336, 309836, 24599, -120614, -14318, 129213, 107339, 47263, 173497, 396091, 430488, 265996, 179169, 265262, 296757, 132671, -52951, -87543, -55253, -67357, -38122, 111737, 249425, 241715, 191536, 248321, 329307, 247834, 21204, -145129, -129703, -13726, 35244, -69464, -220381]
33846b20381N5996L68640M08557O6948k54832j78596R5946J29226p3861j65037
33836B32606p9935n3929r8134k989J49247L2500l00903l88246p3145K49830K66034
33825f7064J38786R2989O2234k5834l5540O4161N6940j15835j78349J2842J92660
33814A97990J32678K80o985k9974k24894l90087k78246k5039R6823J33415K85279
33803a08760M59440L80820O9493j52966j22136q21K6815j6329l1368j9269m2738
33792D42181j00403j03869J6832J82488J90414m2199l06176l16238p8632J29799
33782A4197J44680P2905M5131L3458j1166m0036j8989J140k405P472L830q4467
33770A65750j86435j20646J17210K88155K19725J9442j04554r4349l9452l8175
$$ y = [-220381, -164385, 204255, 612812, 679760, 424928, 246332, 342278, 471504, 397643, 232606, 152671, 98742, 608, -2381, 146866, 179366, -121537, -509783, -582928, -333098, -67064, 71722, 164711, 226945, 201111, 165571, 229732, 286672, 170837, -7512, 5330, 197990, 330668, 330948, 323963, 293989, 69095, -320992, -599238, -624277, -527454, -394039, -108760, 350680, 731500, 800993, 648027, 525891, 525070, 551885, 535556, 504188, 484919, 442181, 341778, 237909, 254741, 437229, 627643, 585444, 279268, -36970, -115602, 14197, 158877, 231782, 276913, 310371, 299205, 259169, 240180, 241320, 238915, 246387, 250217, 165750, -20685, -141331, -24121, 264034, 483759, 503201, 398647, 304298, 264846, 226671]
33760B26671j10657j66686p6587J30032K18736N5549j53582j41642K0078P6856
33750G8768L3618R1848K03210R6117k13980l46784j21098J47280R6225j87798
33740a22594l16307q8358L00657M64371K13610j99892l17307m8315J82446M8604
33730A16915j92675j47222P2460J05882M652P1269K04781M7374k84035k89360
33720b89959O3117K51430O6407j03626j5390O1183n5444j15836K5966J15585K1249
33709B4682m165J31677J20612j33709k40201j448K04413J00585j0994J23332J89162
33698E03946q5038l47085k19014J9471m2981j86060J3243L55420L28180j1895
33688C28187j55130K1830J67150J06085O322m7800j32720j84119o9527R7150J12187
$$ y = [226671, 116014, -50672, -127259, 2773, 221509, 277058, 123476, -18166, 1912, 78768, 112386, 204234, 407444, 503561, 289581, -57203, -178301, -31021, 65204, -122594, -438901, -527259, -226602, 237769, 451379, 251487, -65820, -114135, 68311, 116915, -75760, -222982, -150522, -44640, -39988, 31281, 236062, 283436, -599, -289959, -226842, 24588, 90995, -12631, -28021, 33162, -22282, -138118, -112152, 3433, 24682, 20517, 152194, 272806, 139097, -101104, -102552, 101861, 202446, 191452, 314784, 503946, 418908, 71823, -147191, -127720, -170701, -356761, -343518, 11902, 340082, 328187, 173057, 194887, 362037, 468122, 474444, 426644, 293924, 109805, 40278, 137428, 249615]
33677B49615M3779M8526j510k58120m41695j80116L03541M08496M8291k26764
33667e957p1421K03514J84775o4683k07107j16279N9746J52281J23524M4630K030
33656C05053l548m5505j29650j56295p7834K9563J05422J58699J44066K211j34293
33645A97889n7527J32529J10207j16764j56309R5158K15032l8305k77852j26315
33635b2257J64403J90728P0587J13774J88990M854k63903k33941J2101Q8491k9292
33624B84535o7206j7128o2077q1363J61084M31449K62277k50309n06163k92632
33614a37533j7866K8404N2307K23293L05492Q7064k25763l11909j55084L9795
33604a11800J31090R7898j1904j02933j28558j57759k17627j76510K5333J82347
$$ y = [249615, 293394, 341920, 340410, 82290, -359405, -539521, -235980, 172516, 220807, -5957, -77378, 126136, 310911, 246228, 39121, -77158, -17412, 134869, 258393, 303023, 305053, 301505, 256000, 126350, -29945, -107779, -78216, 27206, 185905, 329971, 332182, 197889, 140362, 272891, 383098, 266334, 110025, 205183, 420215, 381910, 104058, -22257, 142146, 332874, 403461, 517235, 706225, 711079, 447176, 213235, 225336, 313827, 284535, 217329, 200201, 138124, 56761, 217845, 649294, 911571, 661262, 155099, -137533, -155399, -126995, -74688, 148605, 454097, 541161, 315398, 3489, -151595, -111800, 19290, 117188, 105284, 2351, -126207, -283966, -501593, -678103, -652770, -470423]
33594d70423J16402m268N6135J80135J18202l4299r82J59353J49816l0320j01783
33583A37968q997M0635J0220N4299J22233K969k23534k42730m4152O0615K803
33572h7671N0955K49607K64293l9992l18440k67986m5674O7199Q1662J28727J46683
33561B29363J2643j85344k36583q4666J18895J87945Q4153l1080K7215J84574
33551C07115J50662j34713l29132j84839L9596k750j61349n5756K51009L45059
33541B24902J35690o3808r2787r1594j01557q548Q8634n4523l28055l11392Q1318
33530e21720M39751M50432K43113M9519q1403j31538o1666P349p6574j67901k8564
33519A20798J64102K2072l30938l36935R0533L62623J30125k01276j71794O8749
$$ y = [-470423, -354021, -358289, -302154, -122019, -3817, -38116, -39098, 120255, 270071, 239751, 137968, 128971, 169606, 179826, 234125, 356358, 359327, 135793, -106937, -151089, -90474, -87671, -36716, 212891, 477184, 437192, 118752, -149234, -194908, -127709, -46047, 82680, 229363, 242006, 56662, -179921, -264587, -145692, 42253, 126406, 95326, 122541, 307115, 457777, 323064, -6068, -190907, -151311, -154061, -315410, -371166, -120157, 224902, 360592, 296784, 203997, 112403, 10846, 2298, 90932, 36409, -291646, -603038, -521720, -81969, 368463, 611576, 661095, 579692, 448154, 386488, 393837, 317263, 149362, 120798, 284900, 306972, -23966, -360901, -270368, 92255, 222380, 21104, -150690, -81941]
33509h1941J63765J30629J32728Q2052j08703k14830n3510J30908L2564j97063
33499A6599j81382J00311L14923K51438J6794j65252j56702R054J31908N5895
33489C93586r0799p1320M9602j0020k29358k58440j2272J59409P0109p068J08712
33478A02141J36010j40212m05452l03180k4438M1533n4415o133J63840J94784
33468b95522J00881J20327K46872K46819Q9552l1141o6281j32374j89233o4906
33458B4994J76532K29648j8732l12360l51405j00128K53156M56542L20004j13156
33448E65095n03559n11948j80605J40110K36106K07507J90880J34600l5351j93862
33438D8973j42663Q5540K10502M8056k29700k93281p9629J41909J62989R9779
$$ y = [-81941, 81824, 212453, 345181, 427233, 318530, 103700, 50190, 181098, 213662, 16599, -164783, -64472, 250451, 501889, 518683, 353431, 196729, 205783, 337691, 393586, 302787, 231467, 281069, 271049, 41691, -216749, -229021, -69612, 497, -6571, 102141, 238151, 97939, -307513, -610693, -635131, -593598, -648013, -654146, -490306, -295522, -194641, -74314, 172558, 419377, 508929, 477788, 411507, 279133, 89900, 24994, 201526, 431174, 412442, 100082, -251323, -351451, -98295, 358247, 678251, 565095, 61536, -450412, -631017, -490907, -254801, -47294, 143586, 278186, 242835, 48973, -93690, -8150, 202352, 250408, 20708, -272573, -352202, -210293, -47304, 52475]
33428E2475J28881J57346M935k18234k35155n5372L1657o7243j23800j3388Q1791
33417b56107L3799L985J17274J95200O6492r5736l6732J51744J71100j2388j33406
33406B05225m7460P9297N7349m7546l6449J22004K35925J34722j14507k94497
33396B94063k97664j97798p9843M2713J04964p382k17384k34360M4021L11631
33386b37039K65478L5892o8454l6737l7866k5638J21478K24202M3729k08047j27807
33375e0809J64310J58361j69162k58095R5349L49440Q2463l24094l01158N1609
33365b01786K15808O3089p7176n883J20682J19000J8207n0120k5962K5399k0811
33354A80447j71032k26845l6688K10833K00533k3023j07531M3160J28830k8851
$$ y = [52475, 181356, 338702, 343637, 125403, -109752, -165124, -133467, -200710, -324510, -337898, -256107, -222308, -218323, -101049, 94151, 160643, 64907, 28175, 179919, 351019, 338631, 205225, 157765, 237062, 294411, 246865, 210416, 332420, 568345, 703067, 588560, 294063, -3601, -201399, -281242, -238529, -133565, -140947, -358331, -592691, -548670, -237039, 28439, 64331, -4123, -40860, -78726, -104364, 17114, 241316, 285045, 76998, -50809, 113501, 271862, 102700, -155395, -60046, 289394, 371857, 47763, -253395, -201786, 14022, 77111, -65, -5948, 114734, 233734, 251941, 201821, 175859, 201258, 180447, 9415, -217430, -254118, -43285, 157248, 134225, 26694, 69854, 198684, 169833]
33344A69833k02898j53128L3216J68485K35295K62606K02666P8921R325j3139
33334G91182j00940j92128j08580Q3283J42204R1714J50835K21921r423m05662
33324F64406m37104o1603J25954j29636l12134l5079L10091K73935Q5081J20416
33314F04327K03876L2500j88725j53082n2179j52404k01363Q4020L43907J17478
33304F38355k81316k09142K28366L41289l5937l75133l55058k12203j58577r2055
33294e11411L6030J05092J27491J99980J87811n7491k53722k2036M03455M20265
33284F35464K280k52579q5024Q4495n1529j95219l5710K01684J60284q1910j96752
33273A85484r0371P3907J40994N7104j32080k53792j55127N3768J05047l7875
$$ y = [169833, -33065, -186193, -152977, 15508, 250803, 513409, 716075, 794996, 804321, 791182, 690242, 498114, 389534, 472817, 615021, 706735, 857570, 1079491, 1070068, 664406, 227302, 165699, 291653, 162017, -150117, -185196, 124895, 398830, 483911, 604327, 808203, 840703, 651978, 498896, 446717, 294313, 92950, 176970, 520877, 638355, 357039, 147897, 376263, 717552, 681615, 306482, -48576, -260779, -419356, -511411, -475381, -370289, -242798, -42818, 144993, 87502, -166220, -188256, 215199, 635464, 637744, 385165, 300141, 384636, 333107, 137888, 102178, 303862, 464146, 382236, 185484, 95113, 169020, 310014, 367118, 235038, -18754, -173881, -120113, -15066, -52941]
33263e2941j30709l0339J22783J63280J02558Q182r5515j47070p5951L7867K5189
33252g2666j10290j69248k9290K11206L71282L43540J44564o9711j06676K9137
33242E41848J11285R026j35968j75140j67608j64902o0627J22694J12775j55452
33232C7931k94956m0371K69349K13623l5505p4189M105j54434m25573l65970R761
33221h56229K52185K16270J67802J94715J18613k3731m830R5614J88j82330q9780
33210a11513K01849K63773P7581K6334J19120k3049l44875l25522P8158K68781
33200B30637J3823j93957o2051L7846j11034j15925K04844L48624K4482k32548
33190A44741K9422L56520J77965k13496k34117q697J1790n3425J33710K85640
$$ y = [-52941, -183650, -213989, -91206, 72074, 174632, 182814, 87299, -59771, -135722, -97855, -72666, -182956, -352204, -381494, -170288, 200994, 544534, 689098, 619387, 512711, 541848, 653133, 662159, 526191, 351051, 183443, 18541, -42086, 80608, 193383, 37931, -257025, -297396, -28047, 185576, 150071, 75882, 79987, -74447, -500020, -865990, -856229, -604044, -387774, -219972, -25257, 93356, 69625, 64795, 160409, 160597, -21733, -111513, 90336, 354109, 431690, 458024, 577144, 554095, 209220, -116302, -38144, 230637, 244460, 50503, -11548, 26298, -84736, -200661, 4183, 352807, 377289, 144741, 174163, 530683, 708648, 495152, 261035, 252338, 264128, 210703, 344413, 630053]
33180F30053p2834n97468n11569J32947N07971K93472J0749Q025p25j86766k22691
33169h836K7156J41867j29331l65841j47970K45029K86890M235j56858m1232R4327
33158e0564P3948K3469P8812J53046Q4254j15792k42688j27359J27308K11879
33148B16313k052k34259j35958K08120L68414J59368j42719k38848j77276j39356
33138a18253j13395o50J33146J49783P2782J3020n2281j96026k90645j07681K94329
33127b15871N28154L46836k7294k01706j03850L1167P3976J30663K33430J87931
33117I83436j01663l66476k87990K6323J65009o967j82443j03456N9022M430k10849
33106b1624k41916M6340L75433L92553P8885k46774k74864j3351K35660J99098
$$ y = [630053, 557219, -40249, -551818, -418871, 89100, 382572, 393321, 401346, 400621, 213855, -8836, 18320, 160187, 30856, -334985, -482955, -237926, 48964, 53199, -103659, -144891, -50564, 23384, 46853, 125665, 278711, 362965, 247173, 4485, -122874, 4434, 216313, 214261, -19998, -155956, 52164, 420578, 579946, 437227, 198379, 21103, -118253, -231648, -232298, -99152, 50631, 123413, 136433, 84152, -111874, -402519, -510200, -215871, 312283, 659119, 631825, 430119, 326269, 357436, 431412, 562075, 795505, 983436, 881773, 515297, 227307, 253630, 418639, 411672, 229229, 125773, 184795, 189225, -21624, -263540, -217200, 158233, 550786, 629671, 382897, 108033, 94682, 330342, 529440]
33096E29440p3859k75757j99357L8895J76294J30041M8112N6725P8313k9689k19266
33085B59892k59699m1070K31841K66312N8392j13722q7546k1914j09219k58552
33075g5285k46003o8774O6300O5513M7164J04907J63312J29215M1438r313j3231
33064B05243j8623l1821n653P6751J37445O5076j22308k34856j46055j9578j00197
33053a94576k89037k20374J51806L86828J85497j47380j79877Q011O5786L937
33043b29379Q8678K59727J99533o1461j56339l0406l0055k35677k56944R2713
33033c59610M18486L36404K9340j09370m2543K7717N1223P5414L5447r8804j69889
33022A93815r0253l5292j24253j55551M3537K47882J66448n9425p7543R7701J36814
$$ y = [529440, 455581, 179824, -19533, 19362, 195656, 325697, 373809, 430534, 508847, 479158, 259892, 193, -40877, 190964, 457276, 515668, 401946, 314400, 292486, 183267, -75285, -321288, -390062, -323762, -258249, -211085, -106178, 57134, 186349, 227787, 218474, 205243, 186620, 154799, 149146, 225897, 363342, 428418, 306110, 71254, -74801, -94379, -194576, -483613, -703987, -552181, -165353, 20144, -127236, -307113, -299102, -233316, -229379, -140701, 119026, 318559, 257098, 100759, 70353, 40298, -195379, -452323, -359610, 58876, 395280, 424620, 315250, 272707, 300424, 351647, 427061, 462508, 363704, 193815, 103562, 68270, -55983, -211534, -167997, 79885, 246333, 186908, 109365, 207066, 343880]
33011C43880m1475j55155k3738J91054K69724J89336L0277j43625k46859k01828
33001B11591o7355N983k3182o3260o6637p8019r4061l1721J17492K24566J73349
32990C08746P70j51527j83225j19408o7710p7831n5439J05960L06808K98215K6914
32979C92273k22455j61116J34406L37915K84234R7787n5539j66040k84886l59847
32969c268k68810L403K91714L94451K73245N9561j27262k70479l45236k72493
32959b65174q0032N2047N4850J03372K80677L17917p502l88503l37465O2879K50932
32948D3998M1755j39299K847J99812J61723M6257N9003L4946j82860l26607j12725
32937a71150K26428K71652M8299j05702j00395q5151n7836O6044J33734m3899
$$ y = [343880, 302405, 147250, 123512, 314566, 584290, 773626, 803903, 660278, 413419, 211591, 144236, 150219, 127037, 63777, -2860, -80879, -174940, -206661, -89169, 135397, 308746, 309516, 157989, -25236, -144644, -212354, -290185, -345624, -239664, 67144, 365359, 392273, 169818, 8702, 143108, 481023, 765257, 863044, 807505, 641465, 356579, -3268, -272078, -268675, 23039, 417490, 690735, 750296, 623034, 352555, 7319, -265174, -345206, -293159, -238309, -134937, 145740, 463657, 456155, 67652, -269813, -206934, 43998, 85753, -53546, -50699, 149113, 310836, 357093, 416096, 451042, 268182, -58425, -171150, 55278, 326930, 375229, 269527, 169132, 83981, 26145, 92189, 225923, 182024]
32927A82024k83559k67102q0681m8841j30549r574K59232K81659N4548N0533L89313
32916C97003N17922N3754n44690n92655j27417K31401J74532j1932m506J30148
32906B23560J56290L5177q0067p9568k817M8620L0291k3219o6620q9416p4793
32895G7438K2618J84954K70455J55387q5384k49562k41197j22137L3359J80424
32885B26355K15413M1094k29233l11593r4749J86768K30143K0271j94342k12561
32875a22434o6343P2569R1217L2490J1597L9893r846j85767k72650p965M90554
32864G3315P21047L68617k52887n27762k58550J45813K25798R519j28582k23K07117
32853E83222K42281R6624o3487j31938j32050j26102j39161j32386k2503J93913
$$ y = [182024, -101535, -368637, -449318, -498159, -628708, -638282, -379050, -97391, -42843, 7690, 397003, 914925, 968679, 423989, -168666, -296083, -64682, 109850, 97918, 93412, 223560, 379850, 415027, 334960, 255392, 252575, 301195, 331486, 308267, 241647, 152231, 77438, 100056, 285010, 555465, 710852, 625468, 375906, 134709, 12572, 45931, 226355, 441768, 482862, 253629, -57964, -152713, 34055, 264198, 284469, 90127, -122434, -188777, -116208, -24991, 7499, 19096, 58989, 49143, -136624, -409274, -417239, 73315, 794362, 1162979, 910092, 382330, 123780, 269593, 495391, 504910, 376328, 376105, 583222, 825503, 922127, 858640, 726702, 594652, 468550, 329389, 197003, 174500, 368413]
32843C68413L26285J57034k13814l89696j83885R7985R2702j01047j36111O389
32833B4255L6703j07953j58079J8329K17687K60888K13582J54048N1528l2189
32823F78799L3340J28510k2147l20346l10145Q5572L32459P9653k96464l26572
32813F2659j58959j50531j73093P2312L72880L04352O907k7192J74288J16521
32803F00144k49135l92631j09076J31406k3031k70498k30837l4977L2031M5215
32793e01389J90267L31793K40926K1848n7047J8017P6308Q9092J20257R3549q6162
32782E37459k83213k84428j22169O086N2582R9966J17297K2227o5377N6878K84438
32771D21746K38961k10507o96954p60823l46733K12322N57648N36523K21136j31861
$$ y = [368413, 694698, 851732, 637918, 248222, 64337, 162322, 255024, 153977, 17866, 24255, 60958, -46995, -205074, -186745, 30942, 291830, 505412, 659460, 710988, 678799, 712139, 840649, 818502, 498156, 188011, 273583, 606042, 685695, 389231, 62659, -96300, -246831, -419924, -347612, 25268, 329620, 336527, 309335, 483623, 600144, 351009, -41622, -150698, -19292, -42323, -312821, -543658, -578635, -546604, -501389, -311122, 20671, 261597, 283445, 226398, 244415, 320723, 409815, 530072, 623621, 537459, 254246, -30182, -152351, -146265, -93683, 6283, 123580, 145807, 80430, 137308, 421746, 660707, 450200, -246754, -1007577, -1354310, -1141988, -584340, -47817, 173319, 41458]
32761D1458k22062J8516L09073L17136N1728j86037k24366j86283j84782r8227
32751c63846J67987L87459K66525q2015k29571k6704J88574R1134j85035k90699
32741g6191j57421j7057k9398j12508j19120j8433J04520J40696O2841k1345J4541
32730b28875J28954J65123J10271J08132J50595J7116l16796m77798j75982L05215
32720b14045M27762J06027k26843k19904L1588K36825K54122J22485n1053j63104
32710C03860j85692j78517j58802m1582J81508L35651K96882J88002J44266N5245
32700I40821j94125l92563k62549M9097J24108j10585k92815j74128R2261K62343
32690D1865K72837J42330q4381k28945j24112P5576M8614j71849j99045Q1461
$$ y = [41458, -180604, -162088, 146985, 464121, 515849, 329812, 105446, -80837, -265619, -363846, -195859, 191600, 458125, 376110, 146539, 119835, 308409, 399543, 214508, -76191, -233612, -250669, -280067, -392575, -511695, -530128, -425608, -284912, -222071, -243416, -228875, -99921, 65202, 175473, 283605, 434200, 451316, 134520, -343278, -519260, -214045, 213717, 319744, 92901, -127003, -95415, 141410, 395532, 518017, 466964, 303860, 118168, -60349, -219151, -260733, -79225, 256426, 553308, 741310, 885576, 940821, 746696, 354133, 91584, 140681, 264789, 154204, -138611, -312739, -220478, 41865, 314702, 457032, 372651, 143706, 19594, 95170, 143784, -28065, -227110, -145649]
32680a45649K86433J28280j39931j45035M7183J16362J5732k1769J00356K12397
32670D54359J44955p0322k64900k90284j37776M6138J21568J33097K08986L04295
32660F50116K38453N305j75653j67746o1528L1615R1580N4443j52308l69410l11862
32649a66995k0321J24339k4432j50512j5648J51127Q2072o6163k4488J18143J38762
32638A45884J08776J84529K07779k0605k60073j41287J63363J40582k20025l67816
32628e8893o5232K52614K01091P160K9693J55942Q4508j06341j23462K429n807
32617C73702j47942j42813M7793J19374m1439j13877J39489M17906K71024k22286
32607G00931n18118l25735O0602K22910J33998M4791O0413O1924l2038j41365
$$ y = [-145649, 140784, 269064, 129133, -15902, 31281, 147643, 163375, 141606, 241962, 454359, 599314, 528992, 264092, -26192, -163968, -117830, 3738, 136835, 345821, 650116, 888569, 893874, 718221, 550475, 488947, 520562, 612142, 666585, 514277, 144867, -166995, -187316, -62977, -87409, -237921, -253569, -102442, -20370, -86533, -111021, 7122, 145884, 254660, 439189, 646968, 626363, 366290, 225003, 388366, 528948, 308923, -58893, -124125, 128489, 329580, 336740, 366433, 522375, 606883, 500542, 377080, 379509, 373702, 225760, 82947, 130740, 250114, 208675, 94798, 234287, 652193, 923217, 700931, 182813, -142922, -82320, 140590, 274588, 319379, 379792, 441716, 409678, 268313]
32597B68313j59647n9978J34067L45164M10290K07453j43527l43330k48685m3796
32587C66324K382j32592k35387j57376O033O6989N547j2809J01207J82250J9669
32576B12237k91382l97513j46289J88389K69325J17252j0729j4829J4989N7515
32566a035J66535K48835J23984j59491l24189k40333o9589K9342R3399J58005
32556B5463J15353p5956k40519k19051r5733k7594Q010J09596K12259J65863J463
32545b0846q0971J904J07419Q8879K57r210O3091N8979q9784k09707j00247J55925
32533c4311K68451J33923m4373r2963r3154j39616j26308J0314P5557o2377j51142
32522b55999P5739L77489K97864j11008l34638j58519R9415J73605J76177K09634
$$ y = [268313, 108666, 48688, 182755, 527919, 938209, 1145662, 1002135, 658805, 410120, 366324, 368706, 236114, 727, -156649, -150616, -83627, -78080, -90889, 10318, 192568, 212237, -79145, -476658, -622947, -434558, -165233, -47981, -58710, -73539, -58550, -1035, 165500, 414335, 538319, 378828, 54639, -185694, -255283, -225941, -132542, 25463, 140816, 64860, -175659, -394710, -490443, -518037, -510027, -400431, -188172, -22309, -20846, -101817, -99913, 7506, 96385, 96642, 87432, 150523, 209502, 119718, -89989, -190236, -34311, 234140, 368063, 323690, 230727, 137573, -2043, -128351, -118037, -42480, -104857, -255999, -180260, 197229, 495093, 384085, 49447, -109072, -9657, 163948, 340125, 549759]
32512E49759J34564p2534j60179l5725L3244j07836k14101r5858K9240m5725j19835
32501a04986K3566J65965K2722k12217j56089J22895K28758Q4318r799P2044J01320
32490C38497p5665k76884k61038m0650J65904J67943k7239j97899j20390J39822
32480a87599K82496J83276L7475q242p8267k33242k33652O2356L43084K50909
32470D18594o7349j98225p3585N2035R2160J72117K60479J69899q5230k75412
32460D65483k86786j79650J1638K38901L05034J00727j33139j29292m5244j86182
32450A61490m16541l39965R623J93675Q6044J9187J50619K31089J35427Q9656
32440C20304J75575J19825j70029l32866j23336J64151J75174K8029P756N6353
$$ y = [549759, 684323, 611789, 451610, 415885, 449129, 341293, 127192, 31334, 60574, 14849, -104986, -81420, 84545, 107267, -104950, -261039, -138144, 90614, 174932, 165133, 237177, 338497, 262832, -14052, -275090, -315740, -149836, 18107, -9132, -207031, -327421, -187599, 94897, 278173, 315648, 307406, 229139, -4103, -237755, -175399, 167685, 418594, 351245, 153020, 79435, 131470, 223630, 395747, 656226, 826125, 740895, 465483, 178697, -953, 10685, 249586, 554620, 655347, 522208, 392916, 347672, 161490, -255051, -595016, -585393, -391718, -305674, -286487, -135868, 95221, 230648, 320304, 495879, 615704, 445675, 112809, -10527, 153624, 328798, 356827, 364583, 420936]
32430D20936l3981j75885j46436j4180j5071j20798j01690M4341P3697r2158k33797
32419c95022j62123M1701J81120J83970J15056L6822o9427k35708l81102l37676
32409a022389q2783J52932J74765J26976K56088M43771L35257m5611k33260k1542
32399H4204J92953L5098k60278k54601k108J08264K2954N0567K68196L64078J51038
32388G60365j38201k10971q9532K8087O5098N8499J1039p8398j23447m0661R8913
32377C40791J25948r437j56528j41302J3775J08593J4095j61970k13928r4642
32367a74605N4257J03722O5141J5045q557j5300m0256j09060j64387q4831J20274
32356b38557K21837M3820k51064l58147k40932q4193Q7593L81773O34036M83172
$$ y = [420936, 386955, 211070, 64634, 50454, 35383, -85415, -187105, -142764, -69067, -161225, -395022, -557145, -515444, -334324, -150354, -35298, 1524, -67903, -303611, -684713, -1022389, -1105172, -952240, -777475, -650499, -394411, 49360, 384617, 339006, 105746, 84204, 277157, 312255, 51977, -202624, -204732, -96468, -73514, -22947, 245249, 609327, 760365, 622164, 411193, 321661, 349748, 414846, 473345, 484384, 405986, 282539, 241878, 340791, 466739, 457302, 300774, 159472, 173247, 281840, 295935, 133965, -79963, -174605, -120348, -16626, 48515, 63560, 55003, 39703, -553, -109613, -274000, -358831, -238557, -16720, 27100, -223964, -582111, -823043, -907236, -819643, -437870, 196166, 679338]
32346F79338j6574l02583p3931K44937J44692k14002l08504o0913J40119R1818
32336C24397j6005k0512J127j8958j3330L2112K4965n3179j24025j64547j77237
32325b05192o9874J82651L30754J20965k58238l47743n6107K20603J82876p738
32315I2957o3891L2634J21512J08077j3298j78662k24152n4658J30623O0911j44057
32304a32004j04649J72178K40846l0014j74407R2292L27478O9277l45999k89470
32294a74472J36130K78546K056j66935J4130J45134l6534j93272m3005J05515
32284F7293p4183k87071r2679L08691L57732K7470j59240L1631K43706J55297
32274E78647p6283j72532j44908j23044p3674O5922J90976J86563J14115N9050
$$ y = [679338, 662764, 360181, 286250, 531187, 675879, 461877, 153373, 92460, 232579, 324397, 308392, 287880, 289007, 270049, 256719, 288831, 313796, 260617, 136592, -27955, -205192, -275066, -92415, 238339, 359304, 101066, -246677, -302784, -82181, 100695, 92957, 29066, 61700, 183212, 291289, 277991, 99329, -124823, -179481, -48858, 12053, -132004, -236653, -64475, 176371, 146357, -28050, 64242, 391720, 460997, 114998, -174472, -38342, 240204, 242260, 75325, 89455, 234589, 198055, 4783, -38222, 67293, -6890, -293961, -386640, -77949, 279783, 307253, 148013, 179644, 423350, 578647, 502364, 329832, 184924, 61880, -11794, 54128, 245104, 431667, 545782, 604832]
32264F04832l4621j93435k59466j22446N6353R2933R9801K65398M31788K51971
32254A193108k40826n77671m59032j17633O0859K3006l3072k4809m0977j25423
32244c42470k02817j91571o4399J65721M15378N29866M13963J41086j27397k81408
32234D55952k76242j10912J09486J82522J6995k12785k48704o0656J38459J74817
32224A68932R5546N3438R9265J30998K8600j69262k52342p6871J97464K50541
32214E26309K1633j88369j30798O7150J52281J20223J00518M1287j67659l63530
32204A79045k77684p465P2915r1505j50955K9835J26830l6341r3691K60183O42473
32193F53640M75730j08208m24343k24990L5686q305j36460n1896Q8491L488j88624
$$ y = [604832, 570211, 376776, 117310, -5136, 51217, 144150, 243951, 509349, 941137, 1193108, 952282, 374611, -84421, -202054, -141195, -118189, -151261, -176070, -217047, -342470, -545287, -736858, -801257, -635536, -220158, 309708, 723671, 864757, 737360, 455952, 179710, 68798, 178284, 360806, 377801, 165016, -83688, -144344, -5885, 168932, 264478, 317916, 417181, 548179, 576779, 407517, 155175, 78304, 275768, 526309, 547942, 359573, 228775, 295925, 448206, 568429, 668947, 710234, 542575, 179045, -98639, -106104, -33189, -124694, -275649, -245814, -118984, -155325, -249016, 11167, 653640, 1129370, 1021162, 596819, 371829, 407515, 399210, 262750, 210854, 299345, 302833, 114209]
32182A14209j76887P345N6859r7253k03426j19936l539k81j7862P2784K09813
32171a58174K55245J98918J14971K2453p5224r7093J3391J37485R8841o4252j12830
32160C33731M9711K10450J44899m9135j02834R305M3458j06729k27549j27856
32150A77451N0025N4324r4099j72490j12842m2118j5356L4117Q1343Q291j40365
32139a71719j51302K6236J76132J45070N2605M6750O9034K1444l0938m239K9588
32128B08661l688j2863Q3060J64515R3512n9618j63746k34849k85831j67380J63111
32117b15116L97763K44051j00476k04913l3654P8667J2283k1315M8299K2103j36709
32106I0983j76388n407J27682P0852R125P8595J08080k8253j47849r9205l4337
$$ y = [114209, -62678, -55333, 1526, -95727, -299153, -419089, -422628, -422909, -440771, -367987, -158174, 97071, 295989, 410960, 433413, 358189, 261096, 274487, 411972, 510813, 446561, 333731, 383442, 593892, 738791, 689656, 586822, 596127, 639585, 532856, 305307, 177451, 227476, 281800, 187701, 15211, -97631, -139749, -155105, -120988, -39645, -31354, -171719, -323021, -296785, -120653, 24417, 77022, 123772, 192806, 214250, 183312, 179073, 208661, 204973, 192110, 275170, 439685, 533197, 473579, 309833, 74984, -210847, -378227, -215116, 182647, 426698, 326222, 121309, 87655, 166322, 178605, 157290, 205589, 227692, 90983, -85405, -90812, 36870, 107722, 116847, 195442, 303522, 275269, 127420, 28215, -6122]
32095f122p7779n7487J34340K50259J10631j5322J23738K28355q3803n08353l87713
32084b89256K49521O26997L05895k36794l41013j3726K52961J81121r3163l13583
32074C28960l20328r1023K25967L89144K99499Q2908j12897k55437l06818j77717
32064F2258O7923J58114n0140l16486k96275J4109K95462L12645J28775n8880
32054C17505j29618p4467L9049R4373J4949j26176j52385R792K11259K27554K3767
32043D55602j81169j56147O1602J99188P9470j59650k42454r1096J11854J66642
32033B43842N4179j09726k08568j78552k0315J78781K85574K41589J17193J2675
32023F16672n6197j27140j82705j54071m3087M2955L5454J3290O4306Q9138q2294
$$ y = [-6122, -83901, -141388, -7048, 243211, 353842, 338520, 462258, 690613, 606810, 98457, -289256, -39735, 587262, 893157, 656363, 315350, 301624, 554585, 735706, 642543, 328960, 8632, -82391, 143576, 532720, 832219, 915127, 802230, 546793, 239975, 62258, 130181, 288295, 238155, -78331, -374606, -360497, -65035, 247610, 376385, 317505, 187887, 113420, 152469, 246842, 261791, 135615, -16770, -6978, 204281, 431835, 455602, 274433, 118286, 179888, 379076, 458546, 298896, 56442, -34654, 77200, 243842, 298021, 188295, -20273, -198825, -219140, -40359, 245215, 486804, 603997, 616672, 560475, 433335, 250630, 96559, 53472, 96427, 131881, 145171, 209477, 298615, 216321]
32012B16321l57960l87701l4309L54646L66224P1211j17822m3380O4612L0154
32002A61996m2539m3533l4068m3742J7352J28357J18477k9704j22652r8909j02681
31991i1646j17486O4916L54502L22124r0772l28839o2901K35950N8959k86400
31981E8407k20084J13396J41891j13141j28611J37528J87193r1066k36368n5380
$$ y = [216321, -141639, -529340, -563649, -209003, 157221, 228432, 110610, 67230, 131842, 161996, 119457, 75924, 41856, -1886, 15466, 143823, 262300, 232596, 109944, 11035, -91646, -209132, -144216, 210286, 532410, 441638, 112799, 49898, 285848, 344807, 58407, -161677, -48281, 93610, -19531, -148142, -10614, 176579, 85513, -150855, -206235]
$$ [...]
##END NTUPLES=NMR SPECTRUM
##END=
