##TITLE=31Pdec_BAUj-27.06
 CDCl3, 24 sc
 27.6.2019
##JCAMPDX= 6.0         $$ Bruker NMR JCAMP-DX V2.0
##DATA TYPE= NMR SPECTRUM
##DATA CLASS= NTUPLES
##ORIGIN= UXNMR, Bruker Analytische Messtechnik GmbH
##OWNER= root
$$ XWIN-NMR		Version 3.5
$$ Thu Jun 27 16:12:34 2019 Russian Standard Time (UT+4h)  she@DPX200
##.OBSERVE FREQUENCY= 81.013821
##.OBSERVE NUCLEUS= ^31P
##.ACQUISITION MODE= SIMULTANEOUS
##.ACQUISITION SCHEME= undefined
##.AVERAGES= 24
##.DIGITISER RES= 17
##SPECTROMETER/DATA SYSTEM= spect
##.PULSE SEQUENCE= zgpg30
##.SOLVENT NAME= CDCl3
##.SHIFT REFERENCE= (INTERNAL, CDCl3, 0, 182.463)
##AUDIT TRAIL= $$ (NUMBER, WHEN, WHO, WHERE, WHAT)
$$ ##TITLE= Audit trail, XWIN-NMR		Version 3.5
$$ ##JCAMPDX= 5.01
$$ ##ORIGIN= Bruker BioSpin GmbH
$$ ##OWNER= she
$$ F:/spectra/data/she/nmr/P31/1/pdata/1/auditp.txt
$$ ##AUDIT TRAIL=  $$ (NUMBER, WHEN, WHO, WHERE, WHAT)
(   1,<2019-06-27 16:11:37.70 +0400>,<she>,<DPX200>,
      <created by zg, POWCHK disabled, PULCHK disabled
       configuration hash MD5:
       00 E9 B6 7A A2 85 ED C7 34 08 36 98 17 FE 4E 26
       data hash MD5: 32K
       30 F3 82 8E DE E2 08 0D 00 00 3D 31 1D 33 B5 D9>)
(   2,<2019-06-27 16:11:40.34 +0400>,<she>,<DPX200>,
      <Start of raw data processing
       efp BC_mod = 2 LB = 1 FT_mod = 6 PKNL = 1 PHC0 = -2517.905 PHC1 = 43.19958 SI = 64K 
       data hash MD5: 64K
       27 88 10 05 88 6D B6 E9 4D 52 1B A7 9F E3 6C BE>)
(   3,<2019-06-27 16:11:55.28 +0400>,<she>,<DPX200>,
      <pk PHC0 = -55.011 PHC1 = 116 
       data hash MD5: 64K
       0B DA 88 C7 C1 FD 83 45 69 5F 1A E6 A7 96 9F 76>)
(   4,<2019-06-27 16:11:57.78 +0400>,<she>,<DPX200>,
      <abs ABSG = 5 
       data hash MD5: 64K
       37 7A 92 27 85 EC ED 35 39 31 2D 0F CA 5A 48 CA>)
$$ ##END=
$$ 
$$ hash MD5
$$ FA EC 3D 50 24 72 BD 8B 6A 56 82 8A 17 9E 04 7B
##$RELAX= 
##$RELAX= 
##$RELAX= 
##$RELAX= 
##$RELAX= 
##$RELAX= 
##$RELAX= 
##$RELAX= 
$$ Bruker specific parameters
$$ --------------------------
##$DU= <F:/spectra>
##$EXPNO= 1
##$NAME= <P31>
##$PROCNO= 1
##$TYPE= <nmr>
##$USER= <she>
##$AMP= (0..31)
100 100 100 100 100 100 100 100 100 100 100 100 100 100 100 100 100 100 
100 100 100 100 100 100 100 100 100 100 100 100 100 100 
##$AQSEQ= 0
##$AQ_mod= 1
##$AUNM= <au_zg>
##$AUTOPOS= <>
##$BF1= 81.014009
##$BF2= 200.13
##$BF3= 200.13
##$BF4= 200.13
##$BF5= 200.13
##$BF6= 200.13
##$BF7= 200.13
##$BF8= 200.13
##$BYTORDA= 1
##$CFDGTYP= 0
##$CFRGTYP= 5
##$CHEMSTR= <none>
##$CNST= (0..31)
1 1 145 1 1 1 1 1 1 1 1 1 1 1 1 1 1 1 1 1 1 1 1 1 1 1 1 1 1 1 1 1 
##$CPDPRG= <waltz16>
##$CPDPRG1= <>
##$CPDPRG2= <waltz16>
##$CPDPRG3= <>
##$CPDPRG4= <mlev>
##$CPDPRG5= <mlev>
##$CPDPRG6= <mlev>
##$CPDPRG7= <mlev>
##$CPDPRG8= <mlev>
##$CPDPRGB= <>
##$CPDPRGT= <>
##$D= (0..31)
0 1 0 0 0 0 0 0 0 0 0 0.03 2e-05 3e-06 0 0 0 0 0 0 0 0 0 0 0 0 0 0 0 0 
0 0 
##$DATE= 1561637497
##$DBL= (0..7)
120 120 120 11 120 120 24 19 
##$DBP= (0..7)
150 150 150 150 150 150 150 150 
##$DBP07= 0
##$DBPNAM0= <>
##$DBPNAM1= <>
##$DBPNAM2= <>
$$ [...]
##$SUBNAM3= <"">
##$SUBNAM4= <"">
##$SUBNAM5= <"">
##$SUBNAM6= <"">
##$SUBNAM7= <"">
##$SUBNAM8= <"">
##$SUBNAM9= <"">
##$SW= 369.568048894756
##$SWIBOX= (0..15)
0 1 3 0 0 0 0 0 0 0 0 0 0 0 0 0 
##$SW_h= 29940.119760479
##$TD= 32768
##$TD0= 1
##$TE= 0
##$TE2= 300
##$TE3= 300
##$TEG= 300
##$TL= (0..7)
0 120 53 12 22 120 120 120 
##$TP= (0..7)
150 150 150 150 150 150 150 150 
##$TP07= 0
##$TPNAME0= <>
##$TPNAME1= <>
##$TPNAME2= <>
##$TPNAME3= <>
##$TPNAME4= <>
##$TPNAME5= <>
##$TPNAME6= <>
##$TPNAME7= <>
##$TPOAL= (0..7)
0.5 0.5 0.5 0.5 0.5 0.5 0.5 0.5 
##$TPOFFS= (0..7)
0 0 0 0 0 0 0 0 
##$TUNHIN= 0
##$TUNHOUT= 0
##$TUNXOUT= 0
##$USERA1= <user>
##$USERA2= <user>
##$USERA3= <user>
##$USERA4= <user>
##$USERA5= <user>
##$V9= 5
##$VALIST= <valist>
##$VCLIST= <CCCCCCCCCCCCCCC>
##$VD= 0
##$VDLIST= <DDDDDDDDDDDDDDD>
##$VPLIST= <PPPPPPPPPPPPPPP>
##$VTLIST= <TTTTTTTTTTTTTTT>
##$WBST= 1024
##$WBSW= 4
##$XGAIN= (0..3)
0 0 0 0 
##$XL= 0
##$YL= 0
##$YMAX_a= 38858
##$YMIN_a= -40077
##$ZGOPTNS= <>
##$ZL1= 120
##$ZL2= 120
##$ZL3= 120
##$ZL4= 120
##$ABSF1= 182.463
##$ABSF2= -187.1042
##$ABSG= 5
##$ABSL= 3
##$ALPHA= 0
##$AQORDER= 0
##$ASSFAC= 0
##$ASSFACI= 0
##$ASSFACX= 0
##$ASSWID= 0
##$AUNMP= <proc_1d>
##$AZFE= 0.1
##$AZFW= 0.5
##$BCFW= 0
##$BC_mod= 2
##$BYTORDP= 0
##$COROFFS= 0
##$CY= -3
##$DATMOD= 1
##$DC= 0
##$DFILT= <>
##$DTYPP= 0
##$F1P= 0
##$F2P= 0
##$FCOR= 1
##$FTSIZE= 65536
##$FT_mod= 6
##$GAMMA= 0
##$GB= 0
##$INTBC= 1
##$INTSCL= 5.30512e-09
##$ISEN= 30
##$LB= 1
##$LEV0= 0
##$LPBIN= 0
##$MAXI= 10000
##$MC2= 0
##$MEAN= 0
##$ME_mod= 0
##$MI= 50
##$NCOEF= 0
##$NC_proc= -3
##$NLEV= 6
##$NOISF1= 182.463
##$NOISF2= 159.3651
##$NSP= 0
##$NTH_PI= 0
##$NZP= 0
##$OFFSET= 182.463
##$PC= 4
##$PHC0= -2572.916
##$PHC1= 159.1996
##$PH_mod= 1
##$PKNL= yes
##$PPARMOD= 0
##$PSCAL= 0
##$PSIGN= 0
##$REVERSE= no
##$SF= 81.0140089999434
##$SI= 65536
##$SIGF1= 159.3651
##$SIGF2= -187.1042
##$SINO= 113.3802
##$SIOLD= 16384
##$SREGLST= <1H.CDCl3>
##$SSB= 0
##$STSI= 65536
##$STSR= 0
##$SW_p= 29940.119760479
##$SYMM= 0
##$S_DEV= 0
##$TDeff= 32768
##$TDoff= 0
##$TI= <>
##$TILT= no
##$TM1= 0
##$TM2= 0
##$TOPLEV= 0
##$USERP1= <user>
##$USERP2= <user>
##$USERP3= <user>
##$USERP4= <user>
##$USERP5= <user>
##$WDW= 1
##$XDIM= 65536
##$YMAX_p= 455558850
##$YMIN_p= -1131063
$$ End of Bruker specific parameters
$$ ---------------------------------
##NTUPLES= NMR SPECTRUM
##VAR_NAME=  FREQUENCY,     SPECTRUM/REAL,   SPECTRUM/IMAG
##SYMBOL=    X,             R,               I
##VAR_TYPE=  INDEPENDENT,   DEPENDENT,       DEPENDENT
##VAR_FORM=  AFFN,          ASDF,            ASDF
##VAR_DIM=   65536,         65536,           65536
##UNITS=     HZ,            ARBITRARY UNITS, ARBITRARY UNITS
##FACTOR=    0.456856943014862, 1,           1
##FIRST=     14782.0589164792, 0,            0
##LAST=      -15158.0608439998, 0,           0
##MIN=       -15158.0608439998, -1131063,    0
##MAX=       14782.0589164792, 455558850,    0
$$ Real data points
##PAGE= N=1
##DATA TABLE= (X++(R..R)), XYDATA
$$ [...]
$$ plain form
39092 -163175 -140518 -345269 -509885 -403371 -128678 35452 10813 -22875 81001 244722
39082 244722 288946 136379 -130226 -335358 -337767 -166878 -14032 -8827 -51078 23701 173693
39071 173693 217670 144226 138469 262458 330465 208399 43917 40964 149919 165864 42628
39060 42628 -81584 -127999 -164311 -248089 -340849 -406089 -462686 -501326 -463311 -357553 -295241
39049 -295241 -326761 -322298 -124924 205978 420208 372474 197712 124428 186343 232815 196167
39038 196167 192682 305311 413736 365015 208897 103207 54453 -53821 -201677 -226491
39028 -226491 -111925 -56783 -160654 -252614 -176499 -52821 -60794 -121408 -45985 106202 106894
39017 106894 -34446 -42989 182875 377432 287740 34745 -86921 -25139 18318 -76171 -198980
$$ packed form
39092a63175K2657k04751j64616J06514K74693J64130k4639l3688J03876J63721
39082B44722M4224j52567k66605k05132k409J70889J52846N205m2251P4779J49992
39071A73693M3977p3444n757J23989O8007j22066j64482k953J08955J5945j23236
39060D2628j24212m6415l6312q3778r2760o5240n6597l8640L8015J05758O2312
39049b95241l1520M463J97374L30902K14230m7734j74762p3284O1915M6472l6648
39038A96167l485J12629J08425m8721j56118j05690m8754j08274j47856k4814
39028b26491J14566N5142j03871r1960P6115J23678p973o0614P5423J52187O92
39017A06894j41340q543K25864J94557q9692k52995j21666O1782M3457r4489j22809
$$ plain form
39006 -198980 -212644 -149971 -146463 -245148 -330430 -257591 -36870 141168 115737 -23603 -27453
38995 -27453 174825 356064 299478 99165 -1133 25811 1663 -108876 -117873 41378 131916
38984 131916 -47030 -308621 -305335 -31625 152279 16665 -241591 -287924 -64910 209801
38974 209801 348211 347321 287065 211617 131533 59733 2610 -62281 -174241 -333904 -448311
38963 -448311 -382165 -137642 57842 -22799 -286551 -388330 -175523 115620 223563 228747
38953 228747 346713 502942 416438 77406 -168949 -96299 99888 110959 -66462 -187514
38943 -187514 -109026 77775 191607 114112 -138331 -389638 -412144 -160424 153138 295013
38933 295013 256721 189070 181314 214726 259660 291878 257437 132141 -20296 -132044 -205099
$$ packed form
39006a98980j3664O2673L508r8685q5282P2839K20721J78038k5431j39340l850
38995b7453K02278J81239n6586k00313j00298K6944k4148j10539q997J59251R0538
38984A31916j78946k61591L286K73710J83904j35614k58256m6333K23014K74711
38974B09801J38410q90o0256p5448q0084p1800n7123o4891j11960j59663j14407
38963d48311O6146K44523J95484q0641k63752j01779K12807K91143J07943N184
38953B28747J17966J56229q6504l39032k46355P2650J96187J1071j77421j21052
38943a87514P8488J86801J13832p7495k52443k51307k2506K51720L13562J41875
38933B95013l8292o7651p756L3412M4934L2218l4441j25296j52437j11748p3055
$$ plain form
38922 -205099 -214189 -48193 300692 587603 558426 298172 130025 184862 286731 273724
38912 273724 197100 143210 85537 18662 40918 176871 289597 298676 310818 383701 347728
38901 347728 76183 -220634 -232842 10721 213542 262972 310063 404545 387206 237501
38891 237501 203773 401359 555086 398524 119963 97833 322008 432043 298446 194330
38881 194330 304540 409569 260271 6737 -21964 183412 324763 253505 134498 122539
38871 122539 121888 -23056 -268799 -438602 -448362 -352074 -229244 -129454 -84208 -84159 -73366 -36801
38859 -36801 -57442 -210264 -431761 -581075 -613314 -601146 -585345 -504021 -308664 -74665 64715
38848 64715 60147 -23688 -94556 -104187 -48448 48037 123466 86154 -119103 -426661 -654568
$$ packed form
38922b05099r090J65996L48885K86911k9177k60254j68147N4837J01869j3007
38912B73724p6624n3890n7673o6875K2256J35953J12726R079J2142P2883l5973
38901C47728k71545k96817j2208K43563K02821M9430M7091R4482j7339j49705
38891B37501l3728J97586J53727j56562k78561k2130K24175J10035j33597j04116
38881A94330J10210J05029j49298k53534k8701K05376J41351p1258j19007j1959
38871A22539o51j44944k45743j69803r760R6288J22830R9790M5246M9J0793L6565
38859c6801k0641j52822k21497j49314l2239J2168J5801Q1324J95357K33999J39380
38848F4715m568q3835p0868r631N5739R6485P5429l7312k05257l07558k27907
$$ plain form
38837 -654568 -645639 -431405 -227448 -223686 -381380 -470789 -312746 48070 412150 618309
38827 618309 635816 509647 297475 81550 -30945 -519 63238 -7670 -237308 -451170
38817 -451170 -467408 -297047 -100329 11246 47991 41334 -22457 -137124 -226320 -214874 -113743
38806 -113743 -3711 31254 -55089 -235554 -389850 -390116 -250823 -132746 -152091 -253422 -323289
38795 -323289 -336013 -292374 -113225 237108 558861 549563 182533 -207261 -303580 -145635
38785 -145635 17379 75818 99856 117175 65311 -28526 -22614 110240 194617 107619 -12801
38774 -12801 32471 190116 225000 63549 -130499 -234335 -318100 -448194 -524287 -443360 -292357
38763 -292357 -226228 -245077 -243393 -211163 -227319 -298887 -367224 -445540 -584592 -714736 -700468
$$ packed form
38837f54568Q929K14234K03957L762j57694q9409J58043L60816L64080K06159
38827F18309J7507j26169k12172k15925j12495L0426O3757p0908k29638k13862
38817d51170j6238J70361J96718J11575L6745o657o3791j14667q9196J1446J01131
38806a13743J10032L4965q6343j80465j54296k66J39293J18077j9345j01331o9867
38795c23289j2724M3639J79149L50333L21753r298l67030l89794r6319J57945
38785a45635J63014N8439K4038J7319n1864r3837N912J32854Q4377q6998j20420
38774a2801M5272J57645L4884j61451j94048j03836q3765j30094p6093Q0927J51003
38763b92357O6129j8849J684L2230j6156p1568o8337p8316j39052j30144J4268
$$ plain form
38752 -700468 -567598 -495943 -543036 -554781 -426855 -283824 -280034 -356137 -334700 -178475 -26518
38741 -26518 -11465 -127494 -252766 -260940 -154812 -94020 -200594 -346016 -285393 -23455 156520
38730 156520 103378 8292 66060 164368 128908 63065 147078 257105 140086 -109166 -130276
38719 -130276 133582 334240 277032 202482 322770 417921 191186 -207176 -360831 -184063
38709 -184063 1502 -21897 -93706 -4262 149758 117757 -124541 -336542 -334302 -201206 -129710
38698 -129710 -153149 -134710 5810 170397 233587 224354 260569 346832 357945 233121 77550
38687 77550 22161 58103 68537 -23219 -190041 -353383 -451539 -468610 -428954 -365524 -287864
38676 -287864 -183289 -38192 148224 341181 447218 371242 143401 -68043 -136522 -113927
$$ packed form
38752g00468J32870P1655m7093j1745J27926J43031L790p6103K1437J56225J51957
38741b6518J5053j16029j25272q174J06128O0792j06574j45422O0623K61938J79975
38730A56520n3142r5086N7768R8308l5460o5843Q4013J10027j17019k49252k1110
38719a30276K63858K00658n7208p4550J20288R5151k26735l98362j53655J76768
38709a84063J85565k3399p1809Q9444J54020l2001k42298k12001K240J33096P1496
38698a29710k3439J8439J40520J64587O3190r233L6215Q6263J1113j24824j55571
38687G7550n5389L5942J0434r1756j66822j63342r8156j7071L9656O3430P7660
38676b87864J04575J45097J86416J92957J06037p5976k27841k11444o8479K2595
$$ plain form
38666 -113927 -112702 -128110 -96704 -61119 -110551 -193689 -181219 -107234 -129878 -219459 -141210 136688
38654 136688 271935 1067 -420933 -511387 -202132 96498 69047 -149191 -275404 -294282
38644 -294282 -388299 -592212 -729881 -674563 -503743 -353827 -239498 -93134 87030 222190
38634 222190 267373 259257 245233 238412 257102 323468 383565 320666 122422 -48224 -52238 25061
38622 25061 3807 -111447 -147658 -47554 45236 29749 5210 93178 234828 277639 177487
38611 177487 19575 -90882 -85206 33652 127434 -11763 -415474 -821606 -919363 -671674
38601 -671674 -298095 6211 210143 341127 387422 336740 219590 83651 -18080 -16341
38591 -16341 119446 303219 387053 329315 253950 301533 455221 556567 481929 267137 53300
$$ packed form
38666a13927J225j5408L1406L5585m9432q3138J2470P3985k2644q9581P8249K77898
38654A36688J35247k70868m22000r0454L09255K98630k7451k18238j26213j8878
38644b94282r4017k03913j37669N5318J70820J49916J14329J46364J80164J35160
38634B22190M5183q116j4024o821J8690O6366O0097o2899j98244j70646m014P7299
38622B5061k1254j15254l6211J00104R2790j5487k4539Q7968J41650M2811j00152
38611A77487j57912j10457N676J18858R3782j39197m03711m06132r7757K47689
38601f71674L73579L04306K03932J30984M6295n0682j17150j35939j01731J739
38591a6341J35787J83773Q3834n7738p5365M7583J53688J01346p4638k14792k13837
$$ plain form
38580 53300 -56112 -56369 8181 83634 89619 -42235 -249844 -342839 -222161 -33680 17919
38569 17919 -49486 -58306 20104 19287 -138664 -314386 -370491 -333381 -254071 -100332 92340
38558 92340 147138 -13752 -203315 -216527 -113753 -76970 -108283 -86011 -25498 -41722 -97752
38547 -97752 -38050 117963 143543 -75391 -364872 -480741 -374966 -186968 -72161 -87322
38537 -87322 -172572 -222515 -220637 -266130 -395495 -457739 -305766 -48826 65715 -5432 -73337
38526 -73337 -32874 4011 -59991 -143119 -143414 -97325 -73222 -42758 26946 61641 -19659 -163675
38514 -163675 -244385 -219937 -155888 -133253 -183264 -270999 -314708 -269865 -196828 -171156 -141613
38503 -141613 -1110 192278 223280 10890 -251925 -342465 -274674 -222739 -279005 -386138
$$ packed form
38580E3300j09412k57O4550P5453N985j31854k07609r2995J20678J88481N1599
38569A7919o7405q820P8410q17j57951j75722n6105L7110P9310J53739J92672
38558I2340N4798j60890j89563j3212J02774L6783l1313K2272O0513j6224n6030
38547i7752N9702J56013K5580k18934k89481j15869J05775J87998J14807j5161
38537h7322q5250m9943J878m5493j29365o2244J51973K56940J14541p1147o7905
38526g3337M0463L6885o4002q3128k95M6089K4103L0464O9704L4695q1300j44016
38514a63675q0710K4448O4049K2635n0011q7735m3709M4843P3037K5672K9543
38503a41613J40503J93388L1002k12390k62815r0540O7791N1935n6266j07133
$$ plain form
38493 -386138 -422567 -271513 89332 469912 560851 281503 -65531 -142045 12305 93685
38483 93685 -12408 -121480 -89799 -22280 -55491 -123223 -73892 97367 270541 381860 454964
38472 454964 492832 462961 384469 324738 294784 235277 129445 45071 20223 -16999 -141686
38461 -141686 -288446 -294238 -77365 276760 586863 680380 476239 73532 -251323 -264498
38451 -264498 -29333 167617 180860 158813 261302 389474 354211 188997 83751 69704
38441 69704 3578 -137936 -191512 -97349 -25351 -86301 -118916 46102 255546 209324 -83763
38430 -83763 -270929 -122073 169501 267492 136583 44076 165577 357842 374223 189182
38420 189182 4541 -17086 91423 212604 290702 307234 206114 -45743 -350363 -528727
$$ packed form
38493c86138l6429J51054L60845L80580R0939k79348l47034p6514J54350Q1380
38483I3685j06093j09072L1681O7519l3211o7732M9331J71259J73174J11319P3104
38472D54964L7868k9871p8492n9731k9954n9507j05832q4374k4848l7222j24687
38461a41686j46760n792K16873L54125L10103R3517k04141m02707l24855j3175
38451b64498K35165J96950J3243k2047J02489J28172l5263j65214j05246j4047
38441F9704o6126j41514n3576R4163P1998o0950l2615J65018K09444m6222k93087
38430h3763j87166J48856K91574R7991j30909r2507J21501J92265J6381j85041
38420A89182j84641k1627J08509J21181P8098J6532j01120k51857l04620j78364
$$ plain form
38410 -528727 -494273 -328312 -186849 -170052 -255732 -306329 -172047 140672 423255 463443
38400 463443 275383 55808 -63619 -112978 -139540 -104718 15679 134729 153217 103387
38390 103387 100600 159806 142878 -63089 -343108 -405838 -96237 376706 622704 495142
38380 495142 224278 82072 54417 -36672 -212109 -328229 -332997 -322717 -337197 -290100 -152397
38369 -152397 -40706 -46023 -100869 -97023 -38165 -2857 -32259 -112793 -206304 -259046 -245274 -223174
38357 -223174 -270996 -353059 -341934 -199344 -44190 -11251 -122159 -309007 -474835 -525524
38347 -525524 -448531 -367324 -400631 -465884 -368835 -108822 74184 16525 -165417 -271552 -267672
38336 -267672 -228969 -161989 -20691 170011 324231 401243 438883 508980 653985 810237
$$ packed form
38410e28727L4454J65961J41463J6797q5680n0597J34282L12719K82583M0188
38400D63443j88060k19575j19427m9359k6562L4822J20397J19050J8488m9830
38390A03387k787N9206j6928k05967k80019o2730L09601M72943K45998j27562
38380D95142k70864j42206k7655r1089j75437j16120m768J0280j4480M7097J37703
38369a52397J11691n317n4846L846N8858L5308k9402q0534r3511n2742J3772K2100
38357b23174m7822q2063J1125J42590J55154L2939j10908j86848j65828n0689
38347e25524P6993Q1207l3307o5253R7049K60013J83006n7659j81942j06135L880
38336b67672L8703O6980J41298J90702J54220P7012L7640P0097J45005J56252
$$ plain form
38326 810237 808735 559396 229454 101053 235890 425241 486283 435932 342701 210189
38316 210189 80780 56178 111966 71538 -126760 -310035 -329627 -262591 -232215 -206537 -118587
38305 -118587 -23348 12860 31989 64500 49755 -5907 18348 119520 110022 -45725 -89863
38294 -89863 119088 321048 263515 148213 310121 638207 723033 480864 227241 162728
38284 162728 164630 105753 38020 12289 4502 53527 206508 322841 216317 -5840 -54651
38273 -54651 70175 52776 -233715 -524616 -574486 -469295 -396485 -374830 -356887 -356508 -328378
38262 -328378 -142517 177794 396393 377823 271200 262377 334406 381833 356755 195409 -165679
38251 -165679 -565695 -657639 -349647 10023 78000 -64396 -138717 -97997 -69586 -49329 43784
$$ packed form
38326H10237j502k49339l29942j28401J34837J89351O1042n0351r3231j32512
38316B10189j29409k4602N5788m0428j98298j83275j9592O7036L0376K5678Q7950
38305a18587R5239L6208J9129L2511j4745n5662K4255J01172r498j55747m4138
38294h9863K08951K01960n7533j15302J61908L28086Q4826k42169k53623o4513
38284A62728J902n8877o7733k5731p787M9025J52981J16333j06524k22157m8811
38273e4651J24826j7399k86491k90901m9870J05191P2810K1655J7943L79K8130
38262c28378J85861L20311K18599j8570j06623q823P2029M7427k5078j61346l61088
38251a65679m00016r1944L07992L59670O7977j42396p4321M0720K8411K0257R3113
$$ plain form
38240 43784 107469 -51767 -390877 -638611 -635192 -470099 -283119 -111182 42279 133238
38230 133238 122252 25750 -82457 -93485 45306 212833 192471 -50299 -279653 -279703 -114672
38219 -114672 21129 83673 147338 198486 149908 7004 -140324 -243997 -282949 -200104 -5414
38208 -5414 144070 141094 119970 250036 415123 346008 43303 -195107 -196303 -111185 -120840
38197 -120840 -177943 -161435 -98538 -77425 -64627 34680 197046 283623 200291 -12507 -225494
38186 -225494 -322305 -288603 -207732 -129355 14585 263668 451218 356331 48331 -129844
38176 -129844 -7445 181778 146980 -63624 -204172 -218256 -239238 -290821 -261972 -166400 -151502
38165 -151502 -201921 -107089 161652 298973 82313 -263150 -362243 -213978 -137837 -264279
$$ packed form
38240D3784O3685j59236l39110k47734L419J65093J86980J71937J53461R0959
38230A33238j0986r6502j08207j1028J38791J67527k0362k42770k29354n0J65031
38219a14672J35801O2544O3665N1148m8578j42904j47328j03673l8952Q2845J94690
38208e414J49484k976k1124J30066J65087o9115l02705k38410j196Q5118r655
38197a20840n7103J6508O2897K1113J2798R9307J62366Q6577q3332k12798k12987
38186b25494r6811L3702Q0871P8377J43940K49083J87550r4887l08000j78175
38176a29844J22399J89223l4798k10604j40548j4084k0982n1583K8849R5572J4898
38165a51502n0419R4832K68741J37321k16660l45463r9093J48265P6141j26442
$$ plain form
38155 -264279 -382195 -315410 -162627 -63657 26891 180248 300101 269155 155414 96529
38145 96529 84306 43397 36324 185376 424830 525430 378012 103146 -127451 -236632
38135 -236632 -206332 -57550 89666 74185 -114755 -291239 -272714 -60325 208805 407746
38125 407746 475230 398792 213329 3004 -132720 -138622 -58865 -26501 -129314 -269212 -255033
38114 -255033 -81064 18490 -109370 -298766 -301225 -142477 -49145 -101462 -175204 -184984 -165944
38103 -165944 -129256 -47325 22522 7012 994 157425 390677 437947 250117 65656 32543
38092 32543 19533 -91430 -177122 -89154 104971 253673 327818 351522 277665 77146 -162515
38081 -162515 -334437 -397669 -309966 -42326 268012 374023 231420 66982 33464 11291
$$ packed form
38155b64279j17916O6785J52783R8970R0548J53357J19853l0946j13741n8885
38145I6529j2223m0909p073J49052K39454J00600j47418k74866k30597j09181
38135b36632L0300J48782J47216j5481j88940j76484J8525K12389K69130J98941
38125D07746O7484p6438j85463k10325j35724n902P9757L2364j02813j39898J4179
38114b55033J73969R9554j27860j89396k459J58748R3332n2317p3742r780J9040
38103a65944L6688Q1931O9847j5510o018J56431K33252M7270j87830j84461l3113
38092C2543j3010j10963q5692Q7968J94125J48702P4145K3704p3857k00519k39661
38081a62515j71922o3232Q7703K67640L10338J06011j42603j64438l3518k2173
$$ plain form
38071 11291 -111719 -192612 -62997 174410 294150 265150 224204 231158 223117 143945 -1388
38060 -1388 -150614 -182742 -32666 162971 212604 176139 265319 407585 270518 -157132 -417455
38049 -417455 -244557 30094 42582 -36376 87800 224665 31278 -309018 -328648 -51327
38039 -51327 68414 -72977 -102976 120820 245174 17189 -328162 -471239 -411051 -279501
38029 -279501 -96425 101618 184870 155238 185009 294178 263788 10643 -231262 -263292
38019 -263292 -193914 -192395 -221818 -196802 -177690 -220642 -234358 -159993 -104227 -130139 -109809 40922
38007 40922 167593 105873 -56082 -131043 -107006 -86816 -80922 -42776 -10590 -46376 -112863
37996 -112863 -149848 -191688 -281436 -347462 -287041 -110206 91665 251067 324753 271579 105295
$$ packed form
38071A1291j23010q0893J29615K37407J19740k9000m0946O954q041p9172j45333
38060a388j49226l2128J50076J95637M9633l6465Q9180J42266j37067m27650k60323
38049d17455J72898K74651J2488p8958J24176J36865j93387l40296j9630K77321
38039e1327J19741j41391k9999K23796J24354k27985l45351j43077O0188J31550
38029b79501J83076J98043Q3252k9632K9771J09169l0390k53145k41905l2030
38019b63292O9378J519k9423K5016J9112m2952j3716P4365N5766k5912K0330J50731
38007D0922J26671o1720j61955p4961K4037K0190N894L8146L2186l5786o6487
37996a12863l6985m1840q9748o6026O0421J76835K01871J59402P3686n3174j66284
$$ plain form
37985 105295 -91248 -237876 -277474 -157089 73128 183183 -2229 -297495 -337421 -94248
37975 -94248 76789 -17401 -146001 -88563 4120 -73260 -193108 -134535 3891 -35833 -240692
37964 -240692 -377629 -375400 -343474 -280203 -85483 147925 166133 -67805 -276224 -223107 24355
37953 24355 253332 347563 296110 115504 -124085 -273955 -204979 68322 370819 470139
37943 470139 248169 -176826 -530662 -622929 -469248 -183753 124224 306613 202878 -154608
37933 -154608 -478652 -518488 -335127 -167532 -123187 -136351 -132103 -75386 57206 199216 178983
37922 178983 -50005 -259714 -221530 -40368 6436 -110342 -171303 -94669 -38801 -88354 -113490
37911 -113490 -31565 30529 -37889 -137195 -127558 -34226 59503 185430 391635 566436 535804
$$ packed form
37985A05295j96543j46628l9598J20385K30217J10055j85412k95266l9926K43173
37975i4248J71037r4190j28600N7438R2683p7380j19848N8573J38426l9724k04859
37964b40692j36937K229L1926O3271J94720K33408J8208k33938k08419N3117K47462
37953B4355K28977R4231n1453j80606k39589j49870O8976K73301L02497R9320
37943D70139k21970m24995l53836r2267J53681K85495L07977J82389j03735l57486
37933a54608l24044l9836J83361J67595M4345j3164M248N6717J32592J42010k0233
37922A78983k28988k09709L8184J81162M6804j16778o0961P6634N5868m9553k5136
37911a13490Q1925O2094o8418r9306R637R3332R3729J25927K06205J74801l0632
$$ plain form
37900 535804 302885 50111 -88050 -138655 -171443 -173003 -86802 76121 220521 259404 198558
37889 198558 112655 45501 -29275 -130979 -204151 -182178 -85649 9522 72164 95061 950
37878 950 -287446 -642439 -744655 -427482 69573 332774 233021 18981 -42724 41098 116958
37867 116958 143440 180168 209605 143982 -8315 -136977 -196479 -233473 -237949 -139250 6695
37856 6695 18922 -126949 -208157 -76843 117049 195541 244197 389615 465945 234888 -163364
37845 -163364 -347375 -256742 -199262 -304441 -331496 -142895 23939 -26478 -98773 46091
37835 46091 266326 279550 128973 79135 177681 247470 241476 289981 410234 453994 373921
37824 373921 303418 320561 329404 236535 90331 -11015 -30182 24915 121432 183955 149473
$$ packed form
37900E35804k32919k52774j38161n0605l2788j560Q6201J62923J44400L8883o0846
37889A98558q5903o7154p4776j01704p3172K1973R6529R5171O2642K2897r4111
37878I50k88396l54993j02216L17173M97055K63201r9753k14040o1705Q3822P5860
37867A16958K6482L6728K9437o5623j52297j28662n9502l6994m476R8699J45945
37856F695J2227j45871q1208J31314J93892P8492M8656J45418P6330k31057l98252
37845a63364j84011R0633N7480j05179k7055J88601J66834n0417p2295J44864
37835D6091K20235J3224j50577m9838R8546O9789n994M8505J20253M3760q0073
37824C73921p0503J7143Q843r2869j46204j01346j9167N5097R6517O2523l4482
$$ plain form
37813 149473 49202 -43720 -129575 -251136 -371247 -389145 -272260 -83183 102921 220947
37803 220947 199479 36389 -137626 -186315 -133526 -87361 -40049 100989 291316 338197 167806
37792 167806 -43119 -95957 -27528 -27203 -152231 -249311 -173972 9230 119371 111796 132233
37781 132233 286834 462937 480840 356493 270449 297618 327995 276028 205305 183735 159950
37770 159950 67760 -65476 -193217 -315491 -391513 -311990 -60688 201015 309793 267129
37760 267129 150883 -19386 -220820 -342750 -296391 -142028 -6202 62189 77392 46115
37750 46115 -7510 -30763 -23766 -39970 -59358 10108 150207 209615 141049 90467 151075 210507
37738 210507 169928 131499 207022 303013 274739 162868 110664 164292 296448 486797 634224
$$ packed form
37813A49473j00271r2922q5855j21561j20111j7898J16885J89077J86104J18026
37803B20947k1468j63090j74015m8689N2789M6165M7312J41038J90327M6881j70391
37792A67806k10925n2838O8429L25j25028r7080P5339J83202J10141p575K0437
37781A32233J54601J76103J7903j24347q6044K7169L0377n1967p0723k1570k3785
37770A59950r2190j33236j27741j22274p6022P9523K51302K61703J08778m2664
37760B67129j16246j70269k01434j21930M6359J54363J35826O8391J5203l1277
37750D6115n3625k3253O997j6204j9388O9466J40099N9408o8566n0582O0608N9432
37738B10507m0579l8429P5523R5991k8274j11871n2204N3628J32156J90349J47427
$$ plain form
37727 634224 556228 255779 33094 130521 395209 491149 331110 111335 24751 111126
37717 111126 286814 380361 265149 73661 100729 371306 545864 426985 280563 406283
37707 406283 660161 714745 561837 415772 312962 163183 37245 49778 92553 16696
37697 16696 -68749 -11522 49386 -67600 -189382 -60492 151160 89293 -166567 -206100 41754
37686 41754 235871 208549 148232 171520 161650 86362 72234 118176 105016 92845 230696
37675 230696 402406 373584 238256 259616 330945 138124 -166694 -78951 394265 626552
37665 626552 312779 -84827 -82469 183901 352003 363305 284420 57820 -235547 -268844
37655 -268844 53463 374063 417704 368318 439642 482686 342693 211512 269206 330961 203234
$$ packed form
37727F34224p7996l00449k22685R7427K64688R5940j60039k19775q6584Q6375
37717A11126J75688R3547j15212j91488K7068K70577J74558j18879j46422J25720
37707D06283K53878N4584j52908j46065j02810j49779j25938J2533M2775p5857
37697A6696q5445N7227O0908j16986j21782J28890K11652o1867k55860l9533K47854
37686D1754J94117k7322o0317K3288r870p5288j4128M5942j3160j2171J37851
37675B30696J71710k8822j35328K1360P1329j92821l04818Q7743M73216K32287
37665F26552l13773l97606K358K66370J68102J1302p8885k26600k93367l3297
37655b68844L22307L20600M3641m9386P1324M3044j39993j31181N7694O1755j27727
$$ plain form
37644 203234 49466 51819 57673 -69551 -106905 107398 257574 28954 -294547 -232504 117823
37633 117823 259852 120493 142453 557009 1036401 1151204 833436 322200 -84824 -191851
37623 -191851 -39484 103456 40847 -106641 -106038 49811 195992 270627 323608 350663 334064
37612 334064 366586 532035 731264 801907 733378 608812 437255 211374 35808 28819
37602 28819 160175 304378 376151 339860 208620 95330 105908 135731 -18929 -299693
37592 -299693 -404194 -242893 -67160 -23932 64834 291946 400603 205040 -40789 -11340
37582 -11340 214032 364009 432706 579178 746455 729045 522852 321050 229707 203953
37572 203953 184325 124874 -12798 -162912 -182991 -66833 48021 140808 319725 513774
$$ packed form
37644B03234j53768K353N854j27224l7354K14303J50176k28620l23501O2043L50327
37633A17823J42029j39359K1960M14556M79392J14803l17768n11236m07024j07027
37623a91851J52367J42940o2609j47488O03J55849J46181P4635N2981K7055j6599
37612C34064L2522J65449J99229P0643o8529j24566j71557k25881j75566o989
37602B8819J31356J44203P1773l6291j31240j13290J0578K9823j54660k80764
37592b99693j04501J61301J75733M3228Q8766K27112J08657j95563k45829K9449
37582a1340K25372J49977O8697J46472J67277j7410k06193k01802r1343k5754
37572B03953j9628n9451j37672j50114k0079J16158J14854R2787J78917J94049
$$ plain form
37562 513774 489303 286407 260822 523452 730261 635894 448143 387032 318368 125854
37552 125854 23925 149236 242363 112835 24224 203789 363410 182696 -85560 -12341
37542 -12341 295403 410113 282375 202675 238345 205387 82460 15124 8869 -12345 30528
37531 30528 219774 415786 487244 557615 726839 808155 657398 468550 405839 278813
37521 278813 -35047 -206219 58930 478595 618328 544927 578223 697633 702891 682211
37511 682211 802591 888423 711941 458997 424668 501480 440219 341484 411935 521266 478888
37500 478888 450995 632017 823687 803983 755871 865141 901821 690746 545672 709268
37490 709268 841504 619412 334870 318219 327384 131270 89768 460568 756347 538794
$$ packed form
37562E13774k4471k02896k5585K62630K06809r4367j87751o1111o8664j92514
37552A25854j01929J25311R3127j29528q8611J79565J59621j80714k68256P3219
37542a2341L07744J14710j27738p9700L5670l2958j22927o7336o255k1214M2873
37531C0528J89246J96012P1458P0371J69224Q1316j50757j88848o2711j27026
37521B78813l13860j71172K65149M19665J39733p3401L3296J19410N258k0680
37511F82211J20380Q5832j76482k52944l4329P6812o1261r8735P0451J09331m2378
37500D78888k7893J81022J91670j9704m8112J09270L6680k11075j45074J63596
37490G09268J32236k22092k84542j6651R165j96114m1502L70800K95779k17553
$$ plain form
37480 538794 217944 294016 486878 425070 446550 834434 1069725 807404 728251 1382608
37470 1382608 2141407 2425136 2870706 3956562 4729224 4556092 4835409 6851702 9037901
37461 9037901 8825918 6476094 4535544 4028471 3810161 3348423 3378716 3821863 3706816
37452 3706816 3283444 3738815 4823589 5255547 5273919 6079785 7127694 7097912 7109380 9347701
37442 9347701 12966028 15579042 18299991 24094512 31775733 38954602 51432644 79217451
37434 79217451 117684510 142258699 132155599 94977038 58119150 38613363 31355764
37427 31355764 25294071 18714642 14916607 12970702 9890956 6639852 5828697 6496306
37419 6496306 5910232 4252266 3512730 3567966 2894627 1741995 1452651 1738529 1358772
$$ packed form
37480E38794l20850P6072J92862o1808K1480L87884K35291k62321p9153O54357
37470A382608P58799K83729M45570J085856P72662j73132K79317K016293K186199
37461I037901k11983k349824j940550n07073k18310m61738L0293M43147j15047
37452C706816m23372M55371J084774M31958J8372Q05866J047909k9782J1468K238321
37442I347701L618327K613014K720949N794521P681221P178869J2478042K7784807
37434G9217451L8467059K4574189j0103100l7178561l6857888j9505787p257599
37427C1355764o061693o579429l798035j945905l079746l251104q11155O67609
37419F496306n86074j657966p39536N5236o73339j152632k89344K85878l79757
$$ plain form
37410 1358772 566789 485082 897911 818373 446856 587886 890994 537583 -38048 120534
37400 120534 701166 729530 350770 408220 796866 773040 442984 509576 926098 1087356
37390 1087356 965542 893442 682482 84148 -374404 -130051 359986 381284 199921 417389
37380 417389 705013 406901 -137813 -141851 223605 234773 15666 238280 743938 760493
37370 760493 288218 33399 112505 19667 -220794 -56189 454721 622468 305601 92240
37360 92240 231612 332236 211878 160492 250627 193739 -22357 -85599 6165 -40142 -169914
37349 -169914 -52986 225327 248688 17716 -82543 -21176 -115050 -315540 -229980 131309
37339 131309 328266 241569 186596 252708 179384 -71783 -240592 -291214 -421718 -556308
$$ packed form
37410A358772p91983q1707M12829p9538l71517J41030L03108l53411n75631J58582
37400A20534N80632K8364l78760N7450L88646k3826l30056O6592M16522J61258
37390A087356j21814p2100k10960n98334m58552K44353M90037K1298j81363K17468
37380D17389K87624k98112n44714m038L65456J1168k19107K22614N05658J6555
37370G60493m72275k54819P9106r2838k40461J64605N10910J67747l16867k13361
37360I2240J39372J00624j20358n1386R0135n6888k16096o3242R1764m6307j29772
37349a69914J16928K78313K3361k30972j00259O1367r3874k00490Q5560L61289
37339A31309J96957q6697n4973O6112p3324k51167j68809n0622j30504j34590
$$ plain form
37329 -556308 -427192 -150290 -113572 -307116 -373936 -296877 -387119 -598637 -536564 -198038
37319 -198038 -32629 -168557 -224251 -20347 136965 46931 -76809 -61105 -25671 -28140 55111
37308 55111 154928 -477 -368939 -525065 -275519 59305 126202 -61773 -318627 -527076
37298 -527076 -588817 -450523 -247653 -150694 -86409 94871 263541 187651 -25247 -69740
37288 -69740 51892 89145 30840 84190 225706 227911 91432 14083 -4868 -86477 -101224
37277 -101224 129885 363017 203965 -208425 -347560 -91129 190078 299284 381602 438381
37267 438381 291008 63442 87927 274421 195500 -127008 -177046 180076 439697 288273
37257 288273 65504 120005 267176 209192 20466 -100200 -167468 -232280 -214536 -119474 -92622
$$ packed form
37329e56308J29116K76902L6718j93544o6820P7059r0242k11518O2073L38526
37319a98038J65409j35928n5694K03904J57312r0034j23740J5704L5434k469Q3251
37308E5111R9817j55405l68462j56126K49546L34824O6897j87975k56854k08449
37298e27076o1741J38294K02870R6959O4285J81280J68670p5890k12898m4493
37288f9740J21632L7253n8305N3350J41516K205j36479p7349j8951q1609j4747
37277a01224K31109K33132j59052m12390j39135K56431K81207J09206Q2318N6779
37267D38381j47373k27566K4485J86494p8921l22508n0038L57122K59621j51424
37257B88273k22769N4501J47171n7984j88726j20666o7268o4812J7744R5062K6852
$$ plain form
37246 -92622 -124174 -53980 48637 -64811 -307947 -276318 96288 393336 383614 331017 449073
37235 449073 553744 494370 447376 515950 483775 240160 33802 31842 20401 -185041 -398306
37224 -398306 -392921 -241798 -105784 -7102 14066 -129190 -295699 -205605 59610 91345 -164367
37213 -164367 -264383 -7774 223964 142249 26860 174645 377126 353292 249160 271184
37203 271184 235285 -50294 -309781 -200759 84558 94149 -209791 -474420 -487860 -317069
37193 -317069 -67113 166826 242508 139065 43039 65371 71953 -31526 -121455 -156347 -321486
37182 -321486 -625248 -706682 -363651 54256 130300 -39531 -113191 -64789 -85785 -164033 -163518
37171 -163518 -137006 -186253 -179404 39723 317178 394749 299391 223475 187660 131863 164653
$$ packed form
37246i2622l1552P0194J02617j13448k43136L1629L72606K97048r722n2597J18056
37235D49073J04671n9374m6994O8574l2175k43615k06358j960j1441k05442k13265
37224c98306N385J51123J36014R8682K1168j43256j66509R0094K65215L1735k55712
37213a64367j00016K56609K31738q1715j15389J47785K02481k3834j04132K2024
37203B71184l5899k85579k59487J09022K85317R591l03940k64629j3440J70791
37193c17069K49956K33939P5682j03443r6026K2332O582j03479q9929l4892j65139
37182c21486l03762q1434L43031M17907P6044j69831p3660M8402k0996p8248N15
37171a63518K6512m9247O849K19127K77455P7571r5358p5916l5815n5797L2790
$$ plain form
37160 164653 392566 647181 692616 571796 468307 380039 213340 44924 4387 35738
37150 35738 29119 30830 86611 71239 -77898 -172185 -77320 21385 -69934 -226737 -278684 -331609
37138 -331609 -484611 -515274 -242791 56594 32406 -168497 -170423 -7714 -4699 -173978 -247901
37127 -247901 -212701 -299221 -487141 -516576 -388687 -372676 -482976 -419478 -107611 142278
37117 142278 138780 82636 185653 349773 389393 303166 175152 28660 -95586 -107526 -20843
37106 -20843 20277 -54904 -146342 -132328 4736 210861 399779 474502 422330 347625 309200
37095 309200 216978 13790 -168926 -201504 -167562 -196770 -227152 -147838 -35040 -4691 31829
37084 31829 200291 381726 386137 297034 338043 481137 494956 319319 94947 -113980 -321579
$$ packed form
37160A64653K27913K54615M5435j20820j03489q8268j66699j68416m0537L1351
37150C5738o619J711N5781j5372j49137r4287R4865R8705r1319j56803n1947n2925
37138c31609j53002l0663K72483K99385k4188k00903j926J62709L015j69279p3923
37127b47901L5200q6520j87920k9435J27889J6011j10300O3498L11867K49889
37117A42278l498n6144J03017J64120L9620q6227j28014j46492j24246j1940Q6683
37106b0843M1120p5181r1438J4014J37064K06125J88918P4723n2172p4705l8425
37095C09200r2222k03188j82716l2578L3942k9208l0382P9314J12798L0349L6520
37084C1829J68462J81435M411q9103M1009J43094J3819j75637k24372k08927k07599
$$ plain form
37073 -321579 -407206 -227122 89272 264721 270168 291757 345413 273469 120879 140103 353900
37062 353900 458940 280954 29307 -40982 26767 36132 -64541 -179017 -234513 -239923 -236179
37051 -236179 -239696 -205382 -82664 47522 6499 -211469 -352019 -237496 -27885 48681
37041 48681 41923 99008 121901 -55459 -270650 -193372 157056 409569 358135 164253 41763
37030 41763 43790 164008 348458 408073 223578 26854 150577 504682 667905 523824
37020 523824 401111 491025 542846 324589 18853 -95564 -73269 -132349 -249974 -208985
37010 -208985 42066 294352 319306 85977 -222723 -349165 -187271 82404 160515 -42345
37000 -42345 -331365 -483865 -461137 -348710 -214724 -81117 41609 128945 131842 32035 -66811
$$ packed form
37073c21579q5627J80084L16394J75449N447K1589N3656p1944j52590J9224K13797
37062C53900J05040j77986k51647p0289O7749R365j00673j14476n5496n410L744
37051b36179l517L4314J22718J30186m1023k17968j40550J14523K09611P6566
37041D8681o758N7085K2893j77360k15191P7278L50428K52513n1434j93882j22490
37030D1763K027J20218J84450N9615j84495j96724J23723L54105J63223j44081
37020E23824j22713Q9914N1821k18257l05736j14417K2295n9080j17625M0989
37010b08985K51051K52286K4954k33329l08700j26442J61894K69675P8111k02860
37000d2345k89020j52500K2728J12427J33986J33607J22726Q7336K897r9807r8846
$$ plain form
36989 -66811 -10769 177215 286055 231067 197240 319088 429158 346819 207602 214483 249163
36978 249163 87386 -140705 -117517 102088 131606 -127787 -325018 -210133 17204 51193
36968 51193 -122264 -320113 -424288 -417383 -330831 -246587 -214399 -152792 13916 162540 125359
36957 125359 -11271 -17427 102193 119206 -36070 -186971 -217463 -192115 -157533 -97610 -90170
36946 -90170 -220184 -334722 -194960 112929 247012 121787 6223 48707 60795 -112606
36936 -112606 -335206 -430215 -406658 -312606 -134682 40004 31922 -140225 -232755 -148946 -75402
36925 -75402 -137455 -194285 -118404 -25528 -66053 -193187 -272160 -237225 -48147 309141 693594
36914 693594 880823 834882 714088 576897 326390 -8691 -210224 -175083 -46360 31314
$$ packed form
36989f6811N6042J87984J08840n4988l3827J21848J10070q2339j39217O881L4680
36978B49163j61777k28091K3188K19605K9518k59393j97231J14885K27337L3989
36968E1193j73457j97849j04175O905Q6552Q4244L2188O1607J66708J48624l7181
36957A25359j36630o156J19620J7013j55276j50901l0492K5348L4582N9923P440
36946i0170j30014j14538J39762L07889J34083j25225j15564M2484J2088j73401
36936a12606k22600r5009K3557R4052J77924J74686q082j72147r2530Q3809P3544
36925g5402o2053n6830P5881R2876m0525j27134p8973L4935J89078L57288L84453
36914F93594J87229m5941j20794j37191k50507l35081k01533L5141J28723P7674
$$ plain form
36904 31314 60374 49225 -31668 -108835 -65343 36943 52327 56518 244689 527367 584643
36893 584643 353934 97080 -53519 -213530 -357660 -262868 38717 199982 120724 127013
36883 127013 377394 529124 283653 -110467 -220651 -9834 232255 296341 155333 -109145
36873 -109145 -281554 -145467 196970 387262 309331 218948 263942 259362 113293 67127 265832
36862 265832 466324 446954 358697 393076 444721 394460 389060 526807 585208 387833 145272
36851 145272 107401 165862 130486 112668 280998 496586 552447 547843 673332 828508 793223
36840 793223 601723 439481 336809 233445 164260 141080 58515 -68299 -30268 194706
36830 194706 295854 112552 -77411 -37886 27988 -92413 -170016 56615 341468 275137
$$ packed form
36904C1314K9060j1149q0893p7167M3492J02286J5384M191J88171K82678N7276
36893E84643k30709k56854j50599j60011j44130R4792L01585J61265p9258O289
36883A27013K50381J51730k45471l94120j10184K10817K42089O4086j41008k64478
36873a09145j72409J36087L42437J90292p7931r0383M4994m580j46069m6166J98705
36862B65832K00492j9370q8257L4379N1645n0261n400J37747N8401j97375k42561
36851A45272l7871N8461l5376j7818J68330K15588N5861m604J25489J55176l5285
36840G93223j91500j62242j02672j03364o9185k3180q2565j26814L8031K24974
36830A94706J01148j83302j89963L9525O5874j20401p7603K26631K84853o6331
$$ plain form
36820 275137 -67968 -275149 -193437 20404 243939 394604 308374 5259 -141109 115524
36810 115524 476761 546280 419269 400596 432827 308063 183047 319249 508878 342422
36800 342422 -84604 -299265 -191558 -77295 -88375 -45796 82197 113627 54486 97229
36790 97229 208205 153864 -60159 -190493 -182737 -197623 -243389 -178277 -35450 41905 116147
36779 116147 309720 454936 329290 123571 187061 406981 373432 94972 -16621 141014
36769 141014 240600 150923 111884 206336 212800 102065 147529 391758 508306 365732 250607
36758 250607 340250 408083 265499 79531 26857 8022 -70467 -70433 98440 265510 266305 173900
36746 173900 108527 53215 -16144 -38668 6553 88377 253098 524224 697466 537145 163946
$$ packed form
36820B75137l43105k07181Q1712K13841K23535J50665q6230l03115j46368K56633
36810A15524L61237O9519j27011j8673L2231j24764j25016J36202J89629j66456
36800C42422m27026k14661J07707J14263j1080M2579J27993L1430n9141M2743
36790I7229J10976n4341k14023j30334P756j4886m5766O5112J42827P7355P4242
36779A16147J93573J45216j25646k05719O3490K19920l3549k78460j11593J57635
36769A41014R9586q9677l9039R4452O464j10735M5464K44229J16548j42574j15125
36758B50607Q9643O7833j42584j85968n2674j8835p8489L4J68873J67070P95r2405
36746A73900o5373n5312o9359k2524M5221Q1824J64721K71126J73242j60321l73199
$$ plain form
36735 163946 -71289 -77995 -51657 -57106 14154 92415 -27364 -271457 -352942 -282491 -360963
36724 -360963 -612467 -699020 -490644 -255287 -170618 -103647 6586 11759 -64642 27739 289094
36713 289094 395242 252713 155058 220017 176180 -72534 -181894 49662 306212 280848
36703 280848 143938 148831 176606 46079 -75782 35452 241522 280592 198989 212563 330630
36692 330630 413021 439386 478226 533222 591034 649406 587525 254537 -199045 -375397 -160814
36681 -160814 101900 126537 44296 75409 173039 204731 187017 143274 24769 -59843 125743
36670 125743 506791 658877 423432 179898 247332 397834 280467 -12790 -152786 -69779
36660 -69779 82984 226906 326538 279158 92511 -41178 -53084 -120493 -293334 -321432 -89582
$$ packed form
36735A63946k35235o706K6338n449P1260P8261j19779k44093q1485P0451p8472
36724c60963k51504q6553K08376K35357Q4669O6971J10233N173p6401R2381K61355
36713B89094J06148j42529r7655O4959m3837k48714j09360K31556K56550k5364
36703B80848j36910M893K7775j30527j21861J11234K06070L9070q1603J3574J18067
36692C30630Q2391K6365L8840N4996N7812N8372o1881l32988m53582j76352K14583
36681a60814K62714K4637q2241L1113R7630L1692j7714m3743j18505q4612J85586
36670A25743L81048J52086k35445k43534O7434J50502j17367k93257j39996Q3007
36660f9779J52763J43922R9632m7380j86647j33689j1906o7409j72841k8098K31850
$$ plain form
36649 -89582 114042 45996 -100322 -59350 57140 13310 -115196 -103985 36554 148454
36639 148454 201162 217411 134775 -24019 -74456 26121 70154 -6450 37446 272529 342658
36628 342658 9877 -399230 -465107 -281645 -203576 -266775 -259942 -140308 4761 204951
36618 204951 463822 569607 376895 79795 -81758 -153801 -237079 -215838 -22186 134536
36608 134536 127457 180904 439339 618204 470724 245756 249747 306479 129642 -107313 -95691
36597 -95691 27606 -21564 -81785 156482 503528 533224 296467 161297 124125 -77093
36587 -77093 -313853 -218653 92003 138247 -90520 -109215 204389 401158 243222 58556
36577 58556 106977 160586 -20779 -268116 -328129 -227530 -78378 137864 372014 399508
$$ packed form
36649h9582K03624o8046j46318M0972J16490m3830j28506J1211J40539J11900
36639A48454N2708J6249q2636j58794n0437J00577M4033p6604M3896K35083P0129
36628C42658l32781m09107o5877J83462P8069o3199O833J19634J45069K00190
36618B04951K58871J05785j92712k97100j61553p2043q3278K1241J93652J56722
36608A34536p079N3447K58435J78865j47480k24968L991N6732j76837k36955J1622
36597i5691J23297m9170o0221K38267L47046K9696k36757j35170l7172k01218
36587g7093k36760R5200L10656M6244k28767j8695L13604J96769j57936j84666
36577E8556M8421N3609j81365k47337o0013J00599J49152K16242K34150K7494
$$ plain form
36567 399508 132611 -193913 -319583 -241230 -87808 78914 235617 348010 419317 445332
36557 445332 337265 71075 -145627 -95794 109778 181584 86761 41774 107607 119385 31248
36546 31248 8701 114961 184201 91418 -71534 -160702 -149838 -95847 -67775 -109756 -174841
36535 -174841 -154859 -57840 -22212 -65005 -29308 90958 61086 -166645 -274800 -109210 -17143
36524 -17143 -278305 -564976 -457709 -173814 -195897 -423299 -355735 15022 189619 22029
36514 22029 -72275 140564 366271 341698 221035 207241 229323 185182 161258 245259 387620
36503 387620 530263 624368 528484 186260 -131112 -96390 195561 360295 268417 92236
36493 92236 -92082 -315282 -410775 -185935 136351 140905 -126759 -235260 -95771 -71879
$$ packed form
36567C99508k66897l26524j25670P8353J53422J66722J56703J12393P1307K6015
36557D45332j08067k66190k16702M9833K05572P1806r4823m4987O5833J1778q8137
36546C1248k2547J06260O9240r2783j62952q9168J0864N3991K8072m1981o5085
36535a74841J9982R7019L5628m2793L5697J20266k9872k27731j08155J65590R2067
36524a7143k61162k86671J07267K83895k2083k27402O7564L70757J74597j67590
36514B2029r4304K12839K25707k4573j20663j3794K2082m4141k3924Q4001J42361
36503C87620J42643R4105r5884l42224l17372L4722K91951J64734r1878j76181
36493I2236j84318k23200r5493K24840L22286M554k67664j08501J39489K3892
$$ plain form
36483 -71879 -303095 -468412 -355735 -165870 -88637 -23450 118690 233076 269620 299092
36473 299092 268394 77428 -83926 72307 383454 383769 47191 -163203 -74161 -45344 -274994
36462 -274994 -449422 -325286 -125893 -83763 -76682 1446 -24918 -210028 -259040 -20640 191418
36451 191418 90077 -132568 -158146 -15349 108113 222233 392747 498763 422949 282313
36441 282313 238654 263221 259498 224318 161217 44925 -45295 2927 86388 -3313 -192962
36430 -192962 -190503 29426 180312 156961 168112 299296 362021 277579 194871 129698 -81245
36419 -81245 -369102 -432747 -260884 -179466 -257434 -175921 148469 337443 166520 -88663
36409 -88663 -154065 -127995 -115762 27609 329416 522147 485720 440350 486324 411477 168867
$$ packed form
36483g1879k31216j65317J12677J89865P7233O5187J42140J14386L6544K9472
36473B99092l0698j90966j61354J56233L11147L15l36578k10394Q9042K8817k29650
36462b74994j74428J24136J99393M2130P081P8128k6364j85110m9012K38400K12058
36451A91418j01341k22645k5578J42797J23462J14120J70514J06016p5814j40636
36441B82313m3659K4567l723l5180o3101j16292r0220M8222Q3461q9701j89649
36430a92962K459K19929J50886k3351J1151J31184O2725q4442q2708o5173k10943
36419h1245k87857o3645J71863Q1418p7968Q1513L24390J88974j70923k55183
36409h8663o5402K6070J2233J43371L01807J92731l6427m5370M5974p4847k42610
$$ plain form
36398 168867 53423 166586 203500 16014 -126030 -78182 -74358 -174301 -58286 306669
36388 306669 424555 90112 -176933 14676 260808 107737 -121891 75373 438240 342570
36378 342570 -156415 -414582 -178336 163555 245382 116272 -18622 -43972 70040 236645
36368 236645 269361 108861 -102816 -285769 -506345 -689697 -609203 -327691 -241563 -472994
36358 -472994 -649392 -528931 -376979 -424408 -435218 -181066 95884 87301 -100999 -226703
36348 -226703 -279976 -254949 12162 437252 573287 256173 -88719 -121563 -62801 -143713
36338 -143713 -162784 -18789 -79191 -493954 -726929 -367166 130828 151922 -136270 -213877
36328 -213877 -116558 -193119 -341351 -216264 83548 196541 110687 21958 -117261 -358114
$$ packed form
36398A68867j15444J13163L6914j87486j42044M7848L824r9943J16015L64955
36388C06669J17886l34443k67045J91609K46132j53071k29628J97264L62867r5670
36378C42570m98985k58167K36246L41891Q1827j29110j34894k5350J14012J66605
36368B36645L2716j60500k11677j82953k20576j83352Q0494K81512Q6128k31431
36358d72994j76398J20461J51952m7429j0810K54152K76950q583j88300j25704
36348b26703n3273K5027K67111M25090J36035l17114l44892l2844N8762q0912
36338a43713j9071J43995o0402m14763k32975L59763M97994K1094k88192p7607
36328b13877R7319p6561j48232J25087K99812J12993q5854q8729j39219k40853
$$ plain form
36318 -358114 -419823 -164187 -17088 -315298 -647310 -498114 -128139 -91237 -281038 -244908
36308 -244908 -95806 -265899 -609011 -597497 -250607 -72082 -184757 -268805 -246811 -316152
36298 -316152 -401474 -256477 -13789 5610 -94589 10934 211178 147984 -91283 -117007
36288 -117007 71099 161709 138303 187576 192456 -44582 -274575 -155796 77290 -22840
36278 -22840 -304108 -277086 18142 144157 75874 128409 252918 170438 46214 245475
36268 245475 555436 448818 13738 -176649 -34131 -366 -192102 -292157 -248190 -309448
36258 -309448 -406687 -250743 -31 -68526 -313039 -179757 361055 770127 798484 667315
36248 667315 450817 31338 -373977 -388145 -146832 -101348 -238963 -200703 -24677 -13788
$$ packed form
36318c58114o1709K55636J47099k98210l32012J49196L69975L6902j89801L6130
36308b44908J49102j70093l43112J1514L46890J78525j12675q4048K1994o9341
36298c16152q5322J44997K42688J9399j00199J05523K00244o3194k39267k5724
36288a17007J88106R0610k3406M9273M880k37038k29993J18779K33086j00130
36278b2840k81268K7022K95228J26015o8283N2535J24509q2480j24224J99261
36268B45475L09961j06618m35080j90387J42518L3765j91736j00055M3967o1258
36258c09448r7239J55944K50712o8495k44513J33282N40812M09072K8357j31169
36248F67315k16498m19479m05315j4168K41313M5484j37615L8260J76026J0889
$$ plain form
36238 -13788 -36632 224383 506236 317151 -114714 -164055 79665 4478 -349368 -358660 -7876
36227 -7876 70934 -220384 -294058 4924 175373 85513 193644 569289 686302 399968
36217 399968 195074 265654 257492 104496 209944 600409 777034 603806 529734 798172
36207 798172 1219570 1740731 2384015 2681160 2146481 1274146 1018227 1307421 1196262 487341
36197 487341 -15899 44667 140190 28833 124764 462304 505666 244080 288678 652799
36187 652799 656969 262496 207156 565480 536388 -16396 -218812 217116 469170 156273
36177 156273 -6611 335454 476607 56112 -193880 181622 531419 364429 199212 418517
36167 418517 498967 129210 -96010 161105 305177 22604 -25423 521457 945234 721564
$$ packed form
36238a3788k2844K61015K81853j89085m31865m9341K43720p5187l53846r292L50784
36227g876P8810k91318p3674K98982J70449q9860J08131L75645J17013k86334
36217C99968k04894P0580q162j52996J05448L90465J76625j73228p4072K68438
36207G98172M21398N21161O43284K97145n34679q72335k55919K89194j11159p08921
36197D87341n03240O0566R5523j11357R5931L37540M3362k61586M4598L64121
36187F52799M170l94473n5340L58324k9092n52784k02416M35928K52054l12897
36177A56273j62884L42065J41153m20495k49992L75502L49797j66990j65217K19305
36167D18517Q0450l69757k25220K57115J44072k82573m8027N46880M23777k23670
$$ plain form
36157 721564 403780 478961 518201 219240 90204 331288 274471 -277552 -436608 215795
36147 215795 763498 524248 159167 286695 348584 -109172 -366044 129188 604806 321700
36137 321700 -110886 61786 384715 215704 -24772 194745 403052 122009 -92044 271879
36127 271879 631343 434643 225728 508682 708525 357106 107294 443883 638195 149504
36117 149504 -230408 151188 523252 152800 -257222 37602 395880 144062 -26187 531575
36107 531575 997805 592309 116082 425816 771209 291549 -238424 118360 630309 326575
36097 326575 -102420 327581 958099 790613 411561 726396 1101177 695355 292276 812932
36087 812932 1378992 903835 211417 453372 861977 308975 -359961 97188 848984 550156
$$ packed form
36157G21564l17784P5181L9240k98961j29036K41084n6817n52023j59056O52403
36147B15795N47703k39250l65081J27528O1889m57756k56872M95232M75618k83106
36137C21700m32586J72672L22929j69011k40476K19517K08307k81043k14053L63923
36127B71879L59464j96700k08915K82954J99843l51419k49812L36589J94312m88691
36117A49504l79912L81596L72064l70452m10022K94824L58278k51818j70249N57762
36107E31575M66230m05496m76227L09734L45393m79660n29973L56784N11949l03734
36097C26575m28995M30001O30518j67486l79052L14835L74781m05822m03079N20656
36087H12932N66060m75157o92418K41955M08605n53002o68936M57149P51796k98828
$$ plain form
36077 550156 -46005 419435 1199045 868397 124665 435465 1189968 968391 364003 706593
36067 706593 1276071 715496 -84996 456586 1479706 1218312 360424 650971 1464179
36058 1464179 1124259 326121 754441 1608803 1121701 208750 827017 2028588 1605156
36049 1605156 345032 525784 1492597 1071302 65135 771151 2283575 2049169 859846
36040 859846 1315140 2582198 1966370 443286 1012804 2743027 2394948 821974 1438363
36031 1438363 3420162 3172117 1547482 2412480 4938493 5000460 3404646 4475280 7254545
36022 7254545 7124442 5512701 8018715 13218170 14266900 11710451 12734652 17308994
36014 17308994 18534834 17734685 23917244 36364058 45170807 51948029 69231414 95003273
$$ packed form
36077E50156n96161M65440P79610l30648p43732L10800P54503k21577o04388L42590
36067G06593N69478n60575q00492N41582J023120k61394q57888K90547Q13208
36058A464179l39920p98138M28320Q54362m87102r12951O18267J201571m23432
36049A605156j260124J80752R66813m21295j006167P06016J512424k34406j189323
36040H59846M55294J267058o15828j523084N69518J730223l48079j572974O16389
36031A438363J981799k48045j624635Q64998K526013O1967j595814J070634K779265
36022G254545j30103j611741K506014N199455J048730k556449J024201M574342
36014A7308994J225840q00149O182559J2446814Q806749O777222J7283385K5771859
$$ plain form
36006 95003273 115247917 142952835 219726801 349138088 455558850 452589382 344348646
35999 344348646 219898643 149011921 122614421 100614526 74263247 57950895 51295072
35992 51295072 41390042 28327646 22422696 23223965 21391706 16318495 14868981 16440072
35984 16440072 14303805 9075169 7451180 9464697 8989682 5504257 4336830 6116020
35976 6116020 6122575 3716498 3109290 4816319 4858451 2656266 1902532 3250524 3364634
35967 3364634 1665657 1266393 2679554 2914540 1420908 997523 2163169 2243332 744396
35958 744396 304736 1539059 1970713 890098 506928 1449979 1652799 558984 141099
35949 141099 913765 1037749 173317 234775 1510900 1905784 875916 389199 1126433
$$ packed form
36006I5003273K0244644K7704918P6773966J29411287J06420762k969468j08240736
35999C44348646j24450003p0886722k6397500k1999895k6351279j6312352o655823
35992E1295072r905030j3062396n904950Q01269j832259n073211j449514J571091
35984A6440072k136267n228636j623989K013517m75015l485425j167427J779190
35976F116020O555k406077o07208J707029M2132k202185p53734J347992J14110
35967C364634j698977l99264J413161K34986j493632m23385J165646Q0163j498936
35958G44396m39660J234323M31654j080615l83170R43051K02820j093815m17885
35949A41099P72666J23984q64432O1458J276125L94884j029868m86717P37234
$$ plain form
35940 1126433 1371167 551210 313930 1122702 1243156 154894 -343979 479825 985695
35931 985695 343597 -28946 627286 992872 362817 2092 592734 929291 362224 69291
35921 69291 709777 1163776 757128 495098 971689 1210557 659393 263468 537357 587697
35911 587697 21398 -165525 455343 852764 503228 317913 728273 791115 112052 -256225
35901 -256225 225822 588042 239865 17408 406495 544537 -14829 -302706 279950 844853
35891 844853 675414 395136 525312 470578 -89927 -342670 167036 643478 522442 391142
35881 391142 625323 627942 230503 272816 932342 1084525 250011 -426376 -126941 297708
35871 297708 -5477 -431999 -257828 23484 -132044 -185779 286169 568017 130475 -268625
$$ packed form
35940A126433K44734q19957k37280Q08772J20454j088262m98873Q23804N05870
35931I85695o42098l72543O56232L65586o30055l60725N90642L36557n67067k92933
35921F9291O40486M53999m06648k62030M76591K38868n51164l95925K73889N0340
35911E87697n66299j86923O20868L97421l49536j85315M10360O2842o79063l68277
35901b56225M82047L62220l48177k22457L89087J38042n59366k87877N82656N64903
35891H44853j69439k80278J30176n4734n60505k52743N09706M76442j21036j31300
35881C91142K34181K619l97439M2313O59526J52183q34514o76387K99435M24649
35871B97708l03185m26522J74171K81312j55528n3735M71948K81848m37542l99100
$$ plain form
35861 -268625 56161 472982 263220 -102231 -32082 29201 -349639 -544701 -46696 440646
35851 440646 233858 -82033 195468 556958 310897 -71893 118743 492216 357633 4066
35841 4066 10038 109018 -114444 -224014 233732 696172 512326 124529 222082 503569 397251
35830 397251 227481 510829 838170 625017 270248 405937 680362 467069 125911 344317
35820 344317 818633 813350 504855 554138 805431 614964 100581 -83750 90049 142706
35810 142706 64091 179650 344543 211454 3324 149160 483458 623454 738623 1133425
35800 1133425 1532345 1616954 1750216 2266433 2591094 2064290 1139489 720265 754412 559547
35790 559547 138022 40188 219928 139712 -182566 -261861 -105692 -117711 -221551 -22478
$$ packed form
35861b68625L24786M16821k09762l65451P0149O1283l78840j95062M98005M87342
35851D40646k06788l15891K77501L61490k46061l82790J90636L73473j34583l53567
35841D066N972R8980k23462j09570M57746M62440j83846l87797R7553K81487j06318
35830C97251j69770K83348L27341k13153l54769J35689K74425k13293l41158K18406
35820C44317M74316n283l08495M9283K51293j90467n14383j84331J73799N2657
35810A42706p8615J15559J64893j33089k08130J45836L34298J39996J15169L94802
35800A133425L98920Q4609J33262N16217L24661n26804r24801m19224L4147j94865
35790E59547m21525r7834J79740q0216l22278p9295J56169j2019j03840J99073
$$ plain form
35780 -22478 328186 348265 139244 194883 464741 487892 294385 299632 457818 389300 207517
35769 207517 353833 724532 804907 578603 495840 627032 631388 486091 493601 630939 582634
35758 582634 328756 74168 -227238 -643042 -810168 -407001 173064 326841 154468 155222
35748 155222 324009 325025 253625 400634 550596 363132 153434 392953 727724 473552
35738 473552 -149883 -314901 44401 214338 -26172 -177907 -76287 -133713 -422836 -485660
35728 -485660 -211532 -19527 -14933 185827 625413 816763 576095 304029 258963 232277
35718 232277 86353 -32941 -119935 -321690 -484634 -315281 14689 75613 -60299 32174
35708 32174 295713 275262 -7860 -81347 87840 69357 -137018 -48917 375902 626597
$$ packed form
35780b2478L50664K0079k09021N5639K69858K3151j93507N247J58186o8518j81783
35769B07517J46316L70699Q0375k26304q2763J31192M356j45297P510J37338m8305
35758E82634k53878k54588l01406m15804j67126M03167N80065J53777j72373P54
35748A55222J68787J016p1400J47009J49962j87464k09698K39519L34771k54172
35738D73552o23435j65018L59302J69937k40510j51735J01620n7426k89123o2824
35728d85660K74128J92005M594K00760M39586J91350k40668k72066m5066k6686
35718B32277j45924j19294q6994k01755j62944J69353L29970O0924j35912R2473
35708C2174K63539k0451k83122p3487J69187j8483k06375Q8101M24819K50695
$$ plain form
35698 626597 572703 655923 987276 1100504 821151 571811 570237 498053 221894 92810
35688 92810 248146 319287 113194 -72988 -65315 -96712 -251974 -267337 -93840 -29929 -114083
35677 -114083 -38615 172413 103280 -252423 -365602 -76404 109143 -102949 -340217 -288386
35667 -288386 -171068 -178472 -90508 179721 299168 121463 -15526 76357 95427 -140429
35657 -140429 -337184 -297797 -267266 -385750 -379687 -125221 54607 -13088 -20940 218419 393673
35646 393673 250649 -2393 -153347 -312239 -484981 -386212 4218 251929 150060 37800
35636 37800 137456 163459 -69836 -240740 -96083 118151 169107 241055 472957 633439
35626 633439 607492 665840 912938 1027220 882120 840141 1107541 1437365 1802738 2609280
$$ packed form
35698F26597n3894Q3220L31353J13228k79353k49340j574p2184k76159j29084
35688I2810J55336P1141k06093j86182P673l1397j55262j5363J73497O3911q4154
35677a14083P5468K11028o9133l55703j13179K89198J85547k12092k37268N1831
35667b88386J17318p404Q7964K70229J19447j77705j36989R1883J9070k35856
35657a40429j96755L9387L0531j18484O063K54466J79828o7695p852K39359J75254
35646C93673j43024k53042j50954j58892j72742R8769L90430K47711j01869j12260
35636C7800R9656K6003k33295j70904J44657K14234N0956P1948K31902J60482
35626F33439k5947N8348K47098J14282j45100m1979K67400L29824L65373Q06542
$$ plain form
35616 2609280 3772444 4355191 3751537 2578987 1748088 1266394 677576 107113 25430
35607 25430 342425 536781 464967 375887 320470 149348 -61914 -101997 6384 124836
35597 124836 274904 449122 438050 194904 36565 130262 164375 -96634 -351793 -269816
35587 -269816 -29217 72361 106066 173520 61014 -288422 -453568 -209796 -19485 -278124
35577 -278124 -593319 -463666 -166546 -231762 -484666 -420263 -158996 -186678 -423664 -398984
35567 -398984 -148133 -108459 -266622 -222984 -8470 -37687 -291618 -326339 -105587 -72565
35557 -72565 -329102 -458244 -283593 -148091 -271097 -403785 -310847 -117853 -19451 -35563
35547 -35563 -149596 -331718 -400985 -216964 23277 38675 -78953 -61408 17120 -108993
$$ packed form
35616B609280J163164N82747o03654j172550q30899m81694n88818n70463q1683
35607B5430L16995J94356p1814q9080n5417j71122k11262m0083J08381J18452
35597A24836J50068J74218j1072k43146j58339R3697L4113k61009k55159Q1977
35587b69816K40599J01578L3705O7454j12506l49436j65146K43772J90311k58639
35577b78124l15195J29653K97120o5216k52904O4403K61267k7682k36986K4680
35567c98984K50851L9674j58163M3638K14514k9217k53931l4721K20752L3022
35557g2565k56537j29142J74651J35502j23006j32688R2938J92994R8402j6112
35547c5563j14033j82122o9267J84021K40241J5398j17628J7545P8528j26113
$$ plain form
35537 -108993 -344715 -353225 -147048 -29187 -8085 172415 455363 504166 324724 271477
35527 271477 379803 279147 -114819 -387353 -281902 -69045 -54566 -156929 -186669 -168821
35517 -168821 -178527 -163757 -104656 -97001 -167056 -233215 -293544 -407752 -497495 -433439 -289463
35506 -289463 -226108 -190070 -50126 64831 -55437 -268357 -241215 7865 159624 132957
35496 132957 124386 155236 69670 -30235 133186 463845 548349 331358 209063 340614 397444
35485 397444 168650 -87282 -117566 -56663 -94416 -152727 -127167 -108296 -153846 -158694 -125664
35474 -125664 -235258 -474684 -540717 -309486 -79395 -131284 -332911 -390704 -241640 -5609
35464 -5609 214037 305331 144600 -209621 -494429 -534944 -403780 -242980 -120788 -78906
$$ packed form
35537a08993k35722q510K06177J17861K1102J80500K82948M8803j79442n3247
35527B71477J08326j00656l93966k72534J05451K12857J4479j02363k9740J7848
35517a68821r706J4770N9101P655p0055o6159o0329j14208q9743O4056J43976
35506b89463O3355L6038J39944J14957j20268k12920K7142K49080J51759k6667
35496A32957q571L0850q5566r9905J63421L30659Q4504k16991j22295J31551N6830
35485C97444k28794k55932l0284O0903l7753n8311K5560J8871m5550m848L3030
35474a25664j09594k39426o6033K31231K30091n1889k01627n7793J49064K36031
35464e609K19646R1294j60731l54221k84808m0515J31164J60800J22192M1882
$$ plain form
35454 -78906 -94714 -8909 245761 389886 111680 -393694 -602801 -398754 -187606 -217066
35444 -217066 -258826 -121170 -5425 -103171 -227611 -119860 178356 481495 702834 750985
35434 750985 493138 30766 -277327 -268985 -178107 -209418 -236615 -130421 -48241 -126820 -182795
35423 -182795 -18134 216536 255665 118063 5299 -23505 -30586 -15368 25473 6790 -83433
35412 -83433 -99258 7913 45549 -112186 -278971 -243567 -105938 -73862 -97570 8623 201195
35401 201195 256301 134911 47340 156570 407737 652206 783655 745846 542098 275460
35391 275460 104946 120393 261775 360621 291927 119532 39004 122671 211681 156215 44588
35380 44588 40586 109867 108299 43720 25656 42654 28333 57583 218230 388933 431895 483539
$$ packed form
35454g8906j5808Q5805K54670J44125k78206n05374k09107K04047K11148k9460
35444b17066m1760J37656J15745r7746j24440J07751K98216L03139K21339M8151
35434G50985k57847m62372l08093Q342R0878l1311k7197J06194Q2180p8579n5975
35423a82795J64661K34670L9129j37602j12764k8804p081J5218M0841j8683r0223
35412h3433j5825J07171L7636j57735j66785L5404J37629L2076k3708J06193J92572
35401B01195N5106j21390q7571J09230K51167K44469J31449l7809k03748k66638
35391B75460j70514J5447J41382R8846o8694j72395q0528Q3667Q9010n5466j11627
35380D4588m002O9281j568o4579j8064J6998j4321K9250J60647J70703M2962N1644
$$ plain form
35368 483539 703435 854534 571617 -4974 -339695 -261034 -127001 -167587 -168843 32706
35358 32706 217315 175749 49384 49111 160466 313298 520951 684358 591459 278209 58761
35347 58761 44521 -15576 -265278 -493806 -533275 -510779 -506748 -366365 -82986 34541 -150368
35336 -150368 -320805 -193119 68936 201792 245724 314282 318304 225253 248095 466914 607908
35325 607908 508840 434266 584081 673163 407618 30079 -52625 116278 244196 318033
35315 318033 468326 559381 401542 177975 198372 395170 492281 487297 523909 480201 173806
35304 173806 -175395 -199226 -3371 -31819 -351593 -556680 -396253 -60527 196033 319558
35294 319558 292671 67241 -252608 -437384 -405860 -272729 -143682 -62855 -89796 -202763
$$ packed form
35368D83539K19896J51099k82917n76591l34721P8661J34033m0586j256K01549
35358C2706J84609m1566j26365k73J11355J52832K07653J63407r2899l13250k19448
35347E8761j4240o0097k49702k28528l9469K2496M031J40383K83379J17527j84909
35336a50368j70437J27686K62055J32856M3932O8558M022r3051K2842K18819J40994
35325F07908r9068p4574J49815Q9082k65545l77539q2704J68903J27918P3837
35315C18033J50293R1055j57839k23567K0397J96798R7111m984L6612m3708l06395
35304A73806l49201k3831J95855k8448l19774k05087J60427L35726K56560J23525
35294C19558k6887k25430l19849j84776L1524J33131J29047Q0827k6941j12967
$$ plain form
35284 -202763 -215963 -25065 178580 179304 78381 94669 183638 164068 77874 92848 172912
35273 172912 173231 137197 170035 159225 -26008 -199511 -100876 157653 275652 260894 321881
35262 321881 389563 207978 -174047 -455923 -563199 -614897 -499226 -16308 574864 721238
35252 721238 363684 27486 14221 39445 -144514 -294141 -138617 123730 133287 -118075
35242 -118075 -381288 -530580 -582079 -506107 -267719 35823 242669 279916 190387 86575
35232 86575 77894 134200 71734 -176900 -374721 -275824 -7542 105784 5346 -113893 -176398
35221 -176398 -235790 -198193 55354 314001 247613 -28866 -70531 178434 287342 71222
35211 71222 -107169 20863 186448 89111 -81367 -4868 208647 211164 -42632 -299956
$$ packed form
35284b02763j3200J90898K03645P24j00923J6288Q8969j9570q6194J4974Q0064
35273A72912L19l6034L2838j0810j85233j73503R8635K58529J17999j4758O0987
35262C21881O7682j81585l82025k81876j07276n1698J15671M82918N91172J46374
35252G21238l57554l36198j3265K5224j83959j49627J55524K62347R557k51362
35242a18075k63213j49292n1499P5972K38388L03542K06846L7247q9529j03812
35232H6575q681N6306o2466k48634j97821R8897K68282J13326j00438j19239o2505
35221a76398n9392L7597K53547K58647o6388k76479m1665K48965J08908k16120
35211G1222j78391J28032J65585r7337j70478P6499K13515K517k53796k57324
$$ plain form
35201 -299956 -411183 -420249 -356341 -205634 -41576 18001 -42892 -152937 -256391 -323722 -341670
35190 -341670 -342736 -348179 -275327 -43810 234422 354360 298871 214512 136940 4120 -81249
35179 -81249 61984 312465 315892 26125 -191291 -130132 -39442 -151634 -281584 -173727
35169 -173727 47263 84412 -80502 -227829 -237160 -145948 -12643 73946 -10087 -238577 -393703
35158 -393703 -366048 -316544 -376414 -399790 -230201 -17027 -10482 -182380 -300975 -282738 -240768
35147 -240768 -255561 -296236 -313671 -254589 -53812 246634 453774 435370 293624 208672 207823
35136 207823 214115 219383 266769 333932 353200 292792 145249 -83318 -313110 -419026 -374117
35125 -374117 -269157 -173087 -104790 -135789 -326790 -541904 -547007 -339771 -157663 -116925 -103767
$$ packed form
35201b99956j11227r066O3908J50707J64058N9577o0893j10045j03454o7331j7948
35190c41670j066n443P2852K31517K78232J19938n5489q4359p7572j32820q5369
35179h1249J43233K50481L427k89767k17416O1159R0690j12192j29950J07857
35169a73727K20990L7149j64914j47327r331R1212J33305Q6589q4033k28490j55126
35158c93703K7655M9504n9870k3376J69589K13174O545j71898j18595J8237M1970
35147b40768j4793m0675j7435N9082K00777L00446K07140j8404j41746q4952q49
35136B07823O292N268M7386O7163J9268o0408j47543k28567k29792j05916M4909
35125c74117J04960R6070O8297l0999j91001k15114n103K07236J82108M0738J3158
$$ plain form
35114 -103767 -75912 -155309 -307002 -261362 53169 302393 200573 -93075 -275244 -344929
35104 -344929 -469812 -615123 -609874 -451170 -282006 -172666 -135424 -225725 -417097 -507589
35094 -507589 -362091 -125462 -4804 17301 59266 93596 43586 -25628 -42708 -111013 -312839
35083 -312839 -470634 -362913 -67940 161494 263044 342389 377276 235638 -33826 -188489
35073 -188489 -96872 120579 259489 205905 -19237 -256132 -295862 -96021 153457 273727
35063 273727 297823 322346 306733 177150 2833 -98805 -129945 -144966 -134238 -103960 -127185
35052 -127185 -182362 -112485 104521 236770 127131 -55392 -88713 -18112 11571 27052 79669
35041 79669 45542 -135261 -220162 9021 350980 459583 362071 333903 381579 260702 -41938
$$ packed form
35114a03767K7855p9397j51693M5640L14531K49224j01820k93648j82169o9685
35104c44929j24883j45311N249J58704J69164J09340L7242r0301j91372r0492
35094e07589J45498K36629J20658K2105M1965L4330n0010o9214j7080o8305k01826
35083c12839j57795J07721K94973K29434J01550P9345L4887j41638k69464j54663
35073a88489R1617K17451J38910n3584k25142k36895l9730J99841K49478J20270
35063B73727K4096K4523j5613j29583j74317j01638l1140j5021J0728L0278k3225
35052a27185n5177O9877K17006J32249j09639j82523l3321P0601K9683J5481N2617
35041G9669l4127j80803q4901K29183L41959J08603r7512k8168M7676j20877l02640
$$ plain form
35030 -41938 -247263 -221427 -125361 -91843 -64444 -2509 30502 25707 31910 -18510 -246270 -574226
35018 -574226 -771590 -757979 -649128 -522434 -375589 -293953 -388035 -544249 -488918 -149005
35008 -149005 247393 450651 396422 156137 -126229 -272971 -234491 -174111 -224877 -260667
34998 -260667 -118423 79408 97899 -22242 -55307 18040 41435 38236 175997 399747 462788
34987 462788 335438 241202 269632 293043 282718 347544 423832 300971 19511 -129864 -86002
34976 -86002 -111903 -299023 -374385 -175252 52121 45229 -100999 -181314 -220477 -328777 -452742
34965 -452742 -498658 -509897 -527161 -464125 -300177 -198014 -245563 -271359 -105014 151500 291119
34954 291119 274527 170228 629 -165859 -136989 173861 552821 710678 621248 484225
$$ packed form
35030d1938k05325K5836R6066L3518K7399O1935L3011m795O203n0420k27760l27956
35018e74226j97364J3611J08851J26694J46845Q1636r4082j56214N5331L39913
35008a49005L96398K03258n4229k40285k82366j46742L8480O0380n0766l5790
34998b60667J42244J97831J8491j20141l3065P3347K3395l199J37761K23750O3041
34987D62788j27350r4236K8430K3411j0325O4826P6288j22861k81460j49375M3862
34976h6002k5901j87120p5362J99133K27373o892j46228q0315l9163j08300j23965
34965d52742m5916j1239j7264O3036J63948J02163m7549k5796J66345K56514J39619
34954B91119j6592j04299j69599j66488K8870L10850L78960J57857q9430j37023
$$ plain form
34944 484225 435143 432089 366009 177635 -79048 -239425 -188668 -47958 -62104 -264968 -420091
34933 -420091 -343631 -112147 104222 226892 229260 118063 26025 111982 295506 319647 152915
34922 152915 61176 171762 266913 182837 112346 262089 463564 423468 180973 15379
34912 15379 20209 54211 40188 50547 126438 222372 309749 372234 339806 177024 -12091
34901 -12091 -104145 -125591 -177473 -258673 -288493 -239176 -132861 19379 170970 221547 154639
34890 154639 100639 153402 224517 193673 96129 32351 -8048 -92573 -193144 -214126 -116226
34879 -116226 73766 297563 439698 379902 159067 -15499 -8855 111562 235089 332943
34869 332943 358181 228268 24807 2310 242242 487518 487287 320821 204088 172067 158510
$$ packed form
34944D84225m9082l054o6080j88374k56683j60377N0757J40710j4146k02864j55123
34933d20091P6460K31484K16369J22670K368j11197r2038Q5957J83524K4141j66732
34922A52915r1739J10586R5151q4076p0491J49743K01475m0096k42495j65594
34912A5379M830L4002j4023J0359P5891R5934Q7377O2485l2428j62782j89115
34901a2091r2054k1446n1882q1200k9820M9317J06315J52240J51591N0577o6908
34890A54639n4000N2763P1115l0844r7544o3778m0399q4525j00571k0982R7900
34879a16226J89992K23797J42135n9796k20835j74566O644J20417J23527R7854
34869C32943K5238j29913k03461k2497K39932K45276k31j66466j16733l2021j3557
$$ plain form
34858 158510 194602 283131 247679 -20099 -299750 -307159 -110637 -5444 -71550 -149760 -184627
34847 -184627 -276596 -410604 -428490 -294594 -136769 -2046 189531 419618 528660 441937
34837 441937 244412 9194 -248588 -432959 -407516 -224986 -110131 -152324 -205903 -153958
34827 -153958 -67835 -20128 58507 208905 298376 200014 1928 -108575 -87479 -25875 35221
34816 35221 138812 287172 417484 512870 622176 728615 702167 474660 206794 154683
34806 154683 351344 532041 441253 126210 -161447 -271989 -242413 -146245 -29177 24757
34796 24757 -59626 -210361 -266431 -194259 -100032 -27485 68406 130721 13573 -244012 -381754
34785 -381754 -258784 -22356 167440 345650 529612 545705 288967 -34946 -163420 -124564
$$ packed form
34858A58510L6092Q8529l5452k67778k79651p409J96522J05193o6106p8210l4867
34847a84627r1969j34008j7886J33896J57825J34723J91577K30087J09042q6723
34837D41937j97525k35218k57782j84371K5443J82530J14855m2193n3579N1945
34827a53958Q6123M7707P8635J50398Q9471r8362j98086j10503K1096O1604O1096
34816C5221J03591J48360J30312R5386J09306J06439k6448k27507k67866n2111
34806A54683J96661J80697r0788l15043k87657j10542K9576R6168J17068N3934
34796B4757q4383j50735n6070P2172R4227P2547R5891O2315j17148k57585j37742
34785c81754J22970K36428J89796J78210J83962J6093k56738l23913j28474L8856
$$ plain form
34775 -124564 -104712 -112007 -29668 94597 79702 -102892 -293278 -372882 -351249 -255787 -104829
34764 -104829 33148 96434 116758 139024 119786 17173 -104356 -175112 -224528 -269439 -227331
34753 -227331 -74456 54945 79704 120927 263939 349734 227970 50775 49182 152405
34743 152405 116497 -70093 -205259 -225807 -243185 -263079 -157714 77820 285716 368129
34733 368129 348172 238880 58332 -65634 -16440 127076 218847 279683 396788 499786
34723 499786 487660 470748 601669 760730 716950 516484 381691 306582 124039 -81868
34713 -81868 -46464 192643 307279 222326 222117 416488 528467 384325 224720 298876 472320
34702 472320 490995 379912 324644 343267 305944 155558 -61190 -277820 -410559 -390361
$$ packed form
34775a24564J9852p295Q2339J24265j4895j82594j90386p9604K1633R5462J50958
34764a04829J37977O3286K0324K2266j9238j02613j21529p0756m9416m4911M2108
34753b27331J52875J29401K4759M1223J43012Q5795j21764j77195j593J03223
34743A52405l5908j86590j35166k0548j7378j9894J05365K35534K07896Q2413
34733C68129j9957j09292j80548j23966M9194J43516R1771O0836J17105J02998
34723D99786j2126j6912J30921J59061m3780k00466j34793p5109j82543k05907
34713h1868L5404K39107J14636q4953k09J94371J11979j44142j59605P4156J73444
34702D72320J8675j11083n5268J8623l7323j50386k16748k16630j32739K0198
$$ plain form
34692 -390361 -271194 -191553 -193465 -214248 -249212 -339213 -415696 -379558 -310051 -339418 -357101
34681 -357101 -157163 139886 195889 17119 -15963 222937 391529 258413 51079 -12224
34671 -12224 -102605 -370366 -543124 -334880 32426 132311 -44290 -164005 -94342 10142
34661 10142 65619 142968 233785 233830 144991 58985 -22313 -142036 -226216 -178985 -83559 -101984
34649 -101984 -215260 -247494 -117427 82598 217531 208587 77366 -16794 94990 327538
34639 327538 371865 121328 -117826 -17539 341626 620129 632698 414673 56511 -286871
34629 -286871 -372719 -114858 251955 464193 549798 638149 630877 364723 -22851 -216757
34619 -216757 -150472 -14981 101576 279440 493359 567874 435843 213485 8834 -146310
$$ packed form
34692c90361J19167P9641j912k0783l4964r0001p6483L6138O9507k9367j7683
34681c57101J99938K97049N6003j78770l3082K38900J68592j33116k07334o3303
34671a2224r0381k67761j72758K08244L67306R9885j76601j19715O9663J04484
34661A0142N5477P7349R0817M5q8839q6006q1298j19723q4180M7231R5426j8425
34649a01984j13276l2234J30067K00025J34933q944j31221r4160J11784K32548
34639C27538M4327k50537k39154J00287L59165K78503J2569k18025l58162l43382
34629b86871q5848K57861L66813K12238Q5605Q8351p272k66154l87574j93906
34619b16757O6285J35491J16557J77864K13919P4515j32031k22358k04651j55144
$$ plain form
34609 -146310 -203235 -147311 -104740 -184072 -266661 -189013 -62362 -125868 -325613 -361403 -163387
34598 -163387 3205 -30762 -115188 -94893 -58892 -120472 -184186 -115809 21434 73320 24304
34587 24304 -23758 -22167 -5394 -966 4498 33772 88921 127747 83949 -37420 -124620 -103697
34575 -103697 -71955 -175152 -388661 -544072 -543668 -425035 -251074 -77585 349 -76787 -220175
34564 -220175 -284296 -246167 -172205 -77178 12758 -67189 -442190 -900526 -1023012 -668343 -138056
34553 -138056 188258 196264 -19425 -329142 -580798 -622655 -458060 -281939 -271820 -418761
34543 -418761 -602158 -715941 -678070 -454629 -154680 13734 -28114 -129344 -110738 12022
34533 12022 80783 7729 -140706 -242471 -245783 -198976 -175270 -182496 -181246 -191160 -293201 -474436
$$ packed form
34609a46310n6925N5924M2571p9332q2589P7648J26651o3506j99745l5790J98016
34598a63387J66592l3967q4426K0295L6001o1580o3714O8377J37243N1886m9016
34587B4304m8062J591J6773M428N464K9274N5149L8826m3798j21369q7200K0923
34575a03697L1742j03197k13509j55411M04J18633J73961J73489P7934p7136j43388
34564b20175o4121L8129P3962R5027Q9936p9947l75001m58336j22486L54669N30287
34553a38056L26314Q006k15689l09717k51656m1857J64595J76121J0119j46941
34543d18761j83397j13783L7871K23441K99949J68414m1848j01230J8606J22760
34533A2022O8761p3054j48435j01765l312M6807K3706p226J250r914j02041j81235
$$ plain form
34521 -474436 -560890 -400014 -54709 263139 393721 308674 97199 -45179 51710 293205
34511 293205 353224 93523 -204225 -209329 14777 168439 163642 129116 87193 -47759 -210005
34500 -210005 -246217 -206185 -254286 -327295 -226596 -31786 -35029 -237503 -321371 -195732 -135115
34489 -135115 -236777 -194091 150062 441695 334836 36458 -35938 113535 154252 -17825
34479 -17825 -195942 -229699 -143884 43171 318858 532553 519417 347475 221117 183017
34469 183017 128844 55472 44857 35792 -124779 -389107 -508158 -369331 -131520 25140
34459 25140 94591 126223 85033 -70929 -283643 -445300 -489091 -401516 -223649 -59745 -5046
34448 -5046 -48774 -111339 -159082 -200262 -206320 -157702 -135594 -210206 -245269 -12808 438469 731453
$$ packed form
34521d74436q6454J60876L45305L17848J30582q5047k11475j42378R6889K41495
34511B93205O0019k59701k97748n104K24106J53662m797l4526m1923j34952j62246
34500b10005l6212M0032m8101p3009J00699J94810l243k02474q3868J25639O0617
34489a35115j01662M2686L44153K91633j06859k98378p2396J49473M0717j72077
34479a7825j78117l3757Q5815J87055K75687K13695j3136j71942j26358l8100
34469A83017n4173p3372j0615r065j60571k64328j19051J38827K37811J56660
34459B5140O9451L1632m1190j55962k12714j61657m3791Q7575J77867J63904N4699
34448e046m3728o2565m7743m1180o058M8618K2108p4612l5063K32461M51277K92984
$$ plain form
34436 731453 612271 293934 165796 276805 348497 262247 244174 466903 717933 680662
34426 680662 401305 217206 268501 349520 282117 175342 190840 266536 253601 171748 127822
34415 127822 91588 -36749 -205720 -265901 -204421 -137073 -104186 -67670 -73433 -194878 -321205
34404 -321205 -235134 62197 316227 358811 283638 226656 176144 87102 1311 -48394 -103000
34393 -103000 -157609 -117303 43521 204010 249633 189361 83188 -17648 -40797 41039 105574
34382 105574 25393 -85421 -1740 224028 293657 145919 79727 256046 409720 286109
34372 286109 76645 124779 404259 597490 560555 424395 316081 232690 149403 59361
34362 59361 -50012 -126529 -56855 131219 215220 83672 -68991 -40889 58567 18897 -101890
$$ packed form
34436G31453j19182l18337j28138J11009P1692q6250j8073K22729K51030l7271
34426F80662k79357j84099N1295Q1019o7403j06775J5498P5696j2935q1853m3926
34415A27822l6234j28337j68971o0181O1480O7348L2887L6516n763j21445j26327
34404c21205Q6071K97331K54030M2584p5173n6982n0512q9042q5791m9705n4606
34393a03000n4609M0306J60824J60489M5623o0272j06173j00836k3149Q1836O4535
34382A05574q0181j10814Q3681K25768O9629j47738o6192J76319J53674j23611
34372B86109k09464M8134K79480J93231l6935j36160j08314q3391q3287r0042
34362E9361j09373p6517O9674J88074Q4001j31548j52663K8102R9456l9670j20787
$$ plain form
34351 -101890 -86246 79497 216683 242271 198442 84510 -91656 -181950 -69125 116482
34341 116482 195293 235112 368855 454438 278155 3516 -2242 227982 272032 -4750 -228286
34330 -228286 -128529 37891 -68337 -328320 -380148 -164894 51752 92272 31353 -12773
34320 -12773 -35182 -79126 -151939 -229499 -276261 -260455 -180118 -55742 97895 239505 263883
34309 263883 96863 -169050 -337526 -322440 -209895 -112828 -74848 -115680 -241828 -388367
34299 -388367 -461359 -455589 -427787 -357732 -164292 128058 364752 429179 339286 180449 44230
34288 44230 8974 60791 63861 -66415 -218214 -263320 -297328 -479920 -698867 -674697 -403187
34277 -403187 -201125 -250051 -366975 -318896 -108414 156708 416553 548015 362913 -94612
$$ packed form
34351a01890J5644J65743J37186K5588m3829j13932j76166r0294J12825J85607
34341A16482P8811L9819J33743Q5583j76283k74639n758K30224M4050k76782k23536
34330b28286R9757J66420j06228k59983n1828K15254K16646M0520o0919m4126
34320a2773k2409m3944p2813p7560m6762J5806Q0337J24376J53637J41610K4378
34309B63883j67020k65913j68476J5086J12545R7067L7980m0832j26148j46539
34299c88367p2992N770K7802P0055J93440K92350K36694O4427q9893j58837j36219
34288D4230l5256N1817L070j30276j51799m5106l4008j82592k18947K4170K71510
34277d03187K02062m8926j16924M8079K10482K65122K59845J31462j85102m57525
$$ plain form
34267 -94612 -459953 -451579 -189902 52028 212299 347761 379854 213838 -4145 -28180
34257 -28180 137806 271975 288584 327575 472489 582273 475693 165182 -145598 -235247
34247 -235247 -37597 286582 455936 308820 -60304 -417369 -592095 -555707 -395751 -263377
34237 -263377 -252769 -288005 -237629 -168909 -308694 -664564 -894707 -730467 -356836 -153050
34227 -153050 -190280 -241876 -195560 -156164 -157801 -76929 102532 193892 87274 -76189 -125032
34216 -125032 -77150 -14541 94041 280471 416731 364516 217768 196263 312313 337976
34206 337976 141067 -126358 -262360 -280974 -303770 -305404 -167558 52043 120726 -55074
34196 -55074 -301924 -444532 -520846 -611411 -630258 -477644 -273510 -207618 -230788 -142555 45998
$$ packed form
34267i4612l65341Q374K61677K41930J60271J35462L2093j66016k17983k4035
34257b8180J65986J34169J6609L8991J44914J09784j06580l10511l10780q9649
34247b35247J97650L24179J69354j47116l69124l57065j74726L6388J59956J32374
34237b63377J0608l5236N0376O8720j39785l55870k30143J64240L73631K03786
34227a53050l7230n1596M6316L9396j637Q0872J79461R1360j06618j63463m8843
34216a25032M7882O2609J08582J86430J36260n2215j46748k1505J16050K5663
34206C37976j96909k67425j36002j8614k2796j634J37846K19601O8683j75800
34196e5074k46850j42608p6314r0565j8847J52614K04134O5892k3170Q8233J88553
$$ plain form
34185 45998 105497 -29948 -140325 -61512 88923 140542 108542 70009 4911 -77168 -34258
34174 -34258 190888 392253 338774 88968 -111348 -145784 -64190 89973 279746 378089
34164 378089 288864 124603 67984 100237 72475 2416 55168 227907 312711 235272 191919
34153 191919 339310 550557 625308 584998 590841 668469 682345 542446 301164 59116 -119725
34142 -119725 -200700 -172597 -68389 49476 125770 117637 3962 -163389 -257674 -201400 -81518
34131 -81518 -64601 -185707 -296706 -264389 -156504 -158301 -330396 -529967 -583523 -472687 -321153
34120 -321153 -249335 -276290 -325107 -294598 -162287 -31480 -17277 -74420 -40718 104908 164435
34109 164435 7348 -196609 -195414 -2594 170877 247827 302039 293593 91144 -205826 -280981
$$ packed form
34185D5998N9499j35445j10377P8813J50435N1619l2000l8533o5098q2079M2910
34174c4258K25146K01365n3479k49806k00316l4436Q1594J54163J89773R8343
34164C78089q9225j64261n6619L2253k7762p0059N2752J72739Q4804p7439m3353
34153A91919J47391K11247P4751m0310N843P7628J3876j39899k41282k42048j78841
34142a19725q0975K8103J04208J17865P6294q133j13675j67351r4285N6274J19882
34131h1518J6917j21106j10999L2317J07885j797j72095j99571n3556J10836J51534
34120c21153P1818k6955m8817L0509J32311J30807J4203n7143L3702J45626N9527
34109A64435j57087k03957J195J92820J73471P6950N4212q446k02449k96970p5155
$$ plain form
34098 -280981 -58036 139174 60228 -89494 25930 357625 551109 429351 143552 -99031
34088 -99031 -231865 -276871 -281614 -302783 -323343 -231897 -7189 161915 100505 -85340 -142032
34077 -142032 -5198 175488 280939 294435 190054 -24439 -184832 -127555 31601 12675
34067 12675 -212270 -359415 -247568 -40952 16748 -90162 -217559 -262614 -183782 20552
34057 20552 231725 253282 65715 -84124 19490 285706 476276 531067 564126 608373
34047 608373 562556 394367 225640 159036 135048 35216 -137891 -257900 -233002 -114495
34037 -114495 -37246 -75417 -174935 -227757 -197314 -153236 -178586 -255314 -261806 -101902 167584
34026 167584 370806 391653 282852 169234 99944 57987 45383 43621 -52055 -290421 -481864
$$ packed form
34098b80981K22945J97210p8946j49722J15424L31695J93484j21758k85799k42583
34088i9031j32834m5006m743k1169k0560R1446K24708J69104o1410j85845n6692
34077a42032J36834J80686J05451J3496j04381k14493j60393N7277J59156j8926
34067A2675k24945j47145J11847K06616N7700j06910j27397m5055P8832K04334
34057B0552K11173K1557j87567j49839J03614K66216J90570N4791L3059M4247
34047F08373m5817j68189j68727o6604k3988r9832j73107j20009K4898J18507
34037a14495P7249l8171r9518n2822L0443M4078k5350p6728o492J59904K69486
34026A67584K03222K0847j08801j13618o9290m1957j2604j762r5676k38366j91443
$$ plain form
34015 -481864 -377376 -68122 36424 -255601 -632714 -702186 -492454 -309355 -263101 -220346
34005 -220346 -128527 -90072 -130751 -149738 -112823 -80342 -38288 87050 236745 254981 144347
33994 144347 83480 152487 231272 214972 149424 100440 51704 -16230 -83738 -153019 -218010
33983 -218010 -188874 -13057 154269 104626 -111178 -245821 -220845 -180161 -180727 -123783 -33481
33972 -33481 -84551 -258613 -288396 -76366 139416 194626 252920 440722 543360 349569
33962 349569 39773 -85833 -60492 -104244 -194778 -139779 29332 90996 18497 9778 140201
33951 140201 274173 328900 352763 321205 129113 -152389 -262734 -99318 114997 119067
33941 119067 -79823 -280722 -345505 -283417 -167818 -63300 -4174 5738 -24596 -73329 -80177
$$ packed form
34015d81864J04488L09254J04546k92025l77113o9472K09732J83099M6254M2755
34005b20346R1819L8455m0679j8987L6915L2481M2054J25338J49695J8236j10634
33994A44347o0867O9007P8785j6300o5548m8984m8736o7934o7508o9281o4991
33983b18010K9136J75817J67326m9643k15804j34643K4976M0684n66N6944R0302
33972c3481n1070j74062k9783K12030K15782N5210N8294J87802J02638j93791
33962C49569l09796j25606K5341m3752r0534N4999J69111O1664p2499q719J30423
33951A40201J33972N4727K3863l1558j92092k81502j10345J63416K14315M070
33941A19067j98890k00899o4783O2088J15599J04518N9126R912l0334m8733o848
$$ plain form
33930 -80177 7406 118999 92905 -92431 -233993 -182608 -91764 -198186 -428388 -454671 -143081
33919 -143081 268622 489180 492374 445325 462659 526846 563723 510742 349454 120119 -108400
33908 -108400 -286943 -393872 -433225 -454475 -513176 -565397 -481701 -238221 -8239 31977 -84864
33897 -84864 -190707 -185800 -77619 80506 182586 121172 -28958 -17488 235875 460681
33887 460681 402119 200772 141347 176716 47101 -218411 -315807 -179370 -83317 -157186 -178688
33876 -178688 11805 233681 289287 266955 302747 288127 57129 -313907 -610734 -745593
33866 -745593 -748003 -647943 -531612 -541182 -640146 -557561 -171211 226608 282469 50595 -148553
33855 -148553 -204294 -251823 -318382 -266905 -98654 -5585 -48768 -41401 138423 329721 326917
$$ packed form
33930h0177Q7583J11593k6094j85336j41562N1385R0844j06422k30202k6283L11590
33919a43081M11703K20558L194m7049J7334O4187L6877n2981j61288k29335k28519
33908a08400j78543j06929l9353k1250n8701n2221Q3696K43480K29982M0216j16841
33897h4864j05843M907J08181J58125J02080o1414j50130J1470K53363K24806
33887D60681n8562k01347n9425L5369j29615k65512r7396J36437R6053p3869k1502
33876a78688J90493K21876N5606k2332L5792j4620k30998l71036k96827j34859
33866g45593k410J00060J16331r570r8964Q2585L86350L97819N5861k31874j99148
33855a48553n5741m7529o6559N1477J68251R3069m3183P367J79824J91298k804
$$ plain form
33844 326917 186359 133646 240153 340386 266363 57113 -108738 -134513 -83508 -30691
33834 -30691 61073 220855 309717 171095 -61366 -35955 345612 740476 794214 562661
33824 562661 315959 120219 -105489 -253066 -102246 272792 501080 401449 214521 241260
33814 241260 458860 615390 539745 243824 -142681 -431856 -490181 -381687 -292014 -255624
33804 -255624 -111248 190480 415963 336376 52355 -139875 -115538 9731 100106 106518
33794 106518 -5171 -243892 -499665 -616930 -592467 -569589 -604334 -574364 -385143 -145394
33784 -145394 -31693 -49419 -43416 74378 209606 215013 61548 -155216 -326390 -396516 -352622
33773 -352622 -219338 -76322 -20830 -72379 -141416 -122158 7177 193953 370292 459437
$$ packed form
33844C26917j40558n2713J06507J00233p4023k09250j65851k5775N1005N2817
33834c0691R1764J59782Q8862j38622k32461K5411L81567L94864N3738k31553
33824E62661k46702j95740k25708j47577J50820L75038K28288r9631j86928K6739
33814B41260K17600J56530p5645k95921l86505k89175n8325J08494Q9673L6390
33804b55624J44376L01728K25483p9587k84021j92230K4337J25269R0375O412
33794A06518j11689k38721k55773j17265K4463K2878l4745K9970J89221K39749
33784a45394J13701j7726O003J17794J35228N407j53465k16764j71174p0126M3894
33773c52622J33284J43016N5492n1549o9037J9258J29335J86776J76339Q9145
$$ plain form
33763 459437 380953 136444 -129310 -237960 -150590 31541 215325 370481 453372 411319
33753 411319 298054 258520 332772 384425 302530 166875 109126 108285 60672 -16214 -8922 89424
33741 89424 159820 150856 147938 216153 305338 364000 426632 513192 547074 468985 350518 284569
33729 284569 223262 53731 -190719 -337230 -317126 -275504 -364610 -519904 -544214 -368661
33719 -368661 -122203 47649 115454 119545 74567 11025 20277 162543 367844 513073 563033
33708 563033 546227 437661 200878 -68768 -208923 -233566 -339415 -585011 -733515 -561817
33698 -561817 -193716 58889 97759 76493 88061 46984 -94789 -228821 -264660 -258140 -277401
33687 -277401 -280187 -222167 -169333 -192810 -237881 -201337 -77655 56872 149999 190315 174657
$$ packed form
33763D59437p8484k44509k65754j08650Q7370J82131J83784J55156Q2891m2053
33753D11319j13265l9534P4252N1653q1895j35655n7749q41m7613p6886P292R8346
33741H9424P0396q964k918O8215Q9185N8662O2632Q6560L3882p8089j18467o5949
33729B84569o1307j69531k44450j46511K0104M1622q9106j55294k4310J75553
33719c68661K46458J69852O7805M091m4978o3542R252J42266K05301J45229M9960
33708E63033j6806j08566k36783k69646j40155k4643j05849k45596j48504J71698
33698e61817L68101K52605L8870k1266J1568m1077j41773j34032l5839O520j9261
33687b77401k786N8020N2834k3477m5071L6544J23682J34527R3127M0316j5658
$$ plain form
33676 174657 130225 122868 183408 263865 301391 278451 212216 159760 219712 401401 505806
33665 505806 332603 32300 -6094 276670 449251 212103 -104434 -4253 419866 624814
33655 624814 419719 162070 116149 81889 -163317 -451134 -520515 -437588 -416266 -425688 -291307
33644 -291307 -60931 41872 -18629 -55005 8164 14741 -144030 -331485 -352699 -211545 -70009
33633 -70009 -23798 -29214 -35601 -80630 -188572 -233807 -41488 332171 557615 402130 43407
33622 43407 -167249 -174524 -199893 -287227 -209196 74978 215120 -45605 -450903 -586689 -456810
33611 -456810 -378998 -449007 -476329 -399204 -387657 -492530 -528981 -411922 -318134 -372325 -415984
33600 -415984 -264955 -8130 144769 182725 263539 432295 548954 493243 319068 182578
$$ packed form
33676A74657m4432p357O0540Q0457L7526k2940o6235n2456N9952J81689J04405
33665E05806j73203l00303l8394K82764J72581k37148l16537J00181M24119K04948
33655F24814k05095k57649m5921l4260k45206k87817o9381Q2927K1322r422J34381
33644b91307K30376J02803o0501l6376O3169O577j58771j87455k1214J41154J41536
33633g0009M6211n416o387m5029j07942m5235J92319L73659K25444j55485l58723
33622D3407k10656p275k5369q7334P8031K84174J40142k60725m05298j35786J29879
33611d56810P7812p0009k7322P7125J1547j04873l6451J17059R3788n4191m3659
33600d15984J51029K56825J52899L7956Q0814J68756J16659n5711j74175j36490
$$ plain form
33590 182578 177176 251068 268706 165866 36533 18765 106078 156490 101103 41723 88501
33579 88501 186010 185164 50124 -86028 -81442 39142 100742 -18590 -225698 -310091 -203434
33568 -203434 -51874 1648 -14663 -35875 -127296 -353939 -570590 -541553 -248531 91823
33558 91823 297434 335193 197914 -108579 -430549 -542987 -437242 -344938 -395367 -431219
33548 -431219 -265988 40477 280322 336978 221801 2414 -195018 -224424 -66039 149332
33538 149332 312996 412847 405262 210623 -71650 -157064 57541 300216 274955 48702
33528 48702 -104863 -96565 -28373 68677 240033 408847 422547 288074 151603 56683 -70435
33517 -70435 -198854 -177240 17843 206875 243122 172836 104872 58977 8402 -40679 -80654
$$ packed form
33590A82578n402P3892J7638j02840j29333j7768Q7313N0412n5387n9380M6778
33579H8501R7509q46j35040j36152M586J20584O1600j19332k07108q4393J06657
33568b03434J51560N3522j6311k1212r1421k26643k16651K9037K93022L40354
33558I1823K05611L7759j37279l06493l21970j12438J05745R2304n0429l5852
33548d31219J65231L06465K39845N6656j15177k19387j97432k9406J58385K15371
33538A49332J63664R9851p585j94639k82273q5414K14605K42675k5261k26253
33528D8702j53565Q298O8192R7050J71356J68814J3700j34473j36471r4920j27118
33517g0435j28419K1614J95083J89032L6247p0286o7964m5895n0575m9081l9975
$$ plain form
33506 -80654 -135019 -212453 -283797 -318883 -293962 -182230 -8332 123716 149836 152465 239754
33495 239754 368931 427253 437340 499352 550139 402477 73192 -140925 -28734 253138
33485 253138 396433 321643 196717 147547 103630 -62691 -340964 -562919 -556373 -318791
33475 -318791 -40833 64897 -39821 -215041 -312496 -298325 -221491 -128964 -28836 97554
33465 97554 246612 341143 276434 62747 -136357 -174340 -73971 54045 157055 212140
33455 212140 162670 30737 -6505 156342 326036 235435 -51626 -213327 -135680 -27484
33445 -27484 -37766 -56152 10729 53863 2953 -9412 89587 124577 -34297 -200660 -148385
33434 -148385 16389 40985 -50096 -25822 130343 186041 45940 -110883 -124831 -51394 -5597
$$ packed form
33506h0654n4365p7434p1344l5086K4921J11732J73898J32048K6120K629Q7289
33495B39754J29177N8322J0087O2012N0787j47662l29285k14117J12191K81872
33485B53138J43295p4790j24926m9170m3917j66321k78273k21955O546K37582
33475c18791K77958J05730j04718j75220r7455J4171P6834R2527J00128J26390
33465I7554J49058R4531o4709k13687j99104l7983J00369J28016J03010N5085
33455B12140m9470j31933l7242J62847J69694r0601k87061j61701P7647J08196
33445b7484j0282j8386O6881M3134n0910j2365R8999L4990j58874j66363N2275
33434a48385J64774K4596r1081K4274J56165N5698j40101j56823j3948P3437M5797
$$ plain form
33423 -5597 -16120 -96887 -277305 -488336 -579751 -519273 -427921 -362645 -228012 18000 234408
33412 234408 287877 242279 231155 241781 163157 -8449 -135889 -96219 105847 351867 477908
33401 477908 371283 72664 -233036 -374032 -327127 -184687 -39596 66078 135498 206851
33391 206851 308136 392020 369328 239089 118661 97223 123991 100005 20708 -41717 -49171
33380 -49171 -17775 37147 106091 158147 167055 147524 128139 120575 144880 226972 327486 345595
33368 345595 256371 165144 143374 101223 -53832 -209998 -168825 61519 262793 299914 249597
33357 249597 211869 172526 121200 137001 243113 308136 225212 92871 78356 169668 209373
33346 209373 139264 66644 85032 154686 191983 179129 135009 42824 -126755 -330576 -439389
$$ packed form
33423e597j0523q0767j80418k11031r1415O0478R1352O5276J34633K46012K16408
33412B34408N3469m5598j1124J0626p8624j71606j27440L9670K02066K46020J26041
33401D77908j06625k98619l05700j40996M6905J42440J45091J05674O9420P1353
33391B06851J01285Q3884k2692j30239j20428k1438K6768k3986p9297o2425p454
33380d9171L1396N4922O8944N2056Q908j9531j9385p564K4305Q2092J00514J8109
33368C45595q9224r1227k1770m2151j55055j56166M1173K30344K01274L7121n0317
33357B49597l7728l9343n1326J5801J06112O5023q2924j32341j4515R1312L9705
33346B09373p0109p2620J8388O9654L7297j2854m4120r2185j69579k03821j08813
$$ plain form
33335 -439389 -350865 -125367 42661 48588 24966 151147 343638 322018 35111 -190541
33325 -190541 -79847 191829 256883 95155 29246 200344 344808 185068 -188592 -472133
33315 -472133 -528662 -463319 -412807 -404767 -394448 -344014 -268631 -235164 -285512 -358417 -349247 -244506
33303 -244506 -113721 17202 156342 207805 20934 -349765 -597529 -502875 -210103 -37884
33293 -37884 -97277 -224258 -231605 -100961 53265 116778 78035 41482 104048 203059 174817
33282 174817 -1506 -141276 -111745 -26202 -64369 -204014 -275111 -211962 -105063 -40321 -20622
33271 -20622 -27955 -43763 -11348 120053 302234 408560 361009 210241 102065 161607 354619
33260 354619 471228 342791 74319 -66959 -675 98998 112227 133640 239728 322681
$$ packed form
33335d39389Q8524K25498J68028N927k3622J26181J92491k1620k86907k25652
33325a90541J10694K71676O5054j61728o5909J71098J44464j59740l73660k83541
33315d72133n6529O5343N0512Q040J0319N0434P5383L3467n0348p2905R170J04741
33303b44506J30785J30923J39140N1463j86871l70699k47764R4654K92772J72219
33293c7884n9393j26981p347J30644J54226O3513l8743l6553O2566R9011k8242
33282A74817j76323j39770K9531Q5543l8167j39645p1097O3149J06899O4742J9699
33271b0622p333j5808L2415J31401J82181J06326m7551j50768j08176N9542J93012
33260C54619J16609j28437k68472j41278O6284R9673J3229K1413J06088Q2953
$$ plain form
33250 322681 292853 247951 310712 517906 988293 1872648 2895575 3298250 2645568 1464287
33240 1464287 652831 441181 399296 299239 358075 627220 770747 639498 551570 745775
33230 745775 978825 951964 784662 753620 838914 842005 750176 696961 705867 704064 661847 543452
33218 543452 276597 -68215 -253210 -198039 -129099 -221280 -311687 -198316 -12311 -15239 -186641
33207 -186641 -299807 -288955 -260841 -229785 -114559 54999 173485 257580 385880 493103
33197 493103 451020 314959 263662 314756 314893 203404 80590 13223 -28830 -26755 102347
33186 102347 326108 462113 393239 216984 127577 210246 375463 458272 381266 226736
33176 226736 112416 23567 -121693 -264082 -252096 -126092 -109773 -226412 -202870 65937
$$ packed form
33250C22681k9828m4902O2761K07194M70387Q84355J022927M02675o52682j181281
33240A464287q11456k11650m1885j00057N8836K69145J43527j31249q7928J94205
33230G45775K33050k6861j67302l1042Q5294L091r1829n3215Q906j803m2217j18395
33218E43452k66855l44812j84995N5171O8940r2181r0407J13371J86005k928j71402
33207a86641j13166J0852K8114L1056J15226J69558J18486Q4095J28300J07223
33197D93103m2083j36061n1297N1094J37j11489j22814o7367m2053K075J29102
33186A02347K23761J36005o8874j76255q9407Q2669J65217Q2809p7006j54530
33176B26736j14320q8849j45260j42389J1986J26004J6319j16639K3542K68807
$$ plain form
33166 65937 241440 11417 -390675 -481568 -198490 88667 156247 145234 200388 241953 184465
33155 184465 119912 174897 352904 572587 727949 711935 524437 329180 256598 215361
33145 215361 73216 -69632 -18654 178048 288627 242702 151916 32996 -189911 -419312
33135 -419312 -437003 -259255 -147841 -216111 -299677 -266804 -173877 -56574 133842 305597
33125 305597 248063 -675 -105427 89772 305353 224785 -85399 -339839 -412118 -359539
33115 -359539 -246188 -126103 -66938 -45776 42959 168032 127590 -137877 -388707 -398705 -250715
33104 -250715 -154762 -139382 -110411 -71507 -82391 -97465 -30354 92967 194449 279552 376616
33093 376616 422351 346119 204534 110790 82302 53414 -13737 -100417 -155375 -115731 9100
$$ packed form
33166F5937J75503k30023m02092r0893K83078K87157O7580j1013N5154M1565n7488
33155A84465o4553N4985J78007K19683J55362j6014j87498j95257p2582m1237
33145B15361j42145j42848N0978J96702J10579m5925r0786j18920k22907k29401
33135d19312j7691J77748J11414o8270q3566L2873R2927J17303J90416J71755
33125C05597n7534k48738j04752J95199K15581q0568l10184k54440p2279N2579
33115c59539J13351J20085N9165K1162Q8735J25073m0442k65467k50830r998J47990
33104b50715R5953J5380K8971L8904j0884j5074O7111J23321J01482Q5103R7064
33093C76616M5735p6232j41585r3744k8488k8888o7151q6680n4958L9644J24831
$$ plain form
33082 9100 70646 -61198 -265781 -285800 -109962 -17636 -161407 -342407 -330371 -181447 -71614
33071 -71614 -14760 66793 161310 241685 363286 504483 464780 127782 -293309 -468309 -321346
33060 -321346 -42178 162768 191512 46805 -140333 -210104 -208629 -354174 -654029 -788169
33050 -788169 -558701 -218715 -112290 -199591 -216260 -118678 -64797 -96949 -149250 -249403 -416442
33039 -416442 -480062 -310178 -105976 -128652 -267210 -238945 -116785 -222246 -522259 -593787
33029 -593787 -264331 129133 251563 173615 106263 66897 11509 22467 137874 196939 68934
33018 68934 -108994 -103890 112027 375233 551568 623642 630859 611361 556607 399783 122797
33007 122797 -139018 -214791 -107636 38933 146869 217811 195161 28421 -148322 -145304
$$ packed form
33082I100O1546j31844k04583k0019J75838R2326j43771j81000J2036J48924J09833
33071g1614N6854Q1553R4517Q0375J21601J41197l9703l36998m21091j75000J46963
33060c21346K79168K04946K8744j44707j87138o9771J475j45545k99855j34140
33050g88169K29468L39986J06425q7301j6669R7582N3881l2152n2301j00153j67039
33039d16442o3620J69884K04202k2676j38558K8265J22160j05461l00013p1528
33029e93787L29456L93464J22430p7948o7352l9366n5388J0958J15407N9065j28005
33018F8934j77928N104K15917K63206J76335P2074P217j9498n4754j56824k76986
33007A22797k61815p5773J07155J46569J07936P0942k2650j66740j76743L018
$$ plain form
32997 -145304 -27643 -35399 -167230 -138305 161503 459636 494289 361322 297081 333814 361309
32986 361309 355294 352764 330598 270182 229306 225871 183809 108039 147351 341448 475501 361790
32974 361790 117294 -28209 -64736 -131201 -223845 -217135 -124727 -105007 -198001 -252333 -157876
32963 -157876 -1511 72104 53783 49544 107478 131013 51 -229778 -328110 -166653 73582
32952 73582 111584 -54790 -161842 -69716 82487 164575 258309 447591 618577 640312 578443
32941 578443 553342 531127 436502 337949 327729 340967 297831 304119 469958 619608 457202
32930 457202 2709 -388333 -458945 -286449 -62147 137684 288630 322395 213869 51599
32920 51599 -68266 -147516 -243103 -392620 -600255 -813006 -905472 -787326 -532573 -298359
$$ packed form
32997a45304J17661p756j31831K8925K99808K98133L4653j32967o4241L6733K7495
32986C61309o015k530k2166o0416m0876l435m2062p5770L9312J94097J34053j13711
32974C61790k44496j45503l6527o6465r2644O710R2408J9720r2994n4332R4457
32963a57876J56365P3615j8321m239N7934K3535j30962k29829r8332J61457K40235
32952G3582L8002j66374j07052R2126J52203Q2088R3734J89282J70986K1735o1869
32941E78443k5101k2215r4625r8553j0220J3238m3136O288J65839J49650j62406
32930D57202m54493l91042p0612J72496K24302J99831J50946L3765j08526j62270
32920E1599j19865p9250r5587j49517k07635k12751r2466J18146K54753K34214
$$ plain form
32910 -298359 -119740 82905 286654 328941 155846 -49348 -101641 -61876 -109233 -241517
32900 -241517 -266270 -88913 131342 173885 26416 -115956 -102363 -5601 -13981 -179744 -345952
32889 -345952 -342667 -186906 -25646 65937 125788 162607 110042 -20999 -64356 107106 367180
32878 367180 451155 279632 41576 -68879 -64643 -46377 -4342 122267 269261 304664 244645
$$ packed form
32910b98359J78619K02645K03749M2287j73095k05194n2293L9765m7357j32284
32900b41517k4753J77357K20255M2543j47469j42372J3593R6762q380j65763j66208
32889c45952L285J55761J61260R1583N9851L6819n2565j31041m3357J71462K60074
32878C67180Q3975j71523k38056j10455M236J8266M2035J26609J46994L5403o0019
$$ [...]
##END NTUPLES=NMR SPECTRUM
##END=
