##TITLE=31Pdec_BAU-j-XR
 CDCl3, 24 sc
 18.12.2019
##JCAMPDX= 6.0         $$ Bruker NMR JCAMP-DX V2.0
##DATA TYPE= NMR SPECTRUM
##DATA CLASS= NTUPLES
##ORIGIN= UXNMR, Bruker Analytische Messtechnik GmbH
##OWNER= root
$$ XWIN-NMR		Version 3.5
$$ Wed Dec 18 15:35:38 2019 Russian Standard Time (UT+4h)  she@DPX200
##.OBSERVE FREQUENCY= 81.013821
##.OBSERVE NUCLEUS= ^31P
##.ACQUISITION MODE= SIMULTANEOUS
##.ACQUISITION SCHEME= undefined
##.AVERAGES= 24
##.DIGITISER RES= 17
##SPECTROMETER/DATA SYSTEM= spect
##.PULSE SEQUENCE= zgpg30
##.SOLVENT NAME= CDCl3
##.SHIFT REFERENCE= (INTERNAL, CDCl3, 0, 182.463)
##AUDIT TRAIL= $$ (NUMBER, WHEN, WHO, WHERE, WHAT)
$$ ##TITLE= Audit trail, XWIN-NMR		Version 3.5
$$ ##JCAMPDX= 5.01
$$ ##ORIGIN= Bruker BioSpin GmbH
$$ ##OWNER= she
$$ F:/spectra/data/she/nmr/P31/1/pdata/1/auditp.txt
$$ ##AUDIT TRAIL=  $$ (NUMBER, WHEN, WHO, WHERE, WHAT)
(   1,<2019-12-18 15:34:57.10 +0400>,<she>,<DPX200>,
      <created by zg, POWCHK disabled, PULCHK disabled
       configuration hash MD5:
       00 E9 B6 7A A2 85 ED C7 34 08 36 98 17 FE 4E 26
       data hash MD5: 32K
       F1 02 65 32 44 AC 71 1C AB 53 D0 73 68 74 BB 91>)
(   2,<2019-12-18 15:34:59.51 +0400>,<she>,<DPX200>,
      <Start of raw data processing
       efp BC_mod = 2 LB = 1 FT_mod = 6 PKNL = 1 PHC0 = -1329.438 PHC1 = 184.4011 SI = 64K 
       data hash MD5: 64K
       45 1D 1E 1E 63 91 52 53 2A C0 F9 2E C3 25 9A C5>)
(   3,<2019-12-18 15:35:13.17 +0400>,<she>,<DPX200>,
      <pk PHC0 = -14.28281 PHC1 = 0 
       data hash MD5: 64K
       16 ED 26 84 A4 DD AD 0B 35 5E B3 6B 7A C7 40 92>)
(   4,<2019-12-18 15:35:16.46 +0400>,<she>,<DPX200>,
      <abs ABSG = 5 
       data hash MD5: 64K
       E5 0C C1 BC 60 A7 5C B3 BF 22 B3 81 1E 0D 4E BF>)
$$ ##END=
$$ 
$$ hash MD5
$$ 7E 2D A4 08 55 E5 66 E0 AC 49 49 3D CE 79 D1 86
##$RELAX= 
##$RELAX= 
##$RELAX= 
##$RELAX= 
##$RELAX= 
##$RELAX= 
##$RELAX= 
##$RELAX= 
$$ Bruker specific parameters
$$ --------------------------
##$DU= <F:/spectra>
##$EXPNO= 1
##$NAME= <P31>
##$PROCNO= 1
##$TYPE= <nmr>
##$USER= <she>
##$AMP= (0..31)
100 100 100 100 100 100 100 100 100 100 100 100 100 100 100 100 100 100 
100 100 100 100 100 100 100 100 100 100 100 100 100 100 
##$AQSEQ= 0
##$AQ_mod= 1
##$AUNM= <au_zg>
##$AUTOPOS= <>
##$BF1= 81.014009
##$BF2= 200.13
##$BF3= 200.13
##$BF4= 200.13
##$BF5= 200.13
##$BF6= 200.13
##$BF7= 200.13
##$BF8= 200.13
##$BYTORDA= 1
##$CFDGTYP= 0
##$CFRGTYP= 5
##$CHEMSTR= <none>
##$CNST= (0..31)
1 1 145 1 1 1 1 1 1 1 1 1 1 1 1 1 1 1 1 1 1 1 1 1 1 1 1 1 1 1 1 1 
##$CPDPRG= <waltz16>
##$CPDPRG1= <>
##$CPDPRG2= <waltz16>
##$CPDPRG3= <>
##$CPDPRG4= <mlev>
##$CPDPRG5= <mlev>
##$CPDPRG6= <mlev>
##$CPDPRG7= <mlev>
##$CPDPRG8= <mlev>
##$CPDPRGB= <>
##$CPDPRGT= <>
##$D= (0..31)
0 1 0 0 0 0 0 0 0 0 0 0.03 2e-05 3e-06 0 0 0 0 0 0 0 0 0 0 0 0 0 0 0 0 
0 0 
##$DATE= 1576668896
##$DBL= (0..7)
120 120 120 11 120 120 24 19 
##$DBP= (0..7)
150 150 150 150 150 150 150 150 
##$DBP07= 0
##$DBPNAM0= <>
##$DBPNAM1= <>
##$DBPNAM2= <>
$$ [...]
##$SUBNAM3= <"">
##$SUBNAM4= <"">
##$SUBNAM5= <"">
##$SUBNAM6= <"">
##$SUBNAM7= <"">
##$SUBNAM8= <"">
##$SUBNAM9= <"">
##$SW= 369.568048894756
##$SWIBOX= (0..15)
0 1 3 0 0 0 0 0 0 0 0 0 0 0 0 0 
##$SW_h= 29940.119760479
##$TD= 32768
##$TD0= 1
##$TE= 0
##$TE2= 300
##$TE3= 300
##$TEG= 300
##$TL= (0..7)
0 120 53 12 22 120 120 120 
##$TP= (0..7)
150 150 150 150 150 150 150 150 
##$TP07= 0
##$TPNAME0= <>
##$TPNAME1= <>
##$TPNAME2= <>
##$TPNAME3= <>
##$TPNAME4= <>
##$TPNAME5= <>
##$TPNAME6= <>
##$TPNAME7= <>
##$TPOAL= (0..7)
0.5 0.5 0.5 0.5 0.5 0.5 0.5 0.5 
##$TPOFFS= (0..7)
0 0 0 0 0 0 0 0 
##$TUNHIN= 0
##$TUNHOUT= 0
##$TUNXOUT= 0
##$USERA1= <user>
##$USERA2= <user>
##$USERA3= <user>
##$USERA4= <user>
##$USERA5= <user>
##$V9= 5
##$VALIST= <valist>
##$VCLIST= <CCCCCCCCCCCCCCC>
##$VD= 0
##$VDLIST= <DDDDDDDDDDDDDDD>
##$VPLIST= <PPPPPPPPPPPPPPP>
##$VTLIST= <TTTTTTTTTTTTTTT>
##$WBST= 1024
##$WBSW= 4
##$XGAIN= (0..3)
0 0 0 0 
##$XL= 0
##$YL= 0
##$YMAX_a= 11247
##$YMIN_a= -9682
##$ZGOPTNS= <>
##$ZL1= 120
##$ZL2= 120
##$ZL3= 120
##$ZL4= 120
##$ABSF1= 182.463
##$ABSF2= -187.1042
##$ABSG= 5
##$ABSL= 3
##$ALPHA= 0
##$AQORDER= 0
##$ASSFAC= 0
##$ASSFACI= 0
##$ASSFACX= 0
##$ASSWID= 0
##$AUNMP= <proc_1d>
##$AZFE= 0.1
##$AZFW= 0.5
##$BCFW= 0
##$BC_mod= 2
##$BYTORDP= 0
##$COROFFS= 0
##$CY= -3
##$DATMOD= 1
##$DC= 0
##$DFILT= <>
##$DTYPP= 0
##$F1P= 0
##$F2P= 0
##$FCOR= 1
##$FTSIZE= 65536
##$FT_mod= 6
##$GAMMA= 0
##$GB= 0
##$INTBC= 1
##$INTSCL= 5.30512e-09
##$ISEN= 30
##$LB= 1
##$LEV0= 0
##$LPBIN= 0
##$MAXI= 10000
##$MC2= 0
##$MEAN= 0
##$ME_mod= 0
##$MI= 50
##$NCOEF= 0
##$NC_proc= -8
##$NLEV= 6
##$NOISF1= 182.463
##$NOISF2= 159.3651
##$NSP= 0
##$NTH_PI= 0
##$NZP= 0
##$OFFSET= 182.463
##$PC= 4
##$PHC0= -1343.721
##$PHC1= 184.4011
##$PH_mod= 1
##$PKNL= yes
##$PPARMOD= 0
##$PSCAL= 0
##$PSIGN= 0
##$REVERSE= no
##$SF= 81.0140089999434
##$SI= 65536
##$SIGF1= 159.3651
##$SIGF2= -187.1042
##$SINO= 113.3802
##$SIOLD= 16384
##$SREGLST= <1H.CDCl3>
##$SSB= 0
##$STSI= 65536
##$STSR= 0
##$SW_p= 29940.119760479
##$SYMM= 0
##$S_DEV= 0
##$TDeff= 32768
##$TDoff= 0
##$TI= <>
##$TILT= no
##$TM1= 0
##$TM2= 0
##$TOPLEV= 0
##$USERP1= <user>
##$USERP2= <user>
##$USERP3= <user>
##$USERP4= <user>
##$USERP5= <user>
##$WDW= 1
##$XDIM= 65536
##$YMAX_p= 400758866
##$YMIN_p= -36289314
$$ End of Bruker specific parameters
$$ ---------------------------------
##NTUPLES= NMR SPECTRUM
##VAR_NAME=  FREQUENCY,     SPECTRUM/REAL,   SPECTRUM/IMAG
##SYMBOL=    X,             R,               I
##VAR_TYPE=  INDEPENDENT,   DEPENDENT,       DEPENDENT
##VAR_FORM=  AFFN,          ASDF,            ASDF
##VAR_DIM=   65536,         65536,           65536
##UNITS=     HZ,            ARBITRARY UNITS, ARBITRARY UNITS
##FACTOR=    0.456856943014862, 1,           1
##FIRST=     14782.0589164792, 0,            0
##LAST=      -15158.0608439998, 0,           0
##MIN=       -15158.0608439998, -36289314,   0
##MAX=       14782.0589164792, 400758866,    0
$$ Real data points
##PAGE= N=1
##DATA TABLE= (X++(R..R)), XYDATA
$$ [...]
40814a54745j190042M307725N055797K722502M30933r07255j568701j719997j583834
$$ -154745 -1344787 2962938 8018735 10741237 11172170 10264915 8696214 6976217 5392383
40805E392383j048784M96029K278019J308258l881725r399688r213378k578592
$$ 5392383 4343599 4839628 7117647 8425905 4544180 -4855508 -14068886 -16647478
40797a6647478M735943P388143N703276K982521R27903k20724q1561M96259r62966
$$ -16647478 -11911535 -4523392 1179884 4162405 5090308 4869584 4788023 5284282 4321316
40788D321316m422540n406744j193632L591277K893440j022266m18696N556724
$$ 4321316 -101224 -5507968 -6701600 -3110323 -216883 -1239149 -1657845 3898879
40780C898879Q923368N105298m43844j645072q33437k798721n615516m469517
$$ 3898879 12822247 17927545 17483701 15838629 15005192 12206471 6590955 2121438
40772B121438o40809P42140o36758j102416o07818k035252l892854j564213L888072
$$ 2121438 1480629 2222769 1586011 483595 -124223 -2159475 -6052329 -7616542 -3728470
40763c728470N844323K357601j036780q47705q73781m608069q588296p584071
$$ -3728470 2115853 4473454 3436674 2588969 1715188 -2892881 -11481177 -19065248
40755a9065248j938986L981649O983163N865134J071550l660918l348792J670136
$$ -19065248 -21004234 -17022585 -10039422 -4174288 -3102738 -6763656 -10112448 -8442312
40747h442312N141032L439478K58093j21544P80170o9837j200163K39941K823651
$$ -8442312 -3301280 138198 396291 274747 1054917 985080 -215083 24858 2848509
40738B848509K979512J90278l560246o652926p169114l182860L011954N245642
$$ 2848509 5828021 6018299 2458053 -4194873 -11363987 -14546847 -11534893 -6289251
40730f289251J588612k473153k394579l68618J138727M259438Q345879O106544
$$ -6289251 -4700639 -7173792 -9568371 -9936989 -8798262 -4538824 3807055 9913599
40722I913599m246942j0950021m137946P177885P133514k647771o375052J73041
$$ 9913599 5666657 -5283364 -9421310 -2243425 4890089 2242318 -4132734 -3959693
40714c959693M475592k29572m631319j506991J734605j923986n001549J523794
$$ -3959693 515899 286327 -4344992 -5851983 -4117378 -6041364 -11042913 -9519119
40706i519119J1205357J1420110L208993j532313O83302J432463l982459q883733
$$ -9519119 1686238 13106348 16315341 14783028 15466330 16898793 12916334 4032601
40698D032601o236688Q91475M197450Q46118m325176n206783q02682M236805M919372
$$ 4032601 -2204087 -1312612 2884838 3730956 -594220 -5801003 -6603685 -2366880 2552492
40689B552492J543621j131635k12026K307160L237257J745347j615970n694030
$$ 2552492 4096113 2964478 2752452 5059612 8296869 10042216 8426246 2732216
40681B732216p270800l057644M762198R038345O044510l79406m866396o205895
$$ 2732216 -4538584 -7596228 -2834030 6204315 12248825 11869419 7003023 797128
40673G97128n117985j780306J680145J726204o00485j32931L081496K314067l795136
$$ 797128 -4320857 -6101163 -4421018 -2694814 -3295299 -3428230 -346734 1967333 -1827803
40664a827803o353691N360O913376M677432k517413m302218p99068M00236p10577
$$ -1827803 -8181494 -8176134 -1262758 3414674 897261 -3404957 -4204025 -3803789 -4514366
40655d514366K059892O853447M767168m350894r922025o570229n09725K505479
$$ -4514366 -2454474 4398973 9166141 4815247 -5106778 -11677007 -12186732 -9681253
40647i681253M286663N879505L388433k916775n491262j261311K658327R49676
$$ -9681253 -5394590 484915 3873348 956573 -4534689 -5796000 -3137673 -2187997
40639b187997j167081J875382N508277L151908k028069k620259P75379J849714
$$ -2187997 -3355078 -1479696 4028581 7180489 5152420 2532161 3307540 5157254
40631E157254k74697p94430J902085M610832N156913L570106o63670o307841p695567
$$ 5157254 4882557 4088127 5990212 10601044 15757957 19328063 18664393 12356552 4660985
40622D660985j502176N517930L514921o050081j1119730n537896K904605M192453
$$ 4660985 3158809 8676739 12191660 6141579 -4978151 -10516047 -7611442 -3418989
40614c418989o17115k856395R91471N663874N339854R91748j906320q93227O04146
$$ -3418989 -4036104 -6892499 -5901028 -237154 5102700 6094448 4188128 3294901 3899047
40605C899047j503740n579954n831123m37416N299755N974183L184885K242415
$$ 3899047 2395307 -3184647 -9015770 -9453186 -4153431 1820752 5005637 7248052
40597G248052M011831M471581J587729j989759l624354l932863l926705k615078
$$ 7248052 11259883 15731464 17319193 15329434 11705080 7772217 3845512 1230434
40589A230434J64399J396686j369602n411053n505241j219743J865898k68172
$$ 1230434 1394833 2791519 1421917 -3989136 -9494377 -10714120 -8848222 -9116394
40581i116394m133433l470023J662492M991387L552871J848348L606244M478734
$$ -9116394 -13249827 -16719850 -15057358 -10065971 -6513100 -4664752 -1058508 3420226
40573C420226j192322r497093j0666233l426132K446544L11760m072030k224208
$$ 3420226 2227904 -7269189 -17935422 -21361554 -18915010 -18603250 -22675280 -24899488
40565b4899488M037576N865812N76961n061141m275976J975163P466031P875919
$$ -24899488 -20861912 -14996100 -14419139 -19480280 -23756256 -21781093 -14315062 -6439143
40557f439143M683082K969456N110384P050045L405742l872719o586227j540277
$$ -6439143 -1756061 1213395 6323779 13373824 16779566 12906847 6320620 4780343
40549D780343M658863N149379J621512q92463k421513m942988n708218j607455
$$ 4780343 9439206 14588585 16210097 15317634 12896121 7953133 2244915 637460
40541F37460L061280J825798k832477k675252K502932L889549k104352p908617
$$ 637460 3698740 5524538 2692061 16809 2519741 6409290 4304938 -3603679
40533c603679o514288j141456J365291K99000q04948p30260k03514J172897L101500
$$ -3603679 -10117967 -11259423 -9894132 -9595132 -10400080 -11130340 -11333854 -10160957 -7059457
40524g059457K946256j26893k459556j078985J513572J521648j69000k76717J176551
$$ -7059457 -4113201 -4240094 -6699650 -7778635 -6265063 -4743415 -4912415 -5189132 -4012581
40515d012581J708877J019438P66629J136664J202620J370197K175437K051566
$$ -4012581 -2303704 -1284266 -517637 619027 1821647 3191844 5367281 7418847
40507G418847m08090l247568l451759j296282P42297K269145M817895Q052511
$$ 7418847 7010757 3763189 311430 -984852 -242555 2026590 6844485 14896996
40499A4896996R217861O406383N28000n391202p836224n680647k685850l998859
$$ 14896996 24114857 30521240 31049240 25658038 17821814 12141167 9455317 5456458
40491E456458q289880p885403k73217N882388K480425m854783m167842M695615
$$ 5456458 -2833422 -10718825 -10992042 -5109654 -2629229 -7484012 -11651854 -6956239
40483f956239R747674N092060j331421j691360L37550j381022l572950J15523
$$ -6956239 2791435 7883495 6552074 4860714 5198264 3817242 244292 359815
40475C59815O313023N646102k653645r237369q010130k760812J109034L669619
$$ 359815 6672838 12318940 9665295 427926 -7582204 -10343016 -9233982 -5564363
40467e564363N897159M819200j286717p100729n703234J931849P987949P666871
$$ -5564363 332796 5151996 3865279 -3235450 -8938684 -7006835 981114 8647985
40459H647985L468670k50920k263761k829457j538817M75037m30708n410371r289828
$$ 8647985 12116655 11865735 9601974 6772517 5233700 5708737 5278029 -132342 -9422170
40450i422170o143092J993962O696364M196820J29971Q60568M464442M736993
$$ -9422170 -15565262 -13571300 -6874936 -2678116 -2548145 -1687577 2776865 7513858
40442G513858J273721l12025K222306M072369J053042l739248m416618o75845
$$ 7513858 8787579 8475554 10697860 14770229 15823271 12084023 7667405 6991560
40434F991560K157245M84154l431319m985818k762655L75037J024316o08338r86873
$$ 6991560 9148805 9632959 6201640 1215822 -1546833 -1171796 -147480 -755818 -1742691
40425a742691J807172M711278L462956j014730l402714j488482J068791Q88037
$$ -1742691 64481 4775759 8238715 7223985 3821271 2332789 3401580 4289617
40417D289617m51242m91628n02352k140304l096696q38666K146318K064069L31794
$$ 4289617 3838375 3346747 2844395 704091 -2392605 -3231271 -1084953 979116 1310910
40408A310910O13127J606518k79727k652973R5423N774401N505181j973132o649377
$$ 1310910 1924037 3530555 3250828 597855 693278 6467679 11972860 9999728 3350351
40399C350351k410870L121332P80108n689700o146199K51855N490594N853284
$$ 3350351 939481 4060813 4840921 -848779 -6994978 -6743123 -1252529 4600755
40391D600755M881818M094159K54660o560413j0110409o282540J145453N594239
$$ 4600755 9482573 13576732 13831392 7270979 -2839430 -9121970 -7976517 -2382278
40383b382278M537053j73537m830502n526503j149038M186149N150849K036224
$$ -2382278 2154775 1981238 -2849264 -8375767 -9524805 -5338656 -187807 1848417
40375A848417k12873L21927O09106j099520k313541j037905J103546K051351J695991
$$ 1848417 1635544 1957471 2566577 1467057 -846484 -1884389 -780843 1270508 2966499
40366B966499K09598j928106k077590J483853M833357K903661j401479m65489
$$ 2966499 3176097 1247991 -829599 654254 5487611 8391272 6989793 6524304
40358F524304M771520M437524m140291j0228227n683346K420552L559214p4425
$$ 6524304 11295824 15733348 11593057 1364830 -4318516 -1897964 1661250 1586825
40350A586825M68790M914984N400988O91793k657522k016544j082946j012732
$$ 1586825 2055615 6970599 12371587 13063380 10405858 8389314 7306368 6293636
40342F293636P75298K549292r90567q292891j0662004m973915J815243L759896
$$ 6293636 7068934 9618226 8627659 334768 -10327236 -15301151 -13485908 -9726012
40334i726012L242055L666944L040599k66373k499211r90059K17492k779171o083876
$$ -9726012 -6483957 -2817013 223586 -42787 -2541998 -3532057 -3314565 -6093736 -12177612
40325a2177612l525507L582235Q255198P190548L039121r09021l359588l406223
$$ -12177612 -15703119 -12120884 -3865686 3324862 6363983 5454962 2095374 -1310849
40317a310849p90366K373639L353168K099680N70978m60074j807569l845160n765726
$$ -1310849 -2101215 272424 3625592 5725272 6296250 5836176 4028607 183447 -5582279
40308e582279o159679l597027J755175O532117O677626K555672j128161j486384
$$ -5582279 -11741958 -15338985 -13583810 -7051693 -374067 2181605 1053444 -432940
40300d32940k80681N37924J946891M276872M770024K013678q33804r33215n53006
$$ -432940 -713621 -175697 1771194 6048066 10818090 12831768 11997964 11064749 10511743
40291A0511743k830281n698645m866896r42989J294026m8794j873524r62920K221892
$$ 10511743 7681462 1982817 -2884079 -3827068 -2533042 -2581836 -4455360 -5418280 -3196388
40282c196388M651687L661428n24901l922477k356064K710492M923726J634312
$$ -3196388 1455299 5116727 4591826 669349 -1686715 1023777 5947503 7581815
40274G581815k158996j637100L95995j269551n266742n952142k415254J013513
$$ 7581815 5422819 3785719 4181714 2912163 -2354579 -8306721 -10721975 -9708462
40266i708462K046339K362355K874457K518225J469941P84139m21700k717452
$$ -9708462 -7662123 -5299768 -2425311 92914 1562855 2346994 1925294 -792158
40258g92158k906215J431568N541285K625325n306387r226365n891509j012542
$$ -792158 -3698373 -2266805 3274480 5899805 593418 -8632947 -14524456 -15536998
40250a5536998J198548L058634N720878N238212M63950k886984j141988J179231
$$ -15536998 -14338450 -11279816 -5558938 -320726 143224 -2743760 -3885748 -2706517
40242b706517m50414k650166o13959L171991L520112J087836o37951k475861o007632
$$ -2706517 -3156931 -5807097 -6421056 -3249065 271047 1358883 720932 -1754929 -7762561
40233g762561o795262o2077R005861R951814J899215m938264l774611O92749J202731
$$ -7762561 -14557823 -14619900 -5614039 4337775 6236990 1298726 -2475885 -1783136 -580405
40224e80405k067031m160209k984373m14561J223110J054821M5844M51047K540097
$$ -580405 -2647436 -6807645 -9792018 -10206579 -8983469 -7928648 -7882804 -7431757 -4891660
40215d891660K400557k881742q307585n234702O048243J4317437J1212826J580896
$$ -4891660 -2491103 -5372845 -13680430 -18915132 -12866889 1450548 12663374 14244270
40207A4244270m164697l231634p01440k00611o21577p97265j627177l021903k881889
$$ 14244270 10079573 6847939 6146499 5945888 5324311 4527046 2899869 -122034 -3003923
40198c003923j64650L531949N808898N047291O86203n802151j0567919j0256333
$$ -3003923 -3168573 363376 6172274 11219565 11905768 6103617 -4464302 -14720635
40190a4720635n307793Q84456N312627O542678M254231k4379k909144k389598
$$ -14720635 -20028428 -19143972 -13831345 -7288667 -3034436 -3058815 -5967959 -8357557
40182h357557j95107J133822J934434L471300M188678J778870k116755l489169
$$ -8357557 -8552664 -7418842 -5484408 -2013108 2175570 3954440 1837685 -1651484
40174a651484j792988m1148N67847J490578K315581P26098k081873j578941K508670
$$ -1651484 -3444472 -3485620 -2917773 -1427195 888386 1614484 -467389 -2046330 462340
40165D62340M464792J493946j330731M19018K299413k205064r977086j0911800
$$ 462340 4927132 6421078 5090347 5509365 7808778 5603714 -4373372 -15285172
40157a5285172j779499R038094J1766990N399020l507985q074551n769805P46293
$$ -15285172 -17064671 -8026577 3740413 9139433 5631448 -2443103 -8212908 -7466615
40149g466615N852647O179209M011558L331785L363110L5477o260951r515099
$$ -7466615 -1613968 4565241 8576799 11908584 15271694 15307171 9046220 -468879
40141d68879o394607j090279Q78054k90111j320398k056361m194399n713991k085502
$$ -468879 -6863486 -7953765 -7075711 -7365822 -8686220 -10742581 -14936980 -20650971 -22736473
40132b2736473O285767J2211103R725305J650780l544891j817323K187153K014979
$$ -22736473 -16450706 -4239603 5485702 7136482 3591591 1774268 3961421 5976400
40124E976400j672078k457390J591318L764145j685341r287214q014435L236578
$$ 5976400 4304322 1846932 3438250 7202395 5517054 -3770160 -11784595 -8548017
40116h548017J2622004J0200452K5131o686231n836002k439366j322402k150333
$$ -8548017 4073987 14274439 14299570 7613339 1777337 -662029 -1984431 -4134764
40108d134764l049120l450493k465011J028941N249016O111710K617238j284869
$$ -4134764 -7183884 -10634377 -13099388 -12070447 -6821431 -709721 1907517 622648
40100F22648j831396K1639Q22586o55363k432266j512572L723331J1246877J4899455
$$ 622648 -1208748 -1187109 -364523 -1019886 -3452152 -4964724 -1241393 10005484 24904939
40091B4904939R360007k604547j1053844r896085m128877k327102m716666m505459
$$ 24904939 34264946 31660399 20606555 10710470 6581593 4254491 -462175 -4967634
40083d967634P0355K450804j403290n799490l897961J614227L142723M51795M34194
$$ -4967634 -4897279 -2446475 -3849765 -9649255 -13547216 -11932989 -8790266 -8338471 -7904277
40074g904277N131764Q161884N248933R43362O15508J783055q23558n750627o841073
$$ -7904277 -2772513 5389371 10638304 11581666 12197174 13980229 13156671 7406044 564971
40065E64971k618333K216712L585153J348789k984763o900192o434488n14533
$$ 564971 -2053362 163350 3748503 5097292 2112529 -4787663 -11222151 -11736684
40057a1736684N113760L982836j676602l798473m67515K094537L42327j543434
$$ -11736684 -6622924 -2640088 -4316690 -8115163 -8582678 -6488141 -6145814 -7689248
40049g689248L082J832064L45669k144391j798902P73909K911104L956136L613076
$$ -7689248 -7686166 -5854102 -5508433 -7652824 -9451726 -8677817 -5766713 -1810577 1802499
40040A802499Q46851k592055k767793m97796j303239n210428m686089K249106
$$ 1802499 2649350 57295 -2710498 -3208294 -4511533 -9721961 -14408050 -12158944
40032a2158944O027759M03342n691067j792041O248202N338843l069722n323931
$$ -12158944 -6131185 -5727843 -11418910 -13210951 -6962749 -1623906 -4693628 -10017559
40024a0017559K053764P586394L967784k189478l589466k654986l277230l005287
$$ -10017559 -7963795 -377401 3590383 1400905 -2188561 -4843547 -8120777 -11126064
40016a1126064J92028K360858J057075N58320L565894N149745J293465l376420
$$ -11126064 -10934036 -8573178 -7516103 -6957783 -3391889 1757856 3051321 -325099
40008c25099l018968L77884J985233K419226M114562M614440Q69211l891822m758994
$$ -325099 -3344067 -2966183 -980950 1438276 5552838 10167278 11036489 7144667 2385673
39999B385673l183788l606080n160371l576735J084316M967521O523912O270152
$$ 2385673 -798115 -4404195 -9564566 -13141301 -12056985 -7089464 -565552 5704600
39991E704600L013133l560419q878969q358852m331057k146055j704724N89879
$$ 5704600 8717733 5157314 -3721655 -12080507 -16411564 -18557619 -20262343 -19672464
39983a9672464L682577L181221k43120j259308J360501L282754K316676J136576
$$ -19672464 -15989887 -12808666 -13051786 -14311094 -12950593 -9667839 -7351163 -6214587
39975f214587J590427K204449K174839K494052K609131J038207p88852n88261
$$ -6214587 -4624160 -2419711 -244872 2249180 4858311 5896518 5107666 4519405
39967D519405l13535k992090n547657k471971L687496M433000j131065m527239
$$ 4519405 4205870 1213780 -4333877 -6805848 -3118352 1314648 183583 -4343656
39959d343656k119897p38560m538598o700996j510040M502816K912226k308502
$$ -4343656 -6463553 -7202113 -11740711 -18441707 -19951747 -15448931 -12536705 -14845207
39951a4845207j582513M244814O239052K960244J767620M811053N359316L82305
$$ -14845207 -16427720 -12182906 -5943854 -2983610 -1215990 3595063 8954379 9336684
39943I336684l627829j569487K289658K475517J154997K722489N271069M127391
$$ 9336684 5708855 4139368 6429026 8904543 10059540 12782029 18053098 22180489
39935B2180489o1319l174954m655484o518215p569889n053122r39000j96692k748992
$$ 22180489 22119170 18944216 14288732 7770517 200628 -4852494 -5791494 -5988186 -8737178
39926h737178l082772J225519N980869O855755M571911J729564j068098l558227
$$ -8737178 -11819950 -10594431 -4613562 2242193 6814104 8543668 7475570 3917343
39918C917343m183274k703666j211971l77799J822829N331920N908231J051051
$$ 3917343 -265931 -2969597 -4181568 -4559367 -2736538 2595382 8503613 9554664
39910I554664n325652p565708m715167O11722O073142Q816870N328480k921724
$$ 9554664 4229012 -3336696 -8051863 -7440141 -1366999 7449871 12778351 9856627
39902I856627p731901m054862J974012J688792k874971k755518L225743P105556
$$ 9856627 2124726 -1930136 43876 1732668 -1142303 -3897821 -672078 6433478
39894F433478M740213N12016j839493l620487m659412k042451J890234J86964
$$ 6433478 11173691 11685707 9846214 6225727 1566315 -476136 1414098 1601062
39886A601062o237469p049038J188055P650343L783487k794600r18217O000011
$$ 1601062 -4636407 -11685445 -10497390 -2847047 936440 -1858160 -2776377 3223634
39878C223634O542970K29338l134929k38348K308734J040308M67111L053928M249913
$$ 3223634 9766604 9995942 6861013 6622665 8931399 9971707 10438818 13492746 17742659
39869A7742659O54393m306382n793639l115771J688169N702976N029799j651557
$$ 17742659 18397052 14090670 8297031 5181260 6869429 12572405 17602204 15950647
39861A5950647q956704r730104m377224J39796L30953q58113q62817n54663l466
$$ 15950647 6993943 -2736161 -7113385 -6973589 -6642636 -7500749 -8363566 -8918229 -8921695
39852h921695K241515M821302M651598K735781K615921L195599L84514m142593
$$ -8921695 -6680180 -1858878 2792720 5528501 8144422 11340021 11724535 7581942
39844G581942m260254k73154O99632k815854l468531K089781O596021L471936
$$ 7581942 3321688 3048534 3748166 932312 -2536219 -446438 6149583 9621519
39836I621519l497169p316139p224399n428302j574025L505575N214773K496390
$$ 9621519 6124350 -1191789 -8416188 -13844490 -15418515 -11912940 -6698167 -4201777
39828d201777J246102M380372N594301P8451n916607m926805q69540j446716l628071
$$ -4201777 -2955675 1424697 7018998 7097449 1180842 -3745963 -4615503 -6062219 -9690290
39819i690290J091432J0143276J1586535K290833p497254r584431p045775m910910
$$ -9690290 -8598858 1544418 13130953 15421786 7924532 -1659899 -8705674 -13616584
39811a3616584j830834L631540O633787K936074k987537l401507J928768O050496
$$ -13616584 -15447418 -11815878 -5182091 -2246017 -5233554 -8635061 -6706293 -655797
39803f55797M406989o77686m628025n612957m242102j468934J402213K374338
$$ -655797 3751192 3073506 -1554519 -7167476 -11409578 -12878512 -11476299 -9101961
39795i101961P74051p22029J403005O090284P574152L067339k193858j868692
$$ -9101961 -8327910 -9049939 -7646934 -1556650 6017502 9084841 6890983 5022291
39787E022291J664005P21162m981113p024714j808932L019661O21366m075015
$$ 5022291 6686296 7407458 2426345 -4598369 -6407301 -3387640 -2766274 -6841289
39779f841289k803451K374017K815743k413247n288275j388762M355228N621090
$$ -6841289 -9644740 -7270723 -4454980 -6868227 -12156502 -13545264 -9190036 -3568946
39771c568946K212867j781106k772021J63143M323098M930682Q67537k970539
$$ -3568946 -1356079 -3137185 -5909206 -5746063 -1422965 3507717 4375254 1404715
39763A404715k900144k658657o377522q921721k179430J0351730J5487886Q402632
$$ 1404715 -1495429 -4154086 -10531608 -19453329 -21632759 -11281029 4206857 12609489
39755A2609489r07703k625895L91477M76219k176682k082162J059199K090964
$$ 12609489 11701786 9075891 9467368 9943587 7766905 5684743 6743942 8834906
39747H834906j217357n607790p771764p866322p290485n959562k548731L513776
$$ 8834906 7617549 2009759 -5762005 -13628327 -20918812 -26878374 -29427105 -25913329
39739b5913329J0086931J2611634Q336990M66931m456094l840048r79350O47518
$$ -25913329 -15826398 -3214764 5122226 5589157 1133063 -2706985 -3686335 -3038817
39731c038817J323072K123804J969231L2528j956227k302193j809907j573017
$$ -3038817 -1715745 408059 2377290 2409818 453591 -1848602 -3658509 -5231526
39723e231526q05268R56386J875557L59555k363766m137209m395750l234141l43545
$$ -5231526 -6036794 -5080408 -3204851 -2845296 -5209062 -9346271 -13742021 -16976162 -17319707
39714a7319707L340014N379319N058398M260455L417606J14004n484998p682486
$$ -17319707 -13979693 -8600374 -3541976 718479 4136085 4250089 -1234909 -8917395
39706h917395k416418N167732O011022n74641n508911k032529N593617Q199439
$$ -8917395 -11333813 -6166081 -155059 -729700 -6238611 -8271140 -2677523 5521916
39698E521916L224243l462105n790679l803993j250813P9557J343871L147183
$$ 5521916 8746159 5284054 -506625 -4310618 -5561431 -5481874 -4138003 -990820
39690i90820L835215K157199j32280j30268K171545L379354Q93199l274944m183987
$$ -990820 2844395 5001594 4869314 4739046 6910591 10289945 11183144 7908200 3724213
39681C724213J1852M760227L796491k715431p543422n563328l47103J819959J083358
$$ 3724213 3736065 8496292 12292783 9577352 2033930 -3529398 -3876501 -2056542 -973184
39672i73184J430674J747550k040064o578629l453898N629486P621459k014646
$$ -973184 457490 2205040 164976 -6413653 -9867551 -4238065 3383394 1368748
39664A368748r777937m052957N865166L975756o912271j0024094j295027N946333
$$ 1368748 -8409189 -12462146 -6596980 -2621224 -9533495 -19557589 -20852616 -14906283
39656a4906283L424758j353124n39149K525677L015354L283210N139662M359796
$$ -14906283 -11481525 -12834649 -13373798 -10848121 -7832767 -4549557 590105 4949901
39648D949901k40211k152259J550958L906978K33298l015553J92215M246096J790971
$$ 4949901 4709690 2557431 4108389 8015367 8248665 5233112 5425327 9671423 11462394
39639A1462394l170053k476117K374762M131866K270313J274114Q48343k065756
$$ 11462394 8292341 5816224 8190986 12322852 14593165 15867279 16715622 14649866
39631A4649866n135112m140687j386445j499002k414184J12535K872326K95145
$$ 14649866 9514754 5374067 3987622 2488620 74436 186971 3059297 3354442
39623C354442m348858l877347m13180j721177o201609m447676M106553Q897301
$$ 3354442 -994416 -4871763 -5284943 -7006120 -13207729 -17655405 -13548852 -4651551
39615d651551M610147j765661l128800r47236J361642L704398M558386N34427
$$ -4651551 -41404 -1807065 -4935865 -5883101 -4521459 -817061 3741325 4275752
39607D275752n661888o048917K02695M455351K461310M74532K670133L124800
$$ 4275752 -1386136 -7435053 -7232358 -2777007 -315697 158835 2828968 5953768
39599E953768k465123o777550j871681P100789R044701K791682l511280n296674
$$ 5953768 3488645 -3288905 -5160586 1940203 10984904 13776586 10265306 4968632
39591D968632m818417l551407N1300N064322O887564K799271m724317j0223927
$$ 4968632 150215 -3401192 -3349892 1714430 8601994 11401265 6676948 -3546979
39583c546979r109480j519130N905704N727510n52801l141240K719348R795996
$$ -3546979 -12656459 -14175589 -8269885 -2542375 -3095176 -6236416 -3517068 6278928
39575F278928R623819M092697J69352j227469l311632m972761l154344p43267
$$ 6278928 15902747 19995444 20164796 18937327 15625695 10652934 7498590 6755323
39567F755323k829183o650520m657756K646893O337838K711985j777967j768801
$$ 6755323 3926140 -2724380 -7382136 -4735243 1602595 4314580 2536613 767812
39559G67812m33550j417249j187656M102533R526064O750849l475155j0835361
$$ 767812 334262 -1082987 -2270643 1831890 11357954 18108803 14633648 3798287
39551C798287q070051M14713M432500J73479n887158n243725K344812Q952565
$$ 3798287 -4271764 -3857051 575449 748928 -5138230 -10381955 -8037143 915422
39543I15422Q562282L660430R3266r13672j722532k241494n08147J921139J150011
$$ 915422 9477704 13138134 13231400 12317728 10595196 8353702 7845555 9766694 10916705
39534A0916705k380880m162169l153933k861083l534684l82911P129148J1135163
$$ 10916705 8535825 4373656 1219723 -1641360 -5176044 -5558955 1570193 12705356
39526A2705356O008661k352985m567189j046975L08999k771865m523893j744163
$$ 12705356 18714017 16361032 11793843 10746868 11055867 8284002 3760109 2015946
39518B015946J279779O19093j158138j36488K588450L431354J673247j002215
$$ 2015946 3295725 3914818 2756680 2620192 5208642 8639996 10313243 9311028
39510I311028l407846m442824k767381K65901N86137k493124l814006k19908L075192
$$ 9311028 5903182 1460358 -1307023 -1041122 -454985 -2948109 -6762115 -6982023 -3906831
39501c906831O3037n207946l469451M937590R166173L732376l550056l988777
$$ -3906831 -3843794 -9051740 -12521191 -7583601 1582572 5314948 1764892 -2223885
39493b223885n60428j226311n585799o718304l203560m03892l17912J468585P024109
$$ -2223885 -2784313 -4010624 -9596423 -16314727 -19518287 -19922179 -20240091 -18771506 -11747397
39484a1747397J1289270R334017L484360l50126k93021O60414n21421l604367
$$ -11747397 -458127 8875890 12360250 12010124 11717103 12377517 11856096 8251729
39476H251729n758537m658571j595562n85244k648102l148581J443218O458340
$$ 8251729 2493192 -2165379 -3760941 -4346185 -6994287 -10142868 -8699650 -2241310
39468b241310M728192j738891l584438J414092M420399k83981n811883l755635
$$ -2241310 2486882 747991 -2836447 -1422355 2998044 2714063 -3097820 -6853455
39460f853455K413236L528234o01496k280473P62170K886676J253763o9135J527000
$$ -6853455 -4440219 -911985 -1513481 -3793954 -3031784 -145108 1108655 1039520 2566520
39451B566520K645243O94130j369157p55838J86900j228189k814878j533316P91407
$$ 2566520 5211763 5905893 4536736 3780898 3967798 2739609 -75269 -1608585 -817178
39442h17178M72267j607064j173147K765066O233895N216630k42159o542822r294010
$$ -817178 -344911 -1951975 -3125122 -360056 5873839 11090469 10848310 4305488 -4988522
39433d988522o417890m24611L302008K300266q1759L90056K652514K213476j695377
$$ -4988522 -11406412 -11831023 -8529015 -6228749 -6310508 -5920452 -3267938 -1054462 -2749839
39424b749839m651621l272191M47702K468446J778767K76628n06511m55326K22442
$$ -2749839 -7401460 -10673651 -10225949 -7757503 -5978736 -5702108 -6208619 -6663945 -6441503
39415f441503J179869J591337J183905J151114K699617N161331O764581O598525
$$ -6441503 -5261634 -3670297 -2486392 -1335278 1364339 6525670 13290251 19888776
39407A9888776M531297L52512m882563p687634n390139m03402K010606O33236
$$ 19888776 24420073 24772585 19890022 12202388 6812249 6408847 8419453 9052689
39399I052689o81280K10535L66917k385352m715897l149222n82023j902775n320964
$$ 9052689 8371409 8581944 8948861 6563509 1847612 -1301610 -1883633 -3786408 -9107372
39390i107372m416002J711218O718192O326323L435012K158401K308706K465123
$$ -9107372 -13523374 -11812156 -5093964 1232359 4667371 6825772 9134478 11599601
39382A1599601L375217M701057K847696l475441q842415p199114n11075L311609
$$ 11599601 14974818 19675875 22523571 19048130 10205715 3006601 2495526 5807135
39374E807135M97621m421494m758477O43095O414555O269223l02280o998348p636643
$$ 5807135 6304756 1883262 -2875215 -2232120 4182435 10451658 10149378 3151030 -4485613
39365d485613l388435k40481j15553M74793K596711K346385j307715k938403O81409
$$ -4485613 -7874048 -8114529 -8230082 -7755289 -5158578 -2812193 -4119908 -7058311 -6376902
39356f376902M640116M083694K133308K876379K737257k392792o951279l475032
$$ -6376902 -1736786 2346908 4480216 7356595 10093852 7701060 749781 -2725251
39348b725251L369908K967079l103525l075184M305233O263665k529203r828457
$$ -2725251 644657 3611736 508211 -2566973 1738260 8001925 5472722 -4355735
39340d355735n261729L114414K840077k757820j911427M933711O560860K82654
$$ -4355735 -9617464 -6503050 -3662973 -6420793 -8332220 -3398509 3162351 3445005
39332C445005m429488k216680R77599j7915j382903Q56935K798623O178l597496
$$ 3445005 -984483 -3201163 -2223564 -2241479 -3624382 -2767447 31176 37354 -3560142
39323c560142j376639N323244Q910886O116986Q59339k829686n135950o720196
$$ -3560142 -4936781 386463 9297349 15414335 16273674 13443988 8308038 1587842
39315A587842n479741n0020O069501P459409L456429r99074j827875m71266l06777
$$ 1587842 -3891899 -3941919 2127582 9586991 13043420 12044346 10216471 9745205 9438428
39306I438428q67070P41184L587209K776226l113652q635977q282595l430752
$$ 9438428 8571358 9312542 12899751 15675977 12562325 3926348 -4356247 -7786999
39298g786999Q78603L202856N283087O410707L867704j033953k880204J78873
$$ -7786999 -6908396 -3705540 1577547 7988254 11855958 10822005 7941801 8120674
39290H120674L256857J824142j828122k733861j063410j300307m591586o540157
$$ 8120674 11377531 13201673 11373551 8639690 7576280 6275973 1684387 -4855770
39282d855770l732990J077373K730955N48323j492844q21444O49071L96183n91111
$$ -4855770 -8588760 -7511387 -4780432 -4232109 -5724953 -6546397 -5897326 -5501143 -6092254
39273f092254M488J282025K74097k465575k268237K793643P456849N114704k931067
$$ -6092254 -6087766 -4805741 -4531644 -6997219 -9265456 -6471813 985036 6099740 3168673
39264C168673p763808l442771N308183Q372822K338828n499682o373254q18129
$$ 3168673 -4595135 -8037906 -2729723 5643099 7981927 2482245 -3891009 -4709138
39256d709138L105444J477848p91058R85034L145323L00803l940452j463069O026402
$$ -4709138 -1603694 -125846 -916904 68130 3213453 3514256 -426196 -1889265 4137137
39247D137137P091627k235298j0856886q052239J564214O497208N175466M225391
$$ 4137137 11228764 8993466 -1863420 -9915659 -8351445 -1854237 3321229 7546620
39239G546620M406733K56462p116992q842295k218515M477649M914784L183972
$$ 7546620 11953353 12209815 5092823 -3749472 -5967987 -1490338 3424446 6608418
39231F608418M360481N185657J087517m228848m189468O7892K191598O61843r27300
$$ 6608418 10968899 16154556 17242073 13013225 8823757 8891649 11083247 11745090 10817790
39222A0817790j413763k613581l469673q35235L691303M199947r03812n881234
$$ 10817790 9404027 6790446 3320773 2485538 6176841 10376788 9472976 3591742
39214C591742n079402L19335M377300K721169l529959q150556n319236K820065
$$ 3591742 -1487660 -1168325 3208975 5930144 2400185 -5750371 -11069607 -8249542
39206h249542O783353J789507m539980k850854L167222K144678o188940r232515
$$ -8249542 -1466189 323318 -4216662 -7067516 -3900294 -1755616 -7944556 -17177071
39198a7177071q60525R109577J0342161O209673M416471K785325m359122j1961711
$$ -17177071 -18037596 -8928019 1414142 7623815 12040286 14825611 10466489 -1495222
39190a495222r449182J975836R492761O691989O14951j245011q03248k243636
$$ -1495222 -10944404 -8968568 524193 7216182 7831133 6586122 5782874 3539238
39182C539238l738428k032837Q66687J393446O02471J581641L875280M917098
$$ 3539238 -199190 -2232027 -1365340 28106 630577 2212218 6087498 11004596
39174A1004596M410164L323402Q09243m029042q834952r780423n924991M1787
$$ 11004596 15414760 18738162 19547405 15518363 6683411 -3097012 -9022003 -8980216
39166h980216M265030M183601Q29467q47410K615670O972315M492545m038440
$$ -8980216 -4715186 -531585 297882 -549528 2066142 9038457 13531002 9492562
39158I492562q033934j804309N857514L359694p073560j2543527p117184J761975
$$ 9492562 1458628 -345681 5511833 8871527 1797967 -10745560 -17862744 -16100769
39150a6100769M742010J541671j450589J29339M468828N902957J043057o118419
$$ -16100769 -11358759 -9817088 -11267677 -11138338 -6669510 -766553 276504 -5841915
39142e841915p342323p30512N460923L835468j482511j721241K587176L353981
$$ -5841915 -13184238 -13914750 -8453827 -4618359 -6100870 -7822111 -5234935 -1880954
39134a880954r40475k946402N85338L334181L70129l842613l101690J663973N930418
$$ -1880954 -2821429 -5767831 -5182493 -1848312 -1478183 -5320796 -8422486 -6758513 -828095
39125h28095P993545P174329J561185o977339j0772292n469941K845809N435610
$$ -828095 7165450 14339779 15900964 8923625 -1848667 -7318608 -4472799 962811
39117I62811K173753p25227o76424P0281N50385J672364K175258K42842j829633
$$ 962811 3136564 2411337 1734913 1805194 2355579 4027943 6203201 6446043 4616410
39108D616410m70411K479631J878623k326596m964474m094700l208114l754315
$$ 4616410 4145999 6625630 8504253 6177657 1213183 -2881517 -6089631 -9843946
39100i843946k006583L610920P645678M678950k192834m880960q44342M427617
$$ -9843946 -11850529 -8239609 -593931 4085019 1892185 -2988775 -3833117 594500
39092E94500N571996L918637L860670N337701L740375k531172q147326p208579
$$ 594500 6166496 10085133 13945803 19283504 23023879 20492707 12345381 5136802
39084E136802j358811K297612O96798k053013j662538N51690Q84979j174118l054322
$$ 5136802 3777991 6075603 6772401 4719388 3056850 3608540 4493519 3319401 265079
39075B65079k509949P08581M326447M092227j617279p134415m450442N437741
$$ 265079 -2244870 -1536289 2790158 6882385 5265106 -1869309 -6319751 -882010
39067h82010J1815819P873443q04513n339494m965153l788724k036638K033971
$$ -882010 10933809 18807252 18002739 12663245 7698092 3909368 1872730 3906701
39059C906701N513137L824065j957517o967777q974106p471797r87728P769353
$$ 3906701 9419838 13243903 11286386 4318609 -4655497 -12127294 -13115022 -5345669
39051e345669R542146O01980p778370l285693P921724R154437j315047q041585
$$ -5345669 4196477 4798457 -2979913 -6265606 1656118 10810555 9495508 1453923
39043A453923k887333M164614L334162p74492q70616J84474k303567m433366j855173
$$ 1453923 -1433410 2731204 6065366 5290874 4420258 4604732 2301165 -2132201 -3987374
39034c987374L97932l318292p876233n229313K271342O545080O516907O135138
$$ -3987374 -3589442 -6907734 -14783967 -20013280 -17741938 -11196858 -4679951 1455187
39026A455187M639088m33824m550988j783571L664923K866001k764894l566615
$$ 1455187 6094275 5660451 1109463 -674108 2990815 5856816 3091922 -474693
39018d74693J761223L869068j334014o127772l983073J006019K575352J752278
$$ -474693 1286530 5155598 3821584 -2306188 -6289261 -5283242 -2707890 -955612
39010i55612K308352L389738K362521K33168n87247j77439Q35022L184375N693124
$$ -955612 1352740 4742478 7104999 7338167 6750920 6573481 7408503 10592878 16286002
39001A6286002M347894j588665o354064m721668O12418K629422j062662o280354
$$ 16286002 20633896 19045231 12691167 7969499 8581917 11211339 10148677 3868323
38993C868323p843513m520104M97033K562188M00938j683049J026326O358025
$$ 3868323 -3975190 -8495294 -7998261 -5436073 -5035135 -6718184 -5691858 666167
38985F66167P335845K270815k611335k755747j545183l050567m307173r06411
$$ 666167 8002012 10272827 7661492 4905745 3360562 309995 -3997178 -4903589
38977d903589M020875L866964n78597j983687K053096N618588L858830o82425
$$ -4903589 -882714 2984250 2405653 421966 2475062 8093650 11952480 11270055
38969A1270055l441318l981863l685968k165177J99017K56937k852419m071593
$$ 11270055 7828737 3846874 160906 -2004271 -1805254 -1548317 -4400736 -8472329
38961h472329P23623O690584N388760k505996p053614l155408K357448J733164
$$ -8472329 -7748706 -1058122 4330638 1824642 -5228972 -8384380 -6026932 -4293768
38953d293768j990238r51397M109755N020901k13969l894598q72122L570071K583089
$$ -4293768 -6284006 -7235403 -3125648 1895253 1681284 -2213314 -3085436 484635 3067724
38944C067724j739869k788703m7397J663334J223518K247546N335195O049826
$$ 3067724 1327855 -1460848 -1508245 155089 1378607 3626153 8961348 15011174
38936A5011174K198998k276881l015545p13688J346611J708543M93940j906369
$$ 15011174 17210172 14933291 11917746 11204058 12550669 14259212 14753152 12846783
38928A2846783l560890j697659K639759L938862l94111n189482m557028j083692
$$ 12846783 9285893 7588234 10227993 14166855 13772744 8583262 4026234 2942542
38920B942542j882738o516892o403642J629292Q453716M812008m569414o703917
$$ 2942542 1059804 -5457088 -11860730 -10231438 -1777722 3034286 -1535128 -8239045
38912h239045J550790R447395P941404J468305n56934K088501J978296l254104
$$ -8239045 -6688255 2759140 10700544 12168849 11611915 13700416 15678712 12424608
38904A2424608p706976o851801l439455j775325j690344j195702q26490j808495
$$ 12424608 4717632 -2134169 -5573624 -7348949 -9039293 -10234995 -11061485 -12869980
38896a2869980k694936j001293L351598P944941R532625N502928l037270r279350
$$ -12869980 -15564916 -16566209 -13214611 -5269670 4262955 9765883 6728613 -2550737
38888b550737o668802J684326N194250J7411n328552k948038K531039J957579
$$ -2550737 -9219539 -7535213 -2340963 -2323552 -7652104 -10600142 -8069103 -6111524
38880f111524l854698o409547l120965O52212J975561L607114O305926O264040
$$ -6111524 -9966222 -16375769 -19496734 -18844522 -16868961 -13261847 -6955921 -691881
38872f91881K246036j604052k309164j534855p34991J331737M261843M856607
$$ -691881 1554155 -49897 -2359061 -3893916 -4628907 -3297170 964673 5821280
38864E821280K570749Q66508R71538m32219m819752q151498o362754l32215O566539
$$ 5821280 8392029 9258537 10230075 9797856 4978104 -3173394 -9536148 -9868363 -3301824
38855c301824J1390225J0789312L040436o799390r751417m049068K182852K500629
$$ -3301824 8088401 18877713 21918149 15118759 5367342 1318274 3501126 6001755
38847F001755J96508O84790K278638N52586l031107l560519p07866J685209K035553
$$ 6001755 6198263 6883053 9161691 9714277 6683170 3122651 2414785 4099994 6135547
38838F135547J888017J864408J053727o43993k563440m158782m021930p76506
$$ 6135547 8023564 9887972 10941699 10297706 7734266 3575484 -446446 -1222952
38830a222952L512868M755253L236414L435661N521383L847447k644633o290087
$$ -1222952 2289916 7045169 10281583 13717244 19238627 23086074 20441441 14151354
38822A4151354k406458K533495J546848j317272J121147O068991N821673J157548
$$ 14151354 11744896 14278391 15825239 14507967 15629114 21698105 27519778 28677326
38814B8677326j213615j149686l751125p743527o749783j421224R68476p38556
$$ 28677326 27463711 26314025 22562900 14819373 8069590 6648366 7616842 6878286
38806F878286l00351L450825L912178j170272n232965l840493r16729o26165j399761
$$ 6878286 6577935 10028760 13940938 12770666 7537701 3697208 2780479 2154314 754553
38797G54553j235799j055485j57519L595927O970533L756277l747175n674478
$$ 754553 -481246 -1536731 -1694250 1901677 8872210 12628487 8881312 3206834
38789C206834n5365L586531K24519k900828m00975J681131j311039k186306M873226
$$ 3206834 3151469 6738000 6962519 4061691 3660716 5341847 4030808 1844502 6717728
38780F717728J1046349N723146n495822r473579o073800n408215q529190o274372
$$ 6717728 17764077 23487223 17991401 8517822 2444022 -2964193 -11493383 -17767755
38772a7767755L233017J0245640Q613105L600043J778498K861497M071798M156817
$$ -17767755 -14534738 -4289098 4324007 7924050 9702548 12564045 16635843 20792660
38764B0792660J310894m939615r108199n635277M83079q29562p899795q065679
$$ 20792660 22103554 17163939 8055740 2420463 2903542 2073980 -5825815 -13891494
38756a3891494J795566Q714138L923756k992694j65762O905035M807677n324884
$$ -13891494 -12095928 -3381790 541966 -2450728 -2616490 4288545 9096222 3771338
38748C771338r364637k278621N147347L796292j324095j331274K684609L440701
$$ 3771338 -5593299 -7871920 -2724573 1071719 -252376 -1583650 1100959 4541660
38740D541660n0465j740117J179071M317480L665299J509328J545447K133154
$$ 4541660 4491195 2751078 3930149 8247629 11912928 13422256 14967703 17100857
38732A7100857n78703m731806m151779J599814M812056N19744n567063n220501
$$ 17100857 16522154 11790348 7638569 9238383 14050439 14570183 9003120 3782619
38724C782619K60964K769213j97963l244342k777084j557184k129772k385911
$$ 3782619 4043583 6812796 6614833 3370491 593407 -963777 -3093549 -5479460
38716e479460m22606J573533J524490J322848L270612N727498N021558k05876
$$ -5479460 -5902066 -4328533 -2804043 -1481195 1789417 7516915 12538473 12332597
38708A2332597p545911j1641803p446915L333799J0539255O399645k892027m406643
$$ 12332597 4786686 -6855117 -14302032 -10968233 -428978 5970667 3078640 -1328003
38700a328003K849426O720408J454066l564505m70387L644177l32954p114883
$$ -1328003 1521423 8241831 9695897 6131392 5661005 9305182 8972228 1857345
38692A857345n964053J011540L209668k12966p24491K867668K656681k631418
$$ 1857345 -4106708 -3095168 114500 -98466 -822957 2044711 4701392 2069974
38684B069974m210451J199671N184886K040729k070988p26276K110247O45328
$$ 2069974 -2140477 -940806 4244080 6284809 4213821 3487545 5597792 6243120
38676F243120k022560k98188L314432K820598p13226j666679L56476J217323M53472
$$ 6243120 4220560 3922372 7236804 10057402 9344176 7677497 8033973 9251296 9704768
38667I704768J223119L225563K706190n49338k228122q3561L180593M125956J926466
$$ 9704768 10927887 14153450 16859640 16310302 14082180 13998619 17179212 21305168 23231634
38658B3231634k526615p384813r737847p781938l007186J866642N818619Q059863
$$ 23231634 20705019 13320206 3582359 -4199579 -7206765 -5340123 478496 8538359
38650H538359O100390p74619p776993q808505l846888J408721K528276r5892l148065
$$ 8538359 14638749 13864130 6087137 -2721368 -6568256 -5159535 -2631259 -2727151 -5875216
38641e875216k436907M720213J4784358J8069108R148222m606029j1135444q688348
$$ -5875216 -8312123 -3591910 11192448 29261556 38409778 33803749 22668305 13979957
38633A3979957n215554m105848n98273N974225P478252J95982o691792m150034
$$ 13979957 8764403 4658555 4060282 10034507 17512759 17708741 11016949 6866915
38625F866915K332694J452015n525222o646758J608218Q723006O194096q05163
$$ 6866915 9199609 10651624 5126402 -1520356 87862 8810868 15004964 14199801
38617A4199801k979218l72558O94626r31605p68105K351224M183616K190865j194847
$$ 14199801 11220583 10848025 11542651 10611046 9842941 12194165 16377781 18568646 17373799
38608A7373799l513845n254072o189889l910706J070939L451987N61367k344572
$$ 17373799 13859954 8605882 2415993 -1494713 -423774 3028213 3589580 1245008
38600A245008L88765N179864M136424j928667l894860J117830M554917Q5455n675351
$$ 1245008 1633773 6813637 10950061 9021394 5126534 6244364 10799281 10884736 5209385
38591E209385l488996L344211L782365l492058p705547k288900N573151N699817
$$ 5209385 1720389 5064600 8846965 5354907 -2350640 -4639540 933611 6633428
38583F633428j482971p364485o891743k459714J665034L738124L751009K110564
$$ 6633428 5150457 -2214028 -9105771 -11565485 -9900451 -6162327 -2411318 -300754
38575c00754j01663j565701j968708j872048j501544n59440R48534K374371K839875
$$ -300754 -402417 -1968118 -3936826 -5808874 -7310418 -7869858 -6921324 -4546953 -1707078
38566a707078J801320m52353k694845l364186j431337K717135O413932N810879
$$ -1707078 94242 -358111 -3052956 -6417142 -7848479 -5131344 1282588 7093467
38558G093467M59486l783461q36434N920923O224600j739029o050225J985053
$$ 7093467 7552953 3769492 2933058 8853981 15078581 13339552 7289327 9274380
38550I274380J2444618R374785n051896j2535566n148165M379801L395599l004587
$$ 9274380 21718998 31093783 26041887 13506321 8358156 12737957 16133556 13128969
38542A3128969l501997J049678K036524j030692j020416L541278O365997L902323
$$ 13128969 9626972 10676650 12713174 11682482 10662066 14203344 20569341 24471664
38534B4471664n68639l397630m307372l652398j638507p3627k99932n15539P60843
$$ 24471664 23903025 20505395 16198023 12545625 10907118 10833491 10533559 10018020 10778863
38525A0778863J182842o87352q43621L609047P136418L050613m768756o591770
$$ 10778863 11961705 11274353 10430732 14039779 21176197 24226810 19458054 12866284
38517A2866284j637299J658912j71617j467550J181982L425355J995413J42235
$$ 12866284 11228985 12887897 12716280 11248730 12430712 15856067 17851480 17993715
38509A7993715N47151P42012o25333m65494J889795J871340j954939l902024m37678
$$ 17993715 18540866 19282878 18657545 18192051 20081846 21953186 19998247 16096223 15658545
38500A5658545L423932K419715p93651j775707k468047o258404r869969p624191
$$ 15658545 19082477 21502192 20708541 18932834 16464787 10206383 336414 -7287777
38492g287777m87209N715583Q353329Q504103O478267K690317J94435O59562O24824
$$ -7287777 -7774986 -2059403 6293926 14798029 21276296 23966613 24161048 24820610 25445434
38483B5445434k683992n206271k187219K754318K321848k780525n001440k040336
$$ 25445434 22761442 17555171 15367952 18122270 20444118 17663593 12662153 10621817
38475A0621817M03849j211591k997541q64567L043456M152001J564250j950836
$$ 10621817 11025666 9814075 6816534 5951967 8995423 13147424 14711674 12760838
38467A2760838l099107j02585N463371Q554542N611249m43276l681723l108531
$$ 12760838 9661731 9559146 15022517 23577059 29188308 28745032 25063309 21954778
38459B1954778k714507l991994l919911j323304M31542n92436j217640J288459
$$ 21954778 19240271 15248277 11328366 10005062 10436604 9844168 8626528 9914987
38451I914987L951371K407822k014331l725044o72525K710712J184072m449219
$$ 9914987 13866358 16274180 14259849 10534805 9862280 12572992 13757064 9307845
38443I307845p636553l483508N009677R774087O960552J082353j392797J60950
$$ 9307845 1671292 -1812216 3197461 12971548 19932100 21014453 19621656 19782606
38435A9782606J732127J188589j52965j013156j313133o31819Q97672R02017k342943
$$ 19782606 21514733 22703322 22550357 21537201 20224068 19592249 20489921 21391938 19048995
38426A9048995o037283n750213j673118J974154L284484M106684N329194N252528
$$ 19048995 13011712 7261499 5588381 7562535 10847019 14953703 20282897 25535425
38418B5535425L145029M51483j832011l306239k207248K250848O207693N158357
$$ 25535425 28680454 29131937 27299926 23993687 21786439 24037287 30244980 35403337
38410C5403337J302120Q30121L812831L925941n68153l500310j397918M28212
$$ 35403337 36705457 37535578 41348409 45274350 44706197 41205887 39807969 40236181
38402D0236181k835565o990590n664445l67408K757864K354867J769347K427960
$$ 40236181 37400616 30410026 24745581 24378173 27136037 29490904 31260251 33688211
38394C3688211L025242L049981K277281n61190l985143k383242N685885J1557243
$$ 33688211 36713453 39763434 42040715 41479525 37494382 35111140 40797025 52354268
38386E2354268O436957n062282r843803m066957K784805K538666j707018l310812
$$ 52354268 58791225 53728943 43885140 39818183 42602988 45141654 43434636 40123824
38378D0123824j954162q04564K72035K709968M205664J693948k426018k415653
$$ 40123824 38169662 37365098 37637133 40347101 44552765 46246713 43820695 41405042
38370D1405042K753430P794326Q087654M952759K932165M277710P499105R766907
$$ 41405042 44158472 51952798 60040452 64993211 67925376 72203086 79702191 89469098
38362H9469098R172650N414267P8434l350496j354737N898502J2934469J3371304
$$ 89469098 98641748 104056015 104134449 100783953 99429216 105327718 118262187 131633491
38354A31633491P227034K018169M354881J1645640J5255750J1762465P266754
$$ 131633491 138860525 140878694 145233575 156879215 172134965 183897430 191164184
38347A91164184Q714095J4229636J5946007J1302754P003092J0136598J8639210
$$ 191164184 199878279 214107915 230053922 241356676 248359768 258496366 277135576
38340B77135576K3791948K0869013J3800219R129368Q797740J0366151J1317104
$$ 277135576 300927524 321796537 335596756 344726124 353523864 363890015 375207119
38333C75207119J0473104P293825K948583O86246J791255K358734j940036q721602
$$ 375207119 385680223 392974048 395922631 396608877 398400132 400758866 398818830 390097228
38325C90097228j1526309r825277j0506644j7209102k3958558k3609809j8019345
$$ 390097228 378570919 368745642 358238998 341029896 317071338 293461529 275442184
38318B75442184j4402758j4757397j5061050j3364375j2209854j2842423j2982184
$$ 275442184 261039426 246282029 231220979 217856604 205646750 192804327 179822143
38311A79822143j1831944j2075485j4426410j4662307r664745l308363k149799
$$ 179822143 167990199 155914714 141488304 126825997 117161252 113852889 111703090
38304A11703090o626862j0469241q867901l958170j128076k292072m740069n464068
$$ 111703090 105076228 94606987 85739086 81780916 80652840 78360768 73620699 68156631
38296F8156631m289541k437108r5299K760912M031594O16700p008981j3071279
$$ 68156631 63867090 61429982 61334683 64095595 68127189 68743889 61734908 48663629
38288D8663629j1566842l177066M424660M214699k632591p961821n904876K31227
$$ 48663629 37096787 33919721 38344381 42559080 39926489 31964668 26059792 26291019
38280B6291019K275371j939746n458901j985299M635676N420495p40062n180842
$$ 26291019 28566390 26626644 21167743 19182444 23818120 29238615 28498553 23317711
38272B3317711j855779M224051M737376j5424k360752J222373N339984L476683
$$ 23317711 21461932 25685983 30423359 30407935 28047183 29269556 34609540 38086223
38264C8086223l278175p792015n829269j071705l37197m811673q358862n693388
$$ 38086223 34808048 27016033 21186764 20115059 19777862 14966189 6607327 913939
38256I13939K31402K253335j007031l790503k005061J648448L111498K841434
$$ 913939 1145341 3398676 2391645 -1398858 -3403919 -1755471 1356027 4197461
38248D197461L259850M035761L346342J206143j374994m105495n843576m205131
$$ 4197461 7457311 11493072 14839414 16045557 14670563 10565068 4721492 516361
38240E16361O36056M698827N285836M090036K875303L18671l747185n823688m567338
$$ 516361 1152417 5851244 11137080 15227116 18102419 18421090 14673905 8850217 4282879
38231D282879l946219n592938l899833M241536J0534412N732673m810853p236089
$$ 4282879 336660 -5256278 -9156111 -4914575 5619837 11352510 6541657 -694432
38223f94432M83417O055571K101541l721738k277979L263968M152521j37963k521944
$$ -694432 -211015 5844556 7946097 4224359 1946380 5210348 9362869 9224906 6702962
38214F702962M34376M351331L609455j880219o910602o565304j437671L241424
$$ 6702962 7137338 11488669 15098124 13217905 6307303 -258001 -1695672 1545752
38206A545752M222425L602854L634518K158039k256407m742959p50695M803974
$$ 1545752 5768177 9371031 13005549 15163588 12907181 8164222 7413527 12217501
38198A2217501L624089k422767l586630K127482O021910K879504k324612m540892
$$ 12217501 15841590 13418823 9832193 11959675 17981585 20861089 18536477 13995585
38190A3995585n150314m808370l52166O307578O608356j351196p824369o172580
$$ 13995585 8845271 4036901 3684735 9992313 16600669 15249473 7425104 1252524
38182A252524k283856j834093M64799Q620705J3232530N079893p372449q984004
$$ 1252524 -1031332 -2865425 -2400626 6220079 19452609 24532502 17160053 8176049
38174H176049q93431K917202j463309m384413j195904J606584P40755J810094
$$ 8176049 7282618 10199820 8736511 4352098 3156194 4762778 5503533 7313627
38166G313627O343469O354250j948587r810468q346122j014427L044049J548452
$$ 7313627 13657096 20011346 18062759 8252291 -93831 -1108258 1935791 3484243
38158C484243j247202k166215q60894K069582M518953L906047J344951O63054
$$ 3484243 2237041 70826 -790068 1279514 5798467 9704514 11049465 11712519
38150A1712519J748850N08325k910199k982576J243914K976797j001794l841190
$$ 11712519 13461369 13969694 11059495 8076919 9320833 12297630 11295836 7454646
38142G454646O3528M640448J648802n011462m789250K570779O327320J197680
$$ 7454646 7518174 12158622 13807424 8795962 4006712 6577491 12904811 14102491
38134A4102491n389559n264777m89072K268627K025223K040984J948397j541849
$$ 14102491 8712932 3448155 2959083 5227710 7252933 9293917 11242314 9700465
38126I700465o694974o345690J854015R604801P225553l298139r967581n828383
$$ 9700465 3005491 -3340199 -1486184 8118617 15344170 12046031 2078450 -3749933
38118c749933K847919N748183J298981l793969m544717k075537O20693K275380
$$ -3749933 -902014 4846169 6145150 2351181 -2193536 -4269073 -3648380 -1373000
38110a373000K525303J337337k17098j115896j838387k408152p68998L597247
$$ -1373000 1152303 2489640 2272542 1156646 -681741 -3089893 -3858891 -261644
38102b61644O569432M297639n58475k362293n63962J096327J452109J572948l94851
$$ -261644 6307788 10605427 10046952 7684659 7120697 8217024 9669133 11242081 10847230
38093A0847230n943338q939652j530536J1701820J5946414N907686o396286q375719
$$ 10847230 4903892 -4035760 -5566296 6135524 22081938 27989624 21593338 13217619
38085A3217619k254961K398950K949532K508939J194134k467870n424871l415725
$$ 13217619 10962658 13361608 16311140 18820079 20014213 17546343 12121472 8705747
38077H705747J940912N440842N264063L006397J76147j162846J233433M660879
$$ 8705747 10646659 16087501 21351564 24357961 24534108 23371262 24604695 29265574
38069B9265574K633561m197273o034441O87099N029709j691405r863736n535724
$$ 29265574 31899135 27701862 21667421 22354520 27384229 25692824 15829088 10293364
38061A0293364O559827R957651K606498j461093L696576Q033359N141695K545459
$$ 10293364 16853191 26810842 29417340 27956247 31652823 39686182 44827877 47373336
38053D7373336N642297O838215K07545n871601j875403P058636R993348P102976
$$ 47373336 53015633 59853848 60061393 54189792 52314389 59373025 69366373 76469349
38045G6469349O185112Q236049Q162613N997359O290559Q407379P396262L532790
$$ 76469349 82654461 90890510 99053123 105050482 111341041 119748420 127144682 130677472
38037A30677472K314352N509770R690121J2743039J4882990J4762613J1933439
$$ 130677472 132991824 138501594 148191715 160934754 175817744 190580357 202513796
38030B02513796J1335151J7150868K3837320K2613004J6097714J5853074K4139580
$$ 202513796 213848947 230999815 254837135 277450139 293547853 309400927 333540507
38023C33540507K9214090K2470909R919518R69646m883958j2511329j9700537
$$ 333540507 362754597 385225506 395145024 396114670 391230712 378719383 359018846
38016C59018846k0583771j6426462j4275297j6579139j9273946j9238987j7593000
$$ 359018846 338435075 322008613 307733316 291154177 271880231 252641244 235048244
38009B35048244j6090005j5308808j5869156j7194400j6338722j2324404r620461
$$ 235048244 218958239 203649431 187780275 170585875 154247153 141922749 132302288
38002A32302288j2082557j5498454j2676780m814020m65259k978600o457150n738347
$$ 132302288 120219731 104721277 92044497 87230477 86765218 83786618 77329468 71591121
37994G1591121l114512k513371l709590n496877q209800r644003n295405K933105
$$ 71591121 68476609 65963238 62253648 56756771 48546971 38902968 33607563 36540668
37986C6540668N471339j501982q448655o014055M63578N3280n429080m789057
$$ 36540668 42012007 40510025 32061370 26047315 26510893 26564173 21135093 16346036
37978A6346036L056203O802854J468114m055706k811416q81036n161627j0258020
$$ 16346036 19402239 26205093 27673207 23617501 20806085 19925049 14763422 4505402
37970D505402p411224O64161M464308K760764K484190N801195P398467M475379
$$ 4505402 -2905822 -2241661 2222647 4983411 7467601 13268796 20667263 25142642
37962B5142642M33379k438194n879275r394626q539853k455450L215301M351775
$$ 25142642 25576021 23137827 17258552 7863926 -675927 -3131377 83924 4435699
37954D435699L635547L990520K453924l724607r150131n881186M179632R648308
$$ 4435699 8071246 12061766 14515690 10791083 1640952 -4240234 -60602 9587706
37946I587706M062421n635681q297902k390342L806521L842657k24453l133823
$$ 9587706 13650127 8014446 -283456 -2673798 1132723 4975380 4750927 1617104
37938A617104l377296k269497j4524L101840L981976J67451m830393m704046R84259
$$ 1617104 -1760192 -4029689 -4044213 -942373 3039603 3207054 -1623339 -6327385 -5343126
37929e343126O256143P365066O430174N102620J102501n630373r530630p081137
$$ -5343126 913017 8278083 14708257 19810877 20913378 15283005 5752375 -1328762
37921a328762k695780j344935l10745M627668Q991345M631640o555182j3006138
$$ -1328762 -4024542 -5369477 -5680222 -1052554 7938791 12570431 6015249 -6990889
37913f990889q493044Q33353O062814N503073K789969Q74159P55910J922745J942734
$$ -6990889 -15483933 -14650580 -8587766 -3084693 -294724 579435 1335345 3258090 5200824
37904E200824p52387k934324p1898N538872N919046j353589q720371q462068k067236
$$ 5200824 4448437 1514113 1442215 6981087 12900133 11546544 2826173 -5635895 -7703131
37895g703131L518470M681373K617649k93725j883238o32763K238791L350744
$$ -7703131 -4184661 496712 3114361 2820636 937398 304635 2543426 5894170
37887E894170J794802M15576R10671J316491L26580o4167J069538P69295k740195
$$ 5894170 7688972 8104548 9015219 10331710 10658290 10594123 11663661 12432956 9692761
37878I692761n880633m703134j186215l18885k737850m155210j296767M367428
$$ 9692761 3812128 -891006 -2077221 -2396106 -5133956 -9289166 -10585933 -6218505
37870f218505Q335438P073492J235991m555898o498777n575272m454036k384721
$$ -6218505 2116933 9190425 10426416 5870518 -628259 -6203531 -10657567 -13042288
37862a3042288K155125N588675L076591k225270k136691L351721N253790L92313
$$ -13042288 -10887163 -5298488 -2221897 -4447167 -6583858 -3232137 2021653 2413966
37854B413966l360526j026266J277961j237801k433629K696957O626885J644205
$$ 2413966 -946560 -1972826 -694865 -1932666 -4366295 -1669338 4957547 6601752
37846F601752n177555l042195L492830K063273n318653m705393N923391J2194003
$$ 6601752 1424197 -1617998 1874832 3938105 -1380548 -6085941 -162550 12031453
37838A2031453N692178m178867n940221j251973J743384L30211l429824p177441
$$ 12031453 17723631 13544764 7604543 6352570 8095954 8426165 4996341 -2181100
37830b181100p367274j341372O172413O473058k72044m357750j641981Q75311
$$ -2181100 -9548374 -10889746 -4717333 1755725 1483681 -2874069 -4516050 -3640739
37822c640739j292806k216156K100924M493788j047513p096246l698610N196209
$$ -3640739 -4933545 -7149701 -5048777 -554989 -1602502 -8698748 -12397358 -7201149
37814g201149P591908J445165m123311l439164k64669L38543j808564m150849
$$ -7201149 390759 1835924 -2287387 -5726551 -5991220 -5652677 -7461241 -11612090
37806a1612090l974343M98427O942385Q844444L359142l406132m072369J25680
$$ -11612090 -15586433 -15088006 -8145621 698823 4057965 651833 -3420536 -3294856
37798c294856K801111K451074K318610K786831J206251j819480k571066l01068
$$ -3294856 -493745 1957329 4275939 7062770 8269021 6449541 3878475 3577407
37790C577407K005645K190867Q8958l768375o468851l290371M840767Q795009
$$ 3577407 5583052 7773919 7862877 4094502 -2374349 -5664720 -823953 7971056
37782G971056K803174n863824o800185j631146N31814j044976M99847M733764
$$ 7971056 10774230 4910406 -1889779 -3520925 -2989111 -4034087 -3534240 1199524
37774A199524L411338l824050o644685r76974L602821m82391o590456n083231
$$ 1199524 4610862 786812 -5857873 -6834847 -3232026 -3714417 -10304873 -15388104
37766a5388104J872107N231647K458130k082042n199215n936439k577918M443409
$$ -15388104 -13515997 -8284350 -5826220 -7908262 -13107477 -19043916 -21621834 -17178425
37758a7178425R770015R180425N360898K629441J12181m064989o403540l113799
$$ -17178425 -7408410 1772015 7132913 9762354 9874535 5809546 -593994 -3707793
37750c707793K028582K732346M07715J117443M268417L450793j792410m559574
$$ -3707793 -1679211 1053135 1460850 2578293 6846710 10297503 8505093 3945519
37742C945519k615155k486379p526168j0219560l105163Q221595J1149937L118497
$$ 3945519 1330364 -1156015 -8682183 -18901743 -22006906 -13785311 -2635374 483123
37734D83123n023817l821754K823802M237569k105242p738736n457791P80039
$$ 483123 -4540694 -8362448 -5538646 -1301077 -3406319 -11145055 -16602846 -15822807
37726a5822807J976255k747102n024577J82120O874419O514512m8648m403657
$$ -15822807 -13846552 -16593654 -21618231 -21436111 -14561692 -8047180 -8095828 -12499485
37718a2499485k146112K934689N657093N006054K164045j937707n101702m107894
$$ -12499485 -14645597 -11710908 -6053815 -1047761 1116284 -821423 -5923125 -10031019
37710a0031019P06923M173405K453019j980417m353965m112969l729043k889373
$$ -10031019 -9324096 -5150691 -2697672 -4678089 -9032054 -13145023 -16874066 -19763439
37702a9763439J154884P319518R690872M990807k448758o018183m562470j520299
$$ -19763439 -18608555 -11289037 -1598165 3392642 943884 -5074299 -9636769 -11157068
37694a1157068J418562N099494P970100N883103j219882o912188n942844j161797
$$ -11157068 -9738506 -4639012 3331088 9214191 7994309 1082121 -4860723 -6022520
37686f022520J033236k67134o35195J776004L624447K146050r35606k619751k193640
$$ -6022520 -4989284 -5256418 -5891613 -4115609 -491162 1654888 719282 -1900469 -4094109
37677d094109j68068L064674N791333N149030Q00386l785048n403237m364509
$$ -4094109 -4262177 -1197503 4593830 9742860 10543246 6758198 1354961 -3009548
37669c009548k374239J77555K927918M023735K274907q29727l109187m050236
$$ -3009548 -5383787 -5206232 -2278314 1745421 4020328 3190601 81414 -3968822
37661c968822l714389j440500K406099N223117M714228J394053k513266m862155
$$ -3968822 -7683211 -9123711 -6717612 -1494495 3219733 4613786 2100520 -2761635
37653b761635l696287J409971O854913P249835K031057l477445n312487m964089
$$ -2761635 -6457922 -5047951 1806962 9056797 11087854 7610409 2297922 -2666167
37645b666167l993219j25718O806820J0240325M809921m331489p113285j739703
$$ -2666167 -6659386 -6785104 21716 10262041 15071962 10740473 3627188 1887485
37637A887485M284256N113288J865620k471502o455277p877226m671598K42799
$$ 1887485 6171741 11285029 13150649 10679147 4223870 -3653356 -8324954 -8082155
37629h082155Q60021l184082n144630q69580M939836N371754M81246l570961k334270
$$ -8082155 -7222134 -10406216 -15550846 -16420426 -11480590 -6108836 -5627590 -9198551 -11532821
37620a1532821K639025O176369M751334m4613l461305l590226l190766l744641
$$ -11532821 -8893796 -2717427 2033907 1989294 -1472011 -5062237 -8253003 -11997644
37612a1997644j713333M779533R644485O348910j043252l054513M33987O62750
$$ -11997644 -13710977 -8931444 713041 7061951 6018699 2964186 3398173 4060923
37604D060923m514895o877784k263550K626921K743426K937944O767580P657478
$$ 4060923 -453972 -7331756 -9595306 -6968385 -4224959 -1287015 5480565 13138043
37596A3138043O50227o196355l636040K644368P14849p451932q663010Q8811O981201
$$ 13138043 13788270 7591915 3955875 6600243 7315092 -136840 -8799850 -8711039 -1729838
37587a729838M062426k004258k371339J225629K277271K72420j187781j892927
$$ -1729838 2332588 328330 -2043009 -817380 1459891 1732311 544530 -1348397
37579a348397m000773o249525m812558Q13178O486407Q030314N308570J821670
$$ -1348397 -5349170 -11598695 -16411253 -15598075 -9111668 -1081354 4227216 6048886
37571F048886R92765K675959L689420K169407k11129j460201k164541l056197
$$ 6048886 7041651 9717610 13407030 15576437 15365308 13905107 11740566 8684369
37563H684369k715103p80766q6853j630404j336981K844682N012252l7424o056259
$$ 8684369 5969266 5188500 5101647 3471243 2134262 4978944 9991196 9953772 3897513
37554C897513l029477O419606R554984K705226l904710k925666M88844M70169
$$ 3897513 868036 7287642 16842626 19547852 15643142 12717476 13206320 13676489
37546A3676489Q7634K164158J317859n394247r079090j641331R004047Q896418
$$ 13676489 13764123 15928281 17246140 11851893 2772803 1131472 10135519 19031937
37538A9031937j011513o867932l277897M55243l023879q127854o464689R61832
$$ 19031937 18020424 11152492 7874595 8329838 5305959 -2821895 -9286584 -8324752
37530h324752P132790Q486031O132720K122694j224792j568497M51939J101215
$$ -8324752 -1191962 7294069 13426789 15549483 14324691 12756194 13208133 14309348
37522A4309348j151170l111643j903997M91443L44563k689844o043751p644288
$$ 14309348 13158178 10046535 8142538 8633981 8978544 6288700 244949 -7399339
37514g399339o496856k050065M239007Q233989O906273K240691q72171l69164
$$ -7399339 -13896195 -15946260 -11707253 -3473264 3433009 5673700 4801529 4432365
37506D432365J214548O66466j903922l614859k447837N45419K672713K604282
$$ 4432365 5646913 6313379 4409457 794598 -1653239 -1107820 1564893 4169175
37498D169175J343668N32674Q89757K380770M367439M910572J721834m627104
$$ 4169175 5512843 6045517 6935274 9316044 13683483 18594055 20315889 15688785
37490A5688785r680811r103957l275454L110004N292695J937328l755181n691265
$$ 15688785 6007974 -3095983 -6371437 -3261433 2031262 3968590 213409 -5477856
37482e477856m20702P332741P985473j153174j0673324r784339L27274Q888657
$$ -5477856 -5898558 1434183 9419656 8266482 -2406842 -12191181 -11863907 -2975250
37474b975250R419459N255919J843342J59289p12908k61369J347791J915896O03788
$$ -2975250 6444209 11700128 13543470 13702759 12989851 12728482 14076273 15992169 16595957
37465A6595957m56198J67225J212938K113734M514479P977752Q085093K414547
$$ 16595957 16139759 16306984 17519922 19633656 24148135 32125887 40210980 42625527
37457D2625527m519203o354490l126116m52501j348222k735990o23414M222581
$$ 42625527 38106324 31751834 28625718 28173217 26824995 24089005 23465591 27688172
37449B7688172P362620O243824L155868K252904M320060N940918M344249J133732
$$ 27688172 35050792 41294616 44450484 46703388 51023448 56964366 61308615 62442347
37441F2442347n24659m42716k70887M41730L015251N433005M199745M93657o24981
$$ 62442347 61917688 61474972 61204085 61645815 64661066 70094071 74293816 74787473 74162492
37432G4162492J872239L004204n10823n595007q297658r099858r683392q935831
$$ 74162492 76034731 79038935 78528112 72933105 64635447 55535589 45852197 36916366
37424C6916366n768989j990731J045279M571151P779172O070718j289162o746226
$$ 36916366 31147377 29156646 30201925 34773076 42552248 48622966 47333804 40587578
37416D0587578m083039J507569M67157o658589j0086990n348550J322260L266080
$$ 40587578 36504539 38012108 38479265 31820676 21733686 16385136 17707396 20973476
37408B0973476J611494N96813P40365K40160r38524j731418k149405k419852j897691
$$ 20973476 22584970 23181783 23922148 24162308 23223784 21492366 19342961 16923109 15025418
37399A5025418l57297J222718J835350R40747j800608n261192o387282l851692
$$ 15025418 14668121 15890839 17726189 18666936 16866328 11605136 5217854 1366162
37391A366162q85275r33339k003306Q9073M164403N105129K361207N91867J284109
$$ 1366162 480887 -452452 -2455758 -2366685 1797718 6902847 9264054 9855921 11140030
37382A1140030O57325k330607l024798O31701L446156J085485k736558k271498
$$ 11140030 11797355 9466748 6441950 7073651 10519807 11605292 8868734 6597236
37374F597236J553154L612212K146084r79305m197157n825083l303376K290517
$$ 6597236 8150390 11762602 13908686 12929381 8732224 2907141 -396235 1894282
37366A894282M691384P69359l494497j593182K938079K370654k025435k232627
$$ 1894282 6585666 7355025 3860528 2267346 5205425 7576079 5550644 3318017
37358C318017K318751L352448k093707o355365l662046J135223J609623k76995
$$ 3318017 5636768 8989216 6895509 540144 -3121902 -1986679 -377056 -654051
37350f54051L58313K384186K421731K322834M915063O196605N73576q197544j0358791
$$ -654051 -295738 2088448 4510179 6833013 11748076 17944681 18518257 10320713 -38078
37341c8078m312984J159454J72691k973138k653487n28401o22883j728364m09410
$$ -38078 -4351062 -3191608 -3018917 -5992055 -8645542 -9173943 -9796826 -11525190 -11934600
37332a1934600K324253K930654J417029N39782P88610P15943O60454J656135J992680
$$ -11934600 -9610347 -6679693 -5262664 -4722882 -3934272 -3218329 -2557875 -901740 1090940
37323A090940n00434l674283l276226M87289L153110K580003Q97167O8965O1276
$$ 1090940 590506 -3083777 -6360003 -5872714 -2719604 -139601 757566 826531 887807
37314H87807J112061K810826J434338n554084j2329229r677133J339454R066648
$$ 887807 1999868 4810694 6245032 690948 -11638281 -21315414 -19975960 -10909312
37306a0909312P671304M702158O958964Q513109J792682p359881p590618l16325
$$ -10909312 -3238008 1464150 8423114 16936223 18728905 11369024 3778406 3462081
37298C462081K682041j814364m856725j549723J641102o11396l765938k607439
$$ 3462081 6144122 4329758 -526967 -2076690 -435588 -1046984 -4812922 -7420361
37290g420361O9199K44215L38386L242073N259169K402134j530572p89684K517882
$$ -7420361 -7351162 -7106947 -6768561 -3526488 1732681 4134815 2604243 1814559 4332441
37281D332441K212450j374674k511492n5875J464744M50503N31673L091549L845499
$$ 4332441 6544891 5170217 2658725 2602850 4067594 4518097 5049770 8141319 11986818
37272A1986818n75440p064793r785092o820346j172985K995953L703874K000255
$$ 11986818 11411378 4346585 -5438507 -12258853 -13431838 -10435885 -6732011 -4731756
37264d731756N95848J318596L680355N650168N048842R25277m352719n330087
$$ -4731756 -4135908 -2817312 863043 6513211 11562053 12487330 8134611 2804524
37256B804524L18587O139044L173056o898386j1855929n515541L374605M610742
$$ 2804524 3123111 9262155 12435211 5536825 -6319104 -11834645 -8460040 -3849298
37248c849298J320524K321836N769122K431151p117246j1405198n497292K125428
$$ -3849298 -2528774 -206938 5562184 7993335 876089 -10529109 -16026401 -13900973
37240a3900973L713535K801550N019749P430769M817095K25049M04166L940959
$$ -13900973 -10187438 -7385888 -2366139 5064630 9881725 10106774 10510940 14451899
37232A4451899K519321o073387j3193724j0057059Q25092Q374841O258427K64246
$$ 14451899 16971220 10897833 -2295891 -12352950 -11527858 -3153017 3105410 3369656
37224C369656J07909N705827P129283p3686o603831k886398N144517M252940n088037
$$ 3369656 3477565 9183392 16312675 16238989 9635158 6748760 11893277 16146217 11058180
37215A1058180r112601l215451N20556n873879j1597941l818401J1239151J7005924
$$ 11058180 1945579 -1269872 -749316 -6623195 -18221136 -22039537 -10800386 6205538
37207F205538R936996P68973l626991n768139o388814k071306M116997K992160
$$ 6205538 16142534 16911507 13284516 7516377 1127563 -943743 3173254 6165414
37199F165414n261524p886148J586431J1601758Q474573l873777j0317426n752410
$$ 6165414 903890 -6982258 -5395827 6205931 14680504 10806727 489301 -5263109
37191e263109Q76046J950393Q2633K37383J753466J975411J657643K262603J936481
$$ -5263109 -4387063 -2436670 -2354037 -2116654 -363188 1612223 3269866 5532469 7468950
37182G468950j333391n083608n140520j598454J794372L231800L753417K957987
$$ 7468950 6135559 1051951 -4088569 -5687023 -3892651 -660851 3092566 6050553
37174F050553j245176p234356q974514m125317J087762j8549m344364l191267
$$ 6050553 4805377 -2428979 -11403493 -15528810 -14441048 -14459597 -18803961 -21995228
37166b1995228M165574Q453078L908611l102604l441012K190065N993726M916839
$$ -21995228 -17829654 -9376576 -5467965 -8570569 -12011581 -9821516 -3827790 1089049
37158A089049K757805J847434j09896l862411n558715k616045J821833L311604
$$ 1089049 3846854 5694288 5584392 1721981 -3836734 -6452779 -4630946 -1319342
37150a319342J670683p72833l454618o536115p736072m398981J711171N333563
$$ -1319342 351341 -421492 -3876110 -10412225 -18148297 -22547278 -20836107 -15502544
37142a5502544M081509J124911M48195J808486K232241Q67802k24148K80534J229797
$$ -15502544 -11421035 -10296124 -9847929 -8039443 -5807202 -4939400 -5163548 -4883014 -3653217
37133c653217J681199K763119M835770M894288K42784n991243p211272k187441
$$ -3653217 -1972018 791101 5626871 10521159 10763943 4772700 -2438572 -4626013
37125d626013K546077J503749k281112k479965P10534J455433j879319l924977
$$ -4626013 -2079936 -576187 -2857299 -5337264 -4626730 -3171297 -5050616 -8975593
37117h975593j052611K516035J292481k433843j629243M391516P714146K696167
$$ -8975593 -10028204 -7512169 -6219688 -8653531 -10282774 -5891258 1822888 4519055
37109D519055n401150o947088r40357L951755J837379k498435j507794L667496
$$ 4519055 -882095 -7829183 -8769540 -4817785 -2980406 -5478841 -6986635 -3319139
37101c319139N382441J235412k927166k355115L96605R97362j35483l56723K80398
$$ -3319139 2063302 3298714 371548 -1983567 -1586962 -589600 -725083 -1081806 -801408
37092h01408O07625J632681M136398N550909L284280r71835l949813n413103o230726
$$ -801408 -193783 1438898 5575296 11126205 14410485 13438650 9488837 4075734 -2154992
37083b154992m763327K7949M455534M459004J796289K28915j669185o573499r640083
$$ -2154992 -6918319 -6890370 -2434836 2024168 3820457 4049372 2380187 -4193312 -13833395
37074a3833395l290729R032667J4034368O303388m323304p292234m471546l064447
$$ -13833395 -17124124 -8091457 5942911 12246299 7922995 630761 -3840785 -6905232
37066f905232l546746k432838q43846j610800k094585J347709M831641K106287
$$ -6905232 -10451978 -12884816 -13728662 -15339462 -17434047 -16086338 -11254697 -9148410
37058i148410l472517k034838P172509J2965088Q082439o43403l092691r2148
$$ -9148410 -12620927 -14655765 -7483256 5481832 13564271 12920868 9828177 9736029
37050I736029P6218m614871p568048m465246L33606Q45052j641311j052235L664046
$$ 9736029 9812247 5197376 -2370672 -6835918 -6502312 -5657260 -7298571 -8350806 -4686760
37041d686760O025567J051887o562477p407233J42107O925927M462171m106182
$$ -4686760 1338807 2390694 -4171783 -11579016 -11436909 -4510982 -48811 -4154993
37033d154993q141119k863623N494871P989897K982657l415083m674255k2186
$$ -4154993 -12296112 -15159735 -9664864 -1674967 1307690 -2107393 -6781648 -6803834
37025f803834N589918O363242R16869o408444r460343n878781R52459N401220
$$ -6803834 -1213916 5149326 6066195 -342249 -9802592 -15681373 -14728914 -9327694
37017i327694N026485K508471J860944L045285K066237k650995o431353m016831
$$ -9327694 -4301209 -1792738 68206 3113491 5179728 2528733 -3902620 -7919451
37009g919451K321657M707853m0891o409530p689607l211804L621038R763223
$$ -7919451 -5597794 -889941 -930832 -7340362 -15029969 -18241773 -14620735 -4857512
37001d857512J2128027P661364j680711p904958o089908j397660j494506n045783
$$ -4857512 7270515 14931879 13251168 5346210 -743698 -2141358 -3635864 -8681647
36993h681647m669038O33494M176676K819866J133473K177198K024033k241958
$$ -8681647 -13350685 -12717191 -8540515 -5720649 -4587176 -2409978 -385945 -2627903
36985b627903n680314k675209L398234M318377j172247n863716m223605J135457
$$ -2627903 -8308217 -10983426 -7585192 -3266815 -4439062 -10302778 -14526383 -13390926
36977a3390926M316172L572007J752576J506538K385860K433079J233941N36129
$$ -13390926 -9074754 -5502747 -3750171 -2243633 142227 2575306 3809247 4345376
36969D345376J686269L214606K294023j260882m027390l023275L99048K157713
$$ 4345376 6031645 9246251 11540274 10279392 6252002 3228727 3627775 5785488
36961E785488M98365k097399k465181r76641p59052k805207l910696j241251K550192
$$ 5785488 6283853 4186454 1721273 744632 -14420 -2819627 -6730323 -7971574 -5421382
36952e421382K225288k001683l776950m2486L452088N45387n034584m421835K585247
$$ -5421382 -3196094 -5197777 -8974727 -9017213 -5565125 -5019738 -10054322 -14476157 -11890910
36943a1890910O130616N22395p037769o330959J976500P885303N388544j192501
$$ -11890910 -5760294 -5237899 -12275668 -18606627 -16630127 -8744824 -3356280 -4548781
36935d548781m337792k406626M34731J014125Q78689K683377M981696L498022
$$ -4548781 -8886573 -11293199 -10858468 -9844343 -8965654 -6282277 -1300581 2197441
36927B197441k090566n982064l399030K580509M991890K078760j884561l616214
$$ 2197441 106875 -5875189 -9274219 -6693710 -1701820 376940 -1507621 -5123835
36919e123835l415417j176218L855868Q134743N256661m444522j1429449q395434
$$ -5123835 -8539252 -9715470 -5859602 2275141 7531802 3087280 -8342169 -16737603
36911a6737603L15695N353371M446243K547507K854349L593977K679429N45318
$$ -16737603 -16421908 -11068537 -6622294 -4074787 -1220438 2373539 5052968 5598286
36903E598286j599253k856374k431496j059294j370340m033966n329375j884547
$$ 5598286 3999033 1142659 -1288837 -2348131 -3718471 -7752437 -13081812 -14966359
36895a4966359L913049O849546N582978K638150n36706m025427o062989m020228
$$ -14966359 -11053310 -4203764 1379214 4017364 3480658 -544769 -6607758 -10627986
36887a0627986J064468M692234L988320J16754l608262l814149O17410N478327
$$ -10627986 -9563518 -4871284 -882964 -766210 -4374472 -8188621 -7571211 -2092884
36879b092884L649659n241103j1272033o264416M037773P454276K458925j530784
$$ -2092884 1556775 -3684328 -14956361 -21220777 -17183004 -9728728 -7269803 -8800587
36871h800587R0852J906353N70251Q26483M795066N481636j744807r144616o751429
$$ -8800587 -8709735 -6803382 -6233131 -5406648 -611582 4870054 3125247 -6019369 -12770798
36862a2770798K686406P592572L501962k725111l459122J345558O218568O121305
$$ -12770798 -10084392 -2491820 1010142 -1714969 -5174091 -3828533 2390035 8511340
36854H511340O30342n083151n028628j2824K956487R46615p25408J705590L300018
$$ 8511340 9141682 4058531 -970097 -982921 1973566 2920181 2194773 3900363 7200381
36845G200381n69900m677577k265368K567589J648586k054524J089634R090395
$$ 7200381 6630481 1952904 -312464 2255125 3903711 1849187 2938821 12029216
36837A2029216Q959596k042798j0050103n454773K600074J516312n450352o562092
$$ 12029216 20988812 18946014 8895911 3441138 6041212 7557524 2107172 -4454920
36829d454920j043454J633719j376298k633565J982365O661555N537583J080588
$$ -4454920 -5498374 -3864655 -5240953 -7874518 -5892153 769402 6306985 7387573
36821G387573j315172j308277j863804l271630l055553j96894L447699N280708
$$ 7387573 6072401 4764124 2900320 -371310 -3426863 -3623757 -176058 5104650
36813E104650L961670l3489m692128p551926p116480l638792P07466K595311M19166
$$ 5104650 9066320 9032831 4340703 -3211223 -10327703 -13966495 -13259029 -10663718 -10244552
36804a0244552k876677k272533K584400O072776M481909J741759L000279N499400
$$ -10244552 -13121229 -15393762 -12809362 -6736586 -2254677 -512918 2487361 7986761
36796G986761K325187n621079q918531l059966M061399K792081m617275p086956
$$ 7986761 10311948 4690869 -4227662 -7287628 -3226229 -434148 -5051423 -12138379
36788a2138379Q7806R123698J0226092L790000j272326M40172M668359M511587
$$ -12138379 -12050573 -2926875 7299217 11089217 9816891 10257063 14925422 19437009
36780A9437009M4301k949711k386781k512398n711848p402536l451502J700719
$$ 19437009 19481310 16531599 14144818 11632420 5920572 -1481964 -4933466 -3232747
36772c232747P00869n210391p455381k531647L909383O423781O171956N536277
$$ -3232747 -2531878 -7742269 -15197650 -17729297 -13819914 -7396133 -1224177 4312100
36764D312100L201846j265088l715852j496526J181370o07215m513221m796363
$$ 4312100 7513946 6248858 2533006 1036480 2217850 1610635 -2902586 -7698949
36756g698949j451538O23565r9093m67233R40038J859043J235812J048612K205053
$$ -7698949 -9150487 -8526922 -8626015 -9093248 -8153210 -6294167 -5058355 -4009743 -1804690
36747a804690K724326J176010j290281l091861l599098k250266P91315L243302
$$ -1804690 919636 2095646 805365 -2286496 -5885594 -8135860 -7344545 -4101243
36739d101243L026755J522733J183104R03749j775602m637744k697705L311429
$$ -4101243 -1074488 448245 1631349 2535098 759496 -3878248 -6575953 -3264524
36731c264524O482102L690152J11305P09287K711053R35689l799521o714008o366651
$$ -3264524 3217578 6907730 7019035 7728322 10439375 11375064 7575543 861535 -5505116
36722e505116m697049j993142K677999O991083O739888K191954j422102j031651
$$ -5505116 -10202165 -12195307 -9517308 -2526225 4213663 6405617 4983515 3951864
36714C951864L12032j540451n658463p467684n002597j030122J202782K012200
$$ 3951864 4263896 2723445 -2935018 -10402702 -15405299 -16435421 -15232639 -13220439
36706a3220439L462636M975354L788038N8539k104569p58009L25483k120134m502112
$$ -13220439 -9757803 -4782449 -994411 -935872 -3040441 -3798450 -3472967 -5593101 -10095213
36697a0095213j833847K969784K676206k256850l899821r2650K087579o29574
$$ -10095213 -11929060 -8959276 -6283070 -8539920 -12439741 -12532391 -10444812 -11074386
36689a1074386j295501M445972Q681769L485830m847602m950642J663971M059043
$$ -11074386 -12369887 -7923915 757854 4243684 -603918 -5554560 -3890589 168454
36681A68454M6359k106594Q03238K915785K026529L171758O328051L586792n805698
$$ 168454 214813 -1891781 -1088543 1827242 3853771 7025529 13353580 16940372 11134674
36672A1134674r912018j628723Q873187Q835451J129247k981787j886587k219345
$$ 11134674 1222656 -406067 8467120 17302571 18431818 15450031 13563444 11344099
36664A1344099m569550l692908n67746j416970n016133l249472M288892P937556
$$ 11344099 6774549 3081641 2513895 1096925 -3919208 -7168680 -2879788 5057768
36656E057768L139785k931811m040617l687774n557011n085827J473992P578841
$$ 5057768 8197553 5265742 1225125 -2462649 -8019660 -13105487 -11631495 -4052654
36648d052654N284591j968123m811209k107344j18673l49653J562341N447552
$$ -4052654 1231937 -736186 -5547395 -7654739 -7773412 -8123065 -6560724 -1113172
36640a113172N107776j066812o380659n406904m53989L903463O133023N125971
$$ -1113172 3994604 2927792 -3452867 -8859771 -9313760 -5410297 722726 5848697
36632E848697o24753p545228p465570J494386J0236433J0023076L150687l037181
$$ 5848697 5223944 -2321284 -9786854 -8292468 1943965 11967041 15117728 12080547
36624A2080547o787465r478303q200021l68239P560668O362218j923512o139695
$$ 12080547 5293082 -4185221 -12385242 -12753481 -5192813 1169405 -754107 -6893802
36616f893802k369740J802657O91786k072082k392545j915249j224508L134789
$$ -6893802 -9263542 -7460885 -6769099 -8841181 -11233726 -13148975 -14373483 -11238694
36608a1238694R247040P667886l499346j1043187m441831P014214P348811k093938
$$ -11238694 -1991654 5676232 2176886 -8866301 -13308132 -6293918 1054893 -1039045
36600a039045o244444n48204M253656K016373K0800L558922N925002J289051l967122
$$ -1039045 -7283489 -7831693 -3578037 -1561664 -1540864 2018058 7943060 9232111 5264989
36591E264989k011445L016936K157424l962281p489215n890839l076396q94542
$$ 5264989 3253544 6270480 8427904 4465623 -3023592 -8914431 -11990827 -12885369
36583a2885369J884335L882530K507204J80265J724462N818780O166678J476866
$$ -12885369 -11001034 -7118504 -4611300 -4431035 -2706573 3112207 9278885 10755751
36575A0755751k598920k480890j011432j026915q54201R47197J796725k67485
$$ 10755751 8156831 5675941 4664509 3637594 2783393 3730590 5527315 5259830
36567E259830k403058j416161Q21300O30557j047104r3622L626955N033402R52981
$$ 5259830 2856772 1440611 2261911 2892468 1845364 1751742 5378697 10412099 11365080
36558A1365080m712551n394793j44584N080065M732794R8894l162988k331546
$$ 11365080 6652529 1257736 1113152 6193217 10926011 11024905 7861917 5530371
36550E530371J98689J530794J649008J291590j43812k385674k799178n9885K762267
$$ 5530371 5729060 7259854 8908862 10200452 10056640 7670966 4871788 4811903 7574170
36541G574170K044763j001024k256017r33638j39710j539849l188707l118235
$$ 7574170 9618933 8617909 6361892 5428254 5288544 3748695 559988 -2558247
36533b558247j889184p81992o9480J65388k50410m87460N61114K128425K278975
$$ -2558247 -4447431 -5229423 -5298903 -5133515 -5383925 -5871385 -5310271 -3181846 -902871
36524i02871R64735J10847M91065R85862J159181J773841K209539M34978l222961
$$ -902871 61864 172711 663776 1649638 2808819 4582660 6792199 7227177 4004216
36515D004216n119793k922755R71803K577478J262703k88916P7655J878705L155950
$$ 4004216 -1115577 -4038332 -3066529 -489051 773652 484736 562391 2441096 5597046
36506E597046K588120O73147q60831j229822j684071l182185l775335q31472M073427
$$ 5597046 8185166 8858313 7997482 6767660 5083589 1901404 -1873931 -2705403 1368024
36497A368024N545599J012393n467030p893218n005240k61989L308068N572402
$$ 1368024 6913623 7926016 2458986 -5434232 -10439472 -10701461 -7393393 -1820991
36489a820991P005089O613642L358259j587378n454865o709338o153097m825779
$$ -1820991 5184098 11797740 15155999 13568621 8113756 1404418 -4748679 -9574458
36481i574458k214393J890470M891001L671033m34883k271200K70837L321220
$$ -9574458 -11788851 -9898381 -5007380 -1336347 -1771230 -4042430 -3771593 -450373
36473d50373K972984O84243k18779k1224o06333r65480M54328J331901j228274
$$ -450373 2522611 3206854 2988075 2966851 2360518 1395038 1849366 3181267 1952993
36464A952993m872276n160821k787695j327908L45591N515857J0546264P925371
$$ 1952993 -2919283 -8080104 -10867799 -12195707 -11850116 -6334259 4212005 12137376
36456A2137376o07632m213282O29258M212101n00684o147077l354290L504711
$$ 12137376 11529744 7316462 7945720 12157821 11657137 5510060 2155770 5660481
36448E660481L406662l802115p980282m377949J369293L469406K458290Q71765
$$ 5660481 9067143 5265028 -2715254 -7093203 -5723910 -2254504 203786 1075551
36440A075551k76177J95704K871977M874813K977680r86044l175060m534135p773911
$$ 1075551 799374 995078 3867055 8741868 11719548 10733504 7558444 3024309 -4749602
36431d749602r338528l289995O749984R387376J676462n688009l562265L621800
$$ -4749602 -14088130 -17378125 -10628141 -1240765 435697 -5252312 -8814577 -5192777
36423e192777O481073L918336R32056r01893k993787l675459m10473L895187L832502
$$ -5192777 1288296 5206632 6138688 5236795 2243008 -1432451 -1842924 2052263 5884765
36414E884765j08084k265356n91610J143010K89371j028354m73971R53147J697613
$$ 5884765 5776681 3511325 2919715 4062725 4352096 3323742 2849771 3802918 5500531
36405E500531K067364J854771r58602o370686r802335o749611R32212O317191
$$ 5500531 7567895 9422666 8464064 2093378 -7708957 -14458568 -13526356 -7209165
36397g209165N145845Q6730l387818l396649k185618j463802j26264K579818M368017
$$ -7209165 -2063320 -1976590 -5364408 -8761057 -10946675 -12410477 -12536741 -9956923 -5588906
36388e588906K980451M70580J071567M882750P017395M007931j846062o063571
$$ -5588906 -2608455 -2137875 -1066308 3816442 10833837 14841768 12995706 6932135
36380F932135p360189p346038o822913m938374j226859L405610P344332Q949905
$$ 6932135 -428054 -7774092 -14597005 -19535379 -20762238 -17356628 -10012296 -1062391
36372a062391P540531M543925K388556J492265O9935k352066l788697l491495
$$ -1062391 6478140 11022065 13410621 14902886 14972821 12620755 8832058 5340563
36364E340563l624303m864099l768182J570505O182570L961022k758354n543381
$$ 5340563 1716260 -3147839 -6916021 -5345516 837054 4798076 2039722 -3503659
36356c503659j902411J541796j83545k951312j114238K660297J459209m475143
$$ -3503659 -5406070 -3864274 -4047819 -6999131 -8113369 -5453072 -3993863 -8469006
36348h469006p190911k164794N613702Q569187N436369P93331j226348P1158L113251
$$ -8469006 -15659917 -17824711 -12211009 -3641822 1794547 2587878 1361530 1432688 4545939
36339D545939N187699L537180j779998o562805o594264k957669o48206j741731
$$ 4545939 9733638 13270818 11490820 4928015 -1666249 -4623918 -5272124 -7013855
36331g013855k928237r20622K636939L963115K754535J970592K821601L071746
$$ -7013855 -9942092 -10862714 -8225775 -4262660 -1508125 462467 3284068 6355814
36323F355814Q57340k124217k505019P01652M826269O030663L028474j338790
$$ 6355814 7213154 5088937 2583918 3285570 8111839 14142502 17170976 15832186
36315A5832186k811768p07958Q42518j829279o487451p405453l047660J681812
$$ 15832186 13020418 12312460 13154978 11325699 4838248 -2567205 -5614865 -3933053
36307c933053J833082j724898m669845n104468m264298k666982R33856O145642
$$ -3933053 -2099971 -3824869 -8494714 -13599182 -17863480 -20530462 -19596606 -13450964
36299a3450964R268148P057379J149348l239668l166467r44553m58211j921259
$$ -13450964 -4182816 2874563 4023911 784243 -2382224 -3326777 -3784988 -5706247
36291e706247k256778j12835K299111L141641L708146N011137M340699q80298
$$ -5706247 -7963025 -8075860 -5776749 -2635108 1073038 6084175 10424874 9544576
36283I544576p188011p852347k082492L094933K055338k248920l285017n7385
$$ 9544576 2356565 -5495782 -7578274 -4483341 -2428003 -4676923 -7961940 -8019325
36275h019325K654023J604316j359545k927891k142766J83620L205206N721286
$$ -8019325 -5365302 -3760986 -5120531 -8048422 -10191188 -10007568 -6802362 -1081076
36267a081076N839718K911500o48696j315264J059606K117524j730314p368893
$$ -1081076 4758642 7670142 7021446 5706182 6765788 8883312 7152998 -215895
36259b15895p387259J69838P663569O886705j44118m369261k512355l55906k273758
$$ -215895 -7603154 -7433316 230253 7116958 6972840 2603579 91224 -264682 -2538440
36250b538440m580200l037494o45393j804073l285858J120672Q996789J0803351
$$ -2538440 -7118640 -10156134 -10801527 -12605600 -15891458 -14770786 -5773997 5029354
36242E029354L794210l401092l237261K08190j650224q481801j1220550m771106
$$ 5029354 8823564 5422472 2185211 2393401 743177 -7738624 -18959174 -23730280
36234b3730280N150168R462915O249994J191719m71588Q84334K054912J820666
$$ -23730280 -18580112 -9117197 -2867203 -1675484 -2147072 -1262738 792174 2612840
36226B612840J063088m7285k047155l740795k810523L27923J956292j31943l388208
$$ 2612840 3675928 3628643 1581488 -2159307 -4969830 -4641907 -2685615 -2817558 -6205766
36217f205766l898880j346285J217140J176634j550322m681848m575727P56087
$$ -6205766 -10104646 -11450931 -10233791 -9057157 -10607479 -15289327 -19865054 -19108967
36209a9108967Q017169J0622498O501024J050090l47693P27014J55365j024275
$$ -19108967 -11091798 -469300 6031724 7081814 6734121 7461135 7616500 6592225
36201F592225Q10272M034309L536718l38721j781189P65814J905513j488658m822837
$$ 6592225 7402497 11436806 14973524 14634803 12853614 13619428 15524941 14036283 9213446
36192I213446l051757J818458M406157L026117n81149m827423p779829o460827
$$ 9213446 6161689 7980147 12386304 15412421 14831272 10003849 2224020 -4236807
36184d236807p37415M625857N413646L065077J150748k13599k497508m210313
$$ -4236807 -4974222 -348365 5065281 8130358 9281106 9067507 6569999 2359686
36176B359686l037969n62804L9997l26227J702456N357404N877447J658824l183393
$$ 2359686 -678283 -1241087 -1201090 -1527317 175139 5532543 11409990 13068814 9885421
36167I885421m434198k398225J39019J518667J665339J350961J894293L753753
$$ 9885421 5451223 3052998 3192017 4710684 6376023 7726984 9621277 13375030
36159A3375030N154957L906839L50559l382030o206329p759747o525713j853877
$$ 13375030 18529987 22436826 22787385 19405355 13199026 5439279 -1086434 -2940311
36151b940311K865210L229812J23254j247894Q81973K555962P63066k304236l759116
$$ -2940311 -75101 3154711 3277965 2030071 2912044 5468006 6231072 3926836 167720
36142A67720m273762m849207l456892J164889N542284N628281K686976P78518
$$ 167720 -4106042 -8955249 -12412141 -11247252 -5704968 -76687 2610289 3388807
36134C388807L23294j096936k859631j701406J855576K881781m78706l538857
$$ 3388807 3712101 2615165 -244466 -1945872 -90296 2791485 2312779 -1226078
36126a226078j881218J939160K154168j916966n296731m463123j357655M86134
$$ -1226078 -3107296 -1168136 986032 -930934 -6227665 -10690788 -12048443 -11562309
36118a1562309R02933K203251M770062N968153L788221o8796k102078j519526
$$ -11562309 -10659376 -8456125 -3686063 2282090 6070311 6001515 3899437 2379911
36110B379911j220070l612254o731593o170723p24214N491935P262166L702068
$$ 2379911 1159841 -2452413 -9184006 -15354729 -16078943 -10587008 -3324842 377226
36102C77226j251080l109872p90328L219531N504333M258979L9768m938230p896268
$$ 377226 -873854 -3983726 -4774054 -1554523 3949810 8208789 8248557 3310327 -4585941
36093d585941o730452j656018L955821N861043L420700P26747J425749L460035
$$ -4585941 -11316393 -12972411 -9016590 -3155547 265153 991900 2417649 5877684
36085E877684J895526l298947o256879l313518J928171M364878M385593M823666
$$ 5877684 7773210 4474263 -1782616 -5096134 -3167963 1196915 5582508 10406174
36077A0406174M213011o76521o966348p548341j797411K497159M92453k935322
$$ 10406174 14619185 13942664 6976316 -572025 -2369436 127723 620176 -2315146
36069b315146j873047J219321P46802k031995j651765J484084J522450k731524
$$ -2315146 -4188193 -2968872 -2222070 -4254065 -5905830 -4421746 -2899296 -5630820
36061e630820n438629k752426J903260L682305K466675Q36051o0537l12220o5465
$$ -5630820 -11069449 -13821875 -11918615 -8236310 -5769635 -4933584 -4994121 -5306341 -5371806
36052e371806j36980j010308p32194K553300N913991M497757k50487j409936K443013
$$ -5371806 -5508786 -6519094 -7251288 -4697988 1216003 5713760 5463273 4053337 6496350
36043F496350L993184j204252o610206m263534K717004M504130j531970q408532
$$ 6496350 10489534 9285282 2675076 -1588458 1128546 5632676 4100706 -4307826
36035d307826r686646n819963q75158J856465J273214l08259J660972P657521
$$ -4307826 -13994472 -19814435 -20689593 -18833128 -17559914 -17868173 -16207201 -8549680
36027h549680J1147131O857360n98810k841108m42917j432793p325698r661320
$$ -8549680 2597451 9454811 8856001 6014893 5571976 4139183 -3186515 -12847835
36019a2847835l108347N820319P681636K139121l619668m552300j525346J885747
$$ -12847835 -15956182 -10135863 -2454227 -315106 -3934774 -8487074 -10012420 -8126673
36011h126673K828948J180145P5487K238691M994343K807834l900504p533451
$$ -8126673 -5297725 -4117580 -4042093 -1803402 3190941 5998775 2098271 -5435180
36003e435180l758234J898340K292328q20326l64718M518680P062176K961324
$$ -5435180 -9193414 -7295074 -5002746 -5823072 -6187790 -1669110 5393066 8354390
35995H354390l659386o125810l364307K66935J328153P03202N65581L64989j672812
$$ 8354390 4695004 -1430806 -4795113 -4528178 -3200025 -2496823 -1931242 -1566253 -3239065
35986c239065l701763j063115N905075R171596L138689n583637n613540L034605
$$ -3239065 -6940828 -8003943 -2098868 7072728 10211417 4627780 -985760 2048845
35978B048845Q422315L531983m823164p327421m424331j917386j074635J86021
$$ 2048845 10471160 14003143 9179979 1852558 -2571773 -4489159 -5563794 -5377773
35970e377773J199860M77820O8785J793579K672414K64885j374647J756460M833462
$$ -5377773 -4177913 -3700093 -3631308 -1837729 834685 1099570 -275077 1481383 6314845
35961F314845O42650p518324q929796j137543O805724Q045726N866597N030342
$$ 6314845 6957495 -560829 -9490625 -10628168 -3822444 4223282 10089879 15120221
35953A5120221L524586j983508q459607j0076861o266621j549764Q25569J596419
$$ 15120221 18644807 16661299 8201692 -1875169 -8141790 -9691554 -8865985 -7269566
35945g269566K902217N361516P286667O066878J266366l810215n281692l055717
$$ -7269566 -4367349 994167 8280834 14347712 15614078 11803863 6522171 3466454
35937C466454k54507Q15907j0486k036212l615894k519023N76821J280520k093990
$$ 3466454 3211947 4027854 4017368 1981156 -1634738 -4153761 -3576940 -2296420 -4390410
35928d390410m387260j030595L664896K610430k319210l188966P63044K481952
$$ -4390410 -8777670 -9808265 -6143369 -3532939 -5852149 -9041115 -8278071 -5796119
35920e796119j79688j488817O15651Q16022k038998n86898P745811J2975896O373237
$$ -5796119 -5975807 -7464624 -6848973 -6032951 -8071949 -8658847 -913036 12062860 18436097
35911A8436097n548450r819629m441563J472395J067603m400117r963166j0536674
$$ 18436097 12887647 3068018 -1373545 98850 1166453 -3233664 -13196830 -23733504
35903b3733504l187589Q249715J4260116J0780487M816231L315785K526472l602901
$$ -23733504 -26921093 -18671378 -4411262 6369225 11185456 14501241 17027713 13424812
35895A3424812j0350528q258693J070175O365109L011099k084400k222311J426906
$$ 13424812 3074284 -5184409 -4114234 2250875 5261974 3177574 955263 2382169
35887B382169M651821M963644J171883m804673o466338n15965N562080K547086
$$ 2382169 7033990 11997634 13169517 8364844 1898506 1382541 6944621 9491707
35879I491707n715335p316668j209203J545437l228704o292338j741746L055682
$$ 9491707 3776372 -3540296 -4749499 -3204062 -6432766 -12725104 -14466850 -11411168
35871a1411168J291488j471155J601534N730267L261613k392185k634992J796417
$$ -11411168 -10119680 -11590835 -9989301 -4259034 -997421 -3389606 -6024598 -4228181
35863d228181K914999j325822n648475o877211n971725k676452L425632Q038712
$$ -4228181 -1313182 -2639004 -8287479 -15164690 -21136415 -23812867 -20387235 -12348523
35855a2348523O437060J590016M05334K933315L147503k43238k154250p10464
$$ -12348523 -5911463 -4321447 -3916113 -982798 2164705 1921467 -232783 -943247
35847i43247j38642k341586l259692m72394K201714J199942j144139j208108N8495
$$ -943247 -1081889 -3423475 -6683167 -7155561 -4953847 -3753905 -4898044 -6106152 -6047657
$$ [...]
##END NTUPLES=NMR SPECTRUM
##END=
