##TITLE=31Pdec_BAU-j-XN
 CDCl3, 124 sc
 18.12.2019
##JCAMPDX= 6.0         $$ Bruker NMR JCAMP-DX V2.0
##DATA TYPE= NMR SPECTRUM
##DATA CLASS= NTUPLES
##ORIGIN= UXNMR, Bruker Analytische Messtechnik GmbH
##OWNER= root
$$ XWIN-NMR		Version 3.5
$$ Wed Dec 18 15:48:05 2019 Russian Standard Time (UT+4h)  she@DPX200
##.OBSERVE FREQUENCY= 81.013821
##.OBSERVE NUCLEUS= ^31P
##.ACQUISITION MODE= SIMULTANEOUS
##.ACQUISITION SCHEME= undefined
##.AVERAGES= 124
##.DIGITISER RES= 17
##SPECTROMETER/DATA SYSTEM= spect
##.PULSE SEQUENCE= zgpg30
##.SOLVENT NAME= CDCl3
##.SHIFT REFERENCE= (INTERNAL, CDCl3, 0, 182.463)
##AUDIT TRAIL= $$ (NUMBER, WHEN, WHO, WHERE, WHAT)
$$ ##TITLE= Audit trail, XWIN-NMR		Version 3.5
$$ ##JCAMPDX= 5.01
$$ ##ORIGIN= Bruker BioSpin GmbH
$$ ##OWNER= she
$$ F:/spectra/data/she/nmr/P31/1/pdata/1/auditp.txt
$$ ##AUDIT TRAIL=  $$ (NUMBER, WHEN, WHO, WHERE, WHAT)
(   1,<2019-12-18 15:46:44.21 +0400>,<she>,<DPX200>,
      <continue with go, POWCHK disabled, PULCHK disabled
       configuration hash MD5:
       00 E9 B6 7A A2 85 ED C7 34 08 36 98 17 FE 4E 26
       data hash MD5: 32K
       31 56 4A 0A 1C AC D9 F8 FC 72 38 57 BC BD 06 06>)
(   2,<2019-12-18 15:46:47.92 +0400>,<she>,<DPX200>,
      <Start of raw data processing
       efp BC_mod = 2 LB = 1 FT_mod = 6 PKNL = 1 PHC0 = -1343.721 PHC1 = 184.4011 SI = 64K 
       data hash MD5: 64K
       A3 2B 78 9E FB F6 35 43 0B 4A 96 95 48 02 00 ED>)
(   3,<2019-12-18 15:47:28.29 +0400>,<she>,<DPX200>,
      <pk PHC0 = -488.7732 PHC1 = 363.2003 
       data hash MD5: 64K
       B8 C7 98 1D 94 49 35 77 DF 12 24 8E FA 93 8A B7>)
(   4,<2019-12-18 15:47:32.23 +0400>,<she>,<DPX200>,
      <abs ABSG = 5 
       data hash MD5: 64K
       60 4E C2 11 E3 70 2F 2E 94 2C 79 81 D9 50 1E 08>)
$$ ##END=
$$ 
$$ hash MD5
$$ 58 E3 F3 8E 48 D0 1D DA A1 7B D9 1E 35 94 E7 A5
##$RELAX= 
##$RELAX= 
##$RELAX= 
##$RELAX= 
##$RELAX= 
##$RELAX= 
##$RELAX= 
##$RELAX= 
$$ Bruker specific parameters
$$ --------------------------
##$DU= <F:/spectra>
##$EXPNO= 1
##$NAME= <P31>
##$PROCNO= 1
##$TYPE= <nmr>
##$USER= <she>
##$AMP= (0..31)
100 100 100 100 100 100 100 100 100 100 100 100 100 100 100 100 100 100 
100 100 100 100 100 100 100 100 100 100 100 100 100 100 
##$AQSEQ= 0
##$AQ_mod= 1
##$AUNM= <au_zg>
##$AUTOPOS= <>
##$BF1= 81.014009
##$BF2= 200.13
##$BF3= 200.13
##$BF4= 200.13
##$BF5= 200.13
##$BF6= 200.13
##$BF7= 200.13
##$BF8= 200.13
##$BYTORDA= 1
##$CFDGTYP= 0
##$CFRGTYP= 5
##$CHEMSTR= <none>
##$CNST= (0..31)
1 1 145 1 1 1 1 1 1 1 1 1 1 1 1 1 1 1 1 1 1 1 1 1 1 1 1 1 1 1 1 1 
##$CPDPRG= <waltz16>
##$CPDPRG1= <>
##$CPDPRG2= <waltz16>
##$CPDPRG3= <>
##$CPDPRG4= <mlev>
##$CPDPRG5= <mlev>
##$CPDPRG6= <mlev>
##$CPDPRG7= <mlev>
##$CPDPRG8= <mlev>
##$CPDPRGB= <>
##$CPDPRGT= <>
##$D= (0..31)
0 1 0 0 0 0 0 0 0 0 0 0.03 2e-05 3e-06 0 0 0 0 0 0 0 0 0 0 0 0 0 0 0 0 
0 0 
##$DATE= 1576669421
##$DBL= (0..7)
120 120 120 11 120 120 24 19 
##$DBP= (0..7)
150 150 150 150 150 150 150 150 
##$DBP07= 0
##$DBPNAM0= <>
##$DBPNAM1= <>
$$ [...]
##$SUBNAM3= <"">
##$SUBNAM4= <"">
##$SUBNAM5= <"">
##$SUBNAM6= <"">
##$SUBNAM7= <"">
##$SUBNAM8= <"">
##$SUBNAM9= <"">
##$SW= 369.568048894756
##$SWIBOX= (0..15)
0 1 3 0 0 0 0 0 0 0 0 0 0 0 0 0 
##$SW_h= 29940.119760479
##$TD= 32768
##$TD0= 1
##$TE= 0
##$TE2= 300
##$TE3= 300
##$TEG= 300
##$TL= (0..7)
0 120 53 12 22 120 120 120 
##$TP= (0..7)
150 150 150 150 150 150 150 150 
##$TP07= 0
##$TPNAME0= <>
##$TPNAME1= <>
##$TPNAME2= <>
##$TPNAME3= <>
##$TPNAME4= <>
##$TPNAME5= <>
##$TPNAME6= <>
##$TPNAME7= <>
##$TPOAL= (0..7)
0.5 0.5 0.5 0.5 0.5 0.5 0.5 0.5 
##$TPOFFS= (0..7)
0 0 0 0 0 0 0 0 
##$TUNHIN= 0
##$TUNHOUT= 0
##$TUNXOUT= 0
##$USERA1= <user>
##$USERA2= <user>
##$USERA3= <user>
##$USERA4= <user>
##$USERA5= <user>
##$V9= 5
##$VALIST= <valist>
##$VCLIST= <CCCCCCCCCCCCCCC>
##$VD= 0
##$VDLIST= <DDDDDDDDDDDDDDD>
##$VPLIST= <PPPPPPPPPPPPPPP>
##$VTLIST= <TTTTTTTTTTTTTTT>
##$WBST= 1024
##$WBSW= 4
##$XGAIN= (0..3)
0 0 0 0 
##$XL= 0
##$YL= 0
##$YMAX_a= 9657
##$YMIN_a= -13159
##$ZGOPTNS= <>
##$ZL1= 120
##$ZL2= 120
##$ZL3= 120
##$ZL4= 120
##$ABSF1= 182.463
##$ABSF2= -187.1042
##$ABSG= 5
##$ABSL= 3
##$ALPHA= 0
##$AQORDER= 0
##$ASSFAC= 0
##$ASSFACI= 0
##$ASSFACX= 0
##$ASSWID= 0
##$AUNMP= <proc_1d>
##$AZFE= 0.1
##$AZFW= 0.5
##$BCFW= 0
##$BC_mod= 2
##$BYTORDP= 0
##$COROFFS= 0
##$CY= -3
##$DATMOD= 1
##$DC= 0
##$DFILT= <>
##$DTYPP= 0
##$F1P= 0
##$F2P= 0
##$FCOR= 1
##$FTSIZE= 65536
##$FT_mod= 6
##$GAMMA= 0
##$GB= 0
##$INTBC= 1
##$INTSCL= 5.30512e-09
##$ISEN= 30
##$LB= 1
##$LEV0= 0
##$LPBIN= 0
##$MAXI= 10000
##$MC2= 0
##$MEAN= 0
##$ME_mod= 0
##$MI= 50
##$NCOEF= 0
##$NC_proc= -9
##$NLEV= 6
##$NOISF1= 182.463
##$NOISF2= 159.3651
##$NSP= 0
##$NTH_PI= 0
##$NZP= 0
##$OFFSET= 182.463
##$PC= 4
##$PHC0= -1832.494
##$PHC1= 547.6014
##$PH_mod= 1
##$PKNL= yes
##$PPARMOD= 0
##$PSCAL= 0
##$PSIGN= 0
##$REVERSE= no
##$SF= 81.0140089999434
##$SI= 65536
##$SIGF1= 159.3651
##$SIGF2= -187.1042
##$SINO= 113.3802
##$SIOLD= 16384
##$SREGLST= <1H.CDCl3>
##$SSB= 0
##$STSI= 65536
##$STSR= 0
##$SW_p= 29940.119760479
##$SYMM= 0
##$S_DEV= 0
##$TDeff= 32768
##$TDoff= 0
##$TI= <>
##$TILT= no
##$TM1= 0
##$TM2= 0
##$TOPLEV= 0
##$USERP1= <user>
##$USERP2= <user>
##$USERP3= <user>
##$USERP4= <user>
##$USERP5= <user>
##$WDW= 1
##$XDIM= 65536
##$YMAX_p= 438512016
##$YMIN_p= -390124042
$$ End of Bruker specific parameters
$$ ---------------------------------
##NTUPLES= NMR SPECTRUM
##VAR_NAME=  FREQUENCY,     SPECTRUM/REAL,   SPECTRUM/IMAG
##SYMBOL=    X,             R,               I
##VAR_TYPE=  INDEPENDENT,   DEPENDENT,       DEPENDENT
##VAR_FORM=  AFFN,          ASDF,            ASDF
##VAR_DIM=   65536,         65536,           65536
##UNITS=     HZ,            ARBITRARY UNITS, ARBITRARY UNITS
##FACTOR=    0.456856943014862, 1,           1
##FIRST=     14782.0589164792, 0,            0
##LAST=      -15158.0608439998, 0,           0
##MIN=       -15158.0608439998, -390124042,  0
##MAX=       14782.0589164792, 438512016,    0
$$ Real data points
##PAGE= N=1
##DATA TABLE= (X++(R..R)), XYDATA
$$ [...]
42544 62274875 26051453 -3026073 -7670405 -5214292 -9583450 -16044636 -21851541 -30503200
42536 -30503200 -33565431 -17720085 5375653 4169487 -30289082 -72280127 -99849522
42529 -99849522 -118978833 -137545148 -141445297 -115741641 -70888014 -29405538 -965661
42522 -965661 13871891 11307023 -6528963 -24458456 -34325668 -47956798 -71542417 -84042113
42514 -84042113 -65897731 -34167691 -18245635 -11532288 15544990 57521700 71146633
42507 71146633 40605856 6034856 6120659 25410744 27420402 13950071 14405849 29927506
42499 29927506 28454695 -3373735 -38502361 -50698219 -49731099 -57618607 -69676900 -62643250
42491 -62643250 -33190925 -5354642 1935918 -3733102 -6281069 -5224669 -8252869 -9570268
42483 -9570268 4652534 29173247 38708739 23634945 8542254 17501838 34440561
42476 34440561 23459478 -16894930 -49508565 -52789938 -47284518 -53381970 -52664641 -19623424
42468 -19623424 28408814 48556072 32440718 14183228 16602719 22468394 9850793
42461 9850793 -12434070 -21945790 -14091367 2128981 23039931 44626915 50947905 31223197
42453 31223197 2277608 -7379785 6439315 22286459 25653459 22259486 17645408 6038617
42445 6038617 -12523035 -23949998 -21356173 -17652928 -21450859 -16064644 14974059 51099839
42437 51099839 52139216 14742297 -16666080 -8495920 15666378 9846602 -27636948
42430 -27636948 -51260527 -30453391 13493551 41586932 44275297 37579244 30474606
42423 30474606 20683324 14871954 25866463 46182222 47359556 16976568 -19467649
42416 -19467649 -27172117 -2523615 27769136 39982384 31239365 8568054 -22837636
42409 -22837636 -56133623 -78573859 -78169988 -52741388 -12289964 24097322 36985451
42402 36985451 21551837 -4330244 -14487613 -539382 20985560 29073591 19690459
42395 19690459 4363064 -5873946 -9608623 -11777347 -16200242 -19963592 -13390691 10526460
42387 10526460 43658695 64563415 59115031 37792334 26276501 37762610 59127884
42380 59127884 66979807 54054918 34985844 26164425 26476552 23901831 16700267 15584660
42372 15584660 21811406 17403933 -10617181 -46157655 -61189125 -52129550 -40218900
42365 -40218900 -37550801 -35492632 -30214389 -33606435 -47102146 -49886582 -32067708 -17090054
42357 -17090054 -26548793 -42715627 -37463335 -22662864 -32368649 -61661946 -67655596 -36586439
42349 -36586439 -6149833 -5695610 -15107658 -7675322 2418757 -11232097 -38607897 -50625285
42341 -50625285 -46181667 -43968177 -41138844 -20665584 6640771 8898331 -16154195 -35182521
42333 -35182521 -30262840 -19919523 -19153271 -14274798 5231388 21743585 19614293 14882168
42325 14882168 28834984 50670046 53765897 37391849 26308647 34217630 49011202
42318 49011202 52300596 37852686 13633029 -1919715 8837823 42706313 72917315
42311 72917315 77681894 62835499 44315792 21565500 -12066269 -42846677 -46116505
42304 -46116505 -21203299 4963975 11718381 4644873 -145119 5120349 19611454 37135202
42296 37135202 46375268 41470891 34104665 40621775 55399321 53273686 23119464 -15873332
42288 -15873332 -37628977 -36572803 -26358725 -22721883 -32200587 -47323786 -50266366 -32747324
42280 -32747324 -12999797 -17677877 -44850182 -63456990 -55048863 -35957265 -27957998
42273 -27957998 -27178576 -18507896 -5084326 -3371377 -17254934 -34514984 -44159621 -43411994
42265 -43411994 -32727950 -17094043 -7714533 -10121849 -14772424 -10500486 -2121286 -2918308
42257 -2918308 -14470325 -25920931 -28956767 -21867776 -3863845 21142057 38695510
42250 38695510 36052203 19617225 8559548 12294919 24487802 35582584 38835498
42243 38835498 27921288 4015034 -15977948 -14291279 3083111 11524231 414132
42236 414132 -13445700 -9545748 11423812 31285151 32834863 11238031 -22444054 -45593338
42228 -45593338 -42113887 -19598001 537502 10240483 19520148 33420248 41369493 35380306
42220 35380306 22842958 12839461 4785019 301016 10045398 34207676 50211054
42213 50211054 38642625 12933984 4080529 20241308 40131308 45321536 40686930
42206 40686930 39577323 44704378 50747887 54718152 56025520 52967645 45092538 35187896
42198 35187896 26207812 19950834 18611861 21195580 18266545 -971418 -33471045 -62245941
42190 -62245941 -75364755 -77018825 -74516880 -63515671 -36473463 -626955 24661028
42183 24661028 28624481 17547344 2007164 -13300073 -23374777 -18702078 2545952
42176 2545952 25289686 32645160 27339233 26378442 35598348 42399434 35289764 17311692
42168 17311692 -3667884 -23593638 -34492020 -23885809 6151421 33108204 41715888
42161 41715888 44240181 55480092 62435943 45777319 21580067 26083742 56723056
42154 56723056 65124081 23364764 -33770976 -54336564 -33401021 -7524438 -3125425
42147 -3125425 -16221318 -31404295 -35573142 -20002800 9281837 29745856 30220831 30101198
42139 30101198 47925544 63654888 44655279 2815240 -13084468 12754911 38671603
42132 38671603 26158553 -7802304 -21763800 -7765460 9296453 14060615 13917209
42125 13917209 16282797 16928473 10950364 -1326035 -19001563 -38400517 -48640581 -41873196
42117 -41873196 -25897086 -15535486 -14467244 -16441272 -19808615 -26943751 -31966767 -24969443
42109 -24969443 -10087569 -4600789 -14648940 -23310487 -10371387 22707344 53839708
42102 53839708 62875224 49708558 32706734 30738538 44231090 54235944 43401240
42095 43401240 16232107 -6065975 -8795077 4251268 19622172 26028390 16964296
42088 16964296 -8325268 -41361541 -68061253 -80881357 -83689975 -81874055 -73294726
42081 -73294726 -54209158 -29782734 -11464952 -4128912 -871616 8435728 26579851
42074 26579851 47336299 60804609 59096756 40866247 14835696 -2697087 -516739
42067 -516739 14120892 19542482 2690974 -24616618 -39210409 -34711026 -26779144 -28514608
42059 -28514608 -32014657 -23200894 -7394708 -6271422 -28087372 -52486377 -53242414 -32302370
42051 -32302370 -21819707 -47956455 -97424971 -128752097 -118146885 -83902829 -57647734
42044 -57647734 -42737940 -19889219 9853362 15071863 -20452087 -63817445 -68090089
42037 -68090089 -31162568 5343684 13514597 9310654 18191554 34468223 33721666 13577409
42029 13577409 -145251 10735637 31565574 34958329 17658720 4054634 11960301
42022 11960301 27781815 25795800 4043350 -15195963 -19273850 -19602531 -25498610 -24239323
42014 -24239323 -3500022 22261862 30231924 24698661 29255924 46905406 53766549 35901544
42006 35901544 9142929 -4899979 -2785526 7985188 20283973 22638911 3599505
41999 3599505 -26775380 -38394221 -18538806 9268833 19335826 19026804 30115065
41992 30115065 50760765 60700272 53876012 40074970 20715644 -9430520 -37995583
41985 -37995583 -41200562 -20506189 -8760447 -29096866 -66067496 -88283269 -83856699
41978 -83856699 -61616207 -30795768 5250945 40627329 63623159 62418293 33666925
41971 33666925 -8796264 -36039976 -28192617 467958 14028168 -2573232 -27505751
41964 -27505751 -34546382 -24928254 -15082509 -7919820 6249100 28927479 50370131 62305956
41956 62305956 60001348 38515920 3506608 -19583148 -7416814 29312417 54113722
41949 54113722 48187857 28383097 16566181 10168735 -4029268 -20957050 -20054753 6668219
41941 6668219 42401783 61153755 48171285 8106124 -37781753 -63968966 -60029114
41934 -60029114 -39835604 -25450096 -21584417 -13436726 8546098 30783471 30731448 5324339
41926 5324339 -22439359 -26568459 -3160530 29505904 51601572 57218522 50575379 35015975
41918 35015975 12249226 -10677100 -22647472 -20011008 -11659091 -8487857 -11094024 -12146610
41910 -12146610 -8628629 -6584521 -12912839 -24829858 -28949504 -12877654 19097044 43704043
41902 43704043 39780193 13720367 -5095192 336187 13728214 9697478 -10758245
41895 -10758245 -24844550 -22693526 -17359114 -18539643 -17151962 -4839563 8997531 12925183
41887 12925183 12228180 16388202 19154647 9985481 -1465286 6284681 33417286 53754245
41879 53754245 48961316 32524713 30020663 45221091 56654721 44988927 15960090
41872 15960090 -6267233 -7088125 692359 -7483610 -35041942 -57970606 -56263379 -37778937
41864 -37778937 -19065607 2414144 35342134 63952802 59663631 24315577 -5844604
41857 -5844604 -6391292 9868054 22198582 29932638 37022996 35110904 23271268 22213491
41849 22213491 42956586 59617203 43404661 10531725 2278055 23084430 34197664
41842 34197664 11963899 -21727550 -38464704 -42776195 -53510429 -67450320 -65032963
41835 -65032963 -42077552 -15226332 1075221 7093132 6893214 -2105224 -22699057 -46535103
41827 -46535103 -56681520 -45055442 -24603973 -16578284 -23515063 -24493874 -4567523 21140453
41819 21140453 25953630 7559693 -10893871 -13053990 -5685757 -1752737 -3571038 -7063809
41811 -7063809 -9196530 -6190984 5072149 20912665 35311783 48954629 61238400
41804 61238400 57572632 25047021 -18887695 -37517538 -21438490 -422679 2154451
41797 2154451 2609276 26937337 67862066 94967254 94850249 78265615 55393126 26713264
41789 26713264 -3945778 -26784603 -38202816 -42633269 -42184947 -34625281 -19983150 -811092
41781 -811092 19767170 32063123 19879526 -20408477 -65876663 -85942170 -73956856
41774 -73956856 -50131937 -35895182 -34706496 -35073126 -23868109 385858 21759748
41767 21759748 20634929 -2072406 -24872607 -35105827 -41704201 -48639929 -38283576
41760 -38283576 -3106348 25512998 11705593 -31530534 -56640892 -46233365 -29861722
41753 -29861722 -32807679 -41922287 -35085957 -16830592 -6346998 -8383066 -13138686 -13436939
41745 -13436939 -9208550 -3633371 -3207248 -13492115 -30239557 -43484785 -50796215 -54665529
41737 -54665529 -50124933 -33795061 -22976977 -39785045 -72090583 -78473067 -42832064
41730 -42832064 2846197 24506449 27571536 33029832 38560303 30837426 16622151 10866561
41722 10866561 6613914 -13067534 -41450151 -55961455 -54594173 -54901434 -58202091 -45938055
41714 -45938055 -17373365 -1863429 -19743926 -51868701 -64388343 -51080841 -36031754
41707 -36031754 -40881374 -61866839 -78267134 -76028733 -60519780 -46762488 -40047424
41700 -40047424 -32846051 -22011825 -17452741 -25204823 -32459737 -22775108 1012721 23179972
41692 23179972 37931327 49820815 56645593 50554577 34794920 21758269 14595771
41685 14595771 7465351 2499082 6852045 12610988 1705754 -25031591 -45104521 -46115489
41677 -46115489 -38238166 -28550607 -9029226 17138141 24226106 182252 -27841741
41670 -27841741 -29897330 -17890107 -24057465 -46267148 -48629319 -15429532 27135545
41663 27135545 49312442 50973308 46010805 36843016 20480974 4666305 1004775 8797937
41655 8797937 16998540 17318630 8511561 -5609550 -16064622 -14155822 -3664015 -111035
41647 -111035 -11234669 -25997865 -29767912 -21558880 -8380465 6817359 19555082 15771124
41639 15771124 -13858537 -54909892 -79932757 -78235110 -63305562 -52714817 -53695172
41632 -53695172 -65929307 -81918351 -84130750 -59836030 -22721811 -2289533 -6322584
41625 -6322584 -12457173 -4658008 3427162 -4257342 -15877201 -9947753 10049597 21937678
41617 21937678 16341767 415783 -20494355 -40472151 -40146533 -5665770 40436359
41610 40436359 56618428 34446563 6286842 -3269728 -3378762 -5515111 773238 22025326
41602 22025326 38931774 33859788 18302185 9366936 86395 -19991168 -34293309
41595 -34293309 -22080632 1516992 3374301 -16599439 -27399679 -17944387 -10249365
41588 -10249365 -16699534 -18591813 16285 25334328 36807307 35111583 30883583 23284946
41580 23284946 6906849 -12080563 -21528028 -17655773 -5127607 8560349 13275817
41573 13275817 2329670 -16358049 -27888793 -32998001 -46145313 -65452395 -66342857
41566 -66342857 -38453867 -9035032 -10511587 -38780854 -63301166 -67779548 -60660162
41559 -60660162 -52911117 -46324271 -41401617 -39292931 -36058352 -28041914 -20875586 -21298309
41551 -21298309 -24171353 -20939485 -16911247 -25005215 -44098566 -58457165 -58976762 -51945219
41543 -51945219 -46363803 -44983948 -48273354 -54510689 -54287765 -37293540 -8324967 13136211
41535 13136211 13165962 -3266137 -20020273 -24226690 -14171887 -933992 -1039526 -19060055
41527 -19060055 -39264709 -43585458 -34714544 -29614554 -32927138 -32582336 -23586512 -19873511
41519 -19873511 -34673008 -59755277 -72236385 -56617469 -17464768 22294145 34665410
41512 34665410 9681153 -29526403 -44254670 -19535151 20396262 40429620 31659400
41505 31659400 15487212 16551936 36233846 50143414 31903924 -15546270 -55359336
41498 -55359336 -53460773 -17978145 11320677 12786475 4531382 11342124 29319871 36775013
41490 36775013 26380072 10028423 -798352 -4586809 -3514420 272612 3800367 6409607
41482 6409607 10359705 13434541 8984298 -293015 -86185 13749031 23848369 16763638
41474 16763638 7631694 19057681 44002500 54223193 42181751 27608059 20103946
41467 20103946 3994638 -28835691 -57107435 -59224604 -44846280 -37063471 -37915244 -34407856
41459 -34407856 -28577939 -35434579 -52469945 -55030988 -27648915 16736704 53903478
41452 53903478 70449905 64936780 43154555 20370694 14296861 24758075 30429150
41445 30429150 16410129 -4341515 -9489834 508144 3957428 -10944196 -30743939
41438 -30743939 -33853223 -12701180 21844661 48884416 51004553 30267008 10575260
41431 10575260 12011490 23002752 14099214 -17599711 -38528500 -25032313 -67076
41424 -67076 -1864333 -27765575 -36546728 -6171392 36700737 53535373 39854978 20315217
41416 20315217 11850731 9402429 3486050 -4029640 -4863643 3340128 13606591 16069078
41408 16069078 6833937 -8734440 -22424858 -32672534 -44768205 -61707304 -79252087
41401 -79252087 -90723418 -91728767 -79738994 -55917519 -29424735 -12406494 -7128769
41394 -7128769 -5025974 -1409089 -1388327 -5541153 -1149819 21053222 49686328 65835841
41386 65835841 68213662 70570664 76927978 76514657 65685983 58050763 64706855 77092127
41378 77092127 79782024 71085606 59460117 46106003 24845369 -2180998 -21948270
41371 -21948270 -27175338 -25418849 -25761707 -24754099 -15211473 -4923403 -14042029 -49802248
41363 -49802248 -92050796 -110459179 -92006919 -47152853 3858807 41782087 52699640
41356 52699640 38142774 21795087 29713783 57613183 72263118 54107245 23710682
41349 23710682 12622084 21804978 28402647 24766315 26896074 44507314 64490581 69274209
41341 69274209 55297220 29361670 2677607 -8062817 7837631 35972029 47392419
41334 47392419 36232624 26998739 33650382 35075395 11654137 -14478339 -5928828 32831780
41326 32831780 56659632 38754640 410428 -24979545 -33064321 -40707986 -54873366
41319 -54873366 -66049399 -65374295 -55997390 -48830548 -51409521 -58608739 -55431732 -35564094
41311 -35564094 -14152808 -10650389 -20998130 -22962699 -10767069 -5183372 -21190262
41304 -21190262 -43809437 -49540109 -37532513 -23612849 -14244019 -4350550 5299508 6804099
41296 6804099 393088 -3260085 3248746 18156678 36645004 52452894 55844500 41761933
41288 41761933 19252250 2348776 -6493408 -12735320 -13490805 -1494103 14292810 11077698
41280 11077698 -17098072 -46617846 -53439440 -43192827 -38496400 -44116237 -41638378 -19267151
41272 -19267151 7732778 14427246 -2994499 -23940419 -30889317 -30172551 -38000952 -52514161
41264 -52514161 -54068459 -34668406 -11377548 -2144776 -2898073 -2067737 -3755007 -15752111
41256 -15752111 -24553776 -9658399 19066598 27871941 9330642 -2993124 15516194
41249 15516194 41786890 38112333 5011034 -24409190 -31589190 -28334341 -30231936 -38012473
41241 -38012473 -46392131 -52396429 -51530249 -39948308 -23296443 -12595487 -11040842 -15089679
41233 -15089679 -26550817 -50565774 -80822374 -98182690 -86834039 -46842262 5091978
41226 5091978 40704394 35875678 -4499193 -44360340 -54699935 -46632993 -48439703 -59046797
41218 -59046797 -51011443 -17041162 16400018 26946893 19979045 6348085 -15100580
41211 -15100580 -39281747 -46439800 -31847182 -22095725 -39626265 -68215069 -76174486
41204 -76174486 -59450744 -38573866 -24667127 -12568071 432809 11927151 24541358
41197 24541358 38302769 39956826 20923238 -2421331 -10626533 -15396744 -42386658
41190 -42386658 -83038558 -97074491 -68271686 -26069094 -1008621 11110979 24262868
41183 24262868 29673687 13534651 -11111878 -17330195 -847370 18621108 27476561
41176 27476561 29708139 31076516 31415820 35046157 52952126 87921075 125576926 144654727
41168 144654727 133190213 96392952 54383193 30058447 31457092 44918889 49541806
41161 49541806 37586631 18170836 5084383 5881368 18620433 32627853 35345443
41154 35345443 25043695 14670677 17319995 30644293 41877138 45027609 45222366 47881835
41146 47881835 51961583 53845977 50619285 39386159 20721962 3436362 -2090614 1992377
41138 1992377 790548 -14515186 -32465367 -32401327 -9098884 18788753 27701655 14926175
41130 14926175 1467268 7510096 29069124 44417937 40816856 25451732 9238478
41123 9238478 -7632059 -26536506 -37647216 -29674808 -8290167 7750613 8288980 -845115
41115 -845115 -11523947 -22484858 -31666176 -29730104 -8465090 27428624 59760001 67089662
41107 67089662 39816540 -7384425 -41073645 -38376661 -12265992 2699177 -8229219
41100 -8229219 -24642170 -21444316 -1672756 11392121 6387265 -4602949 -5091732 4656223
41092 4656223 8371170 -6341833 -29811890 -36010263 -12660435 18455631 23880013 264825
41084 264825 -23203004 -27061131 -23826488 -26635384 -20492811 10878700 47680829 56005962
41076 56005962 39128379 32374328 47154543 56415529 44147541 32440380 39877211
41069 39877211 45807749 25566906 -2916299 -3604058 19999332 29491038 10906696 -6999803
41061 -6999803 -224533 16973547 19952777 9275955 -32975 -5753735 -13936223 -18955796
41053 -18955796 -9633971 8738630 16488968 4671494 -14404447 -23548537 -18603133 -8577851
41045 -8577851 -5119251 -13503046 -28725673 -38880214 -35987361 -24847410 -19309037 -28688480
41037 -28688480 -47036526 -54997531 -35802863 4805868 36680161 32262049 -3521386
41030 -3521386 -39169307 -52670486 -48924708 -38912241 -20667164 5892945 21295967
41023 21295967 5682785 -29759451 -51204274 -42779422 -21682969 -10020297 -7681449
41016 -7681449 -413681 16476892 31312767 28770196 6136528 -20301427 -27651749 -11764350
41008 -11764350 4245400 -2569120 -23332609 -27910562 -5097637 25634425 43745847
41001 43745847 48317520 42923099 22159405 -12170081 -39102202 -41836752 -31985006 -31940996
40993 -31940996 -41046577 -38608835 -16169522 12690240 34057911 46343070 47995734
40986 47995734 30511813 -6389317 -43275086 -56041501 -40491585 -16576506 -8536198
40979 -8536198 -22269036 -41748459 -47647510 -37574776 -23364827 -11247205 2532209
40972 2532209 13743055 6471400 -19145699 -32659178 -10098011 25268726 27705151
40965 27705151 -7837444 -38834553 -37218066 -24925007 -30593656 -41825523 -30615339
40958 -30615339 -6031959 -3882383 -28945746 -44000983 -24231834 7298276 14476765
40951 14476765 -3178040 -17503228 -15102335 -11230262 -21877778 -40382617 -47985625
40944 -47985625 -37789974 -21417612 -15320095 -24113816 -36246943 -35377750 -16950236 8106126
40936 8106126 27731772 41942064 55392842 61203144 44903390 7376611 -28593406
40929 -28593406 -43289350 -42255948 -42556049 -45566911 -40307383 -29709215 -31357366 -46851380
40921 -46851380 -52432988 -34155690 -14231985 -21281506 -46295254 -54302043 -35992942
40914 -35992942 -19343996 -24637300 -35530239 -29488541 -14183291 -11809873 -22586434
40907 -22586434 -29138425 -28603263 -32564732 -36338028 -18316262 20803154 45301388 29748780
40899 29748780 -3258524 -15363508 -8444382 -16549210 -45201266 -55592668 -22811286
40892 -22811286 22191755 35782603 24718024 29860363 56586427 64626759 35671594
40885 35671594 9777697 28197121 69681281 79810524 47538830 12674919 958596
40878 958596 -7054354 -31739559 -55117021 -48903256 -18671394 5803145 11627985 10819565
40870 10819565 14369102 19945135 23534986 25248959 22635572 12183607 -1966100 -12851948
40862 -12851948 -23540940 -42292483 -64692538 -74274319 -63780729 -43520054 -24729147
40855 -24729147 -6867799 12115995 24187883 20925269 9566208 8043906 22575014
40848 22575014 37513424 33126021 12170786 1518847 20555425 51955950 57643153
40841 57643153 28183079 876313 14870892 59569032 88012719 77272394 52142603
40834 52142603 44906434 54673937 59785433 53118478 45275724 39640187 24025694 -8778101
40826 -8778101 -43727388 -55507642 -37527573 -14535107 -20236613 -59434351 -99186007
40819 -99186007 -105730992 -83455670 -63119676 -56472348 -44965228 -17498348 5882742
40812 5882742 3984398 -10979526 -11620794 1896956 1647430 -26236973 -59570552 -65224455
40804 -65224455 -34565430 9325155 31684379 13670371 -30686432 -64417570 -61763875
40797 -61763875 -32478050 -8365323 -11305872 -40144956 -78298931 -101688653 -89546905
40790 -89546905 -46603785 -9840229 -13407056 -48376991 -76258974 -80146765 -79119931
40783 -79119931 -90130078 -102086820 -97990682 -80771329 -63759522 -52506269 -47979817
40776 -47979817 -51605912 -55628508 -45085435 -21438902 -7058702 -13645716 -25467738
40769 -25467738 -28485225 -33141716 -47139749 -49280049 -20577177 16976738 28278814
40762 28278814 19436128 25208571 48455175 55145939 32841493 10601215 7553517 1946805
40754 1946805 -26508782 -56891457 -57745057 -34281368 -17693275 -23318773 -41969812 -58196230
40746 -58196230 -57706135 -33317724 -2829880 -824642 -29985080 -44011872 -9509931
40739 -9509931 38659398 45137394 19035044 18312972 53944832 69234488 29917059 -19929945
40731 -19929945 -23504912 9737578 30720589 26349524 23567122 33715123 37296746 22340213
40723 22340213 1473729 -13888685 -27776769 -41633974 -45442647 -34641168 -18368585
40716 -18368585 -5414905 2998290 4076832 -6422262 -22054168 -29718582 -28340295 -27752234
40708 -27752234 -28798925 -24443252 -21960582 -38857595 -68965358 -78430152 -49866283 -8261421
40700 -8261421 13696334 15166481 13300976 11643117 7532075 12864253 37193479 62058228
40692 62058228 63326604 50528448 50934014 60664763 49495677 14392324 -12749043 -18549412
40684 -18549412 -26786401 -47422414 -50962595 -22744682 -3101012 -30952846 -75385773
40677 -75385773 -73395788 -21670323 20940351 20591910 6900937 13655640 28376511 24851119
40669 24851119 9720555 6247819 15412201 22867337 28661878 41760408 55135889 52829996
40661 52829996 36604671 22232192 12751695 -1597550 -17416270 -15762972 8241956
40654 8241956 32255632 32551237 10643115 -13659722 -25789070 -25872598 -23003601 -27361518
40646 -27361518 -42653567 -61296801 -71660155 -72558433 -73717475 -79070019 -79029784 -65918538
40638 -65918538 -48281163 -39566255 -38333375 -32300080 -20113635 -14817286 -21972610 -27758128
40630 -27758128 -18385498 -1761811 3470792 -4739670 -11586591 -12344647 -20780176 -42025682
40622 -42025682 -53440510 -29252200 23611376 71022286 89652454 84380339 70531033
40615 70531033 56316154 44476833 34560329 19140725 -7486359 -33041469 -36198048
40608 -36198048 -17465079 -3043144 -8728398 -18722798 -14172690 -5151747 -14758559 -43181747
40600 -43181747 -67907186 -73109886 -61461922 -42274222 -23757831 -12108508 -4896998
40593 -4896998 7514163 22286751 19648479 -4526646 -18768219 4116363 40380264
40586 40380264 42987363 9768349 -14666124 -7174157 4429599 -7627896 -28713333
40579 -28713333 -32160321 -21434273 -15595871 -15187177 -10187202 -6930603 -20770147 -49282281
40571 -49282281 -72321119 -73643232 -51496989 -18951503 -3023114 -25190397 -68723634
40564 -68723634 -85802586 -55567898 -14070760 -4414909 -20285019 -28668694 -26196931
40557 -26196931 -32310715 -40312024 -22697788 15126148 32004048 11267579 -16342802
40550 -16342802 -24052444 -25724266 -40908868 -56970227 -53580638 -39895976 -37572174 -44068302
40542 -44068302 -42062487 -33229251 -32787691 -35992992 -19128123 23524251 66898107 85608340
40534 85608340 80003206 65221851 48920205 29469622 7291458 -12264245 -25562718
40527 -25562718 -35029913 -46386271 -61344315 -71344576 -61177566 -25342911 17917329
40520 17917329 35981084 12591471 -31165857 -53449070 -33862806 4594694 22437460
40513 22437460 10130700 -3494040 8295042 35276221 46745334 32406681 10990421
40506 10990421 2201723 5289311 4961478 -13283401 -50933688 -87027763 -87513496 -43407865
40498 -43407865 4795141 6157150 -35954558 -66263999 -51504712 -20574086 -15118383
40491 -15118383 -31337717 -37993121 -27997246 -18195208 -12975019 -4200573 25691 -16464858
40483 -16464858 -40532402 -36497976 1175155 33718460 30525778 8547119 1061341
40476 1061341 9794555 11409184 -2501339 -15885992 -13575872 2476630 20882897 31332749
40468 31332749 28352446 14246316 -3228062 -21660373 -45676571 -70781217 -77017411
40461 -77017411 -53669815 -22185489 -14832600 -32146858 -41514661 -21693736 10193382
40454 10193382 24641770 16334542 1930390 -6373390 -9425134 -10735682 -13743585 -25458703
40446 -25458703 -46024880 -56189991 -35025897 5410682 24217562 3145830 -24726302
40439 -24726302 -18663162 10928266 16873899 -14263445 -40352732 -25125818 9429148
40432 9429148 19090211 5351500 10518537 49396771 84252640 79831175 51995739 38674957
40424 38674957 43406675 37027994 7078968 -23999847 -33189158 -25608974 -19212177 -18005234
40416 -18005234 -13730701 -4242206 2774601 642696 -10242122 -24073172 -31392777 -23939964
40408 -23939964 -4892495 9584800 6539790 -8597913 -19747101 -20065984 -16395905 -15983688
40400 -15983688 -17681594 -17249485 -14519679 -13205502 -16996215 -25612068 -32834439 -32257445
40392 -32257445 -27273333 -26999201 -26992552 -7696494 33652223 62869729 44756700 -6995937
40384 -6995937 -44392254 -49303931 -49347244 -60982062 -55040684 -4640420 62229146 93121644
40376 93121644 77276054 47336455 27219829 15030361 12123940 29152008 57141524
40369 57141524 66839404 48661927 26322094 19630495 19066494 9826845 -2645444 -6076742
40361 -6076742 -373385 10633203 27673188 43095692 38800740 11894988 -15370075
40354 -15370075 -25216308 -25073836 -24779277 -15498638 9252915 32652004 37413648 31202050
40346 31202050 26571196 16152080 -4925403 -13521329 8773363 34051324 21366664
40339 21366664 -17402567 -30647297 -5449100 14886815 1935416 -15245450 -458015
40332 -458015 34522136 53720758 48524037 36649018 29805159 29843017 41189965 59971867
40324 59971867 62553547 31623798 -13522979 -36963665 -31098709 -18564839 -13568638
40317 -13568638 -6969028 7920146 18618075 11672317 -9066283 -31929332 -52640735
40310 -52640735 -69976542 -75674425 -61244572 -33066073 -11472591 -11638065 -28476690
40303 -28476690 -43116028 -43248844 -33444415 -24121214 -16067701 -2705944 15920339 31931829
40295 31931829 42419267 52004267 60305780 59915492 52579371 53309871 67209998 73324210
40287 73324210 46102523 -12631265 -75029178 -114890042 -122805739 -102180826 -67442342
40280 -67442342 -42483457 -41758582 -50730222 -41236389 -9409723 18113035 21286667 12637658
40272 12637658 15130532 28644196 34851587 27478745 19676966 21763296 26963917 23948884
40264 23948884 12938954 2965379 -144138 3348800 11325102 19188518 16870471 -4529990
40256 -4529990 -39355126 -66776168 -70958865 -60558089 -60141947 -79202177 -96981746 -85920453
40248 -85920453 -46645716 -9183016 2245722 -4667340 -5250744 10352611 31191514
40241 31191514 45709545 53013384 53013977 40775738 18593871 1887727 1565298 8080565
40233 8080565 4804770 -9338392 -24428057 -40645684 -65373114 -89217037 -86951260
40226 -86951260 -51465544 -9309301 10377494 9103628 7443834 12021242 11436735 -1095533
40218 -1095533 -17887130 -27876579 -25214351 -9915208 8166370 11069863 -6501607 -21559703
40210 -21559703 -5772991 34747563 59744008 40625193 -6985581 -42983603 -45215564
40203 -45215564 -25819245 -12019350 -16741998 -27384961 -24204996 -9142166 -5849368
40196 -5849368 -24191769 -39417411 -24262868 9119555 23567975 8723754 -8522598
40189 -8522598 -7410164 -59980 -6273630 -24872564 -42009338 -49790321 -45893479 -30606061
40181 -30606061 -12842336 -3715770 844813 12205158 21111115 4707774 -30690316
40174 -30690316 -45797375 -23695483 2392509 -1092723 -21489731 -31820088 -38514389
40167 -38514389 -58478921 -73458351 -55457257 -24281789 -27571918 -63620668 -74487148
40160 -74487148 -27826494 38004825 69276952 60470388 39214046 19247367 -516490
40153 -516490 -9444405 8983163 48409044 79912383 83230337 64739626 44180657 33346429
40145 33346429 29263342 22836501 11844284 4175665 6533510 14336091 19315522 22595228
40137 22595228 30192422 39025502 40183753 35161920 35422827 44378666 52064063 50238034
40129 50238034 42543052 37935395 42612849 57479923 74378612 78013186 62642744 42500812
40121 42500812 33302727 30176127 19702038 5220210 -1675880 -7579657 -27098618 -48553887
40113 -48553887 -42250898 -8602657 14075460 2221260 -21052870 -22533672 -2232823
40106 -2232823 17614245 24490511 17603277 -2017959 -23596756 -26222092 -5758921 13795886
40098 13795886 13784330 8104622 17290113 33959178 38113402 31175494 28732938 31729000
40090 31729000 30732900 27665097 26684800 14680946 -18757384 -50076161 -44376708 -7392344
40082 -7392344 18895489 15701241 9274417 24622492 48871699 56461238 45717832 31478391
40074 31478391 19576602 7732093 -407242 530478 6240769 8081686 4627965 -95472
40066 -95472 -3298050 -2530488 3042003 4987523 -9371692 -36564839 -53649593 -45728800
40058 -45728800 -25476151 -12329426 -3040757 19033884 51103921 68610665 58576234
40051 58576234 37158803 25556370 22471340 13113233 -3607312 -13218971 -9692002 -5735947
40043 -5735947 -13754819 -28475461 -37459244 -39949188 -43494742 -47685761 -45437275 -38392534
40035 -38392534 -35695988 -36135710 -27869721 -10934000 -2821557 -11558089 -19246970 -7495805
40027 -7495805 13759467 21911977 17453375 21700563 40871830 55378623 50507558 38561928
40019 38561928 39698077 54250731 66981368 70452263 69820079 66382553 50626574 18687099
40011 18687099 -12005819 -16115692 7616319 28408860 17905180 -13704689 -31449447
40004 -31449447 -23958894 -17581686 -34682572 -58776978 -59151328 -36141084 -18849404 -22650196
39996 -22650196 -30968218 -22002668 2597989 20881427 13217754 -19723342 -54782666
39989 -54782666 -64291211 -42977883 -12280771 7052657 14333618 12036028 -9544356
39982 -9544356 -47829734 -67098241 -38386824 8040357 12751703 -26880010 -46038671
39975 -46038671 -4609470 53396188 63736764 30720703 9879038 22405299 34448953
39968 34448953 18658173 -7539142 -16423225 -9355248 -3471031 -1511787 5032030 16010991
39960 16010991 24560777 31916710 43639358 53805721 48651668 28229344 10777323
39953 10777323 8556410 10280966 -655238 -17834453 -19405163 -4391995 -368980 -23570348
39945 -23570348 -49997934 -47217968 -22767417 -13232247 -28260773 -36227711 -13038993
39938 -13038993 23545802 44064815 47987363 53113306 62412812 65838692 63876654 65115851
39930 65115851 67090648 62072229 56530073 61372304 66386364 50608961 19449899 4148595
39922 4148595 16638214 30872678 22708126 5556708 6779090 25219555 34924728 21740795
39914 21740795 -5788925 -37016910 -68661795 -93891402 -103096475 -100530017 -102140389
39907 -102140389 -109609319 -103737415 -74634870 -42393535 -30961610 -33274329 -24051648
39900 -24051648 -2066376 5604573 -13681531 -34596492 -27262497 2112231 22611927
39893 22611927 21556721 15708199 20885086 29307044 23413380 -190388 -28547813 -47106408
39885 -47106408 -50025842 -39947083 -23488575 -6763529 6922574 16399003 22635379
39878 22635379 30290894 43180085 53548001 43080774 4180744 -43955419 -71075568
39871 -71075568 -65587513 -39581965 -9656970 12947559 16735125 -5396513 -40735860
39864 -40735860 -62276817 -57331713 -38224226 -19530491 -909064 18221972 23975298
39857 23975298 4829498 -26072355 -41781351 -30980232 -4996617 19580579 33087837
39850 33087837 31635013 17644782 2683799 -308888 9051677 16873098 8317140 -18320534
39842 -18320534 -47896151 -58111517 -39145557 -5785555 16977106 21800018 22454067
39835 22454067 27694461 26849654 9455403 -15048933 -28923189 -25967573 -9131055 17629499
39827 17629499 41036201 37674071 2526170 -32946219 -35254992 -13968496 -6114971
39820 -6114971 -19606276 -22951255 3709841 37318209 46044460 31755030 19440129
39813 19440129 19265864 19155869 8379585 -8191073 -18210590 -14049469 1468432 14312907
39805 14312907 7420510 -22555374 -57599778 -73091334 -60529288 -33438960 -12053741
39798 -12053741 -3625786 3165514 23756944 56413164 79326684 73424473 42906711
39791 42906711 5885557 -28214090 -58674921 -76679363 -69042450 -41737395 -19819674
39784 -19819674 -15324582 -13006097 62 7760227 -12143609 -50746048 -73848480
39777 -73848480 -62865561 -30345937 4886859 37844502 66353651 77635877 60246118
39770 60246118 22888032 -10056663 -20901073 -11315420 4174702 11282698 4946708
39763 4946708 -7403838 -10405366 5914352 34064691 52630108 44868096 14045655
39756 14045655 -20221000 -40178004 -43961949 -42430144 -43794513 -43759986 -33502638 -16613127
39748 -16613127 -11101788 -27786111 -50545944 -49590847 -17136192 20738488 34089293
39741 34089293 21426025 3664082 -3941280 -373216 12733316 33390215 52085505
39734 52085505 58995155 57669791 55580506 44658562 14068364 -18128345 -16048744 22053833
39726 22053833 52897367 45720128 21892639 14439494 17030478 6567596 -6296709
39719 -6296709 8662947 47345492 73741974 73738798 66926618 63955847 53229517 36584539
39711 36584539 36248627 52511884 54882791 35134936 29783124 62147920 97993995 94702890
39703 94702890 65395889 51926600 55161111 40208867 2166989 -22502801 -14606734
39696 -14606734 1423933 2670483 1285969 12544391 20102963 707170 -35089492
39689 -35089492 -54634106 -47117445 -32126601 -27069412 -26785136 -18729319 -2854852 10533191
39681 10533191 13878394 7137847 -5345479 -17303506 -22532882 -19436704 -13676014 -12882382
39673 -12882382 -17571403 -20315437 -16606492 -13412913 -20694594 -34789724 -39043638 -25634657
39665 -25634657 -8636478 -6074901 -14134658 -11982870 7627021 26006786 22931068 3486247
39657 3486247 -8582790 1124398 24883192 43902987 42928429 17336935 -21683780 -47891822
39649 -47891822 -39226186 -3252166 25952871 24127953 2016517 -13941364 -16141185
39642 -16141185 -17284128 -24510803 -30351474 -28496275 -20846806 -7064815 14794100 33254283
39634 33254283 29080041 4703187 -11195789 -431945 21954506 36054281 47875881
39627 47875881 70608749 92847823 93396469 77549445 69974818 76346074 79477337 71156182
39619 71156182 60309193 49589151 31619206 10901672 1701245 -68918 -14296460
39612 -14296460 -39726672 -49750746 -35405788 -21637882 -24927731 -24478527 2342444
39605 2342444 40394328 57134399 43723973 13135636 -24226992 -58338696 -69871597
39598 -69871597 -50982774 -25223649 -20812822 -32855791 -36799794 -29499508 -27487085 -29401957
39590 -29401957 -12841666 25601103 54029462 41547296 -4550825 -47333680 -56243789
39583 -56243789 -30218730 4979656 17385914 -6582757 -53220786 -96139537 -115546660
39576 -115546660 -103845255 -65488056 -19111809 12259630 23523660 29244141 34907006
39569 34907006 24216463 -9180704 -36241737 -24735641 13689111 36216259 24613994
39562 24613994 2367873 -3507635 7318578 21020488 31004047 38354347 44732341 51225716
39554 51225716 55937092 52076317 36759105 19013705 9935885 9239373 10012145 9167649
39546 9167649 4391552 -7447014 -18022157 -9808029 14795066 26488651 11422013
39539 11422013 -2331158 11397856 30637867 21327788 -1281552 3413096 28455787
39532 28455787 27813057 -2517828 -13196332 14512150 32727357 2505848 -46307294
39525 -46307294 -67183178 -65375631 -70977180 -77743313 -58826887 -24260987 -13417960
39518 -13417960 -34584093 -52386447 -38834629 -6960185 12046744 4160485 -19791261
39511 -19791261 -37592003 -33924927 -12620094 10556086 27725957 40201355 39929833
39504 39929833 12059376 -35085839 -66829646 -64102986 -46030710 -34443911 -22239005
39497 -22239005 200633 14758760 4574032 -8093605 8982952 44569187 58929919
39490 58929919 44677752 32638596 37932848 40131151 24651719 8453137 10108140
39483 10108140 20969274 21368430 6632826 -14286046 -29999147 -28980529 -7463984
39476 -7463984 18198022 23591984 6180382 -14098616 -27487036 -44038134 -61777516
39469 -61777516 -52613729 -1255829 61147546 88369920 73649978 47234204 26599812
39462 26599812 1241861 -28307394 -31578993 6538918 43868195 21685452 -54959356
39455 -54959356 -114298834 -106906362 -63971205 -42653261 -43575573 -23107480 28403591
39448 28403591 69703764 71810026 52281927 33648816 9336043 -28323826 -62775817
39441 -62775817 -81229037 -95827265 -110462546 -99707075 -53912571 -13860281 -19115417
39434 -19115417 -46229427 -43038583 -5514766 26721359 36362731 38066102 30896882 -2544964
39426 -2544964 -47073849 -59593572 -34316266 -14387822 -23540806 -33064906 -16541972
39419 -16541972 7079356 10627097 123738 -8493841 -19254078 -33243874 -27256919
39412 -27256919 11976111 56839450 72694571 61215415 42945219 21762740 -1638193
39405 -1638193 -5645154 23423438 54735015 45980013 4964570 -19224128 -2913344
39398 -2913344 28724286 44196746 39859035 29450141 27154490 43488068 73976824
39391 73976824 92284428 78846234 53333498 50499038 66567790 63991904 32293134
39384 32293134 5717998 7901105 16058731 1977218 -22859644 -31280742 -25578248 -26743873
39376 -26743873 -33896754 -26911191 -2787907 19280164 26596987 22000691 7301802 -15921277
39368 -15921277 -29672737 -13449713 18665813 24075087 -11024288 -45846679 -36531713
39361 -36531713 6866458 39085087 40386834 30206935 27152171 25673410 16431139 4973784
39353 4973784 -181204 -2315718 -10469713 -28223083 -50895780 -63626529 -46017989 2997612
39345 2997612 47271326 45624909 5734910 -21799493 -11850613 4010765 -8354875
39338 -8354875 -32206015 -28729399 5411955 42014818 64398487 72441211 59993622
39331 59993622 25168796 -6780004 -10113275 -1936453 -17954720 -49038591 -49715287 -14803240
39323 -14803240 4047400 -23237783 -57982273 -53488394 -23132614 -10405041 -20336411
39316 -20336411 -22631939 -6529280 7551283 5230464 -6308916 -19361947 -35252966
39309 -35252966 -50734961 -55904124 -49049613 -39085465 -32081890 -25826552 -15881486 853254
39301 853254 23117619 39181334 33766116 9425629 -11173429 -13537916 -6705676 433399
39293 433399 17659111 49768949 74262582 68137344 41927445 19219547 -4238869
39286 -4238869 -46915916 -94331052 -105103705 -70114390 -30766619 -23805747 -35458787
39279 -35458787 -29549996 -898375 22634082 22306831 10934024 10760516 22453804 25554226
39271 25554226 8229569 -13252421 -15049327 -1930690 -4323721 -32606051 -55527365
39264 -55527365 -42419576 -9783751 617930 -20039129 -42584666 -50654018 -61608820
39257 -61608820 -86696560 -102102231 -81931062 -40093457 -13658663 -13006688 -12466525 8759906
39249 8759906 35990596 38152611 6710670 -35832871 -63429191 -70804588 -65947171 -49515776
39241 -49515776 -16921709 20714109 36275109 17138284 -16161287 -33963999 -31816211
39234 -31816211 -27799528 -32003074 -34494938 -23917678 -5178167 6723477 5780488 4215482
39226 4215482 20236943 53426511 77296772 67602922 35067014 12568124 9671573
39219 9671573 3735199 -17174827 -31278737 -20369657 -3568881 -7863028 -24759599
39212 -24759599 -25266368 -4120403 19220773 32370977 35585993 27281579 12594735 14653648
39204 14653648 45975805 79204461 79873808 57936069 49030359 54038678 42229989 11113765
39196 11113765 -6959482 -3774798 -9920805 -35688339 -46710661 -22951375 2135465
39189 2135465 -6556935 -30505256 -30294590 -7871589 13105 -25258175 -67861228 -102489377
39181 -102489377 -111714858 -90265944 -53235019 -29355785 -29396352 -33920345 -25521898 -14166533
39173 -14166533 -14069522 -17004366 -10767297 -5729827 -18756556 -44773014 -66389468 -78614239
39165 -78614239 -83750691 -76196641 -53536942 -29400569 -15405090 -4538109 8916929
39158 8916929 11343351 -5676932 -21400803 -13081596 8506191 17213688 9567965 -2792322
39150 -2792322 -21282728 -48213948 -61588036 -39579581 -955909 16854449 14231991
39143 14231991 24803445 56264796 76627491 65258840 40087993 23374367 13424061
39136 13424061 3566663 492266 8480244 18118521 23868136 33311704 48494987 56824204
39128 56824204 49705449 32964551 12830068 -9210408 -23027589 -14360636 9791446
39121 9791446 23489354 18477823 14414007 21914729 22482483 2965194 -15004861 -4926183
39113 -4926183 22824743 36619557 30993939 30524487 47570791 61578131 49456248 20711409
39105 20711409 8453894 28419611 57699652 61115077 35613831 16017408 29626223
39098 29626223 57587195 58590946 24965997 -7390137 -8235740 9430523 11912630 -10812950
39090 -10812950 -37490732 -43843633 -25852797 1702351 20933153 25301717 22110109
39083 22110109 20757930 20876707 16230834 6438685 -2977249 -9268980 -12679327 -11466827
39075 -11466827 -6270805 -5281299 -14352919 -27119040 -36929352 -50889720 -75013910 -92183252
39067 -92183252 -77022808 -31488302 15226945 41734951 48211894 37003371 6741393
39060 6741393 -29210538 -45306586 -35939107 -24170032 -28772796 -42132577 -49022227 -45973278
39052 -45973278 -32497128 -5269943 27116359 44863611 44775014 45805519 53910875 45903596
39044 45903596 7472191 -34847698 -44150693 -20981110 2128542 3283900 -11941010
39037 -11941010 -27681984 -33233817 -26820995 -17213203 -15465449 -17578654 -7455195 16368504
39029 16368504 35364930 41585289 50045051 65721473 64688978 31699067 -7108821
39022 -7108821 -18571373 -10838113 -14523589 -29207037 -24576282 9925909 48655326 62926484
39014 62926484 45832148 7303858 -31407682 -43752373 -24576676 -5829952 -18539781
39007 -18539781 -45236039 -42060801 -4825415 23898842 18052420 1546459 5863193
39000 5863193 26539111 40329233 40692645 35944265 29645069 21058040 13144723 6909698
38992 6909698 -1360714 -8421677 -3497215 11310209 15430311 -2857836 -26558192 -31212421
38984 -31212421 -15915491 1101266 10733369 21513907 40521739 58116666 58057831 39803513
38976 39803513 23723878 27974006 43210923 43058757 22751628 9979542 25579781
38969 25579781 50876908 53647429 32612033 12256529 4503628 3111356 8065852 24007447
38961 24007447 37397100 27800718 2731349 -10966085 -11821050 -23982642 -48470813
38954 -48470813 -55438629 -38236096 -33271931 -62854363 -95316367 -91695992 -61567715
38947 -61567715 -39612645 -31429481 -17899681 4327697 21672228 32035962 43807554
38940 43807554 54000522 52573960 40401120 22005069 -6532656 -40444621 -54663180
38933 -54663180 -37120005 -16453150 -23756791 -42279220 -33389565 -255928 19312243
38926 19312243 18792080 31957924 68778154 91215673 73230640 43757610 40834909
38919 40834909 53324418 42243338 3156206 -25162905 -10315513 38559333 86195955
38912 86195955 107271751 104543265 97998611 98725619 96157279 75237032 39910975 8403876
38904 8403876 -9278896 -14092663 -4387055 19324553 39285768 35636606 17876091 14056128
38896 14056128 25017707 21442390 -3211729 -12420239 18450173 57348677 56949665 20855165
38888 20855165 -4518616 6610220 34535497 48487217 40395082 24583246 21872236
38881 21872236 41374902 64735554 58068141 16043061 -18982355 -4432780 46951302
38874 46951302 84690510 84123827 63161661 43140996 28391525 25306877 44941069
38867 44941069 76340243 87826060 67395229 36047152 11255539 -13235610 -37796361
38860 -37796361 -39943979 -10395473 20917507 22561076 3969138 -8481865 -17483359
38853 -17483359 -41888851 -71742596 -76385385 -54797123 -39564591 -45454008 -49549290
38846 -49549290 -34685685 -20201137 -28587652 -45442761 -38529610 -4829845 24459974
38839 24459974 22133243 -8215715 -41402222 -53921407 -39687702 -13642304 51008
38832 51008 -9247032 -28231847 -36489182 -29612765 -19048657 -13701659 -11310343 -6548223
38824 -6548223 1734322 12362255 23057375 27739127 19968096 3661675 -4984504 6128320
38816 6128320 26623339 28813213 -2586776 -48126816 -69798323 -53599830 -28303437
38809 -28303437 -32455127 -66459362 -89878018 -68537769 -13536367 31989543 36665325
38802 36665325 5271143 -33010760 -51484436 -44110557 -25427400 -14421484 -16608833
38795 -16608833 -22994883 -26181178 -31382995 -47637493 -72403467 -90124939 -86119612 -61559334
38787 -61559334 -35706174 -29472741 -41568716 -46574770 -26893810 -253456 2293638
38780 2293638 -17137576 -23925221 -3959081 12460873 -2566460 -28607789 -25032981
38773 -25032981 10442108 41053547 40981460 17939000 -9381850 -27520255 -22850341 10188183
38765 10188183 50225081 64317108 48990452 32706195 32422093 34277776 25610556 17027096
38757 17027096 17910646 17263478 8367218 7763184 26187418 42653300 35638974 22204496
38749 22204496 32841445 58181498 57792070 22223711 -9314358 -4700025 15977198
38742 15977198 10768156 -25247125 -54070040 -45103766 -13556075 -302365 -20872106
38735 -20872106 -47980047 -49676010 -31738796 -24560220 -33728261 -30402731 1917117 38210212
38727 38210212 47676114 36068379 27302047 20495186 -3129875 -39681836 -62373231
38720 -62373231 -61277669 -52851466 -46169798 -28742455 5437453 39285510 55996331
38713 55996331 58990805 58214452 55246852 51529970 52000628 49949141 28470877 -9697175
38705 -9697175 -33788460 -23448106 2123118 12880755 9473579 11755084 17555758 3012972
38697 3012972 -35642609 -67163194 -61638653 -24754511 14380813 36930333 43365111
38690 43365111 36620185 13519459 -21451028 -45376096 -35360842 589145 25429550
38683 25429550 15860060 -7353860 -6607324 22710617 49243920 49655024 33077665 19151138
38675 19151138 15326013 23872658 47784519 75782952 81758236 56260105 22442497
38668 22442497 4688709 -1454672 -9860575 -13323785 1943611 24930176 31692223 21344914
38660 21344914 12362146 7482494 -8295060 -34054413 -46318557 -32942256 -9792903
38653 -9792903 4396404 9024208 9792340 6146056 -274547 -3410815 -8973358 -34317669
38645 -34317669 -79331498 -113657281 -108620122 -71198363 -32384197 -10108037 3432233
38638 3432233 23288908 51811081 74954823 73512188 42600465 2107618 -19991716
38631 -19991716 -16181345 -1872270 9232583 16346814 17416182 5605419 -12069263
38624 -12069263 -14478429 2530910 15829418 11623350 9907621 29571991 49998681
38617 49998681 39225936 7590404 -2882767 20246597 44727119 45066594 35952229
38610 35952229 40965961 55440467 59965380 52498617 46834283 49137280 52203917 47365339
38602 47365339 31442126 8405517 -7456940 1497544 36208580 74173404 90816665
38595 90816665 81289317 55712976 24087485 -4213013 -17221951 -11754217 -2467791
38588 -2467791 -5691299 -17181317 -18445519 -3377523 13610288 16844619 7241048 -1052107
38580 -1052107 3584364 17637778 22850821 3956558 -30327557 -52492513 -48660129 -34418031
38572 -34418031 -28207824 -23735365 -7785470 7116838 -3793959 -33864976 -44561056
38565 -44561056 -15499024 30137888 59880553 68507112 68341952 65859380 64358600 70294950
38557 70294950 78712686 70065704 40721209 18202320 22578473 30120491 4892772 -46054001
38549 -46054001 -81937031 -85151250 -74084315 -62484139 -44886156 -27247292 -32219857
38542 -32219857 -59173018 -73480401 -54501146 -23507931 -3561814 15881652 45942551
38535 45942551 60298002 30046836 -21384559 -40589744 -15546614 13303809 12875534
38528 12875534 -7210264 -23673333 -30631469 -30717730 -22578131 -11117823 -9802621 -20803844
38520 -20803844 -29998958 -30552831 -32792058 -40692847 -38123311 -12757879 21751412 42455771
38512 42455771 44718037 40545518 39473318 42560773 46225909 41562184 17996667 -23309807
38504 -23309807 -66195811 -93723419 -96437517 -67549798 -9917488 47458877 65392803
38497 65392803 41215009 16633873 21490909 34179524 22853050 1704222 9243027
38490 9243027 44429709 66577318 57543288 43578920 47080608 53498386 43341576 27266622
38482 27266622 25931960 34530408 31454313 11981723 -6968939 -10925285 -1418803 11583507
38474 11583507 18606205 13319857 -4302835 -26615840 -44404416 -53846067 -56362433 -54857082
38466 -54857082 -51037956 -43631447 -31356854 -21780964 -30318834 -59278571 -83382392 -72494079
38458 -72494079 -28166229 18383599 44318424 52784839 52293463 42941695 31215309 34484838
38450 34484838 55913284 73856984 71543733 59097562 49372519 32069787 -4054588
38443 -4054588 -39112098 -41750226 -13645635 14049874 26352781 38852931 63933489
38436 63933489 88809016 95968567 85483314 67798577 50952626 43518912 53964299
38429 53964299 75651790 85283460 68980521 41792710 30268889 41237133 57124245
38422 57124245 57969058 39837512 14381018 -1964316 1546098 24368654 56282798
38415 56282798 84211221 98271626 94876791 78193585 58085621 43874152 40308442
38408 40308442 48619158 65573940 80515184 83250172 80222565 92322524 128585585
38401 128585585 173208826 208482925 236651631 264810188 284918068 291647639 305059245
38394 305059245 343741970 384026118 384112837 349378702 332827907 360246079 395063974
38387 395063974 396499119 374353680 358332367 346907183 323231582 296699292 287839327
38380 287839327 287669804 272541084 249135292 243479958 250252401 236252142 197394468
38373 197394468 170054505 174646139 186550211 180653640 170332681 177594877 191016418
38366 191016418 182540962 151577045 126731932 129612169 153733421 174050774 167070268
38359 167070268 130516337 91572148 83675492 107463137 130137813 130852318 124275670
38352 124275670 125860094 120788508 92272607 58018264 46447647 52381824 50811011
38345 50811011 42639594 47681631 58726439 47011299 16990314 10320518 41083344
38338 41083344 69079102 60257798 36479475 35556156 53227187 60535197 55303796 57210532
38330 57210532 66670518 67633402 62727419 68001641 77392609 70012169 51807277 51616100
38322 51616100 72299802 84635018 77750601 75411443 87567469 86094223 52262360
38315 52262360 12638126 -1560072 -558366 -9445649 -23066877 -24393839 -24644856 -42727018
38307 -42727018 -60978731 -46988872 -11057684 4280871 -9783830 -18770807 -5049052
38300 -5049052 8641497 6556104 5935951 17491954 21023250 4684099 -7204390 6188406
38292 6188406 24423167 17365228 -9434297 -29308731 -33270789 -27344787 -12090601 7525684
38284 7525684 12011905 -4546167 -16365784 -4778245 7734345 -4147259 -20751797
38277 -20751797 -10096434 12715089 8996888 -14834314 -18264737 -638695 -2839669
38270 -2839669 -28956841 -29239506 18017871 64893168 65190218 38094132 23357372 16423560
38262 16423560 -5838739 -27584316 -14384181 25389256 47447792 34266014 11178967
38255 11178967 1711611 2109142 2715499 4442325 8007844 9671261 12440720 22952459
38247 22952459 34278800 28540975 72342 -35831792 -57390370 -51056418 -18552454
38240 -18552454 18718752 31094742 12360335 -7548044 1491584 28791716 37205047
38233 37205047 12409327 -23397161 -44009856 -43805833 -29380860 -7238127 14574964
38226 14574964 26292337 23239922 7617327 -12449052 -20038758 1531497 43473337
38219 43473337 69155459 55675110 24915638 11457769 14043406 7915085 -6515380
38212 -6515380 -4104945 19240791 39240222 45583562 54690787 70717848 69829852 40598800
38204 40598800 10467627 11164523 38909543 66233882 74511712 60045499 27314386
38197 27314386 -7592793 -22874208 -14425457 49351 7681086 12216190 12935166 -1722508
38189 -1722508 -26778098 -34400147 -12874776 13784198 25038948 35758177 63762791
38182 63762791 90970112 88648422 62496591 39869886 26727174 9898940 -10025613
38175 -10025613 -21899572 -31091146 -49364599 -64340667 -54334302 -30429434 -27039419
38168 -27039419 -48464060 -60796148 -43896168 -17025535 -1072452 12730970 38842576
38161 38842576 67750481 80399679 75157203 64170101 57225959 62246404 86127963
38154 86127963 119672042 134485749 111899599 68401673 39075162 39547242 53466144
38147 53466144 54611804 35410552 15211323 20278652 51176934 75354953 64068316
38140 64068316 31924778 21124050 46094529 75131076 73489977 44779738 18744250
38133 18744250 14039696 24991561 33154522 22835124 -3364592 -19019957 263667
38126 263667 39648363 54737244 29018753 -2133607 -2216604 15827535 16163646 -2237731
38118 -2237731 -8940537 5799239 18586266 14870171 11300283 26519084 54545115 78319904
38110 78319904 88931412 80314957 45526563 -6303065 -46141248 -56065775 -52030379
38103 -52030379 -58124315 -69222768 -60951112 -30845424 -4932662 -807472 -6499323 -4437035
38095 -4437035 2931386 4770104 3587115 7829569 13104437 10478258 7316698 17304286
38087 17304286 30512340 18942800 -19832051 -48031671 -32700595 11970992 45986562
38080 45986562 53352470 48836024 44943934 37707047 23240101 5138895 -16126380 -40263435
38072 -40263435 -51805859 -30366008 17613734 58075015 68423285 58959646 48987358
38065 48987358 44116163 47908158 70971127 109122901 132698586 120911311 92388380
38058 92388380 78790929 82153098 84902599 89738769 114867581 151676307 163710572
38051 163710572 138562337 110766166 114656898 135997380 132907295 92717071 45063470
38044 45063470 21170132 19886867 19888522 12744592 11799820 28448956 48960266 45299255
38036 45299255 10455864 -28485879 -42709121 -38288415 -42616393 -56752394 -46621315
38029 -46621315 5252132 59787125 59150127 -646695 -61086949 -71066372 -42399714
38022 -42399714 -20348975 -17824110 -6503639 31040835 70696638 79205495 54662396
38015 54662396 17912095 -18510241 -50459139 -64360988 -48288843 -17781639 -2287085
38008 -2287085 -3163563 6922709 36027736 54446336 39151541 9128513 -5388893
38001 -5388893 -5851327 -11158627 -18955132 -12338002 5099789 12006788 3390447 -5216941
37993 -5216941 -5439955 -2113680 5889402 22918385 34502065 18170221 -18355523 -38995350
37985 -38995350 -28562451 -12456005 -15136854 -26764366 -28723206 -26749120 -34289995 -41040657
37977 -41040657 -25040369 12390911 46062819 56443949 42549102 11600738 -25728811
37970 -25728811 -52683596 -56135025 -40239315 -19911907 -2816888 12124175 22322379
37963 22322379 20323668 5094806 -14445748 -27775939 -30858465 -30014863 -40564923 -71954437
37955 -71954437 -107888810 -113575337 -74425013 -17125414 21336225 35749398 48109425
37948 48109425 70587736 92941333 101510714 90735499 59638400 18545578 -3040676
37941 -3040676 18793928 65269734 87340772 64036735 25164213 4693066 -2223631
37934 -2223631 -14765099 -22094526 3591874 58121714 102634367 113071430 104266042
37927 104266042 96001731 82361377 53553441 26601908 25055415 36216919 20945553
37920 20945553 -26962244 -59363786 -31518461 36148127 79839396 69938501 39691000
37913 39691000 32191325 45199323 45608431 20927093 -7858365 -19287738 -14319432 -3136666
37905 -3136666 11667568 29160413 40584846 38843183 31981329 36175294 56368226 81136377
37897 81136377 95558661 92503459 72477256 41153836 10128177 -6644274 -3177497
37890 -3177497 13471195 31260000 43647803 49695709 49068320 43690949 40990238 45765283
37882 45765283 48374133 31327758 -7994606 -49533257 -70754902 -67388567 -49684554
37875 -49684554 -28781925 -14860054 -15995997 -23774074 -10256060 39777218 97934056
37868 97934056 116963272 88124713 50502278 37264124 37963807 28220568 13249825
37861 13249825 17631235 44396358 69458852 73580108 59815387 39506030 18427131
37854 18427131 -330653 -13192203 -19985355 -22964707 -21653883 -16564829 -15974427 -28304730
37846 -28304730 -47560648 -56477297 -46157780 -25123071 -8060667 -2489281 -6430007
37839 -6430007 -11545506 -7323938 11477620 39401209 64917533 79225901 78447736 62594115
37831 62594115 38308870 18074733 9670311 9648832 12615791 21168815 39021932 59722826
37823 59722826 71230976 68282749 53348780 30614360 6388321 -10743911 -18354403
37816 -18354403 -22881976 -27708956 -27741776 -22339789 -19741527 -18594850 -2458855 31676255
37808 31676255 58226712 58234740 50879807 60615081 70101793 45026887 -3427490 -26428607
37800 -26428607 -9904071 6886812 -2829026 -13610912 3149831 28606955 26389375
37793 26389375 -3076643 -29477623 -35971304 -28150323 -14283079 -1995465 -2908801 -18181983
37785 -18181983 -30347910 -28487525 -26973066 -38601607 -46723155 -31464941 -9330521
37778 -9330521 -14084095 -44977241 -66722810 -60952667 -47387047 -48282907 -57911594 -57401880
37770 -57401880 -40950728 -17284316 1814362 7447307 -860962 -10005492 -2837917 22092244
37762 22092244 46136021 49084701 30200278 11509236 18413554 48849889 63962246
37755 63962246 27592553 -40915333 -77866819 -52531798 -6862109 4867686 -10561346
37748 -10561346 -7878820 20192302 35565316 20418837 3860215 12239232 30824312
37741 30824312 32933983 19134388 8315972 9714142 20335536 35140061 46613881
37734 46613881 46170141 34940793 22652194 12498630 589620 -9448263 -9652469 -6037014
37726 -6037014 -11883761 -20797308 -11744081 13823675 27327228 15318588 -388042 2348211
37718 2348211 16766549 27978586 37223251 46272747 40897467 12602137 -20492136 -35044468
37710 -35044468 -29669468 -13901439 10972992 39598023 49515032 25332091 -15849554
37703 -15849554 -44116404 -50689405 -44821671 -32171191 -16560087 -8153844 -8073309 980014
37695 980014 27501644 50637110 49718558 36481070 31608527 28290405 10840488 -8325553
37687 -8325553 -7901517 -26116 -12080937 -35504833 -37124195 -17261132 -9580539 -21044549
37679 -21044549 -19969524 7696547 37400272 54163699 73426526 93757143 77476570
37672 77476570 10113845 -61423955 -86716204 -75164611 -64960710 -60302401 -42850231
37665 -42850231 -20816553 -17662198 -25622279 -17873769 532011 1134685 -10528531 4427050
37657 4427050 51242876 82159145 64367884 28873251 24574515 52591371 76333558
37650 76333558 76383062 63222704 46651017 24797796 3042970 -3293129 7858554 18839009
37642 18839009 18354416 19648731 40114664 70599544 79271934 47565255 -6816459 -47858024
37634 -47858024 -57513277 -47484526 -36814873 -28404755 -14444631 2925744 11085985
37627 11085985 8770268 13681819 37160565 60257424 52403390 14677070 -13277521
37620 -13277521 -64484 36568729 52597137 34980880 14039756 16137638 28552179
37613 28552179 26488111 15322041 20658347 44778420 60297491 48710841 21841323
37606 21841323 103536 -7975056 3314395 41837064 96646005 130724165 116375809
37599 116375809 68754479 27370888 13164464 19451833 33873575 48173206 53151857
37592 53151857 45986538 39841854 46619473 53832480 40382197 12769078 407640 13176335
37584 13176335 30013810 35404387 38894816 45836173 36475780 -3882370 -53043860 -73947311
37576 -73947311 -56950471 -20614155 17108010 46090684 53150564 31395802 -884737
37569 -884737 -13937499 -1342562 16932925 25445230 26844589 24164386 13290740 -568677
37561 -568677 -1478727 11087097 14334567 -5493634 -29625100 -32735736 -19468131 -15463984
37553 -15463984 -29527817 -44673492 -45276146 -35837676 -29716760 -31112072 -32103147 -21217541
37545 -21217541 5355558 36472072 53949740 53964832 53196848 63153290 67052381 40258060
37537 40258060 -9510003 -44012324 -41510485 -22626163 -18821670 -31044257 -35458964
37530 -35458964 -21431021 -6604051 -14095872 -45918307 -81616022 -97255440 -84130622
37523 -84130622 -53081836 -24008726 -12243045 -22903974 -50383954 -76636373 -77191346
37516 -77191346 -43070301 3688919 30263519 30521936 27551741 35893749 40190617 21479389
37508 21479389 -12201637 -36009836 -36580699 -16413956 16710838 48241881 57635120
37501 57635120 40989491 23020994 24724110 28809176 4607284 -38076575 -52856129
37494 -52856129 -19284861 29095349 50652552 42455489 25121745 5942173 -18394397
37487 -18394397 -37737862 -34547387 -11164175 9380540 11948210 5673586 9596334 30315628
37479 30315628 55580375 66129425 54885496 35700692 28625646 36419014 44362874
37472 44362874 44215276 44576472 51369356 52867453 36533144 10087899 -8463826 -14940437
37464 -14940437 -18897797 -23666447 -21205236 -7822465 6252218 7878581 -2108752 -6240826
37456 -6240826 12036175 44641681 58866836 33459345 -8732055 -23183682 -598259
37449 -598259 22239390 17491403 5725832 20754295 57423685 81870793 79720406 65428807
37441 65428807 52250181 41535890 37396539 43734133 47397058 30538310 83450
37434 83450 -20596415 -28759333 -41805917 -57857263 -51297958 -18489470 6155409 -375919
37426 -375919 -13791536 -3276901 14820522 -947997 -50817642 -84681165 -64762398
37419 -64762398 -12051117 22557512 19272004 6623599 20135409 55775753 73903169
37412 73903169 49056464 3594222 -19526582 -9678677 4459125 249142 -9637129
37405 -9637129 -3740077 11912260 13079598 -6508638 -27109197 -29611370 -16047424 -1636245
37397 -1636245 3864102 3148934 4444825 10994102 17790821 18619376 13810293 8540580
37389 8540580 7213864 13501215 29403995 46897428 49267326 33172088 20142000 28183634
37381 28183634 40256395 25299667 -14018086 -43941925 -50197289 -51961674 -58189335
37374 -58189335 -47727150 -11465242 20241476 19177946 718959 -5369760 -743191
37367 -743191 -1863589 1041523 29001615 70308813 90352055 80390996 61787572 46091488
37359 46091488 27196597 12034285 19925423 44071952 49756399 24758168 1363755
37352 1363755 10676456 38925731 49032262 29864290 5560179 3294954 24168225
37345 24168225 44122402 41018206 22618975 19737419 42995624 61300794 43218954
37338 43218954 4701360 -14939293 -13540856 -21942371 -41230559 -32231192 18194651
37331 18194651 65346434 67911366 45294545 41382169 58700116 65723671 52638215
37324 52638215 41811896 47362933 55486322 48035955 24948987 -293244 -15027971
37317 -15027971 -16717610 -14967719 -20754898 -30921357 -33164114 -27639863 -26353046 -27489259
37309 -27489259 -14090584 12140875 22092309 100268 -31637113 -47317568 -48485343
37302 -48485343 -38697858 117963 70725414 126515392 118538993 62447812 17155373
37295 17155373 7951498 13192249 17841083 31012840 49246250 50417882 34215346 26985244
37287 26985244 34591452 30299828 4111780 -14750586 -3978444 18258314 27743131
37280 27743131 30363863 39581134 46174935 37106808 21401953 11859561 2045789 -14033210
37272 -14033210 -20944179 -7713973 5006839 -6362485 -28602328 -32110901 -18184847
37265 -18184847 -12176250 -17113356 -9517450 17699329 39713655 34377939 9045989 -13694602
37257 -13694602 -18432720 -1328206 28896417 49289326 39623265 8094553 -13481445
37250 -13481445 -5736123 18736173 35486507 34915212 23591957 10895013 2927559 3724368
37242 3724368 15293206 35955779 58164466 68468473 57137495 32215747 14558039
37235 14558039 11183219 4734390 -18951605 -45093814 -48918519 -30307692 -8954909
37228 -8954909 7003130 22750953 31516759 16829377 -15403254 -33993700 -22181000
37221 -22181000 1135434 10893950 7476781 6705865 14997604 27173697 35227321 28899931
37213 28899931 2353263 -29511539 -38212607 -17852592 2817856 -920082 -17276050
37206 -17276050 -23046900 -22304192 -32629895 -45504211 -33986705 1368734 26067428
37199 26067428 18736937 -1131498 -3748789 14048280 36232166 53828735 66157788
37192 66157788 68292625 56755167 42253963 39159142 43554726 37462532 16531314 -1414069
37184 -1414069 -1223236 8720027 9853686 -1228800 -12276818 -14865949 -11568119 -5744584
37176 -5744584 1762948 4148447 -8527600 -32591885 -50686125 -55430037 -57126574 -57452663
37168 -57452663 -36566773 11614632 50278713 40315022 1188762 -9913637 17914241
37161 17914241 31725223 -2700227 -46792238 -50355608 -27475189 -24220820 -37586493
37154 -37586493 -25197457 12420287 21462557 -19833716 -59185381 -42221895 12919349
37147 12919349 47070043 37892817 9069899 -19968698 -52346237 -84344753 -93611473
37140 -93611473 -68112450 -26765460 -19909 626914 -11603364 -16667316 -8317557 194381
37132 194381 -7559881 -28235767 -40139019 -31316358 -13778303 -1102823 13147635 38741259
37124 38741259 63611139 67661924 54463527 44965296 42855302 32680691 13916986
37117 13916986 7592187 19280750 23522615 2777770 -21582459 -20867138 -4200983 -3661072
37109 -3661072 -23429814 -34206909 -19039365 3105747 8202413 -226133 -1935056 12051062
37101 12051062 34823259 54779064 59140910 37931397 37198 -22704936 -5597065
37094 -5597065 36246183 60663656 44744112 5438213 -25868051 -33556096 -19366082
37087 -19366082 8340637 35960511 47712425 40458776 28938469 27040517 32139525
37080 32139525 37446426 47900484 67534593 80818803 69399743 45053199 41307230
37073 41307230 66556914 87844345 73065653 31591366 -1880427 -10219478 -3710150
37066 -3710150 3519368 8027990 10301183 9224615 6081637 5424172 10708337 23117534
37058 23117534 40827944 54683831 52214829 34307284 19751979 21805730 28118661
37051 28118661 19183441 915803 -697408 22134344 45557211 45338817 25792156 7893151
37043 7893151 641735 -3391152 -10387079 -15878384 -13752400 -6692975 -3093142 -5125404
37035 -5125404 -4870329 2865523 6397616 -13525260 -55865544 -91564685 -93173681 -64035071
37027 -64035071 -27806139 1087106 21555925 29577833 19399807 -235909 -11003357
37020 -11003357 -8871986 -7166636 -14639329 -26471849 -36974406 -43078750 -35226946 -6076959
37012 -6076959 29112050 42746791 29340757 7495505 -13858954 -41646919 -65776790
37005 -65776790 -56993338 -14274354 21009743 22157425 14731558 27274462 38381911
36998 38381911 14678280 -24805853 -32965588 -9882050 -1772945 -27053039 -52759881
36991 -52759881 -50492609 -30512755 -9056224 16157945 41557436 46538088 26609303
36984 26609303 6327215 463332 -7582629 -29597874 -45956980 -38541969 -21659241
36977 -21659241 -14324971 -8718706 4878659 7951817 -15945271 -41398080 -31899077 1676723
36969 1676723 14260495 -6209439 -24653431 -14667147 8900477 23052258 29723036
36962 29723036 39486784 46487144 38444033 17394471 -4110529 -18074601 -23079718 -20457909
36954 -20457909 -15513749 -14253669 -14508828 -8934017 1588597 8937572 13435066 24442386
36946 24442386 42115528 53614701 52477398 46503908 40425743 27758832 9175503
36939 9175503 1617137 15122299 34766288 41282252 37332495 36075534 35417996 25554578
36931 25554578 14422404 19765062 36181540 36212193 11348480 -11244829 -5469587 19206036
36923 19206036 35469569 34402211 25154667 11472644 -7800636 -22169826 -20373888
36916 -20373888 -17263226 -41029569 -86364214 -109561096 -87001608 -52427442 -50699600
36909 -50699600 -75014286 -82925010 -62085850 -40906054 -35099857 -24802028 3548095
36902 3548095 29433752 32728187 25155367 22088366 10246638 -23800736 -53391621 -39429886
36894 -39429886 10036691 45858505 42861638 23563446 13140599 7163909 -2949483
36887 -2949483 -5315547 9601353 24585605 17744170 -5863240 -25974990 -39074655
36880 -39074655 -57285967 -82166685 -99696634 -99704605 -85219272 -64252112 -45139386 -37109042
36872 -37109042 -41534015 -43901000 -28504181 -2037202 10894712 -879648 -20390433
36865 -20390433 -24891852 -12479417 2476811 13096380 26179068 43932159 51650536
36858 51650536 33538774 -2902808 -29923232 -30083502 -13793135 44385 9784354
36851 9784354 24232251 38687456 38364187 25432418 20504730 29621512 29978767 2403472
36843 2403472 -37492928 -57300397 -46064335 -18226828 10528532 31876697 36176077
36836 36176077 18065272 -8439334 -20130708 -14329297 -12522628 -29407964 -52839232
36829 -52839232 -61180907 -48830242 -28443302 -18309085 -32122955 -68855215 -105789429
36822 -105789429 -113571244 -87509104 -54740752 -42472341 -49831586 -60209229 -67486632
36815 -67486632 -73466411 -69857443 -45946836 -13035166 1290901 -10246517 -21812120
36808 -21812120 -8228103 22889107 45009681 46899227 37686806 25940352 12550315
36801 12550315 3645627 12295574 40233602 68933100 76333048 56857464 22579647
36794 22579647 -7017116 -14507107 3550158 27283804 28112929 2480719 -20394666
36787 -20394666 -16880205 -2632642 -8810113 -33548399 -43114134 -21418713 8811277
36780 8811277 22537787 24316995 27809280 25749927 4573620 -24566644 -36599308 -29744126
36772 -29744126 -26180289 -34459353 -36322613 -18737444 3584563 12418508 15719308 32928368
36764 32928368 59025586 65394790 39000171 3599518 -7102749 11624371 32568207
36757 32568207 28250366 -2130081 -35219850 -45580602 -25800420 7495603 25336723
36750 25336723 10970951 -22580303 -43603125 -33441705 -2095136 30164559 56291190
36743 56291190 78192282 88515265 74392166 40034521 10960917 10225331 38031048
36736 38031048 75263737 97362603 86079725 43081098 -3484295 -19287429 3008889
36729 3008889 40221939 68619870 82066888 79841510 60107499 34839021 27210375
36722 27210375 38066233 36854580 6159177 -25623973 -21941495 9169599 30494957
36715 30494957 30607777 28869693 33139464 30772502 22904761 29760143 51906360 59315133
36707 59315133 34352013 -430693 -13134233 -44236 20870655 33706666 29435607
36700 29435607 7399884 -14765306 -12023997 14757861 36070827 35342356 29397715 33756588
36692 33756588 35894354 24778545 19548686 39096438 64840589 66853415 49913718
36685 49913718 38243760 28745289 489685 -35475822 -39475542 -1439525 42097810
36678 42097810 58700595 53882512 42896306 22704536 -9154304 -35765467 -43005799
36671 -43005799 -39621340 -35702347 -22484221 3616677 17236798 -5231148 -42629626
36664 -42629626 -49258944 -16717499 14166685 9458441 -15353272 -22449341 -3207315
36657 -3207315 15867001 11718934 -7649468 -16624944 -3218096 19315702 29946449
36650 29946449 24228999 18266218 28723312 52534511 69604108 63878064 37648853
36643 37648853 5818318 -17726573 -25149445 -12993671 14428455 39413893 39748939
36636 39748939 12616768 -14861788 -10504001 25937610 60032412 60288250 29290900
36629 29290900 -8067326 -36557419 -58361147 -74543438 -75579908 -55892838 -28190361
36622 -28190361 -14561726 -24206789 -43741218 -50078998 -32117735 457605 29284591
36615 29284591 45549574 53475041 59138951 63561786 67003648 70871761 71769641 61988534
36607 61988534 41079146 20035774 9429838 10289123 19389751 32919767 40725804 31142548
36599 31142548 10223249 1935612 17878184 41301858 54331981 63137752 75911965
36592 75911965 73815749 34343417 -25262248 -60951717 -57774983 -42408769 -36999616
36585 -36999616 -31651563 -12272795 12350603 26271081 28624160 27080358 26478107 34271955
36577 34271955 58952023 91836203 107561769 93714003 64659197 38476563 18839475
36570 18839475 7153410 9410242 18651601 13011634 -14306658 -43829784 -61235687
36563 -61235687 -75584981 -91664097 -93358247 -76003391 -65238501 -75099829 -76303558
36556 -76303558 -42426641 -1947530 517032 -22796014 -18828144 23954208 59745700
36549 59745700 55473139 30069398 13534286 9322496 13316207 32601210 64589488
36542 64589488 86867807 87326776 79664256 73470308 56369194 24404469 2447322 9693203
36534 9693203 26800084 23917082 5078623 -1886054 11457541 26514390 27786606 19458771
36526 19458771 13808522 18208502 31455939 42802067 39725655 24356739 13388517
36519 13388517 14690392 17190642 12794436 10849563 16453287 12946148 -12182665 -38081615
36511 -38081615 -33422387 -1331891 24648499 27543095 24313252 32030657 39366541 23714367
36503 23714367 -15340212 -50662637 -53090217 -19702644 21653174 38730257 28354245
36496 28354245 17165271 25572584 42787240 46467307 33683815 17466928 3833171
36489 3833171 -9246157 -18414959 -21037295 -28531882 -50351036 -67140754 -45958170 12529342
36481 12529342 65091008 74611941 50930534 32424452 39660288 57656411 55904206
36474 55904206 19351088 -33632912 -62160585 -41716281 6478024 36950427 31288500
36467 31288500 12214161 4947978 6336198 2061085 -6694595 -11044115 -13052186 -16212435
36459 -16212435 -8277732 23287951 63253909 79559802 64744577 45495312 43422004
36452 43422004 45235675 26608399 -6987564 -23956852 -10174874 10254830 7455623
36445 7455623 -13050150 -17104813 12869153 55119544 75635266 64907914 38953416
36438 38953416 15270417 2149715 5069507 25387227 50989655 62993082 56510260
36431 56510260 43947365 34515498 22914841 3997790 -13931651 -20190528 -17214289
36424 -17214289 -14643404 -14058364 -9795450 -1018161 6791067 10737357 13001344 15434733
36416 15434733 18062759 21399918 23807593 18268741 -444717 -25288276 -41728111 -45663025
36408 -45663025 -48946465 -60786531 -69079850 -51359308 -6386170 36119323 47182497
36401 47182497 33807814 27583130 38112396 36979875 -1240648 -58647116 -94092828
36394 -94092828 -94279022 -81780836 -74878010 -65291258 -42561366 -17014433 -3534261 1621944
36386 1621944 10979740 22328219 20731287 -397579 -31700814 -57629754 -65857342 -53670210
36378 -53670210 -34094910 -28249473 -40848019 -50277849 -35023017 -3227102 18312002
36371 18312002 19316188 13254621 11317726 8297301 -923031 -7920411 -4406863 1706173
36363 1706173 -3488441 -18298227 -25361583 -13331889 9742425 27369493 32514205 28913086
36355 28913086 18604029 -1305683 -25937401 -37471491 -24800627 -3840276 -2980862
36348 -2980862 -26494576 -47152036 -40938030 -15083395 7387682 17656313 22658037
36341 22658037 27215809 30607883 35345945 44306813 51947775 51031163 44349469 36834640
36333 36834640 21499225 -9158284 -40083408 -43225721 -15405549 11782341 9523259
36326 9523259 -15105367 -34818748 -38724766 -37933539 -40768278 -39900635 -28360155 -16680185
36318 -16680185 -23219219 -47928972 -64753259 -48312508 -6678734 22698175 15041069
36311 15041069 -12279555 -21933396 -2644953 20093333 18980275 -2814668 -19945123
36304 -19945123 -16120017 1788303 17733243 26240544 34699369 49024251 63486063
36297 63486063 68409800 62427346 48392834 21093383 -25904640 -78706666 -105545020
36290 -105545020 -90914391 -54749465 -27396789 -17780374 -16347830 -13458409 -183036
36283 -183036 31369592 67335958 68433983 15536100 -51970445 -74836117 -45169438
36276 -45169438 -7046732 9379427 16344976 28605799 36874906 35576998 40641331 58652976
36268 58652976 67956549 53060335 32403409 28503578 33031132 25893228 9185261 -2746124
36260 -2746124 -9459113 -15492443 -11364481 10265376 32768157 35914871 27130742 28010093
36252 28010093 40442981 49887360 50495094 42502486 18468014 -19635646 -43436107 -31363961
36244 -31363961 -7708261 -11911089 -37690888 -44930682 -28479079 -25981579 -48917035
36237 -48917035 -56168126 -19689933 25308484 28540817 -6200647 -34280003 -33186474
36230 -33186474 -18885741 -10099979 -6859757 -2297357 6788637 20886261 33971155 32262452
36222 32262452 10319051 -17110314 -32587170 -37768287 -42167730 -38717002 -12840662
36215 -12840662 25118986 39975590 13350416 -30486868 -52614371 -44087313 -29498664
36208 -29498664 -29811045 -36685473 -29652325 -8031735 7389556 2074097 -16990177 -36275999
36200 -36275999 -50435770 -54371790 -38309581 -7194946 10128495 -5086822 -28170333
36193 -28170333 -20502118 11667301 21404791 -10790488 -47749147 -49886174 -27591331
36186 -27591331 -15444288 -18301702 -13523989 6039815 21534600 18210402 3267841
36179 3267841 -7484009 -4915675 11374148 33455909 47839596 47009738 36118206 22727870
36171 22727870 7219191 -10247005 -23843753 -31508437 -38334545 -42184347 -32056913
36164 -32056913 -12211339 -7439244 -25749009 -36698564 -13120290 23496635 31924323
36157 31924323 12603039 2432964 14107575 21914796 11698789 4292409 16034476
36150 16034476 31276113 32785083 30456340 39245381 52546594 57878137 57939606 56616178
36142 56616178 45325437 24167103 14105893 21915102 14337466 -38532888 -107857781
36135 -107857781 -132824978 -99782415 -57545283 -49305462 -64549678 -70635398 -59481950
36128 -59481950 -41477510 -17425639 16448822 48995176 65357341 70988018 80817460
36121 80817460 87706913 67205459 18631301 -21805335 -21781449 9112364 36629722 44878728
36113 44878728 44618547 46647069 48225753 46272792 44330388 40426763 24654941 -1935040
36105 -1935040 -20190643 -16627025 -3287113 -364641 -7679217 -8632485 2905838 15300041
36097 15300041 16560507 5382957 -13222441 -29781738 -30230093 -9914774 11949544
36090 11949544 8309431 -21671658 -48841138 -48048889 -22585756 7559883 25601292
36083 25601292 21705282 -4816408 -37555773 -52495691 -45414117 -35700571 -34387982 -27438243
36075 -27438243 -5428414 10304633 -4333106 -34564334 -41719767 -16830581 7977921
36068 7977921 5752366 -11740847 -16814127 -3369117 12388742 16629115 8388184 -8722850
36060 -8722850 -31109808 -50795053 -56550434 -44542861 -24172361 -8717534 -802143
36053 -802143 7833694 19553847 20131715 -5412861 -47327386 -74248382 -67970577 -45313253
36045 -45313253 -36286698 -47473359 -57692689 -46363885 -15734661 15093730 31094877
36038 31094877 34833254 40995745 56043422 65680420 51377895 18534502 -6551597
36031 -6551597 -11115295 -8584301 -8815737 629623 25750001 42460021 29964360 8796774
36023 8796774 9233853 14972486 -15750034 -74000129 -96849890 -56810909 -7309922 -7699735
36015 -7699735 -40080051 -42261249 -237285 38486864 37026044 12219369 -588341
36008 -588341 6818726 18108085 19132908 8567265 -6062728 -13568829 -7535386 5981526
36000 5981526 14788536 14345788 8111786 -2993979 -20705652 -39900836 -50113676 -47931939
35992 -47931939 -39418178 -29765546 -17972507 -1529255 19347569 39792942 48525559
35985 48525559 35567952 8602740 -9028255 -7295581 -3759616 -14020684 -23652613
35978 -23652613 -13930553 -2174798 -21293465 -61679797 -72863980 -33956799 12579430
35971 12579430 16691715 -18539435 -55445354 -76505474 -90392145 -98464828 -88287678
35964 -88287678 -59099356 -29004839 -13361128 -11436887 -14872885 -16214469 -9728103 4658942
35956 4658942 19052017 27580632 34325524 42730726 44596560 31455331 10418887 -3892781
35948 -3892781 -7478452 -5411398 -360015 3356932 -6302504 -32208005 -51490634 -37654611
35940 -37654611 1779531 30000175 25184176 2331326 -11635262 -7894895 3030777
35933 3030777 6033848 -5971443 -23135647 -22964921 4332336 38194981 50276494 39593729
35925 39593729 26447242 17277144 1052921 -20946617 -31252572 -27055969 -26059537 -32779198
35917 -32779198 -28002470 -5053705 11572392 1916198 -19773895 -31386064 -36786875
35910 -36786875 -50544255 -67522906 -72213326 -65022636 -57439361 -52465589 -48371888 -48757430
35902 -48757430 -51204309 -41740383 -19797696 -10589879 -29573251 -52422922 -47034647 -19594377
35894 -19594377 -668324 -572922 -8429435 -20117217 -33752138 -32175259 -7329003 11888373
35886 11888373 -1194131 -16419037 17243061 85909444 118533452 87384708 43003188
35879 43003188 32150177 38094832 30390711 20623000 29022650 38620044 27406368 13400732
35871 13400732 22579266 38314056 28985828 5493944 3239682 19474404 16327792 -17794455
35863 -17794455 -53430192 -68161993 -70920482 -73503167 -72391259 -67006567 -66952925 -71757180
35855 -71757180 -66702930 -46494331 -23872931 -10296104 -5460434 -6644433 -9962974 -3907065
35847 -3907065 17461478 36348261 28493593 -2407874 -30008439 -42197109 -46560746
35840 -46560746 -41752798 -16381765 18697344 30545427 9097028 -16186102 -18133830
35833 -18133830 -4373530 5811287 10222208 11342381 495233 -22638539 -34771934
35826 -34771934 -18357052 7835571 11245774 -11596531 -36648574 -48198259 -50411728
35819 -50411728 -47156301 -32113127 -1960985 34432019 63152334 75032526 70503992
35812 70503992 60064802 54506862 49640890 29421327 -9261875 -45964929 -60513314
35805 -60513314 -57080834 -53189721 -54004897 -50161355 -34399367 -9477540 14186683 20866230
35797 20866230 -130012 -36540182 -57520349 -48312034 -28121356 -19017647 -11747826
35790 -11747826 15475308 53827965 66107109 33117923 -21950417 -58308711 -52825550
35783 -52825550 -12148839 34209564 52684334 32759619 -2677560 -24096713 -28281788
35776 -28281788 -31541031 -37436838 -32094753 -10425447 13608410 25660727 23496662 11098839
35768 11098839 -1884240 2426906 29324805 48121347 19346419 -46781045 -90149689
35761 -90149689 -75609372 -39398194 -36143405 -63106574 -70285045 -33407051 18961088
35754 18961088 51224977 61496898 65773111 65074437 46902320 10701393 -23344995
35747 -23344995 -33100797 -17313293 3401703 10146909 7375934 12305152 22978298 14362595
35739 14362595 -21989738 -51597495 -34924784 15264908 43932098 26276398 1607721
35732 1607721 17645266 62819597 81008870 45452787 -10035827 -37860238 -31212625
35725 -31212625 -18071255 -16253026 -16039750 -5799336 6113246 6729381 4100087 19688286
35717 19688286 54871581 81114090 72244596 36189390 2976482 -12289330 -20347697
35710 -20347697 -33935018 -48827529 -52839697 -41126097 -16600595 13510186 34253240
35703 34253240 28138803 -4282435 -37345326 -46698333 -36507678 -26938335 -21858757 -8708037
35695 -8708037 11283991 16579163 -1985631 -20724041 -10086444 28293369 64324175
35688 64324175 71775918 47516839 7403334 -23956559 -26002861 688417 32336152
35681 32336152 47046709 46755036 43844667 36292053 15197933 -9531745 -16239591 -5987128
35673 -5987128 -4653055 -22326164 -34777503 -20387172 5151988 11946930 -534348
35666 -534348 -6900336 3996027 16216179 14726765 6214423 6516202 21268631 44512169
35658 44512169 65998292 75247886 67028849 47164683 26971615 10697916 -4731499
35651 -4731499 -18062968 -21604090 -12304180 4355212 22731608 38548082 40936857 18470178
35643 18470178 -19335851 -41437307 -29611507 -2553280 10392134 10810076 24835255
35636 24835255 57402808 78934686 67412373 41028581 29875319 31230878 19155745
35629 19155745 -8325280 -22422234 -9902165 2216520 -14602371 -47663169 -61353053
35622 -61353053 -44672943 -16016763 10426793 34179870 46015819 28264949 -11416722
35615 -11416722 -33518509 -13375311 23047519 30864428 2630653 -28349715 -35598504
35608 -35598504 -28012165 -26842398 -31330289 -19957862 17407894 58816610 69833788
35601 69833788 44545322 16393809 17742356 37806774 40016370 16695549 -1075130
35594 -1075130 6104212 15536389 -475346 -32609174 -53394308 -58001981 -58741278 -54445783
35586 -54445783 -36281350 -14473306 -7501290 -9077170 3284753 28082437 39002607
35579 39002607 26575987 10890468 7321213 7737253 3222639 -1474670 -4948449 -14218465
35571 -14218465 -23222837 -14032224 7403309 5534199 -34653853 -75826918 -71134214 -23169184
35563 -23169184 21920298 27942108 -1803713 -37717132 -50227407 -32163978 -7305712
35556 -7305712 -6304490 -27010500 -37306197 -25834856 -21482473 -43257149 -62208090
35549 -62208090 -46497985 -18852719 -24584433 -56019916 -59092115 -16585405 24168172
35542 24168172 21762692 -3464982 -9914652 1352024 -2502875 -28485201 -46842059
35535 -46842059 -37457740 -20001108 -27211015 -61091968 -86993133 -70313941 -14993225
35528 -14993225 36780160 44761922 9810531 -29395992 -37301698 -15073794 5883153
35521 5883153 -1206742 -32016952 -57633531 -56303551 -35986545 -20555689 -17136831 -10672558
35513 -10672558 6349930 17729076 10923207 4065354 22276378 55165227 65113999
35506 65113999 39237979 7647207 2296962 20212757 39812300 53276577 63616091
35499 63616091 63424516 40747613 4325905 -17357468 -8779722 12681223 17070197 -4157465
35491 -4157465 -31255942 -40180693 -26892758 -7715079 -1439843 -14260564 -37917474
35484 -37917474 -56356842 -55246649 -32262754 -1108605 18870868 20056426 11726902
35477 11726902 8445012 17239271 34219847 46443559 38702933 9507890 -18598861
35470 -18598861 -17689694 11956176 39210091 38771449 17871348 71726 -2710054 7394523
35462 7394523 24288982 37450844 35020507 20983889 15682808 25158912 26223912 355200
35454 355200 -33883549 -45088995 -31390170 -13322383 1759939 18062998 25382095
35447 25382095 9984115 -13257283 -15169130 2120709 9466415 1267645 2576418 20007901
35439 20007901 27501388 14315607 5398041 13007741 8217350 -29386806 -67481905 -62868778
35431 -62868778 -23234744 9496266 18610447 17556790 9629925 -15099171 -44829646
35424 -44829646 -46930296 -12357121 28947988 47171740 46142787 47923219 60153517
35417 60153517 69766460 60925431 32024248 -2297999 -25204471 -34817434 -41869824 -48504261
35409 -48504261 -42017861 -17494376 8010456 17501835 16786495 18278141 15953166 432696
35401 432696 -10022802 16069191 74615583 117258474 102915793 42874610 -14703817
35394 -14703817 -33940643 -17211014 8087603 18274669 10619084 -2343594 -11583078
35387 -11583078 -19823311 -30867879 -40047518 -41510375 -37447595 -33096905 -29956589 -30306250
35379 -30306250 -38771132 -51757817 -56908363 -52352047 -52666138 -63566161 -66978694 -49072656
35371 -49072656 -27355843 -26131029 -37000999 -31528588 -6721875 10817845 4933122
35364 4933122 -12569290 -25448946 -28927189 -20335762 482213 17382204 9208198 -20011427
35356 -20011427 -45790547 -61394437 -83093401 -110695600 -115867623 -86099805 -50186626
35349 -50186626 -36988201 -34425596 -17362991 4949385 4154416 -15410077 -17062387 14577926
35341 14577926 52092797 66313355 62080685 57670390 50109287 25143419 -7647481
35334 -7647481 -16949034 7615375 36280366 37162978 19113756 15824989 34679783 48541422
35326 48541422 41326353 31562068 35155061 32773346 1991468 -38167193 -50370840 -37095582
35318 -37095582 -37133660 -63170508 -80689001 -59886676 -15668304 21037354 44408077
35311 44408077 64872973 79767992 76777178 56247143 31661599 14011399 6964507
35304 6964507 9342224 13381621 9579841 -430441 -6690602 -9345015 -17504300 -26528163
35296 -26528163 -20138796 -3971040 -9337561 -46118771 -78309444 -71404778 -42288094
35289 -42288094 -32145821 -46157383 -53679186 -39284664 -18920812 -6188653 5318909
35282 5318909 20123263 28112406 23777332 18159217 20504306 21818225 6692998 -26437190
35274 -26437190 -62338058 -80595187 -69832067 -38355060 -10985917 -7495940 -23349534
35267 -23349534 -36767751 -32721614 -15230209 9888 684508 -9240029 -10030737 9921444
35259 9921444 29862569 15742775 -29021618 -56177067 -33158312 12314862 32527522
35252 32527522 23434389 16075712 20433801 16717950 -2842351 -21566944 -29680518 -34723896
35244 -34723896 -37105874 -27108797 -10743722 -6111478 -7366891 13681570 58518613 87472798
35236 87472798 71055712 27800471 -5955189 -17799985 -13897314 1018751 17617385
35229 17617385 19700896 8666163 7452864 20209267 15247379 -24545798 -60465108
35222 -60465108 -43799935 13614286 52886001 43809427 10780783 -13450198 -23259461
35215 -23259461 -24678178 -16898157 -1812075 9342503 10276308 7444008 8473124 14110973
35207 14110973 21687460 24175970 9436318 -23889387 -54171457 -59008717 -45719625
35200 -45719625 -39706196 -47615855 -56264419 -63144559 -76690848 -85637599 -64196410 -17409028
35192 -17409028 14101375 11118089 3438117 17632883 30614681 8802810 -32497071
35185 -32497071 -50011195 -37851730 -29098971 -37737039 -42589468 -33586922 -32111699 -49897441
35177 -49897441 -62916058 -48962641 -24985558 -21555915 -38630565 -51817990 -48876902
35170 -48876902 -34679883 -10424913 24096055 51737593 50102817 25675982 10527924
35163 10527924 17395736 21318916 -1820259 -39603306 -63901083 -70788280 -75967035 -79420612
35155 -79420612 -62909837 -26444894 -2280814 -17297515 -55014891 -72492061 -50954501
35148 -50954501 -14746985 1617499 -6860500 -15644513 -3617108 23261230 42103744
35141 42103744 40588512 28747390 23563135 27278586 26528415 12367467 -5892939 -11994003
35133 -11994003 -4123612 2757475 -3337436 -16854824 -24259782 -22636392 -21730715 -29228857
35125 -29228857 -40554968 -43862142 -30624703 -1605658 32331485 55064474 56824927
35118 56824927 42751590 25657623 11079339 -3442802 -15348222 -15549064 -4228403
35111 -4228403 4069361 -454611 -9003992 -9578986 -6143824 -9027935 -14352178 -9428735
35103 -9428735 5334512 15848095 13763671 2186835 -14771242 -31891398 -35563000
35096 -35563000 -16507784 9932177 16423589 -1300580 -21931081 -31952499 -36616775
35089 -36616775 -33718314 -7277216 38374908 66340355 50515859 10780953 -15403192
35082 -15403192 -17590988 -8257563 5919134 24066611 38404271 45950833 58820586
35075 58820586 80554121 89686148 71799646 47565354 38562045 27563885 -7542398
35068 -7542398 -40309030 -26800323 19785513 40858510 19492393 -340205 8986153
35061 8986153 19279365 5011297 -12168979 -8260547 -569520 -10186933 -19090242 -4176713
35053 -4176713 17665123 19735538 14137706 26865518 45498189 37858777 9817786 -1068441
35045 -1068441 15944415 35016832 41326085 47406492 56463794 47005437 7669772 -40027965
35037 -40027965 -68022548 -72163530 -66272948 -60989144 -56887056 -47998057 -27607506 2212028
35029 2212028 28367924 41654530 47773543 54586020 59276154 60641095 69242144 86150285
35021 86150285 86562436 50972821 2693060 -15057644 4593567 26583567 22747987
35014 22747987 -538485 -23205095 -33594837 -27829875 -11033076 -1313869 -11501944
35007 -11501944 -27881461 -27996251 -14304329 -5501032 -2528403 5350604 8073325 -12330888
34999 -12330888 -38283278 -30542929 8212543 29288647 10940708 -9781034 1411071
34992 1411071 26355277 34183907 30980486 35085159 35668231 14327550 -16833679 -36166872
34984 -36166872 -50579721 -75105882 -92723327 -75638262 -35905629 -14444160 -22970980
34977 -22970980 -32900512 -22504925 -2483847 9889731 14271139 17051888 17626631 12075299
34969 12075299 -633533 -16285771 -21797954 -3554140 29239840 44447667 27504034
34962 27504034 5712384 10339974 32402121 44478604 48681347 64915456 82222835
34955 82222835 66350598 17526202 -20888209 -21118021 -2810748 5877682 6107173 10904271
34947 10904271 17515716 16252730 7851348 -2299656 -10935418 -9133014 13120048 46299673
34939 46299673 65323698 61493040 49087675 35176182 11107362 -16623478 -20312171
34932 -20312171 5042149 21835840 -1092016 -44241000 -68818505 -69938337 -69173944
34925 -69173944 -73643150 -75463019 -77361024 -84391273 -80163989 -46493227 -1190729 18490816
34917 18490816 7604620 -6169386 -12583401 -28909598 -53554892 -53334004 -17383646
34910 -17383646 14097842 5164149 -20789797 -17870288 9553331 13323286 -23756331
34903 -23756331 -61208481 -59558515 -32805517 -22120169 -38766332 -57612210 -57329608
34896 -57329608 -42796122 -27335100 -13240401 1333435 9479878 3206472 -9760239
34889 -9760239 -9452638 12292604 39006697 47390394 33953976 15598632 4666493 -4937517
34881 -4937517 -20689307 -32185268 -24922246 -9858973 -18306363 -58588959 -95223675
34874 -95223675 -89064749 -49054331 -23099354 -38666405 -72845700 -86280044 -68075419
34867 -68075419 -36426741 -9389592 9657789 23797608 32661203 30651877 11872106
34860 11872106 -18247727 -37325236 -26639173 -1114408 1798510 -24248691 -33779470
34853 -33779470 14000483 93304430 136095723 111785816 52710047 2039494 -30418809
34846 -30418809 -52849589 -63655530 -58014649 -42999828 -28790555 -16659095 -6349346
34839 -6349346 -1714640 173604 9130077 20260731 10651058 -27180889 -65552157 -73921085
34831 -73921085 -56835549 -40012124 -32324183 -25810665 -23256133 -36517243 -58749490
34824 -58749490 -66341590 -54142833 -44386664 -50501971 -53819656 -32986140 -1746814 3967684
34816 3967684 -26604590 -62890782 -69068914 -44001474 -15767235 -3371279 1809594
34809 1809594 14259711 28839996 29578117 15798453 2949360 -774742 -1800685 -3879469
34801 -3879469 -1255851 6586544 12182181 18961287 41719657 76571667 92892758 73504420
34793 73504420 42142891 27544379 20081365 -4318454 -32163829 -25122630 16898129
34786 16898129 45939678 29550313 -9306229 -30270578 -23799713 -3272401 23175710
34779 23175710 46870980 44855058 3441943 -51579984 -75681287 -57247310 -28012340
34772 -28012340 -19700389 -28521398 -29089891 -9736616 15640548 24292883 5724072 -30489725
34764 -30489725 -61675825 -67480420 -44152334 -7729647 18144523 22659324 18676826
34757 18676826 29495930 61529989 94333802 102453490 82558016 52911134 31909010
34750 31909010 26279556 34250604 46034207 43012584 12265986 -34715795 -69851738
34743 -69851738 -77506532 -64538998 -41848651 -12927726 14748667 25328533 12930029
34736 12930029 -8136515 -21867497 -28168113 -32371854 -29896403 -15170704 2904557
34729 2904557 8805406 -554717 -15103583 -25358196 -28363759 -26135750 -26747376 -39489214
34721 -39489214 -59367835 -64838489 -43122011 -11030775 2486219 -10008244 -29872639
34714 -29872639 -36453498 -24090060 -958781 15629377 7996285 -22460164 -47478208
34707 -47478208 -39365923 -5786157 17509750 9233398 -16006706 -29683757 -18797200
34700 -18797200 8703147 34329445 41126700 26459107 5466153 -7447925 -18118299
34693 -18118299 -38949005 -58707126 -49544499 -10505990 20691083 15320184 -7158623
34686 -7158623 -9807518 6952968 10253143 -10798163 -27998730 -19277346 -2339675 -4161476
34678 -4161476 -17838373 -17162447 -3786413 -6713856 -30644347 -37637779 -63988 52420585
34670 52420585 68915267 47599123 34203761 50107633 60418473 30549069 -16887038
34663 -16887038 -30823996 112745 38973800 52862229 44819531 32401627 19900156
34656 19900156 528367 -29326651 -64985190 -93026336 -95671652 -68113224 -31558126
34649 -31558126 -15281787 -24570290 -39264901 -43521167 -41982418 -46044488 -59821076 -80778814
34641 -80778814 -98857990 -96249121 -67474303 -38776911 -42889881 -71661598 -82422899
34634 -82422899 -59992209 -40566181 -56406815 -87288182 -93690073 -73814576 -55298939
34627 -55298939 -47784639 -39524989 -31339602 -36808368 -49965472 -47407212 -27195523 -14556485
34619 -14556485 -20768282 -25625658 -13465842 -338878 -7758212 -30221202 -48901569
34612 -48901569 -62366207 -82083858 -105826369 -115550783 -99652169 -63647949 -21726601
34605 -21726601 10295844 18007600 -437678 -25501542 -31233691 -12274487 12856036
34598 12856036 26675823 30345838 32669509 33277523 27066122 18531158 17788094 21979294
34590 21979294 14142030 -12616164 -40270719 -46440657 -33313205 -22002289 -21041098 -18042647
34582 -18042647 -5662816 3253758 -2984432 -14592042 -16661446 -13440718 -18123969 -27723534
34574 -27723534 -29038336 -23779560 -24069679 -24562505 -6103970 26382994 36079812 234357
34566 234357 -54157619 -78419264 -55031311 -8352285 26430141 30256552 7095531
34559 7095531 -17357813 -10374117 34299168 78622734 74749391 21041474 -31653582
34552 -31653582 -35518945 4989066 46486897 57736030 45478837 34464630 35480365
34545 35480365 38366912 30543157 14102022 2045454 1911807 8311105 10618941 2997079
34537 2997079 -12739945 -28326385 -33653003 -28257270 -28111091 -48858430 -78981759 -85509775
34529 -85509775 -57188192 -26605997 -30358761 -57245793 -61200060 -24737712 17147748
34522 17147748 25217580 4644970 -11296632 -8651860 -866146 1884598 5414062 11041081
34514 11041081 5619683 -15991913 -34700830 -30816796 -15993471 -21832793 -55398556
34507 -55398556 -84298954 -75671796 -37439020 -6630917 -2884657 -9624393 -2257788 19334773
34499 19334773 32915502 19832724 -16830837 -53808156 -63999270 -39232475 -965468
34492 -965468 19845331 17118150 12705923 20224947 23195245 4237857 -19348843 -14280671
34484 -14280671 19607009 45873815 41177719 23732943 20646644 27136164 16459675
34477 16459675 -20036897 -59999963 -74388724 -54640266 -19110897 733540 -12974097
34470 -12974097 -43888344 -54906976 -30599335 2952256 11720652 -3400360 -14061465
34463 -14061465 -6792756 4750058 8960003 12651095 19740849 15588954 -11122776 -45739365
34455 -45739365 -65504018 -70338297 -75240975 -77435345 -56174622 -10348787 26960175
34448 26960175 26838933 2702966 -8816895 2772051 13217894 4467811 -8123333
34441 -8123333 -430599 24478785 41846387 39685448 30839476 30915711 38549945 41658397
34433 41658397 33025464 15023768 -2942858 -7265423 10971362 42555912 61274518
34426 61274518 46861621 5864113 -34508909 -51199044 -41394675 -18929280 -536841
34419 -536841 6585375 8355187 13957254 20945332 15410949 -8844214 -37500898 -49855302
34411 -49855302 -42316409 -29760049 -25663684 -29845474 -36085846 -42888967 -52553129 -64049574
34403 -64049574 -70307838 -62057920 -36044955 -2456079 18510025 13210136 -12348833
34396 -12348833 -39223306 -52858133 -49745486 -32409936 -7655778 11701688 14437656
34389 14437656 3462368 -6533622 -6478095 -1503979 -162617 -1990282 391806 10674827
34381 10674827 22192548 19950956 -6816740 -47819621 -73098423 -63528710 -36784022
34374 -36784022 -26882551 -38192659 -40318862 -14823812 15675159 20572016 4860056
34367 4860056 -2597135 6790028 13971030 5920070 -7527445 -14479363 -18135239 -24023047
34359 -24023047 -24831874 -9494025 20054523 49708889 66509631 66038236 50774108 25827002
34351 25827002 -4864038 -38106107 -64753445 -67709721 -36321713 15862592 56109947
34344 56109947 59929718 31390772 -2531080 -13511449 8099043 45569968 68891170
34337 68891170 63285039 42518086 26407662 12770338 -12159131 -40305599 -42691007
34330 -42691007 -9578835 31770929 51072005 49528605 46987062 50030925 50001908 42559535
34322 42559535 32219939 23376397 20055201 27310458 39678505 37349861 10539594 -19597405
34314 -19597405 -23502559 -2828043 11873465 1877149 -20846812 -37035840 -42609425
34307 -42609425 -41668613 -33970934 -18798128 -374806 17548560 33789493 42930371 37293122
34299 37293122 19691183 2716499 -9346553 -25696388 -49997756 -69009337 -70062742
34292 -70062742 -60217001 -56447887 -61614169 -60134063 -37206456 1993996 32198965 29161433
34284 29161433 -3777464 -33590774 -31502703 -5669695 12760826 11476294 4803137
34277 4803137 1359923 -7873915 -20845599 -14266704 17959242 42550201 31546300 9354537
34269 9354537 20177052 59467443 76917039 48353019 7009990 -7433275 2277578
34262 2277578 11848160 18056840 32986181 49924135 44485830 10713120 -24479427 -30466684
$$ [...]
##END NTUPLES=NMR SPECTRUM
##END=
