##TITLE=31Pdec_BAU-j-PK
 DMSO-d6, 124 sc
 2.7.2019
##JCAMPDX= 6.0         $$ Bruker NMR JCAMP-DX V2.0
##DATA TYPE= NMR SPECTRUM
##DATA CLASS= NTUPLES
##ORIGIN= UXNMR, Bruker Analytische Messtechnik GmbH
##OWNER= root
$$ XWIN-NMR		Version 3.5
$$ Tue Jul  2 14:29:01 2019 Russian Standard Time (UT+4h)  she@DPX200
##.OBSERVE FREQUENCY= 81.013821
##.OBSERVE NUCLEUS= ^31P
##.ACQUISITION MODE= SIMULTANEOUS
##.ACQUISITION SCHEME= undefined
##.AVERAGES= 124
##.DIGITISER RES= 17
##SPECTROMETER/DATA SYSTEM= spect
##.PULSE SEQUENCE= zgpg30
##.SOLVENT NAME= DMSO
##.SHIFT REFERENCE= (INTERNAL, DMSO, 0, 182.463)
##AUDIT TRAIL= $$ (NUMBER, WHEN, WHO, WHERE, WHAT)
$$ ##TITLE= Audit trail, XWIN-NMR		Version 3.5
$$ ##JCAMPDX= 5.01
$$ ##ORIGIN= Bruker BioSpin GmbH
$$ ##OWNER= she
$$ F:/spectra/data/she/nmr/P31/1/pdata/1/auditp.txt
$$ ##AUDIT TRAIL=  $$ (NUMBER, WHEN, WHO, WHERE, WHAT)
(   1,<2019-07-02 14:27:29.78 +0400>,<she>,<DPX200>,
      <continue with go, POWCHK disabled, PULCHK disabled
       configuration hash MD5:
       00 E9 B6 7A A2 85 ED C7 34 08 36 98 17 FE 4E 26
       data hash MD5: 32K
       BD 68 A4 43 59 9F 00 47 F6 95 E4 8B 3F 7E 7D EC>)
(   2,<2019-07-02 14:27:32.01 +0400>,<she>,<DPX200>,
      <Start of raw data processing
       efp BC_mod = 2 LB = 1 FT_mod = 6 PKNL = 1 PHC0 = -2482.282 PHC1 = -91.40115 SI = 64K 
       data hash MD5: 64K
       34 86 82 03 DA C5 B1 25 F5 0C BC 4B A1 87 36 2C>)
(   3,<2019-07-02 14:27:36.23 +0400>,<she>,<DPX200>,
      <abs ABSG = 5 
       data hash MD5: 64K
       29 39 D2 FD 66 71 5B 9B 38 C0 16 20 59 6B 4F C5>)
(   4,<2019-07-02 14:28:19.31 +0400>,<she>,<DPX200>,
      <pk PHC0 = 50.86386 PHC1 = -109.6 
       data hash MD5: 64K
       20 8B 9C D8 0F D9 E2 98 0D D9 81 1C 97 DA 35 BB>)
(   5,<2019-07-02 14:28:22.60 +0400>,<she>,<DPX200>,
      <abs ABSG = 5 
       data hash MD5: 64K
       A1 98 70 04 CB 9A 3F C3 AA 4A 8C 53 56 5D E4 19>)
$$ ##END=
$$ 
$$ hash MD5
$$ 5E 69 34 DC A7 43 77 43 CE 51 40 CD 0E 0D 19 44
##$RELAX= 
##$RELAX= 
##$RELAX= 
##$RELAX= 
##$RELAX= 
##$RELAX= 
##$RELAX= 
##$RELAX= 
$$ Bruker specific parameters
$$ --------------------------
##$DU= <F:/spectra>
##$EXPNO= 1
##$NAME= <P31>
##$PROCNO= 1
##$TYPE= <nmr>
##$USER= <she>
##$AMP= (0..31)
100 100 100 100 100 100 100 100 100 100 100 100 100 100 100 100 100 100 
100 100 100 100 100 100 100 100 100 100 100 100 100 100 
##$AQSEQ= 0
##$AQ_mod= 1
##$AUNM= <au_zg>
##$AUTOPOS= <>
##$BF1= 81.014009
##$BF2= 200.13
##$BF3= 200.13
##$BF4= 200.13
##$BF5= 200.13
##$BF6= 200.13
##$BF7= 200.13
##$BF8= 200.13
##$BYTORDA= 1
##$CFDGTYP= 0
##$CFRGTYP= 5
##$CHEMSTR= <none>
##$CNST= (0..31)
1 1 145 1 1 1 1 1 1 1 1 1 1 1 1 1 1 1 1 1 1 1 1 1 1 1 1 1 1 1 1 1 
##$CPDPRG= <waltz16>
##$CPDPRG1= <>
##$CPDPRG2= <waltz16>
##$CPDPRG3= <>
##$CPDPRG4= <mlev>
##$CPDPRG5= <mlev>
##$CPDPRG6= <mlev>
##$CPDPRG7= <mlev>
##$CPDPRG8= <mlev>
##$CPDPRGB= <>
##$CPDPRGT= <>
##$D= (0..31)
0 1 0 0 0 0 0 0 0 0 0 0.03 2e-05 3e-06 0 0 0 0 0 0 0 0 0 0 0 0 0 0 0 0 
0 0 
$$ [...]
##$SUBNAM3= <"">
##$SUBNAM4= <"">
##$SUBNAM5= <"">
##$SUBNAM6= <"">
##$SUBNAM7= <"">
##$SUBNAM8= <"">
##$SUBNAM9= <"">
##$SW= 369.568048894756
##$SWIBOX= (0..15)
0 1 3 0 0 0 0 0 0 0 0 0 0 0 0 0 
##$SW_h= 29940.119760479
##$TD= 32768
##$TD0= 1
##$TE= 0
##$TE2= 300
##$TE3= 300
##$TEG= 300
##$TL= (0..7)
0 120 53 12 22 120 120 120 
##$TP= (0..7)
150 150 150 150 150 150 150 150 
##$TP07= 0
##$TPNAME0= <>
##$TPNAME1= <>
##$TPNAME2= <>
##$TPNAME3= <>
##$TPNAME4= <>
##$TPNAME5= <>
##$TPNAME6= <>
##$TPNAME7= <>
##$TPOAL= (0..7)
0.5 0.5 0.5 0.5 0.5 0.5 0.5 0.5 
##$TPOFFS= (0..7)
0 0 0 0 0 0 0 0 
##$TUNHIN= 0
##$TUNHOUT= 0
##$TUNXOUT= 0
##$USERA1= <user>
##$USERA2= <user>
##$USERA3= <user>
##$USERA4= <user>
##$USERA5= <user>
##$V9= 5
##$VALIST= <valist>
##$VCLIST= <CCCCCCCCCCCCCCC>
##$VD= 0
##$VDLIST= <DDDDDDDDDDDDDDD>
##$VPLIST= <PPPPPPPPPPPPPPP>
##$VTLIST= <TTTTTTTTTTTTTTT>
##$WBST= 1024
##$WBSW= 4
##$XGAIN= (0..3)
0 0 0 0 
##$XL= 0
##$YL= 0
##$YMAX_a= 9652
##$YMIN_a= -17348
##$ZGOPTNS= <>
##$ZL1= 120
##$ZL2= 120
##$ZL3= 120
##$ZL4= 120
##$ABSF1= 182.463
##$ABSF2= -187.1042
##$ABSG= 5
##$ABSL= 3
##$ALPHA= 0
##$AQORDER= 0
##$ASSFAC= 0
##$ASSFACI= 0
##$ASSFACX= 0
##$ASSWID= 0
##$AUNMP= <proc_1d>
##$AZFE= 0.1
##$AZFW= 0.5
##$BCFW= 0
##$BC_mod= 2
##$BYTORDP= 0
##$COROFFS= 0
##$CY= -3
##$DATMOD= 1
##$DC= 0
##$DFILT= <>
##$DTYPP= 0
##$F1P= 0
##$F2P= 0
##$FCOR= 1
##$FTSIZE= 65536
##$FT_mod= 6
##$GAMMA= 0
##$GB= 0
##$INTBC= 1
##$INTSCL= 5.30512e-09
##$ISEN= 30
##$LB= 1
##$LEV0= 0
##$LPBIN= 0
##$MAXI= 10000
##$MC2= 0
##$MEAN= 0
##$ME_mod= 0
##$MI= 50
##$NCOEF= 0
##$NC_proc= -8
##$NLEV= 6
##$NOISF1= 182.463
##$NOISF2= 159.3651
##$NSP= 0
##$NTH_PI= 0
##$NZP= 0
##$OFFSET= 182.463
##$PC= 4
##$PHC0= -2431.418
##$PHC1= -201.0012
##$PH_mod= 1
##$PKNL= yes
##$PPARMOD= 0
##$PSCAL= 0
##$PSIGN= 0
##$REVERSE= no
##$SF= 81.0140089999434
##$SI= 65536
##$SIGF1= 159.3651
##$SIGF2= -187.1042
##$SINO= 113.3802
##$SIOLD= 16384
##$SREGLST= <1H.CDCl3>
##$SSB= 0
##$STSI= 65536
##$STSR= 0
##$SW_p= 29940.119760479
##$SYMM= 0
##$S_DEV= 0
##$TDeff= 32768
##$TDoff= 0
##$TI= <>
##$TILT= no
##$TM1= 0
##$TM2= 0
##$TOPLEV= 0
##$USERP1= <user>
##$USERP2= <user>
##$USERP3= <user>
##$USERP4= <user>
##$USERP5= <user>
##$WDW= 1
##$XDIM= 65536
##$YMAX_p= 493145056
##$YMIN_p= -92515243
$$ End of Bruker specific parameters
$$ ---------------------------------
##NTUPLES= NMR SPECTRUM
##VAR_NAME=  FREQUENCY,     SPECTRUM/REAL,   SPECTRUM/IMAG
##SYMBOL=    X,             R,               I
##VAR_TYPE=  INDEPENDENT,   DEPENDENT,       DEPENDENT
##VAR_FORM=  AFFN,          ASDF,            ASDF
##VAR_DIM=   65536,         65536,           65536
##UNITS=     HZ,            ARBITRARY UNITS, ARBITRARY UNITS
##FACTOR=    0.456856943014862, 1,           1
##FIRST=     14782.0589164792, 0,            0
##LAST=      -15158.0608439998, 0,           0
##MIN=       -15158.0608439998, -92515243,   0
##MAX=       14782.0589164792, 493145056,    0
$$ Real data points
##PAGE= N=1
##DATA TABLE= (X++(R..R)), XYDATA
$$ [...]
38131A8979606k956244k521970r825755j4675985q901619J497793O337196N644777
38123f422201N949935P738774N690106j035032p046489r023418q993532q678371
38115b1820228o570204k423999L65736k31307r02257K837341J0292093J5870573
38107b582252J4777165P161754j941754n915643k201431L918790M223979j640867
38099A5799741m440724J419420P598368K314575j1511821j8411767j1061965J455726
38091a6838447Q635642J0700987J0603719N815793k513555k934823J0488594K3478923
38083D7436833J8165147k47054j0237237n433546r16902o280667j1538243o736849
38075B4211482J423205K730074n78417j988410k954569n556802m053023L569672
$$ plain form
38131 18979606 16023362 13501392 3675637 -11000348 -19901967 -18404174 -12066978 -6422201
38123 -6422201 -472266 7266508 12956614 11921582 4875093 -4148325 -13141857 -21820228
38115 -21820228 -28390432 -30814431 -30448695 -30680002 -31582259 -28744918 -18452825 -2582252
38107 -2582252 12194913 19356667 17414913 11499270 9297839 13216629 17440608 15799741
38099 15799741 11359017 12778437 20376805 22691380 11179559 -7232208 -18294173 -16838447
38091 -16838447 -8202805 2498182 13101901 18917694 16404139 13469316 23957910 47436833
38083 47436833 65601980 65354926 55117689 49684143 48767241 42486574 30948331 24211482
38075 24211482 25634687 28364761 27786344 25797934 22843365 17286563 13233540 16803212
38067A6803212N947866n114551j7123893j2552570L912309J1595967M480179k853070
38059E095449p84220K211255k238568o678668l46140J2293147J6166421N205923
38051C0924599r954327j3679682k135806J1564677J0241129p561085k3963240
38044d563735k1651689l089285J5184529K1566987J5313559O69604j3378704j3502617
38036c451351K866845J6285196O223347j7662084k4497591n224529J4223179J0753909
38028d83079n242284j0428358k008583O992201J2264400J7127393J5439771j640772
38020C2020689k3890956k8604274j2139978L715350K982863l844964j88578J0029867
38012a9919981J0845896Q32584n424129p45658N449495N274010N775633J4444905
$$ plain form
38067 16803212 22751078 17636527 512634 -12039936 -8127627 3468340 7948519 5095449
38059 5095449 4311229 6522484 4283916 -2394752 -2740892 9552255 25718676 30924599
38051 30924599 20970272 7290590 5154784 16719461 26960590 19399505 -4563735
38044 -4563735 -26215424 -29304709 -14120180 7446807 22760366 23429970 10051266 -3451351
38036 -3451351 -584506 15700690 21924037 4261953 -20235638 -25460167 -11236988 -483079
38028 -483079 -5725363 -16153721 -18162304 -11170103 1094297 18221690 33661461 32020689
38020 32020689 8129733 -20474541 -32614519 -28899169 -25916306 -29761270 -29949848 -19919981
38012 -19919981 -9074085 -8241501 -13665630 -14411288 -8961793 -3687783 2087850 16532755
38004A6532755K1181491R713759j5463825k9561696j9237873K42121Q368810P117175
37996a107283J1050191J8962085J5013823l372934j8419722j7505182r082312
37989d461334n458705m502153P02289N900416K728166n406162p116876P57048
37981a6857311J0444957J3927920Q855446k362730j2323619j2060943j977880
37974a2354160N474444J353861p093139p388086O08761P608784R638846R006660
37966F855971N413011j881986o458320j725509O526182O587228j719332p932655
37958E664590p486449m376372J109402J2000456K1029107J3987727q049741k4305852
37950I572868j9576775k487000Q728147Q278370K996465l48732L90376M149844
$$ plain form
38004 16532755 37714246 47428005 31964180 2402484 -16835389 -16593268 -8224458 -1107283
37996 -1107283 9942908 28904993 43918816 40545882 22126160 4620978 -4461334
37989 -4461334 -9920039 -14422192 -13719903 -7819487 -5091321 -10497483 -17614359 -16857311
37981 -16857311 -6412354 7515566 16371012 14008282 1684663 -10376280 -12354160
37974 -12354160 -6879716 -5525855 -12618994 -20007080 -19398319 -11789535 -2150689 6855971
37966 6855971 12268982 10386996 3928676 2203167 8729349 15316577 13597245 5664590
37958 5664590 -1821859 -6198231 -5088829 6911627 27940734 41928461 33878720 9572868
37950 9572868 -10003907 -12490907 -3762760 4515610 7512075 7163343 7553719 11703563
37942A1703563N912310M14151q868638j1581316n138986J386207K197113K670222
37934a305374O219125N429777m243766j2949781j0159151p55774M608779O412793
37926f743372J0026518J1088990L501211m148748J302546J3781631J3637162k009851
37918D0436087j3764148r217007M06163N18027o109351r239042q200709o949497
37910a2119477k982600N684304J0764888M636038m759906l728306O118208J0478473
37902A4091622M494413j788473j251713N72910k222908n769909m972961k723880
37894D29101k959824k082299L876909Q829863L318575j0169489j7660184j0548353
37886b6965701M642206J4991899J4427619O521268j063284k255764L463444R585849
$$ plain form
37942 11703563 17615873 18030024 9161386 -2419930 -7558916 -6172709 -3975596 -1305374
37934 -1305374 4913751 10343528 6099762 -6850019 -17009170 -17764944 -13156165 -6743372
37926 -6743372 3283146 14372136 17873347 13724599 15027145 28808776 42445938 40436087
37918 40436087 26671939 17454932 17861095 18379122 12269771 3030729 -5169980 -12119477
37910 -12119477 -15102077 -9417773 1347115 5983153 1223247 -2505059 3613149 14091622
37902 14091622 18586035 16797562 15545849 16118759 13895851 8125942 3152981 429101
37894 429101 -2530723 -4613022 -736113 8093750 11412325 1242836 -16417348 -26965701
37886 -26965701 -22323495 -7331596 7096023 13617291 12554007 10298243 13761687 23347536
37878B3347536P687682k760774j1708525r459458N18493M211004n823903j9536996
37870a3524941j9843066l355836J4356292J7013789O967418K28048L838641P289745
37862A2970090J55176j0584028j0241159J254948Q967640N309838P1593K470315
37854A0374413M642763n450060k0929313k0558799J967301K5591806K5746508
37847B1384619L452429j7740346k0348810r309850M73569L225592L145896K937513
37839a2779388J381616Q00461O112488J3574129J1092198l391756j3784697p207289
37831d202238M850623K567542j0071121j0010831O664111J5101991N15613j5897103
37823a0481413q541928J2680644J8763283O826478L89316P649027R618636m275565
$$ plain form
37878 23347536 31035218 28274444 16565919 7106461 7624954 11835958 6012055 -13524941
37870 -13524941 -33368007 -36723843 -22367551 -5353762 1613656 1841704 5680345 12970090
37862 12970090 13125266 2541238 -7699921 -6444973 2522667 7832505 7904098 10374413
37854 10374413 15017176 9567116 -11362197 -31920996 -29953695 -4361889 21384619
37847 21384619 24837048 7096702 -13252108 -22561958 -22088389 -18862797 -15716901 -12779388
37839 -12779388 -11397772 -10597311 -4484823 9089306 20181504 16789748 3005051 -4202238
37831 -4202238 648385 3215927 -6855194 -16866025 -10201914 4900077 5415690 -10481413
37823 -10481413 -19023341 -6342697 12420586 19247064 19636380 27285407 36904043 32628478
37815C2628478j6447399j0372879K473585K376781p878695j0980893l393831K901823
37807h693030J423205k248296k285835J706676Q207650J2639646P421187o172198
37799A1999005j2723734k454185J0392183N573792j1611525j6919313m484207
37792b0227984M731904l007423j3366229q517078N218733R815447L356778j388148
37784b3384000P97280K847444M82611j558371J035708O154633R595672Q749649
37776D720626K693470n724113j0046398q110186o262674r074001r515502J296076
37768d0022702J7966660K5468378J8830644P125959k327786j1562792k0749931
37761e271570k1406730q088523J0663438K0228225J4812512N53314j1573290j2950742
$$ plain form
37815 32628478 16181079 5808200 8281785 10658566 2779871 -8201022 -11594853 -8693030
37807 -8693030 -7269825 -9518121 -11803956 -10097280 -1889630 10750016 18171203 11999005
37799 11999005 -724729 -3178914 7213269 12787061 1175536 -15743777 -20227984
37792 -20227984 -15496080 -18503503 -31869732 -40386810 -35168077 -25352630 -21995852 -23384000
37784 -23384000 -22586720 -19739276 -19256665 -20815036 -19779328 -13624695 -4029023 4720626
37776 4720626 7414096 1689983 -8356415 -16466601 -22729275 -31803276 -41318778 -40022702
37768 -40022702 -22056042 3412336 22242980 29368939 27041153 15478361 -5271570
37761 -5271570 -26678300 -34766823 -24103385 -3875160 10937352 11490666 -82624 -13033366
37753a3033366l204547P604040Q269886P26968k030027M502755Q505863M05989
37745A1747561j0192895p278933P589465J6519301R021749o302139j4646105j1087782
37737d629778k224577K147999k005667q436153o707259L539475R653394L834647
37729d827919l289345J603213J1389962P624782q904583j5991232k958145J2521952
37721b831315J0409727l920065j0981109n447026J295283O96447l953139n263708
37713a9994905J108370J4004301K4060187J8868408p86036j6203132j2411291
37706H645902J625400O263714j026201n608318l84504N483709L696709k063352
37698A6633059o107019r401329j2741124j1234540k079665Q702545J2538186P351770
$$ plain form
37753 -13033366 -16237913 -8633873 -363987 362981 -1667046 2835709 11341572 11747561
37745 11747561 1554666 -5724267 1865198 18384499 27406248 21104109 6458004 -4629778
37737 -4629778 -6854355 -4706356 -6712023 -15148176 -21855435 -18315960 -8662566 -4827919
37729 -4827919 -8117264 -6514051 4875911 12500693 3596110 -12395122 -15353267 -2831315
37721 -2831315 7578412 3658347 -7322762 -12769788 -11474505 -10778058 -14731197 -19994905
37713 -19994905 -18886535 -4882234 19177953 38046361 37260325 21057193 8645902
37706 8645902 10271302 16535016 15508815 9900497 9515993 14999702 18696411 16633059
37698 16633059 10526040 1124711 -11616413 -22850953 -24930618 -16228073 -3689887 3661883
37690C661883j865411p752630n958968k63381k04891p976511j2164186l368222
37682c5892317R184378R496375m76121m006350L530036R270753O805453N811950
37674C724157J0869204J0086362l292458j4592077q283229P450380J2901055N066498
37666B3929892k315051j899326p56827o028798j3808037j4094886k333197J3048033
37658d258197J5072237k407846k0658516j5038201J0200822K4542024J4555309
37651B2007632J864501N084730Q894094o338575k5728627k1299975J647702J2840494
37643a028024M462858l197345r85637j659548q622576p085350N746436J2143977
37635b25209N743387L004617J0605856J0412633o693037j9536024j0018001O093108
$$ plain form
37690 3661883 1796472 -5956158 -11915126 -12178507 -12383398 -20359909 -32524095 -35892317
37682 -35892317 -26707939 -17211564 -17687685 -21694035 -18163999 -8893246 -2087793 3724157
37674 3724157 14593361 24679723 21387265 6795188 -1488041 5962339 18863394 23929892
37666 23929892 21614841 19715515 18958688 12929890 -878147 -14973033 -17306230 -4258197
37658 -4258197 10814040 8406194 -12252322 -27290523 -17089701 7452323 22007632
37651 22007632 23872133 28956863 37850957 31512382 5783755 -15516220 -13868518 -1028024
37643 -1028024 3434834 237489 -748148 -2407696 -11030272 -18115622 -12369186 -225209
37635 -225209 5518178 8522795 19128651 29541284 22848247 3312223 -6705778 -612670
37627f12670N299764o648097r143519j933147M32313k579420l39063N493695N052712
37618d977432J732778O135104J3480684J0283922l9659j725491N088337M636542
37610C4614785n375250r209016j723711J764880p641436j6060895q602238P855673
37602d377208J5205577P072663p514595j5478415r558632N098515J1861633k3802
37594B285736j8172419j9862213l104450J1066465J0633853P974581J4707680
37587E529233K0137013R873481p898449j2837307k072791O997148J213571j3695742
37579G246157k2581696j6229608J905245J8025029J8938209N398690q403855j1510584
37571g212413o667855j323513L044426P033364P850660N216223M403907N837965
$$ plain form
37627 -612670 4687094 -1961003 -11104522 -13037669 -12605356 -15184776 -15523839 -10030144 -4977432
37618 -4977432 -3244654 2890450 16371134 26655056 26615397 24889906 29978243 34614785
37610 34614785 29239535 20030519 18306808 20071688 12430252 -3630643 -12232881 -4377208
37602 -4377208 10828369 17901032 10386437 -5091978 -14650610 -9552095 2309538 2285736
37594 2285736 -15886683 -35748896 -38853346 -27786881 -17153028 -9178447 5529233
37587 5529233 25666246 35539727 27641278 14803971 12731180 19728328 20941899 7246157
37579 7246157 -15335539 -31565147 -29659902 -11634873 7303336 12702026 4298171 -7212413
37571 -7212413 -13880268 -15203781 -12159355 -5125991 2724669 7940892 12344799 18182764
37563A8182764J189032j0895899j5838544k971798J4538056J5337652k76038j2529556
37555F735669j0777205l059930J926820N108725O864177K613537o009641q629220
37547e227068j228949O258137L367176p655492j6199350j4128728n73333J6261455
37539a9126152K1888205J0274750m158438j963169J3134698J7659078L886718
37532D1595690p457426k01883J0920340M568876j1586889j2957038J760153Q114093
37524C4755916n108364j8312324j1721492M919218P910015n783247j5685637p248751
37516a6274666R477333J4672221M165612p097596n409825M508666O689945m682846
37508F048844j7704608j8037747n593338Q234104J4780062J3302892N859075m577848
$$ plain form
37563 18182764 19371796 8475897 -7362647 -10334445 4203611 19541263 19265225 6735669
37555 6735669 -4041536 -7101466 -5174646 -65921 6798256 9411793 3402152 -5227068
37547 -5227068 -6456017 -197880 3169296 -4486196 -20685546 -34814274 -35387607 -19126152
37539 -19126152 2762053 13036803 8878365 6915196 20049894 37708972 41595690
37532 41595690 34138264 33936381 44856721 49425597 37838708 24881670 26641823 34755916
37524 34755916 29647552 11335228 -386264 4532954 12442969 6659722 -9025915 -16274666
37516 -16274666 -6797333 7874888 12040500 4942904 -466921 4041745 10731690 6048844
37508 6048844 -11655764 -29693511 -35286849 -27052745 -12272683 1030209 6889284 2311436
37500B311436j1569193r051313K31194O363857M670289Q86496J184399K901537
37492b071298K72319m704572l994538M346702J1950567J0631078L109126j085531
37484A8453853J089737K363501l845186j3632995j8084602j4901780q668418k081395
37476c9307285N194406R678702N916442k232491j990892J0876032K3215387K0586124
37468C1936425N857410o292424q429111n634990n348738r558922j4562619j3204833
37460b5237802j876767J0377219Q319715o964342j3550804J376382J9136563J4877514
37452F457678m742851j2467378l395087P61638q213345j0240630P451118K6043656
37444A654799K2991069M466081p831816p126861j515879L857469P388515L924943
$$ plain form
37500 2311436 -9257757 -18309070 -18077876 -11714019 -7043730 -6157234 -4972835 -2071298
37492 -2071298 -1798979 -6503551 -10498089 -6151387 5799180 16430258 19539384 18453853
37484 18453853 19543590 21907091 18061905 4428910 -13655692 -28557472 -37225890 -39307285
37476 -39307285 -34112879 -24434177 -18517735 -20750226 -22741118 -11865086 11350301 31936425
37468 31936425 37793835 31501411 23072300 17437310 12088572 2529650 -12032969 -25237802
37460 -25237802 -27114569 -16737350 -8417635 -15381977 -28932781 -27556399 -8419836 6457678
37452 6457678 1714827 -10752551 -14147638 -13386000 -21599345 -31839975 -24388857 1654799
37444 1654799 24645868 29111949 21280133 14153272 12637393 16494862 23883377 27808320
37436B7808320o931681j4040127r742577j667263K848175J0147155K2549108K3872316
37428E4843426M638745j3236811m777109J5757475J3106778j3221781k6650673
37421C0460050j0394853Q226478K279773j6405380k1548377j1613602l668647
37414b2664558l954369m829946j723308L106601P681943J0057074P408769K835578
37406b082216M029015Q911662M825952j0285119k0007255j3039174m47078L132959
37398b4961254J625438N715025J1354454P797130j845746n830793l123031r07087
37390a0175864J297592Q022141J3221576P139288m729596o996210J856649P592465
37382A7228041L041826k843765j498317L538861N367014K950151k061324q473281
$$ plain form
37436 27808320 20876639 6836512 -2906065 -4573328 -1725153 8422002 30971110 54843426
37428 54843426 59482171 46245360 41468251 57225726 70332504 57110723 30460050
37421 30460050 20065197 28291675 30571448 14166068 -7382309 -18995911 -22664558
37414 -22664558 -26618927 -31448873 -33172181 -30065580 -22383637 -12326563 -4917794 -2082216
37406 -2082216 1946799 10858461 15684413 5399294 -14607961 -27647135 -28094213 -24961254
37398 -24961254 -23335816 -17620791 -6266337 1530793 -314953 -6145746 -9268777 -10175864
37390 -10175864 -8878272 -856131 12365445 19504733 14775137 7778927 9635576 17228041
37382 17228041 20269867 17426102 15927785 19466646 24833660 27783811 25722487 17249206
37374A7249206j2660312j0186517k093720O028523J0031982P166751m387724j7808550
37366f660361j7278531J944322K0211623J6393024j349101o795239N319864J3552967
37358B5338568M588342q865814j1689627p299880m929847l261254J649084N829443
37350A359015N616301M830650M972594M46848q170260r714541q30487N319881
37342C830001q0489o182311j345745O477043M369450k447604n91289P193626P174979
37333A8397661j220601n295190p01544M045995L762433J748380o56759n057273
37325A5023102p241481j975064M270970P23528q027180o834439M165377P290829
37317G395642m014842j3030783n780277P305395Q650262m91434o053678l846196
$$ plain form
37374 17249206 4588894 -5597623 -7691343 -1662820 8369162 15535913 11148189 -6660361
37366 -6660361 -23938892 -21994570 -1782947 14610077 13260976 6465737 11785601 25338568
37358 25338568 29926910 21061096 9371469 2071589 -2858258 -6119512 -4470428 1359015
37350 1359015 6975316 11805966 16778560 17225408 9055148 -659393 -1489880 3830001
37342 3830001 3749512 -2432799 -3778544 2698499 7067949 4620345 4029056 11222682 18397661
37333 18397661 17177060 11881870 11180326 15226321 18988754 20737134 20080375 15023102
37325 15023102 7781621 5806557 10077527 10801055 2773875 -4060564 104813 7395642
37317 7395642 3380800 -9649983 -15430260 -8124865 525397 33963 -6019715 -9865911
37309i865911o93284J214489N227467P898876J435105j0210302j2332765j378811
37301a8705136P141587R14217r717794o629734Q407048J5929500P705113k308839
37293B735962q57540N407331M018452j970260j759109K124470j063998p701405
37285I33903l313404R785651J1065206m333699j3070032N63505J6768346R072248
37277B7471724j4478841k4016596j2401035m47832j130937n027831l262003l94926
37269c3688277R23725O029865J2038171O684905p936535j1304963M273507J7961477
37261e018125J0594728o833870j2137484m720214J45436j095871N63397N861532
37253a2640471N573435j816935p113151m988695J330203Q479752J3952292J1465190
$$ plain form
37309 -9865911 -10559195 -9344706 -4117239 3781637 5216742 -4993560 -17326325 -18705136
37301 -18705136 -11563549 -10649332 -20367126 -26996860 -18589812 -2660312 5044801 2735962
37293 2735962 1878422 7285753 11304205 9333945 7574836 9699306 8635308 933903
37285 933903 -2379501 7406150 18471356 14137657 1067625 1631130 18399476 27471724
37277 27471724 12992883 -11023713 -23424748 -23872580 -25003517 -30031348 -33293351 -33688277
37269 -33688277 -32764552 -26734687 -14696516 -8011611 -15948146 -27253109 -22979602 -5018125
37261 -5018125 5576603 -1257267 -13394751 -18114965 -17969529 -19065400 -18502003 -12640471
37253 -12640471 -7067036 -8883971 -15997122 -20985817 -19655614 -11175862 2776430 14241620
37245A4241620j339394j2741094q697531N859344J1599616J445148j1011195j1813087
37237a2456573k677218O167785P744679K00512j2209867j7738512p892459Q346428
37229c0515225J3068016M407447j019926N321262J0876360L874443p228486r078317
37221a0294426n735246r252162j5701620r091402J1699063K6405599J8684762
37214F714568k897268j5532383q161010Q288390J4290723K383095j5262709j9821654
37206b9998248o468501J0329323J3607024K529546q946126q953029J037454J0125134
37198a6737423R213185q40058r778570q108917J708301P436566K688732m365949
37190a8784133k506713O713993J1675089P376347J753774L661029J0048713R083630
$$ plain form
37245 14241620 12902226 161132 -8536399 -2677055 8922561 10367709 -643486 -12456573
37237 -12456573 -15133791 -8966006 -1221327 -1020815 -13230682 -30969194 -38861653 -30515225
37229 -30515225 -17447209 -13039762 -14059688 -8738426 2137934 6012377 -1216109 -10294426
37221 -10294426 -16029672 -25281834 -40983454 -50074856 -38375793 -11970194 6714568
37214 6714568 3817300 -11715083 -19876093 -11587703 2703020 5086115 -10176594 -29998248
37206 -29998248 -36466749 -26137426 -12530402 -10000856 -18946982 -27900011 -26862557 -16737423
37198 -16737423 -7524238 -8364296 -18142866 -26251783 -24543482 -17106916 -14418184 -18784133
37190 -18784133 -21290846 -14576853 -2901764 4474583 6228357 9889386 19938099 29021729
37182B9021729m894191k2021205k5135740r194013J0352818J4243867L113556
37175d513179m345491J808014R784228O562271q97370K006585J2314065J3509896
37167C6229019K112743p009596m272490J276872j883279j1094912j6505309j4294678
37159a5441630n279365R912704K5157747K7007289R967864j1554112j7581103
37152B2189394o049033P357266R822679J927907r871782j9558119k0203553q304194
37144b2689435P319529J1443335K049443n410343N84289J1082908J0166593k473111
37136A2073208j3418371j5118417j1117042l948849P863584J8744854J6625589
37129A1704556J327966j0117267o030197L064334K170860l982938j175711P276572
$$ plain form
37182 29021729 24127538 2106333 -23029407 -32223420 -21870602 -7626735 -4513179
37175 -4513179 -8858670 -7050656 2733572 9295843 8398473 10405058 22719123 36229019
37167 36229019 38341762 31332166 27059676 28336548 26453269 15358357 -1146952 -15441630
37159 -15441630 -20720995 -10808291 14349456 41356745 51324609 39770497 22189394
37152 22189394 16140361 23497627 33320306 35248213 25376431 5818312 -14385241 -22689435
37144 -22689435 -15369906 -3926571 -1877128 -7287471 -6703182 4379726 14546319 12073208
37136 12073208 -1345163 -16463580 -27580622 -31529471 -23665887 -4921033 11704556
37129 11704556 13032522 2915255 -3114942 -50608 2120252 -1862686 -3038397 4238175
37121D238175N073538p055062r556522K646403Q900695l385962j5814873p918829
37113b2872437R357502J2069449J602017j845897M226250L546681n850008p273831
37105g040274K214840M095536p998725j4509194l500425P445666J173752r536363
37097b7655187m754932Q410708R596367j71530m030789l80136j369860n591278
37089b5946637J21239J2665869J3748694J910785k894288O690690J2300941J579904
37081B0177197j0385648o676748L900828L365127n857020p964150j354143O13369
37073d181188p137593j4310423j1420910m93769J0779574J5892202J1247847r9372
37065B76368p525082m007463L406416K963059m018504n269827K790747R439109
$$ plain form
37121 4238175 9311713 2256651 -7299871 -4653468 4247227 861265 -14953608 -22872437
37113 -22872437 -13514935 -1445486 156531 -1689366 2536884 6083565 233557 -7040274
37105 -7040274 -4825434 -729898 -8728623 -23237817 -26738242 -19292576 -18118824 -27655187
37097 -27655187 -32410119 -23999411 -14403044 -14574574 -18605363 -18985499 -20355359 -25946637
37089 -25946637 -25825398 -13159529 589165 2499950 -394338 6296352 18597293 20177197
37081 20177197 9791549 3114801 7015629 10380756 4523736 -3440414 -4794557 -4181188
37073 -4181188 -11318781 -25629204 -37050114 -37543883 -26764309 -10872107 375740 276368
37065 276368 -7248714 -11256177 -7849761 -4886702 -8905206 -14175033 -11384286 -1945177
37057a945177P111815L430313Q199148J5985318J2134665n520978k0658381j7749968
37049I86755j460967R252222M468427o056299p359721J844255J0090290R145436
37041B0910398J924835m617766p295448o058335j764956K700956L465775K11445
37033I476904l540596n693703p333198q623748p441153l150679K274588P319912
37025a6711673J1176816J1856749Q994257O644835P065026M869396l835712j0371858
37017A9687836m389865O464535M369534j0097729j6171996m979930O630646M153978
37009E667009k582827J00949N714883K612720k847162J01390K954185p559378
37001D161769k1084047j6886296J49021N589432l535832l673399J4677094L0193533
$$ plain form
37057 -1945177 5166638 8596951 16796099 32781417 44916082 39395104 18736723 986755
37049 986755 -474212 8778010 13246437 7190138 -169583 1674672 11764962 20910398
37041 20910398 22835233 18217467 10922019 4863684 3098728 5799684 9265459 9476904
37033 9476904 5936308 242605 -7090593 -15714341 -23155494 -26306173 -24031585 -16711673
37025 -16711673 -5534857 6321892 15316149 21960984 29026010 33895406 30059694 19687836
37017 19687836 15297971 21762506 26132040 16034311 -137685 -5117615 1513031 5667009
37009 5667009 3084182 3185131 8900014 11512734 8665572 8766962 11721147 4161769
37001 4161769 -16922278 -33808574 -33659553 -28070121 -31605953 -35279352 -20602258 9591275
36993I591275K4663988Q238330k316075p971294j4596928j5748339o328568K378744
36985b088867l99925n989790k006116M997258J776936o758249n718851L577096
36977a2610508O761472J941476Q33711N286848M084237l962023m512053P536443
36969E359603J6376025R497838j679990L1491R527934P079298r828102k0317168
36961A6046929r880048Q042486J0445103l614477j3509406p882443k0524n536611
36953e908991j7104211j5422805Q06740J2950599J0657927M618303N628646P490345
36945C716553J422481o296906n352105O2470m21945l609554J427323J1770830
36937B719147J3149192L854377j672668L542361Q423251L115340n918636q760733
$$ plain form
36993 9591275 34255263 42493593 40177518 32206224 17609296 1860957 -4467611 -2088867
36985 -2088867 -2488792 -8478582 -10484698 -5487440 -3710504 -10468753 -16187604 -12610508
36977 -12610508 -5849036 -3907560 -3073849 2212999 6297236 2335213 -2176840 5359603
36969 5359603 21735628 31233466 29553476 29584967 39112901 46192199 36364097 16046929
36961 16046929 6166881 14209367 24654470 21039993 7530587 -351856 -372380 -5908991
36953 -5908991 -23013202 -38436007 -37629267 -24678668 -14020741 -9402438 -3773792 3716553
36945 3716553 5139034 -1157872 -6509977 -6447507 -6869452 -10479006 -9051683 2719147
36937 2719147 15868339 19722716 18050048 21592409 30015660 33131000 27212364 18451631
36929A8451631p671629r399592j1275784o387968L400831J0101521J1079608Q410474
36921A6709092O72708j3779462k6712923k4631992o565407J1300868J3905512
36914b9101604M804835l62020N297882J2668530J0746340J239391n691384n855919
36906f253949l438762j88381P705160J8402338K0391979Q201889n792505o851564
36898C2176205J76685j692077j4641670k2557596j6010061m288539K776613Q675352
36890a5385088J6656566J7527745M723812r863087j0668759j141060L937143K232586
36882H019858K764704N398232P64033r444085j1430024k280028M158594Q25434
36874a223282o50880Q372029J5858390P279230j0051538j6714967q253484K844535
$$ plain form
36929 18451631 10780002 1380410 -9895374 -16283342 -12882511 -2780990 8298618 16709092
36921 16709092 17381800 3602338 -23110585 -47742577 -54307984 -43007116 -29101604
36914 -29101604 -24296769 -24658789 -19360907 -6692377 4053963 5293354 -398030 -6253949
36906 -6253949 -9692711 -9881092 -2175932 16226406 36618385 44820274 39027769 32176205
36898 32176205 32352890 30660813 16019143 -6538453 -22548514 -26837053 -24060440 -15385088
36890 -15385088 1271478 18799223 23523035 13659948 2991189 1850129 5787272 8019858
36882 8019858 10784562 16182794 16946827 7502742 -3927282 -6207310 -2048716 -1223282
36874 -1223282 -1874162 6497867 22356257 29635487 19583949 2868982 -5384502 -2539967
36866b539967P962310R797853R988842M009665q340195j8175498j7635932q114377
36858b3047299L561333J1025615R981336J193146o736222m307793P362868J7307875
36850A6340859J7273372P875939o519004k0938080k7955801k1991231p302093
36843d3216039O120896J5004476K1958957K3216543J1293034p433761j4161972
36836A2782134m310324L173798n390650j5763742q440628Q840115J2652028N74676
36828D117407p438908l003639l06220q138309j3536745m657698P955277Q111782
36820a6897053j31610K56470J2405483K1462110J6346622L299864m460079k485922
36812B9795885K529193J760546o679116j6169615j8552990j2613815m145892J734153
$$ plain form
36866 -2539967 5422343 15220196 25209038 29218703 20878508 2703010 -14932922 -23047299
36858 -23047299 -19485966 -8460351 1520985 2714131 -4022091 -8329884 -967016 16340859
36850 16340859 33614231 41490170 34971166 14033086 -13922715 -35913946 -43216039
36843 -43216039 -37095143 -22090667 -131710 23084833 34377867 26944106 12782134
36836 12782134 8471810 11645608 6254958 -9508784 -17949412 -9109297 3542731 4117407
36828 4117407 -3321501 -6325140 -6631360 -14769669 -28306414 -32964112 -25008835 -16897053
36820 -16897053 -17028663 -16772193 -4366710 17095400 33442022 36741886 32281807 29795885
36812 29795885 32325078 34085624 27406508 11236893 -7316097 -19929912 -24075804 -22341651
36804b2341651M738173N903226M800570J741856j174488k219069J41657Q111272
36796b98454J9311702K2733785R567135j1511823k0786188j1794419J958003P790511
36788A6970252P904094O573627j231775j6374813k3827003j0888069J0905081
36781i968606J8782400Q658617m053173r349871j0405726p968111L097921J7718826
36773F512277J9347391L175387j3636192j4574567n125333j184408n796840r449154
36765b0731439p123995k490866K071563P875908J2290991R228421P5328m435966
36757c240055J590085R189907N549921p907892j6255277j0422608J775041P646261
36749a2074617N618764K218842j214107p910785j3917119r940348K823260J1338726
$$ plain form
36804 -22341651 -17603478 -11700252 -6899682 -5157826 -6332314 -8551383 -8409726 -298454
36796 -298454 19013248 41747033 51314168 39802345 19016157 7221738 9179741 16970252
36788 16970252 24874346 31447973 30216198 13841385 -9985618 -20873687 -9968606
36781 -9968606 8813794 17472411 13419238 4069367 -6336359 -14304470 -11206549 6512277
36773 6512277 25859668 29035055 15398863 824296 -4301037 -5485445 -11282285 -20731439
36765 -20731439 -27855434 -30346300 -28274737 -20398829 -8107838 1120583 1195911 -3240055
36757 -3240055 -1649970 7539937 13089858 5181966 -11073311 -21495919 -19720878 -12074617
36749 -12074617 -6455853 -4237011 -5451118 -13361903 -27279022 -37219370 -34396110 -23057384
36741b3057384J0028736Q722945J4029104J6119102N616372q190068j1047521
36734A2221286o524423p818974j3165429q854675N411625J3820499Q813559M14868
36726D318336k174952j775880j661291J123912N188324K858444m738296n847774
36718b709177J365233K506762q941691j7261487q036088P445166Q142629n409057
36710b2897710j3220061m859997R595775J6601567J3765542O333643n67298l655918
36702A095543j830551L181453Q509377J0960238O115553p054315j9070270j6712380
36694a4805352j291708R785338N784658l638974n104838k09503K739712M170666
36686b570001P477148Q110673L001268J355809R695571J5071353K555076j7288185
$$ plain form
36741 -23057384 -13028648 -4305703 9723401 25842503 31458875 23268807 12221286
36734 12221286 5696863 -2122111 -15287540 -24142215 -18730590 -4910091 3903468 4318336
36726 4318336 2143384 367504 -1293787 -169875 5018449 7876893 3138597 -2709177
36718 -2709177 -1343944 1162818 -7778873 -25040360 -33076448 -25631282 -17488653 -22897710
36710 -22897710 -36117771 -40977768 -31381993 -14780426 -1014884 5318759 4751461 1095543
36702 1095543 -735008 2446445 10955822 21916060 28031613 20977298 1907028 -14805352
36694 -14805352 -16097060 -6311722 -527064 -4166038 -9270876 -9480379 -6740667 -2570001
36686 -2570001 4907147 13017820 16019088 17374897 27070468 42141821 44696897 27408712
36678B7408712k0388510n443501N064601Q18402l348139L747106J0281362K054145
36670B0194178j4606430k3075671j7829493n475999N853790J0210005O256699
36663a8472921K101794P597477J7292490J4190925l556691j5400558p725585N097903
36655A124834L106114q873857j0645574J947992J3039331J0762814L8669p648013
36647B852310n789401M096870J2043891O735758q231835j3227661M75503J2948688
36639A1904123K590295j8062313j7910226M432719J6596161K364093j3122826
36632a1207974l171092J9764933K5623186J2107216K021122L632473J502417j2017291
36624C8254990k1077480j1405384O634029J2612979L274182o744505o059253J737255
$$ plain form
36678 27408712 7020202 1576701 6641302 7459704 4111565 7858671 18140033 20194178
36670 20194178 5587748 -17487923 -35317416 -40793415 -34939625 -24729620 -18472921
36663 -18472921 -16371127 -8773650 8518840 22709765 19153074 3752516 -3973069 1124834
36655 1124834 4230948 -4642909 -15288483 -13340491 -301160 10461654 10500323 2852310
36647 2852310 -2937091 1159779 13203670 19939428 11707593 -1520068 -1044565 11904123
36639 11904123 14494418 -3567895 -21478121 -17045402 -449241 1914852 -11207974
36632 -11207974 -14379066 5385867 31009053 43116269 45137391 48769864 50272281 38254990
36624 38254990 17177510 5772126 12406155 25019134 28293316 21548811 15489558 17226813
36616A7226813N994132J600104o892554j0612021n836919J642592L883957J637435
36608H643539K659843Q916793J2648116Q180470O67926k086224r47228k528186
36600C6155049q899257j5924659j8751916j4242179j974002J1898748J6410647
36593D672431Q001626l059957n259845k62903L062397L486148N441709O638733
36585B2720339J273486o003289m152438N056099P121866k198620r373031n134233
36577I310179R61314k135228q383492o111345K209988N645847L131109K186474
36569F814846L961005K862681j502863m028756m154554n548295p101271m113255
36561a2810462K568716P161043O897692K000512p774459j7584317j5032323L818485
$$ plain form
36616 17226813 23220945 24821049 17928495 7316474 1479555 3122147 7006104 8643539
36608 8643539 11303382 20220175 32868291 41048761 41716687 39630463 38683235 36155049
36600 36155049 27255792 11331133 -7420783 -21662962 -23636964 -11738216 4672431
36593 4672431 12674057 9614100 4354255 4091352 7153749 10639897 16081606 22720339
36585 22720339 23993825 17990536 13838098 18894197 26016063 23817443 14444412 9310179
36577 9310179 10271493 8136265 -247227 -6358572 -4148584 1497263 4628372 6814846
36569 6814846 10775851 13638532 12135669 8106913 3952359 -1595936 -8697207 -12810462
36561 -12810462 -10241746 -3080703 3816989 5817501 -1956958 -19541275 -34573598 -30755113
36553c0755113K1480454J8224666J164725m264575P975798J5780593L284833j5746491
36545A7144890j9800156r088569O40908K627755K741388M888126O178447M615594
36537I948383K072722N28417J118743M420595P383710M462332l515107p078557
36529A9341238m91695Q817477R661453J495729p090220j0430280r748958p977629
36521C577115o708166o473486n607126j039383O517410J1479884J0324360N404515
36513A7475123l72021o527311r866641m671388O657374J1730522M362622n470461
36505A3317819o692925l779987o622418j1048661n049945Q554077J2799679K409132
36497C886771o659182m30148J2680264J4752786L677793o066295n051783K2423
$$ plain form
36553 -30755113 -9274659 8950007 10114732 5850157 13825955 29606548 32891381 17144890
36545 17144890 -2655266 -11743835 -11102927 -8475172 -5733784 -845658 5332789 9948383
36537 9948383 12021105 12549522 13668265 18088860 25472570 29934902 26419795 19341238
36529 19341238 18849543 27667020 37328473 38824202 31733982 21303702 11554744 3577115
36521 3577115 -3131051 -9604537 -15211663 -16251046 -9733636 1746248 12070608 17475123
36513 17475123 17103102 10575791 709150 -3962238 2695136 14425658 18788280 13317819
36505 13317819 6624894 2844907 -3777511 -14826172 -19876117 -11322040 1477639 3886771
36497 3886771 -2772411 -3202559 9477705 24230491 27908284 21841989 16790206 16812629
36489A6812629p83614n561997n161274J214489L911148k129920q230552l789373
36481c718464Q116202J4919127J1157829J871532q290975j8104829k2222916j3917045
36473c0189539J634590J0220918R506341J2408089K2483346K3148538M689095
36466E3901378j4138472j0956851N376501P761926p627294j7755640j0282308
36459F279240J57249r83190o970166o124351j516297j314310k396104K979835
36451i888094J2462082J6983889J3226335M526305m642172q533518k237472Q648362
36443C0545717Q842401o879430k2297389j8778836J80194J4705670J4363252O236043
36435B6917622j20435k924148k823221Q14287M971074L836685j239423q70100
$$ plain form
36489 16812629 16029015 10467018 5305744 6520233 10431381 8301461 70909 -3718464
36481 -3718464 4397738 19316865 30474694 32346226 24055251 5950422 -16272494 -30189539
36473 -30189539 -28554949 -18334031 -8827690 3580399 26063745 49212283 53901378
36466 53901378 39762906 28806055 34182556 41944482 34317188 16561548 6279240
36459 6279240 6436489 5453299 -1516867 -7641218 -9157515 -10471825 -12867929 -9888094
36451 -9888094 2573988 19557877 32784212 37310517 32668345 24134827 21897355 30545717
36443 30545717 39388118 32508688 10211299 -8567537 -8387343 6318327 20681579 26917622
36435 26917622 26797187 23873039 21049818 21864105 26835179 30671864 29432441 28562341
36427B8562341P889932J3368725L666685j4520196k1088301q086983Q037506O110933
36419B3940642j1877751k1747071p741940J6617074K5296083J1587072o914583
36412B9159526j3125529q437485l278430j034057J325636L989936M205219J988891
36404A4793707m21129k177579k402678P75250N033989L006434o964339j4423453
36396b779798r241196L734440J1353745R872126N992642L331060j62037k515660
36388A9585322J129694O605998M002219m042532k757909R860508J5413236L657882
36380E3454418p835635l32294J3128957N625978j9248991k8791745r709714J2007241
36372A8298215J0593551m010819p459699J270317N742741L110935M468112R673771
$$ plain form
36427 28562341 36452273 49820998 53487683 38967487 17879186 9792203 17829709 23940642
36419 23940642 12062891 -9684180 -17426120 -809046 24487037 36074109 29159526
36412 29159526 16033997 7596512 4318082 3284025 4609661 8599597 12804816 14793707
36404 14793707 14372578 12194999 9792321 10567571 15601560 18607994 11643655 -2779798
36396 -2779798 -12020994 -8286554 3067191 12939317 18931959 22263019 22100982 19585322
36388 19585322 20715016 27321014 31323233 27280701 24522792 34383300 49796536 53454418
36380 53454418 45618783 45286489 58415446 64041424 44792433 16000688 6290974 18298215
36372 18298215 28891766 24880947 17421248 18691565 24434306 27545241 32013353 41687124
36364D1687124O391858n379462j0337251l638680P11634n884724j2604586q733858
36356B212055l63199L780184P908416J6892492K1405405J1098791o791000j7325324
36348C8817820j8491260j6950277j1305562K699634J5923591J4127630P28880
36341B5550456o986033l948799j297306l629051k256929M721140N737681k928260
36333A4962899p716660l79268O866733K037017n670228j594646R391381J1158027
36325B9055255J663066p285578j0023573r617068m561857Q718543K1162028J7552981
36317D6663797K26671j0953813o654350P07743K2631j892036K570383M491971
36309C5182997n827662j7861626j4304067J548584J1024794Q788211O047754N816276
$$ plain form
36364 41687124 48078982 42699520 32362269 28723589 29435223 23550499 10945913 2212055
36356 2212055 1848856 5629040 13537456 30429948 51835353 62934144 56143144 38817820
36348 38817820 20326560 3376283 -7929279 -5229645 10693946 24821576 25550456
36341 25550456 18564423 14615624 13318318 9689267 7432338 12153478 17891159 14962899
36333 14962899 7246239 6866971 13733704 15770721 10100493 8505847 17897228 29055255
36325 29055255 30718321 23432743 13409170 3792102 -769755 7948788 29110816 46663797
36317 46663797 46890468 35936655 29282305 29990048 30012679 28120643 30691026 35182997
36309 35182997 29355335 11493709 -2810358 -1261774 9763020 18551231 24598985 30415261
36301C0415261k342278j7578572k0619523l576820J2660617P690254p523630r115437
36293i990128K745078Q852556M847381L977426Q768941P121347j085806q20580
36285B4416215Q083568N289264j4113495k5036673j0817065Q540538Q260362k940503
36277A682211k510965O135573L557227q287737r951864Q27580Q273888Q326387
36269H052300J0145668J0883835p03655j6249984j4862680K48588M893558k905737
36261d98107J208324K0595461K4723424j21295k3993852j9828254l470273q3600
36253a468172j404731J0384799K2002315J0657541j1577761j4569182k99132K879188
36245A6604865r350068j1713594M452501J6239956Q430483l680828k591313N586858
$$ plain form
36301 30415261 28072983 10494411 -10125112 -13701932 -1041315 6648939 -874691 -9990128
36293 -9990128 -7245050 1607506 6454887 10432313 19201254 26322601 25236795 24416215
36285 24416215 32499783 37789047 23675552 -1361121 -12178186 -3637648 4622714 1682211
36277 1682211 -828754 5306819 8864046 576309 -9375555 -8547975 -274087 8052300
36269 8052300 18197968 29081803 28378148 12128164 -2734516 -2485928 2407630 -498107
36261 -498107 710217 21305678 46029102 45907807 21913955 2085701 -1384572 -1468172
36253 -1468172 -2872903 7511896 29514211 40171752 28593991 14024809 13725677 16604865
36245 16604865 7254797 -4458797 -6296 16233660 24664143 20983315 18392002 23978860
36237B3978860O723294M04252o253438j1223981j3670607r839702r90901M884271
36229e987952M586300L316899M145254M235628K831168K186906O90805l595801
36221A2409207m747852K216898P684417q58671j5993605j7995098m316391Q278259
36213a3322836J0622475Q725121M339654p307546j7435813q651909J2623449J6631286
36205F223881m920064k2118901j1445522R169901J1467740j52604l181103L232154
36197a1724518K598599n281524m342313P517781J4058799P624113q29097j629318
36189G992522J137626J072965n96756j048343j626678l693787n237294l549469
36181e549214K109281R006035J0323476J851244q488600p426989L269462N998781
$$ plain form
36237 23978860 30702154 31106406 24852968 13628987 -41620 -9881322 -10872223 -5987952
36229 -5987952 -1401652 1915247 6060501 10296129 13127297 15314203 16005008 12409207
36221 12409207 7661355 9878253 17562670 16703999 710394 -17284704 -21601095 -13322836
36213 -13322836 -2700361 6024760 10364414 3056868 -14378945 -23030854 -10407405 6223881
36205 6223881 1303817 -20815084 -32260606 -23090705 -11622965 -11775569 -14956672 -11724518
36197 -11724518 -9125919 -14407443 -18749756 -11231975 2826824 10450937 9621840 7992522
36189 7992522 9130148 10203113 9606357 8558014 6931336 3237549 -1999745 -5549214
36181 -5549214 -3439933 5566102 15889578 17740822 9252222 1825233 5094695 11093476
36173A1093476n920393j5707963q853754L945665N521656j20214J187184O467150
36165b387193K603834o256095k946963J2805442K1651923J3299779k069722j2827848
36157B3873157j7249848j3809983J76881J5741870J6440770J614990j0329795
36150A6458042p849726o29081j797832r513267j3240395p642088M616703J4750209
36142d847435J1856893l792296j3665805k392903J6640459J7184854N9498q156205
36134A2887060J015896N171219p890255j7069683m419233J2703919J0507602k372331
36126A0534194k969731O027955M767866o696655j0714555n003046l151262m989316
36118a2194550L513591J9345663K0565097J330938j7036676j7974609r055080
$$ plain form
36173 11093476 5173083 -10534880 -19388634 -15442969 -9921313 -10041527 -8854343 -2387193
36165 -2387193 216641 -6039454 -8986417 3819025 25470948 38770727 36701005 23873157
36157 23873157 6623309 -7186674 -7009793 8732077 25172847 26787837 16458042
36150 16458042 8608316 7979235 6181403 -3331864 -16572259 -24214347 -19597644 -4847435
36142 -4847435 7009458 3217162 -10448643 -12841546 3798913 20983767 21043265 12887060
36134 12887060 13902956 19074175 11183920 -5885763 -10304996 2398923 12906525 10534194
36126 10534194 7564463 13592418 18360284 11663629 949074 -4053972 -7205234 -12194550
36118 -12194550 -8680959 10664704 31229801 32560739 15524063 -2450546 -11505626
36111a1505626p86595R961510K2967220K3654904O031890j1107838r027401L771003
36103C3959067P075350k93378m350907j477372o6764j931992j383750m83260o742411
36094B4304583j5518433j2430548L666983J5973555J2873027J910379n095648
36087B5683898p628293r138390o071304M352967J2998715P891822q040119j8456075
36079A593221j3138685J140635J0152154P097896l353512j1749960j2384149o778144
36071b7420544j43690M669583P963920Q709852M255002l010354m135592N102438
36063d009385J4557803R696953q170524j9967617j1708505O775294J3293271J105581
36055A572871j3147746j1369170L543500J3453957R244826N44241J76160P179868
$$ plain form
36111 -11505626 -12292221 -2330711 20636509 44291413 50323303 39215465 30188064 33959067
36103 33959067 41034417 40741039 36390132 34912760 34845996 32914004 31530254 31046994 24304583
36094 24304583 8786150 -3644398 22585 15996140 28869167 30779546 25683898
36087 25683898 18055605 8917215 2845911 7198878 20197593 28089415 20049296 1593221
36079 1593221 -11545464 -10404829 -252675 6845221 3491709 -8258251 -20642400 -27420544
36071 -27420544 -27564234 -22894651 -14930731 -6220879 -1965877 -4976231 -9111823 -4009385
36063 -4009385 10548418 20245371 12074847 -7892770 -19601275 -12825981 467290 1572871
36055 1572871 -11574875 -22944045 -19400545 -5946588 3298238 3842479 4018639 11198507
36047A1198507J0850837O549513l8797k884774k675182k780793l604613l196893
36039A3417805n13678K837554K161051o927381k0434343k4701138j1228314R013114
36031c6375330J6692343R926910O132557J4589388K2166819J5434671K809964
36024E1377322K23350N180919K579343r657040j8895700j9096717j5954019j1359440
36016a5601982j003756J0787552J2389587N214101M263524J2290710J2769310
36009D1109046j830893j4283859r242758J858295N17925q539044p805989K386330
36001D169053O417753J163057j331770K499494K926390k670497m714509n67408
35993G891563J85746m807920m272916N559188J0817818K210092p768638l833970
$$ plain form
36047 11198507 22049344 28598857 28560060 25675286 23000104 20219311 16614698 13417805
36039 13417805 12904127 15741681 17902732 10975351 -9458992 -34160130 -45388444 -36375330
36031 -36375330 -19682987 -9756077 -3623520 10965868 33132687 48567358 51377322
36024 51377322 51600672 56781591 59360934 49703894 30808194 11711477 -4242542 -15601982
36016 -15601982 -16605738 -5818186 6571401 11785502 16049026 28339736 41109046
36009 41109046 39278153 24994294 15751536 17609831 18127756 9588712 1782723 4169053
36001 4169053 10586806 11749863 10418093 12917587 15843977 13173480 8458971 7891563
35993 7891563 8077309 3269389 -1003527 4555661 15373479 17583571 9814933 5980963
35985E980963P591876Q703124k309737j0401441p336841j428824k386955p935564
35977i523399r186426k306768Q176157J3652414Q311168m269276j1567875l849401
35969a0563406J3650931K4174845J6807234j799598j4463508j1161593J418407
35962A8063312Q067007J797661r770524j5230983j2298368o036721J222664R972109
35954d213843J5249495R028986n977729j4355103o005087J0246755J7239677Q852673
35946C0065824o694590j8123825j9624164j2054605j981139K837440J721669K039015
35938b1814375Q273445J4841484J4586906Q930923L257069k079479p903453q688086
35930I404434K96008J1036364R865124l060008j2367418q060725K420862O934840
$$ plain form
35985 5980963 13572839 22275963 19966226 9564785 2227944 799120 -1587835 -9523399
35977 -9523399 -18709825 -21016593 -12840436 811978 9123146 4853870 -6714005 -10563406
35969 -10563406 3087525 27262370 44069604 42270006 27806498 16644905 18063312
35962 18063312 26130319 27927980 18157456 2926473 -9371895 -15408616 -14185952 -4213843
35954 -4213843 11035652 20064638 14086909 -268194 -6273281 3973474 21213151 30065824
35946 30065824 23371234 5247409 -14376755 -26431360 -28412499 -25575059 -23853390 -21814375
35938 -21814375 -13540930 1300554 15887460 24818383 28075452 25995973 18092520 9404434
35930 9404434 9700442 20736806 30601930 27541922 15174504 7113779 9534641 16469481
35922A6469481M723524L324129N063441M091194m004799j4252174j5848815m165942
35914d599961J1367347J5446587N517006l540733N24081R149070O071953n964924
35906C3970426q005313M464736J1985075M34096j6591567j8521477q363722m685009
35898e312755j0445147j0157360K534830J4128808J3435966P949538Q678867J1319509
35890C2132256M834183q895933j6919888j3732639o558862k340583K69026L238713
35882g973727K192426o564593j6118059j3256789N691639K7086675L2028114J6725443
35874C9811129k451164p295035J239435N761370m413926k0419932k7031991k0894313
35866c5694427r168583L287372J5339435K1568173J4907442j015276j2132410
$$ plain form
35922 16469481 21193005 24517134 29580575 33671769 29666970 15414796 -434019 -4599961
35914 -4599961 6767386 22213973 27730979 24190246 24714327 33863397 39935350 33970426
35906 33970426 25965113 30429849 42414924 42849020 26257453 7735976 -627746 -5312755
35898 -5312755 -15757902 -25915262 -23380432 -9251624 4184342 12133880 20812747 32132256
35890 32132256 36966439 28070506 11150618 -2582021 -9140883 -11481466 -11212440 -7973727
35882 -7973727 -5781301 -12345894 -28463953 -41720742 -36029103 -8942428 23085686 39811129
35874 39811129 37359965 30064930 31304365 37065735 32651809 12231877 -14800114 -35694427
35866 -35694427 -44863010 -41575638 -26236203 -4668030 10239412 9224136 -2908274
35859b908274j0237328j252384O106878J1319512J6289409J6797804Q220369m915133
35851C9420853j3247932j3800359j0167647m596658K495058P152802M396468l639146
35843H013439q852939p131263j690929L200851N878007N014820M32303l394606
35835A469683j353636L962179M849406M95916j470412K213479M556519j21486
35827A4601648o326102n717785K11534L163697M38337k806923k385650j51259
35819A027497l6551k975040o094678n126378J173484P775455P557322Q57277k952835
35810A205553L098062J3968273J8437541J1691501j717796j4150613j9665329
35803A2867192j5962760o906735l10216J845758O927069J8589372K5114105J2045375
$$ plain form
35859 -2908274 -13145602 -14397986 -8291108 3028404 19317813 36115617 44335986 39420853
35851 39420853 26172921 12372562 2204915 -2391743 103315 7256117 11652585 8013439
35843 8013439 -839500 -7970763 -9661692 -6460841 -582834 4431986 4864289 1469683
35835 1469683 116047 4078226 8927632 9423548 7953136 10166615 14723134 14601648
35827 14601648 8275546 2557761 2769295 5932992 6371329 3564406 1178756 1027497
35819 1027497 990946 -1984094 -8078772 -13205150 -12031666 -4256211 3301111 4158388 1205553
35810 1205553 4303615 18271888 36709429 48400930 46683134 32532521 12867192
35803 12867192 -3095568 -10002303 -10312519 -8466761 -1539692 17049680 42163785 54209160
35795E4209160j4676884l0851443k2416177n99438J5941821K2345210K2705403
35788D6657652J5621878j024981j6807485j6719213k576723Q271500Q266432Q482171
35780E0171231J5853245J7782837L195796j3323677p985373J6415803L1966699
35773A14076561K4599154J1438766J1996082K0833170K2114677J6288826J4477009
35766B35824245J5842216J0278754n57379m772141k917026r525233k7200800l7525745
35758A79446891k7708835j1705561j1306153k5322301l2105954j9506493K22014
35751E2013608O804689m869227k1010258k4837986j3547379J263440R472499J3891770
35743A9181156K0812209K4475540J3055982r711820k3013805j5307064l93494
$$ plain form
35795 54209160 39532276 8680833 -13735344 -14334782 1607039 23952249 46657652
35788 46657652 62279530 61254549 44447064 27727851 25151128 33422628 41689060 50171231
35780 50171231 66024476 83807313 87003109 73679432 65694059 82109862 114076561
35773 114076561 138675715 150114481 162110563 182943733 205058410 221347236 235824245
35766 235824245 251666461 261945215 261387836 256615695 253698669 244173436 216972636 179446891
35758 179446891 151738056 140032495 128726342 103404041 71298087 51791594 52013608
35751 52013608 58818297 53949070 32938812 8100826 -5446553 -4183113 5289386 19181156
35743 19181156 39993365 64468905 77524887 67813067 44799262 29492198 29098704
35736B9098704K105742p007958j1267871l507204O498982P936919J945327l125764
35728B2676877k869784o47087k415228q392055j1045063m854580L728639L698591
35720a19690l439741m763855L523501R344440M301450l248395l676124j733326
35712A88260m519469n445578M359384J7150770J7761024O364296l963509q441373
35704B3453805j3057965j8023067j5110485k451087J1391874J9074772J9439530
35697B4717377J2517803R83473o258043m218142j721258p800818j3963686p131238
35689b874532N209490M429375p022572p624111O496158J2851136j006381j6536234
35681f077671j2777959M147299J4990412J4389865Q626560J27165j0055510j4591052
$$ plain form
35736 29098704 31204446 24196488 12928617 9421413 15920395 23857314 25802641 22676877
35728 22676877 19807093 19160006 16744778 8352723 -2692340 -7546920 -3818281 -119690
35720 -119690 -3559431 -8323286 -4799785 4544655 8846105 5597710 1921586 188260
35712 188260 -4331209 -9776787 -5417403 11733367 29494391 35858687 31895178 23453805
35704 23453805 10395840 -7627227 -22737712 -25188799 -13796925 5277847 24717377
35697 24717377 37235180 38218653 31960610 27742468 26021210 18220392 4256706 -2874532
35689 -2874532 2334958 6764333 -258239 -7882350 -1386192 11464944 10458563 -6077671
35681 -6077671 -18855630 -14708331 282081 14671946 23298506 23425671 13370161 -1220891
35673a220891q992205p34630J541564k84507j397232k676426l308553K437183
35665a4635697J1323894Q530067q934336k1294952j3371467K112167O332300M720820
35657b5217204J3101315K5201247K0677563L18450j3453127j1139206o234034
35650C255004p553139n751391M618344J1092229L566028p714682p944843L34839
35642f097611M704116L501781M444865P074539J776318j1822024j8380245o659624
35634b1457885J1841415J5657550L153109m306784N736793J6657525Q697722p096885
35626B8882560m129122J5319646J9754026k368692k3022156j8419856m476678
35619A1539728o234295j5770675r810229P696242J3301145M663555O93139N442729
$$ plain form
35673 -1220891 -10213096 -10947726 -9406162 -9690669 -11087901 -13764327 -17072880 -14635697
35665 -14635697 -3311803 5218264 -3716072 -25011024 -38382491 -36270324 -29938024 -25217204
35657 -25217204 -12115889 13085358 33762921 34081371 20628244 9489038 3255004
35650 3255004 -4298135 -10049526 -5431182 5661047 9227075 1512393 -6432450 -6097611
35642 -6097611 -1393495 2108286 6553151 13627690 15404008 3581984 -14798261 -21457885
35634 -21457885 -9616470 6041080 9194189 4887405 10624198 27281723 35979445 28882560
35626 28882560 24753438 40073084 59827110 57458418 34436262 16016406 11539728
35619 11539728 5305433 -10465242 -20275471 -12579229 721916 5385471 6078610 11521339
35611A1521339L755818p066020j1530354m726454J403459L865291J1893668K0021670
35603B9138417R269024j5894740k3920934l707859J5216683Q992513l828306K772077
35595A8036875J6443861Q049015j7639537k7537750j0245539J0733575J4354179
35588A2194679O622316K961580O136406R023598O454303j116479q006107o724851
35580B7545445K125790O555207j622530j2960915j2535139j696174M680845J38818
35572A2231347o842316p783922m210950j734807l017351p184243r865557n832414
35564c4240213K585647M907556k145257o208798K801094J4205667J1120696k389515
35556i363123p058559J092591O368407J563869n93392P992926J3875176L068579
$$ plain form
35611 11521339 15277157 8211137 -3319217 -8045671 -6642212 -2776921 9116747 29138417
35603 29138417 38407441 22512701 -1408233 -5116092 10100591 19093104 15264798 18036875
35595 18036875 34480736 42529751 24890214 -2647536 -12893075 -2159500 12194679
35588 12194679 18816995 21778575 27914981 36938579 43392882 42276403 34270296 27545445
35580 27545445 29671235 36226442 34603912 21642997 9107858 7411684 12092529 12231347
35572 12231347 5389031 -2394891 -6605841 -8340648 -11357999 -18542242 -28407799 -34240213
35564 -34240213 -31654566 -26747010 -28892267 -35101065 -32299971 -18094304 -6973608 -9363123
35556 -9363123 -16421682 -15329091 -8960684 -7396815 -7990207 2719 13877895 16946474
35548A6946474j4804702j9123468p136627M904131N730637P9753m081161o429833
35540b3914796q450127o650752J371370R801911J1410648Q888939J0695806J5327240
35532A8480239J0370629p021269j9180317r911499R026365J0790474p570855j8784649
35524a3800882m641596J7776874K2601322J1516346M587120N926909J213083j3987602
35516C1191574k4854795j8998987j657096J3850469J8646786J0586778l967422
35509B4797307j1243484n107187J641986m798416j4870058q961340Q177256J1915572
35501A551636j057384n006160J1484235K3671721J0340660j0503227j0496940
35494A9984541M357777O741806p216684j6628026j2878914q149470p724993j843695
$$ plain form
35548 16946474 2141772 -16981696 -24118323 -19214192 -13483555 -13403802 -17484963 -23914796
35540 -23914796 -32364923 -39015675 -37644305 -27842394 -16431746 -7542807 3152999 18480239
35532 18480239 28850868 21829599 2649282 -7262217 1764148 12554622 4983767 -13800882
35524 -13800882 -18442478 -665604 21935718 33452064 38039184 43966093 45179176 31191574
35516 31191574 6336779 -12662208 -14319304 -468835 18177951 28764729 24797307
35509 24797307 13553823 8446636 10088622 5290206 -9579852 -18541192 -10363936 1551636
35501 1551636 494252 -4511908 6972327 30644048 40984708 30481481 19984541
35494 19984541 24342318 31084124 23867440 7239414 -5639500 -13788970 -21513963 -23357658
35486b3357658J0942677J7227401J2080137O953744P073108K157687j1253207
35479B1823889j8879258j1909360k293061j301620p13181Q481609J5357579O954090
35471A7520687o568488p004487J639243J996894m537452j297756J0301924R610583
35463B1661148p012235j7130826r109743p55306n877583q563941O304506J9319045
35455a164935M287649k4246950k6876788O22802J9098848M689542j7453096j4115007
35447e5157935Q353359K0221248J3778832O566346Q132863Q521179l51952j1220928
35439a156988j3322268n309896O443746J3732275J0491392j021477r136474n679303
35431d958993K603050L978524j012385l104353j242448k376581n849866k703464
$$ plain form
35486 -23357658 -12414981 4812420 16892557 23846301 30919409 33077096 21823889
35479 21823889 2944631 -8964729 -11257790 -12559410 -13272591 -4790982 10566597 17520687
35471 17520687 10952199 3947712 5586955 7583849 3046397 1748641 12050565 21661148
35463 21661148 14648913 -2481913 -11591656 -12346962 -18224545 -26788486 -20483980 -1164935
35455 -1164935 3122714 -21124236 -48001024 -47378222 -28279374 -23589832 -41042928 -55157935
35447 -55157935 -46804576 -26583328 -12804496 -6238150 1894713 10415892 10063940 -1156988
35439 -1156988 -14479256 -19789152 -13345406 386869 10878261 9856784 720310 -4958993
35431 -4958993 -2355943 1622581 610196 -2494157 -3736605 -6113186 -11963052 -14666516
35423a4666516Q063250J6316541J6338587J2458663O872011l537237j4237554
35416B7607745j2834040R52188J0201626N011399k920442j563424N09222r083967
35408A7880307k0845487j5458557M271513J5311743Q353269n63701K627651R301503
35400B0878241M684251q541216j6078791j3424219q161220m236934L115560J5124271
35392f640057K2831225J8370626O325344k890341o699576r375333j0063181l099949
35384H758758P690634P725998p219900j9497170j1843895O750920J3374165M434523
35376A0174033k577739L94647J853896l799496l633576Q947283J7018095N174792
35368C3551935j3933912j7861267p435456o58405k068442m96325O755758R198587
$$ plain form
35423 -14666516 -6603266 9713275 26051862 38510525 45382536 41845299 27607745
35416 27607745 14773705 15725893 25927519 30938918 28018476 26455052 26964274 17880307
35408 17880307 -2965180 -18423737 -14152224 1159519 9512788 8949087 11576738 20878241
35400 20878241 25562492 17021276 942485 -12481734 -20642954 -24879888 -21764328 -6640057
35392 -6640057 16191168 34561794 40887138 37996797 31297221 21921888 11858707 8758758
35384 8758758 16449392 24175390 16955490 -2541680 -14385575 -7634655 5739510 10174033
35376 10174033 7596294 7990941 9844837 6045341 2411765 11359048 28377143 33551935
35368 33551935 19618023 1756756 -5678700 -6337105 -8405547 -8901872 -2146114 7052473
35360G052473K395800o527368j2724963j6559457j4386826l821515M453323j8876
35352d0137409n179951Q420870L0645666K8934804j376172k4343308j4565968
35345a7601468P577280J1442556J073679j092428N069066L524825l829198j043778
35337E120534R100704O373954j1860643k3532506j4804688K156807J0733759R920773
35329f791306N795286J54179m244131j757800M861634M215258n420592j0309433
35321a3496905j936910Q645753O896939m708637j2397382r794708j504888O127033
35313b2169705R482561P463536L392794K772833M676342J720994o786398j0134189
35305i581232j792893Q337328O877631l455292p593267J135352J3068124J4746438
$$ plain form
35360 7052473 9448273 2920905 -9804058 -26363515 -40750341 -44571856 -40118533 -40137409
35352 -40137409 -45317360 -36896490 -6250824 22683980 21307808 -3035500 -17601468
35345 -17601468 -10024188 1418368 2492047 1399619 6468685 9993510 6164312 5120534
35337 5120534 14221238 20595192 8734549 -14797957 -29602645 -27445838 -16712079 -6791306
35329 -6791306 -996020 -841841 -5085972 -6843772 -1982138 2233120 -3187472 -13496905
35321 -13496905 -15433815 -6788062 108877 -4599760 -16997142 -26791850 -28296738 -22169705
35313 -22169705 -12687144 -5223608 -1830814 942019 5618361 7339355 552957 -9581232
35305 -9581232 -11374125 -3036797 3840834 385542 -7207725 -6072373 6995751 21742189
35297B1742189L333555j1354483j6181518p966538J642718k20176q750000o070410
35289b3824663J1804761K5398105J7894760j194049j1128351q582080n593409
35282D775074o421263m534377P03434K380112O93086K553704O043240K077694
35274H270704o854411p229633K783212R004610M850142Q41281L167008K009706
35266A6842619p731270j2742945l124894Q436264O364492l167946n806797l936278
35258d866755o856715p869678L910622J7302285J2540194l103380l363951J2514592
35250B0207214J5583857m820856k1296685j2233361L961806J226568j1730894
35243i102351r689601N289687R629262j023701p902185l774957j928155p271447
$$ plain form
35297 21742189 25075744 13721261 -2460257 -10426795 -8784077 -9004253 -17754253 -23824663
35289 -23824663 -12019902 13378203 31272963 30078914 18950563 10368483 4775074
35282 4775074 -1646189 -6180566 -5477132 -3097020 -2403934 149770 6193010 8270704
35274 8270704 1416293 -5813340 -3030128 5974482 10824624 11665905 14832913 16842619
35266 16842619 9111349 -3631596 -6756490 1679774 8044266 4876320 -930477 -4866755
35258 -4866755 -11723470 -19593148 -15682526 1619759 14159953 11056573 7692622 20207214
35250 20207214 35791071 30970215 9673530 -2559831 1401975 2628543 -9102351
35243 -9102351 -18791952 -13502265 -3873003 -4896704 -12798889 -16573846 -18502001 -25773448
35235b5773448o239195N756660J1445513k10919j3033574p414610R667984J6600776
35227i200813R325250K787821M720264O144326o17367r149393r507820k236320
35219g734052M184407M968156L185739M081354Q123772R914091M033189p855728
35211B2900928j7283066j7360833r114692J345296Q881959J0744394N768306l723980
35203B158312j1021226j0077817j666043P332333J0403872O462186j52583l958367
35195e19333l745130l064364l510272n35406Q589630J5536177R326865n563865
35187A6514302j1063382J27949J3279444J2161920L95709p817682r114163j0167474
35179D316623j1872046q807798j734499K788753M034153O179946P429737L005825
$$ plain form
35235 -25773448 -32012643 -26255983 -14810470 -15021389 -28054963 -35469573 -25801589 -9200813
35227 -9200813 124437 2912258 7632522 13776848 13159481 4010088 -5497732 -7734052
35219 -7734052 -3549645 1418511 4604250 8685604 16809376 26723467 30756656 22900928
35211 22900928 5617862 -11742971 -20857663 -19512367 -10630408 113986 5882292 2158312
35203 2158312 -8862914 -18940731 -20606774 -13274441 -2870569 3591617 3439034 -519333
35195 -519333 -4264463 -7328827 -10839099 -11374505 -2784875 12751302 22078167 16514302
35187 16514302 5450920 5578869 18858313 31020233 31415942 23598260 14484097 4316623
35179 4316623 -7555423 -16363221 -18097720 -15308967 -11274814 -5094868 2334869 5340694
35171E340694k491168k50830N723963L170709n590878m232489R057525J3840565
35163B4568091j003914j6615523j1050614P779895J5390670P230837P30065M687132
35155C1716639P610739n41620j1865681j2762493k403746P560260O594850m550717
35147B1358231j4219401j1062023J811419P892464j830155j4739545j2623975
35140b3412985L067074J4193307J1747534N126964M758959Q488334Q890331L597758
35132C6457276n500539j4525905j6501075p219900N454169Q144140L89861m516837
35124B181190m92972K402066l550823r242623l333719Q334653J0356651o25853
35116F028570j3181136j6990521j2022297l706451K930532N246415N258807Q700955
$$ plain form
35171 5340694 2849526 2598696 8322659 11493368 5902490 1670001 10727526 24568091
35163 24568091 23564177 6948654 -4101960 3677935 19068605 26299442 27029507 31716639
35155 31716639 39327378 38785758 26920077 14157584 11753838 19314098 25908948 21358231
35147 21358231 7138830 -3923193 -2111774 5780690 3950535 -10789010 -23412985
35140 -23412985 -20345911 -6152604 5594930 10721894 15480853 23969187 32859518 36457276
35132 36457276 30956737 16430832 -70243 -7290143 -1835974 6308166 6698027 2181190
35124 2181190 1688218 4090284 539461 -8703162 -12036881 -3702228 6654423 6028570
35116 6028570 -7152566 -24143087 -36165384 -39871835 -36941303 -31694888 -26436081 -17735126
35108a7735126J7110280K3260771J9105530N712746q528239j6139170j3820489
35101H966303l071971P754346P981979k927906j2961687j3152472q538111o664510
35093b2614029m048162M866419J2783219Q273924m134647q188392m48069M526375
35085h983362k800382j2433122j0477604J097436R306354Q467815M566879L490850
35077g765136K778101k672570j0483455j0990740M72855J4724786J8329567J1535429
35069A5928837P530705J0984266R147341o953275k3567911k0756418j106538J3979741
35061E186748J3151814L977566n051659j3200482j6828850q887379N493270R928070
35053f230902O08178o575687j196254N352186N9257r692043q823794J782604R676642
$$ plain form
35108 -17735126 -624846 22635925 41741455 47454201 38925962 22786792 8966303
35101 8966303 5894332 13648678 21630657 18702751 5741064 -7411408 -15949519 -22614029
35093 -22614029 -26662191 -21795772 -9012553 -738629 -4873276 -13061668 -13509737 -8983362
35085 -8983362 -11783744 -24216866 -34694470 -33597034 -24290680 -15822865 -11255986 -7765136
35077 -7765136 -4987035 -7659605 -18143060 -29133800 -28660945 -13936159 4393408 15928837
35069 15928837 23459542 34443808 43591149 36637874 13069963 -7686455 -8792993 5186748
35061 5186748 18338562 22316128 17264469 4063987 -12764863 -21652242 -16158972 -6230902
35053 -6230902 -5622724 -12198411 -13394665 -8042479 -7983222 -17675265 -26499059 -24716455 -15039813
35044a5039813J0927039J0771555R833398M248476l632902p315463o635941n693614
35036b537265l718078J841628P447353R185761J0826118J4232278Q679383j3823798
35028C2133380l7123910l5007355p902286J4088346J0362901n701530j0115542
35021c9265996l17981Q649204Q698826N122403L738685L746126K186157k050746
35013i493322p547818r408798k458506J0416727J7756946J2353393K33558p872077
35005C980103q913348o017852n61417O617763J0521047P153062J130189L96051
34997A4305598N041663Q565110Q164106N764733P13761q805190j7061574j4095864
34989B592343o84143R405098O609304k996551q317956p248005l867922L61636
$$ plain form
35044 -15039813 -4112774 6658781 16492179 20740655 17107753 9792290 3156349 -2537265
35036 -2537265 -6255343 -4413715 3033638 12219399 23045517 37277795 45957178 32133380
35028 32133380 -4990530 -39997885 -47900171 -33811825 -23448924 -29150454 -39265996
35021 -39265996 -39583977 -30934773 -22235947 -17113544 -13374859 -9628733 -7442576 -9493322
35013 -9493322 -17041140 -26449938 -28908444 -18491717 -734771 11618622 11852180 3980103
35005 3980103 -4933245 -10951097 -11512514 -4894751 5626296 12779358 13909547 14305598
34997 14305598 19347261 27912371 36076477 41841210 42554971 33749781 16688207 2592343
34989 2592343 1908200 11313298 17922602 14926051 6608095 -639910 -4507832 -4146196
34981d146196M085868J465360r221141j6903932r750459O006759J1860750K162275
34973a4440716r168245r504714k182236M250342Q137323Q862093K297143p509190
34965a9258200n221968J2847923K4603723J0267965j3801680j3511660J2694922
34958H621025K8422040J0507305j9209562k7026528j2175777L68502j580906p068098
34950a9141999m273406N627986J6062605K2020993J8830073N399612j0282869
34943C4242995j7480389j4486582p539386r13872M065044M083405k053509o907005
34935f989299k309504P668412J1464677O391378L72116j544668k233750m469310
34927H350052p486652j1085188j4113433j0679521J917755J3916416J3780375
$$ plain form
34981 -4146196 -60328 1405032 -7816109 -24720041 -34470500 -28463741 -16602991 -14440716
34973 -14440716 -23608961 -33113675 -35295911 -31045569 -22908246 -14046153 -11749010 -19258200
34965 -19258200 -24480168 -11632245 12971478 23239443 9437763 -4073897 8621025
34958 8621025 37043065 47550370 28340808 1314280 -10861497 -10492995 -12073901 -19141999
34950 -19141999 -23415405 -17787419 -1724814 20296179 39126252 44525864 34242995
34943 34242995 16762606 2276024 -5263362 -6177234 -2112190 1971215 -82294 -6989299
34935 -6989299 -9298803 -1630391 9834286 16225664 16597780 15053112 12819362 8350052
34927 8350052 863400 -10221788 -24335221 -35014742 -33096987 -19180571 -5400196
34920e400196N956092M035703P932471M850538o150243j0000739j443511M353957
34912D134072l142516j1654310o395015N829736Q572510J233433l837224k730779
34904g990093k387663n216859n614611o52019O847948J4159306J8183121J2906886
34896C0236016j973778j3897642j1350245j885903k060119j0753666r381223P976035
34888a3090525K1923579J4794538l396607j0040199k463030J457837o598130j2292478
34880i705015k211216J3350450J4362443P97272p562880j002136O657048R37187
34872A5623153j1169498j3774177o320428m09290P34233L016404N431756J147509
34864e720338o065645m958749K080319O53942q857978p717491R346113K0637234
$$ plain form
34920 -5400196 555896 4591599 12524070 17374608 11224365 1223626 -219885 4134072
34912 4134072 991556 -10662754 -17057769 -11228033 -2655523 -1422090 -5259314 -7990093
34904 -7990093 -10377756 -15594615 -21209226 -21861245 -15013297 -853991 17329130 30236016
34896 30236016 28262238 14364596 3014351 1128448 -931671 -11685337 -21066560 -13090525
34888 -13090525 8833054 23627592 20230985 10190786 7727756 9185593 2587463 -9705015
34880 -9705015 -11916231 1434219 15796662 16593934 9031054 8028918 14685966 15623153
34872 15623153 4453655 -9320522 -15640950 -16050240 -15316007 -12299603 -6867847 -5720338
34864 -5720338 -11785983 -16744732 -14664413 -14010471 -22868449 -30585940 -21239827 -602593
34856f02593R830447p866951r787944P62283N936178M308808O654544J0298419
34848A9533191L064177j1195690j4928867m326856O656935R923186J0532043R644202
34840B8902321J257375j0637808j1857555o61243P322827K615994o518232j1228594
34832h04915j2942205j0772037K535617K2026798K6249397N440580k0064203k3795523
34824a2126491m776634J7119054K6729854K1772190N526290j4153967k4845024
34817A5245272k0902318j0155277j151859P717494J7290197J7653862L303671
34810B9001042j1470272r347035M325866J0049505L710704j379715k01786l132741
34802B1555568j3658603j8166536p002997Q655950J1987451K965540n024316m481576
$$ plain form
34856 -602593 9227854 1360903 -8427041 -7664758 -1728580 2580228 9234772 19533191
34848 19533191 22597368 11401678 -3527189 -7854045 -1197110 8726076 19258119 28902321
34840 28902321 30159696 19521888 7664333 7003090 14325917 16941911 10423679 -804915
34832 -804915 -13747120 -24519157 -21983540 43258 26292655 31733235 11669032 -12126491
34824 -12126491 -16903125 215929 26945783 48717973 54244263 40090296 15245272
34817 15245272 -5657046 -15812323 -16964182 -9246688 8043509 25697371 29001042
34810 29001042 17530770 8183735 12509601 22559106 26269810 24890095 24688309 21555568
34802 21555568 7896965 -10269571 -17272568 -8616618 3370833 6336373 1312057 -3169519
34794c169519P20169N573380R560608J1764456Q272616k084568j3171332j6481189
34786I84621j0143649n14301N794960Q728427J1140262J1334265N401444l259612
34778B9466417m810890L082747R632919N494895l317011m751672K06221j333649
34770C3669977j3866214k4654855j9657795j915265J1669585R856209q93554m918019
34762a0709931L625630J3343007J0087839l838522j2576347r450969n926966j1298978
34754b6745237j4541843j40841K4058559L2368112J5837214n128160r103479n24754
34746A6079571K327630m418604q372355k834359M046142L605849j554680m866838
34738D012356o220583q570690r983231o744048j406069J15580j396264N45990
$$ plain form
34794 -3169519 -2449350 3124030 12684638 24449094 32721710 30637142 17465810 984621
34786 984621 -9159028 -9673329 -3878369 4850058 15990320 27324585 32726029 29466417
34778 29466417 24655527 27738274 37371193 42866088 39549077 34797405 35003626 33669977
34770 33669977 19803763 -4851092 -24508887 -26424152 -14754567 -4898358 -5791912 -10709931
34762 -10709931 -7084301 6258706 16346545 12508023 -68324 -9519293 -15446259 -26745237
34754 -26745237 -41287080 -41427921 -17369362 14998750 30835964 25707804 16604325 16079571
34746 16079571 18407201 13988597 5616242 2781883 6828025 10433874 8879194 4012356
34738 4012356 -2208227 -10778917 -20762148 -27506196 -28912265 -28796685 -30192949 -29646959
34730b9646959N848244N372538m415484j2110101n199164J1044847J8446495R313182
34722a346402m076863n594685O155379J8616138J9662775Q233842n975392j1563016
34714B4111776o551068j16190l92587l738480k218612J958745n03103r779979
34706B770502j5259686j1133039k314253O520852J4873810J7150258N133409j4373587
34698C368266k0503979o293033R238719P970969l200207q221999o664991n926212
34690c0232467k498552Q688658J6836587R119626n486563q095254M96228M673163
34682f498574K988366P216984J5340357J2361500j120922p957184m973986p010158
34674A0346383j5411473j1886287O610581J6382891M819242q029774l712718M906567
$$ plain form
34730 -29646959 -23798715 -18426177 -22841661 -34951762 -40150926 -29106079 -10659584 -1346402
34722 -1346402 -5423265 -11017950 -4862571 13753567 33416342 41650184 35674792 24111776
34714 24111776 17560708 17444518 17051931 13313451 11094839 13053584 12550481 2770502
34706 2770502 -12489184 -23622223 -25936476 -19415624 -4541814 12608444 17741853 3368266
34698 3368266 -17135713 -23428746 -14190027 -6219058 -9419265 -17641264 -24306255 -30232467
34690 -30232467 -32731019 -24042361 -7205774 1913852 -3572711 -11667965 -11171737 -6498574
34682 -6498574 -3510208 3706776 19047133 31408633 30287711 22330527 17356541 10346383
34674 10346383 -5065090 -16951377 -10340796 6042095 10861337 2831563 -881155 4025412
34666D025412K7123q750382m209242O161861N727869P23329P150062J7894117
34658B8750149J3749700j021442n498315L70850k922501j6481591j8888097m293045
34650f234292O633513K577043q50842P743181J3662252K889129j1436649r730519
34642E252816L255053Q972630M329355J35365j155223n941111j1911200q831964
34634e894279K920876J0001747M874084m545617p143601j996174L576667L459908
34626E253611k269742q405489r620317n977377k184486m30788K156514O883422
34618a4594652R674319P652579M217857K957988J870541j118453k637869k34326
34610G787984J511026j233945l302328Q94918N728231K245182o114026q297316
$$ plain form
34666 4025412 4052535 -4697847 -8907089 -2745228 2982641 3705970 10856032 28750149
34658 28750149 42499849 41478407 35980092 36350942 33428441 16946850 -1941247 -6234292
34650 -6234292 399221 2976264 2125422 9868603 23530855 26419984 14983335 5252816
34642 5252816 8507869 17480499 21809854 21945219 20789996 14848885 2937685 -5894279
34634 -5894279 -2973403 7028344 11902428 7356811 213210 -1782964 1793703 5253611
34626 5253611 2983869 -5421620 -15041937 -21019314 -23203800 -23634588 -21478074 -14594652
34618 -14594652 -4920333 2732246 6950103 9908091 11778632 10660179 8022310 7787984
34610 7787984 9299010 8065065 4762737 5657655 11385886 13631068 7517042 -780274
34602g80274m167974m083785r316389q442365K053417Q953034L072984m624427
34594a7335779l39106R771279R845872N31568l161339J893968K223976p190457
34586c760018j2091162k657420Q269113N246273l595256J003218J7207446K3019669
34578C2641863R838120m842741m657129K874867J691311p884413j3293496j0433731
34570E934651n917994k994382J247055N841297N182546o67751m572607k744667
34562A308148J259105L811410N093736N225277L804462L426716O100826O625157
34554C6654837j439075j3040083j5444794o851618j62176l824826r474886n388356
34546a8970977O382927J4250587J2483658N186068p78816j224318L023523N295314
$$ plain form
34602 -780274 -4948248 -9032033 -18348422 -26790787 -24737370 -15784336 -12711352 -17335779
34594 -17335779 -17674885 -7903606 1942266 2473834 -687505 1206463 3430439 -3760018
34586 -3760018 -15851180 -18508600 -10239487 -4993214 -8588470 -7585252 9622194 32641863
34578 32641863 42479983 37637242 32980113 35854980 37546291 29661878 16368382 5934651
34570 5934651 16657 -2977725 -1730670 4110627 9293173 8625422 4052815 1308148
34562 1308148 2567253 6378663 11472399 16697676 20502138 23928854 30029680 36654837
34554 36654837 35215762 22175679 6730885 -120733 -282909 -4107735 -13582621 -18970977
34546 -18970977 -12588050 1662537 14146195 19332263 18553447 17329129 20352652 25647966
34538B5647966m21889r232862q867378K557613J1233887O526676l679565n100732
34530A8663716K959722R455578P575501p63655j1391161j9507087j9564203j2492057
34522b5063646p896806j0380769j0677127p90383J0539814J1319360O976182R964226
34514a6009149J5293435Q143297o715350p675804Q398563J8209034P681053p399999
34506A9925080q777140k711811l379713p449987m796587m37046m404176r995275
34498b2026655m430958N702064L141433q746712p668749J1595349K5447106J4401570
34490A7414448r857418k1653275j3156550K491526J1633381J2339934R667879
34483H879925P534221O062531L835460J815774K732891M323053j299201j4391901
$$ plain form
34538 25647966 25226077 15993215 7125837 9683450 20917337 27444013 23764448 18663716
34530 18663716 21623438 31079016 38654517 37890862 26499701 6992614 -12571589 -25063646
34522 -25063646 -32960452 -43341221 -54018348 -54808731 -44268917 -32949557 -25973375 -16009149
34514 -16009149 -715714 7427583 712233 -6963571 1434992 19644026 27325079 19925080
34506 19925080 11147940 8436129 5056416 -2393571 -7190158 -7627204 -12031380 -22026655
34498 -22026655 -26457613 -20755549 -17614116 -26360828 -34029577 -22434228 3012878 17414448
34490 17414448 7557030 -14096245 -27252795 -24761269 -13127888 -787954 8879925
34483 8879925 16414146 22476677 26312137 28127911 30860802 35183855 33884654 19492753
34475A9492753j9877889n697059J4529963J4416555p449231k1251012n983108
34468a1819028K0723370K6539553O460158j5268249j8865968q518035P23390J928227
34460A903418r50534j521324Q37485o43178j0954061k1299172j4882250R253442
34452c8256174K8284058K2669137K658204o928461j978294m19791r927739j5488388
34444a9387448n247963R609420J2236569M552286J396787Q025023J5375824J3702949
34436D0263447J635271j5097525k6297287k2280233m263164J2610704J3951792
34429E23005K312066p239569n406429L768290J1234404J1530185M133633o406551
34421A4449034j1353809n467562M955369P625702l15725p938498m698318N513098
$$ plain form
34475 19492753 -385136 -6082195 8447768 22864323 15415092 -5835920 -11819028
34468 -11819028 8904342 35443895 41904053 26635804 7769836 -748199 -24809 1903418
34460 1903418 952884 -568440 269045 -374133 -11328194 -32627366 -47509616 -38256174
34452 -38256174 -9972116 12697021 15355225 8426764 6448470 6028679 -3899060 -19387448
34444 -19387448 -24635411 -15025991 -2789422 1762864 3159651 11184674 26560498 40263447
34436 40263447 41898718 26801193 503906 -21776327 -26039491 -13428787 523005
34429 523005 2835071 -4404498 -9810927 -6042637 5191767 16721952 20855585 14449034
34421 14449034 3095225 -2372337 2583032 10208734 9893009 1954511 -2743807 2769291
34413B769291R349919J399006q637813q260845J592933P704228K369969o291527
34405A995161o731735j101731o81863o776827q494602j344748M993203K986506
34397a5156636j335363j577370k978188r646220j1921990j854910R286179P818195
34389b7366303K898417J1489637K4187558J5623630r968032j7066002O135878
34382E934783K4229451P632366k0162243j9771142J359263L212640j9399261k7260929
34374d4225072Q4764L1316886L0873782Q474371l094345K107820L592255o675272
34366B2455189j3885691p733652K521933M906843N23644l504925n396720o724411
34358f837790o743293m291323q68963J629303K932130K552106l32880l728356
$$ plain form
34413 2769291 12119210 13518216 4880403 -3380442 -1787509 5916719 8286688 1995161
34405 1995161 -4736574 -5838305 -6520168 -13296995 -21791597 -23136345 -18143142 -15156636
34397 -15156636 -16491999 -18069369 -21047557 -30693777 -42615767 -44470677 -35184498 -27366303
34389 -27366303 -24467886 -12978249 11209309 26832939 16864907 -201095 5934783
34382 5934783 30164234 37796600 17634357 -2136785 -777522 2435118 -16964143 -44225072
34374 -44225072 -44140308 -12823422 18050360 26524731 23430386 25538206 29130461 22455189
34366 22455189 8569498 835846 3357779 8264622 8788266 5283341 -113379 -6837790
34358 -6837790 -13581083 -17872406 -18741369 -17112066 -14179936 -11627830 -11960710 -15689066
34350a5689066l144268K974676J0222994J2041795O159510k323780m771203J052296
34342F522954N313789l064601j8110911j9166842J412136K2920693K1367605K709436
34334A9904259o093956L209741R702928k584857j9661506j8888177j089357J3919988
34326a580937J5012122P359413k283571j1861618j6806769j1499746k81958N115262
34318a6827802K308243J421204P529279J1254899M117353o226176o520566J780393
34310a163173M603364k975573q491472k96816J4259085J7474431N110699q144963
34302B0375582r104437k878666k389282p984675q806869j998190K965777J452688
34294h368072J371613P209576R834095K943836k565174M233748J2441701L788436
$$ plain form
34350 -15689066 -18833334 -15858658 -5635664 6406131 12565641 10241861 5470658 6522954
34342 6522954 11836743 8772142 -9338769 -28505611 -27093475 -4172782 17194823 19904259
34334 19904259 13810303 17020044 26722972 24138115 4476609 -14411568 -15500925 -1580937
34326 -1580937 13431185 20790598 18507027 6645409 -10161360 -21661106 -21943064 -16827802
34318 -16827802 -14519559 -13098355 -5569076 5685823 9803176 3577000 -2943566 -1163173
34310 -1163173 3440191 464618 -8026854 -8323670 5935415 23409846 28520545 20375582
34302 20375582 11271145 8392479 6003197 -1981478 -10788347 -12786537 -9820760 -8368072
34294 -8368072 -6996459 213117 10047212 12991048 10425874 14659622 27101323 30889759
34286C0889759j6329424k3806082j1666753J084969Q57975k164496L676741J1027508
34278f429803R026075K796499J938220L265114J239724K734469J2735303J6744177
34270D4049778j82365k4147958k6664540o040513R939635N079595n311794k862745
34262f140907O972496Q561136O07347o326547o257587o42583P209867J2223312
34254A6206534R609014K975197J852037O560134O619649r51894n834279l899383
34246C3137009n939600j5816822j7610922j446362J3876746O379908j2802359
34239b22402j4667608K724985J2992676M624229l811981J737588Q389335J694440
34231A3461262r229909r140522k088049q30607l535794r9073P166009Q125751
$$ plain form
34286 30889759 14560335 -9245747 -20912500 -19827531 -18969556 -21134052 -17457311 -6429803
34278 -6429803 2596272 5392771 7330991 10596105 11835829 14570298 27305601 44049778
34270 44049778 43867413 19719455 -6945085 -12985598 -3045963 2033632 -3278162 -6140907
34262 -6140907 831589 9392725 10000072 3673525 -2584062 -3226645 3983222 16206534
34254 16206534 25815548 28790745 30642782 37202916 43822565 42870671 37036392 33137009
34246 33137009 27197409 11380587 -6230335 -7676697 6200049 12579957 -222402
34239 -222402 -14890010 -12165025 827651 5451880 1639899 3377487 11766822 13461262
34231 13461262 4231353 -4909169 -6997218 -7827825 -11363619 -11462692 -4296683 3829068
34223C829068M459856O068625J0662909N508811r651268j8833874j3230021l450337
34215a4636231j858772n125283k891417N334356J1264093J0337545N045340q88025
34207F581606m891280m345021J092696O883219P791059M123221L69327j748814
34199A5856013n317587j2406775j8442932j5199795j280190J1855989J0012667
34192a4922610m777932j2332973O69973J9519083J8607114j921740j3978361j108749
34184a0246195J7841811J7318723J914725m517576L309103Q606061M107892K386514
34176D0721058R640811J2162182K63236j3222722j3412651p360834r954398j7100832
34168A735850j3159316J157366R277893N768727K589309N753263N149853n089597
$$ plain form
34223 3829068 8288924 14357549 25020458 30529269 20878001 2044127 -11185894 -14636231
34215 -14636231 -16495003 -21620286 -24511703 -19177347 -7913254 2424291 7469631 6581606
34207 6581606 1690326 -2654695 -1561999 5321220 13112279 17235500 17604827 15856013
34199 15856013 10538426 -1868349 -20311281 -35511076 -36791266 -24935277 -14922610
34192 -14922610 -19700542 -32033515 -31363542 -11844459 6762655 4840915 -9137446 -10246195
34184 -10246195 7595616 24914339 26829064 22311488 25620591 34226652 38334544 40721058
34176 40721058 50361869 62524051 62787287 49564565 36151914 28791080 18836682 1735850
34168 1735850 -11423466 -10266100 -988207 4780520 7369829 13123092 18272945 13183348
34160A3183348j2877840o079419P901867J2747353N433471l920968q630521r771485
34152b014194o956361K747123J5167281J8243838N826058j2713632k1241734j3714902
34144a4656523N29357Q084908N686040J027090M97935J253591j402471m282143
34136c262216j658100K659270r80576j1589038j5698486o044191P800558J3507066
34128a5265713J1798364J0330488R480008M335655l656826p304654m666066j415674
34120C635582k295719n845835p353180l419057M823453J0742764Q192274O47526
34112I127808j525609M113761P857395K965674m271125o071166m533108l042293
34104D621337K196472J0608499R589775n759185j6627903m699385J6117383J6510102
$$ plain form
34160 13183348 305508 -5773911 2127956 14875309 20308780 16387812 7757291 -2014194
34152 -2014194 -8970555 -6223432 8943849 27187687 33013745 20300113 -941621 -14656523
34144 -14656523 -14127166 -6042258 -356218 670872 1168807 2422398 1019927 -3262216
34136 -3262216 -4920316 -2261046 -3241622 -14830660 -30529146 -36573337 -28772779 -15265713
34128 -15265713 -3467349 6863139 16343147 20678802 17021976 9717322 5051256 3635582
34120 3635582 1339863 -4505972 -11859152 -15278209 -10454756 288008 8480282 9127808
34112 9127808 7602199 11715960 19573355 22539029 18267904 12196738 7663630 4621337
34104 4621337 6817809 17426308 27016083 21256898 4628995 -70390 16046993 32557095
34096C2557095l746086j5190693m302554Q117966K577508j0673335j2851240n680270
34088i191609k471753m994721n411736j142343M922814J0252159J0037301J09781
34080B109893j0190991l608364J6996134K4701376O670578j3142660q999476O803238
34072B1339728M561300j5423701k5277129j3342549L547624J1207390J4179509
34065G92172J6620246J1912852m35771p610162k541481N500699P092057N164874
34057C6495486M173952M00677q710679j6583795j6455366r870965j514974N946364
34049f119300Q932841M391418l107217m872595r6872M791649P586774R761925
34041B1268623P380578k424828q812626j94086J1511163K961456k1854120l1489903
$$ plain form
34096 32557095 28811009 13620316 9317762 17435728 20013236 9339901 -3511339 -9191609
34088 -9191609 -11663362 -16658083 -22069819 -23212162 -18289348 -8037189 2000112 2109893
34080 2109893 -8081098 -11689462 5306672 30008048 36678626 23535966 14536490 21339728
34072 21339728 25901028 10477327 -14799802 -28142351 -24594727 -13387337 792172
34065 792172 17412418 29325270 28889499 21279337 18737856 24238555 31330612 36495486
34057 36495486 40669438 41070115 32359436 15775641 -679725 -10550690 -12065664 -6119300
34049 -6119300 2813541 7204959 4097742 -774853 -871725 3919924 11506698 21268623
34041 21268623 28649201 26224373 17411747 17217661 28728824 31690280 9836160 -21653743
34033b1653743j3575196O109509M871789l574155K735796J6272716J6280256N258301
34025A2725273J215521M916116K494028n946646o630774J921706P084710N412276
34017B3192210N895033R579252O596472m172298j0892829p581553j675046l89200
34009B0552041l169407q465710j4664865j4890149m682864O616658O430239j810999
34001a4085056n275952l091513k731516k37396J2721503K4834507J5610990q244032
33993A9501535j6236629n92855J0945687P69981j1014033l690044P992208J310890
33985H986740j3430495j0757636N776508J0230531j755847p933427J290250Q456145
33977H62769R76509q004465l377831O201274K738812j1408568j5080343J683361
$$ plain form
34033 -21653743 -35228939 -29119430 -24247641 -27821796 -25086000 -8813284 7466972 12725273
34025 12725273 13940794 18856910 21350938 15404292 8773518 10695224 17779934 23192210
34017 23192210 29087243 38666495 45262967 41090669 30197840 22616287 20941241 20552041
34009 20552041 17382634 8916924 -5747941 -20638090 -25320954 -18704296 -12274057 -14085056
34001 -14085056 -19361008 -22452521 -25184037 -25421433 -12699930 12134577 27745567 19501535
33993 19501535 3264906 2672051 13617738 14387719 3373686 -316358 7675850 8986740
33985 8986740 -4443755 -15201391 -9424883 805648 -950199 -8883626 -7593376 862769
33977 862769 1839278 -6165187 -9543018 -3341744 -602932 -12011500 -27091843 -25408482
33969b5408482K1778181K0923318j613124k0497472j5162328M509423J2603390
33962b867094K373068q155478o364394j954251n350707p631929K254535J4151374
33954a3544876J0509782m373321r503092J309180J2263563J0549837J560634l883361
33946D888346l315319N50593N547158Q548931O620774K087682j78953l74316j938172
33937B2436724m320139n323803p294932j1956637j3127833n043185O048713R782622
33929h798470O895152M804597L473383o18677k405930L625912Q817097K213109
33921A8006173q182539o950592R56246j040814p900696J239670K2100473K4023574
33913D2251495o62019j9865100j0898187N520263L206499o750103r69966J1673700
$$ plain form
33969 -25408482 -3630301 17293017 15679893 -4817579 -19979907 -15470484 -2867094
33962 -2867094 -494026 -8649504 -15013898 -16968149 -22318856 -29950785 -27696250 -13544876
33954 -13544876 -3035094 -7408415 -16911507 -15602327 -3338764 7211073 8771707 4888346
33946 4888346 1573027 2123620 7670778 16219709 22840483 24928165 24749212 24374896 22436724
33937 22436724 18116585 12792782 5497850 -6458787 -19586620 -24629805 -18581092 -8798470
33929 -8798470 -1903318 2901279 6374662 5755985 3350055 6975967 15793064 18006173
33921 18006173 9823634 2873042 3829288 2788474 -5112222 -3872552 18227921 42251495
33913 42251495 41589476 21724376 10826189 16346452 19552951 12802848 11832882 23506582
33905B3506582N729215j4343102j9103720q96895J6099213J3422712o45091j0490490
33897A3278424j1067739k918558J0927579J9091358R954216j0427838k2560073
33890F277369j7594732m433457O441620J1906453J0046642O70333p847979o917703
33882a451454k386732o018214j4211687j2483502l15287P432778N107418K953411
33874b1373269O499091Q756474P233874R073472J3423570Q604644n264586j0630267
33866A6323003O674R633768K826571j0232579j1053159r04401M559826m50700
33858A0709003p901918j0310779p087667r66975L357908K071837o74822L945385
33850f858028J4387951J7265583O524359p633966j5327297j9060286k1404501
$$ plain form
33905 23506582 29235797 14892695 -4211025 -5107920 10991293 24414005 23768914 13278424
33897 13278424 2210685 -707873 10219706 29311064 39265280 28837442 6277369
33890 6277369 -11317363 -15750820 -9309200 2597253 12643895 13314228 5466249 -1451454
33882 -1451454 -3838186 -9856400 -24068087 -36551589 -36866876 -29434098 -24326680 -21373269
33874 -21373269 -14874178 -6117704 1116170 10189642 23613212 32217856 26953270 16323003
33866 16323003 16329677 25963445 28790016 18557437 7504278 6599877 11159703 10709003
33858 10709003 2807085 -7503694 -14591361 -15558336 -12200428 -10128591 -10803413 -6858028
33850 -6858028 7529923 24795506 31319865 23685899 8358602 -10701684 -32106185
33843c2106185j5755011m45490J2249708J3902945J2961539J6486781J3886123
33836B1180410l791966k1887702k0376240m572864L875556J06044j580899N064544
33828b1983117R965064O033943j129549m464899k494657M308547J1834501J0431243
33820A2501076k103310j1068331l685906R119444Q032377l782960o817680J871887
33812D066597O262682J253706n26620N147977O360241m94566k815832L318361
33804B2572546L991405o218122j1611962k367084P154519K745973o114461m419669
33796E733145L414152N092343K351026K399477N32333q567321j3339270j071204
33788c455319J6591737J6245878k843616j7917089j5464447n364499p12945j260679
$$ plain form
33843 -32106185 -47861196 -48306686 -36056978 -22154033 -9192494 7294287 21180410
33836 21180410 17388444 -4499258 -24875498 -29448362 -25572806 -25466762 -27047661 -21983117
33828 -21983117 -12018053 -5984110 -7113659 -11578558 -14073215 -9764668 2069833 12501076
33820 12501076 10397766 -670565 -4356471 4762973 12795350 9012390 2194710 4066597
33812 4066597 10329279 11582985 11056365 16204342 22564583 22070017 19254185 22572546
33804 22572546 26563951 20345829 8733867 6366783 13521302 16267275 10152814 5733145
33796 5733145 9147297 14239640 16590666 18990143 19522476 10955155 -2384115 -3455319
33788 -3455319 13136418 29382296 26538680 8621591 -6842856 -12207355 -12920300 -14180979
33780a4180979j495489j036738j112137n27400L05162j495744n535031p455692
33772c2534048m977207L48455O375271J0218219P568580j395247q051522m210907
33764b6658406P015794J5067513J3997615N739796m315889r708713o410232M82763
33756d789759M44286o462764p029015L873819J1842370M874305n736310l085017
33748f068085P415016P986273j346155n148675q55706o54233n768488l369467
33740g809520P673143J1615614K626472n122521j840847M154866N603910Q258733
33732B5159850J3396138R591726m838448j1643861j076054Q360015k351864k1618525
33724A4978977k5126607j1603367J548861P480755J1260460J0358711j144985
$$ plain form
33780 -14180979 -15676468 -16713206 -17825343 -18352743 -18047581 -19543325 -25078356 -32534048
33772 -32534048 -37511255 -37162800 -30787529 -20569310 -13000730 -14395977 -22447499 -26658406
33764 -26658406 -19642612 -4575099 9422516 15162312 10846423 1137710 -5272522 -4789759
33756 -4789759 -4345473 -10808237 -17837252 -13963433 -2121063 2753242 -2983068 -6068085
33748 -6068085 1346931 9333204 7987049 2838374 1982668 1328435 -4440053 -7809520
33740 -7809520 -136377 11479237 14105709 8983188 7142341 11297207 16901117 25159850
33732 25159850 38555988 48147714 43309266 31665405 30589351 38949366 36597502 14978977
33724 14978977 -10147630 -21750997 -20202136 -12721381 -1460921 8897790 7752805
33717G752805j3281060j0128509K201574K099952j1797770j6638288k471907J1417529
33709c0845674P766270k959097k615809O409663J0003661O674569N437580P313566
33701G184729N832862J896054K670422O505488K417870j3074323k8280956k8841395
33693d3689249j2594666R130148K1259047J7100265M790826m71682N564549J0500116
33685A1589354L479411p231112n711845O571407J1823309K922913o203519l227287
33677A4012631M101882K798179l945308m544640O2321J10785k936883J110343
33669A0769310Q917829M513928j2124557j8150142j578263J6239198R653571j3276154
33661D964720k3255410j1918256J989105N322425M478179M138250k831675j5329524
$$ plain form
33717 7752805 -5528255 -15656764 -13455190 -11355238 -23153008 -39791296 -42263203 -30845674
33709 -30845674 -23079404 -26038501 -28654310 -22244647 -12240986 -5566417 -128837 7184729
33701 7184729 13017591 14913645 17584067 24089555 26507425 13433102 -14847854 -43689249
33693 -43689249 -56283915 -47153767 -25894720 -8794455 -4003629 -4475311 1089238 11589354
33685 11589354 15068765 7837653 2125808 8697215 20520524 23443437 17239918 14012631
33677 14012631 18114513 20912692 16967384 12422744 12485065 12595850 9658967 10769310
33669 10769310 19687139 24201067 12076510 -6073632 -7651895 8587303 18240874 4964720
33661 4964720 -18290690 -30208946 -28219841 -22897416 -18419237 -14280987 -17112662 -32442186
33653c2442186j6537497n38788J2418185M666053r915423o059281J3899691K3307743
33645a1201503R573682j1233986j8858936j0730014L335918J3841340J5122446
33638a0151053P596110l0716L21899M188323J114757p678238j0416329m010058
33630a9065305J608066J077574J387867P030876J1014398P831003L032296J638453
33622A5555228j222228q401705j0818905j768339Q154514M842804o775353r358678
33614i792662M61795P928411L545611l829763k471942M943360P480330K602420
33606A0867560j688422Q43291O763333Q209814K478045n504280r279487p642851
33598E047003m557220l771662n777072r246028j2020165j0656894l432335M986478
$$ plain form
33653 -32442186 -48979683 -49518471 -37100286 -32434233 -42349656 -48408937 -34509246 -11201503
33645 -11201503 -1627821 -12861807 -31720743 -42450757 -39114839 -25273499 -10151053
33638 -10151053 -2554943 -2585659 -2263760 1924563 3039320 -4638918 -15055247 -19065305
33630 -19065305 -17457239 -16379665 -14991798 -7960922 3053476 10884479 13916775 15555228
33622 15555228 14333000 5931295 -4887610 -6655949 1498565 6341369 -433984 -9792662
33614 -9792662 -9330867 -1402456 2143155 -1686608 -4158550 784810 8265140 10867560
33606 10867560 9179138 10022429 16785762 24995576 27473621 21969341 12689854 5047003
33598 5047003 489783 -3281879 -9058951 -18304979 -30325144 -40982038 -44414373 -39427895
33590c9427895O773229J416239j803668M378264J4888713J8245609R936187m182249
33582A0224429j5157900j7595557j1513474j707888O119155J0852416J5015081
33575c763738J7454975J3024900K520778m884750n088287o722606j6209584k2944863
33567b6613175j3039907O394100J3101210R33181j0906594n764049P638268J0544555
33559a7712411J747764l735415J082540O069021Q88996r342317j1338096k004957
33551c4344875P134243M896839m579599o887034K803033J1846877P228879n080717
33543a6982354p526396M039238J4442321J1014551m7804n725227m734365m165657
33535i685693m487938N7324Q873296J4328490J3421564R791009L828574p499113
$$ plain form
33590 -39427895 -32654666 -31238427 -33042095 -28663831 -13775118 4470491 14406678 10224429
33582 10224429 -4933471 -22529028 -34042502 -35750390 -29631235 -18778819 -3763738
33575 -3763738 13691237 26716137 29236915 24352165 19263878 12541272 -3668312 -26613175
33567 -26613175 -39653082 -33258982 -20157772 -19224591 -30131185 -35895234 -28256966 -17712411
33559 -17712411 -15964647 -19700062 -18617522 -12548501 -11659505 -21001822 -32339918 -34344875
33551 -34344875 -27210632 -22313793 -26893392 -33780426 -30977393 -19130516 -11901637 -16982354
33543 -16982354 -24508750 -20469512 -6027191 4987360 4939556 -785671 -5520036 -9685693
33535 -9685693 -14173631 -14116307 -5243011 9085479 22507043 32298052 36126626 28627513
33527B8627513j8181197j3680046P703274K4568533J6301418q298320k0527439
33520A6513736r120470O600187N275141q395635j4245911o118663K918974J844546
33512d728095n236043r169580p812064l439187L091621R457661R734649K032289
33504f068749o136408o639255j650990K83070l632719q414960r405836o389166
33496d8055013p00669O549977J3877957K0222357K4134536K0346760L832120j7886637
33488B2321388k5873975j3410295K74076n190997j9632981j5636702Q595656K3914472
33480b4639358J3366573l609424l165619Q200494R891427J493567k436999j164034
33472b063373o194313j5433434j3705281J17420R261791O457243M127189J0234077
$$ plain form
33527 28627513 10446316 -3233730 4469544 29038077 45339495 37041175 16513736
33520 16513736 7393266 13993453 19268594 10872959 -3372952 -9491615 -6572641 -4728095
33512 -4728095 -9964138 -19133718 -26945782 -30384969 -27293348 -17835687 -8101038 -6068749
33504 -6068749 -12205157 -18844412 -20495402 -20212332 -23845051 -32260011 -41665847 -48055013
33496 -48055013 -48755682 -42205705 -28327748 -8105391 16029145 36375905 40208025 22321388
33488 22321388 -3552587 -16962882 -16688806 -21879803 -41512784 -57149486 -48553830 -24639358
33480 -24639358 -11272785 -14882209 -18047828 -9847334 44093 1537660 -899339 -2063373
33472 -2063373 -8257686 -23691120 -37396401 -37278981 -28017190 -21559947 -17432758 -7198681
33464g198681J3691929M627306p315357q153981r77053J041895n397445j2277820
33456b1959207j2433146m358375Q323481J5261761O540926j1058556j6590248
33449c6273364l245555R716895O626455J270031J2619987K8091067J9295637j0752897
33441B7348256k6975304j2128118J1329808J7900986J0791124L809388l582973
33434B8493167j4644967j9176399j0204287r98662m084672p801224K793929J5266324
33426a0356791Q351080q170978m561837K0063067L3281400J8588399k701550r139249
33418D5353541q561839j3574843j4756883r22139J4248194J0869892n240845j2806932
33410A4608146p389765j333677M52132K458326K324879n195041j1905591n524690
$$ plain form
33464 -7198681 6493248 11120554 3805197 -4348784 -5325837 -4283942 -9681387 -21959207
33456 -21959207 -34392353 -38750728 -30427247 -15165486 -8624560 -19683116 -36273364
33449 -36273364 -39518919 -29802024 -23175569 -21905538 -9285551 18805516 38101153 27348256
33441 27348256 372952 -11755166 -425358 17475628 28266752 32076140 28493167
33434 28493167 13848200 -5328199 -15532486 -16531148 -20615820 -28417044 -25623115 -10356791
33426 -10356791 -2005711 -10176689 -14738526 5324541 38605941 57194340 54492790 45353541
33418 45353541 36791702 23216859 8459976 7537837 21786031 32655923 27415078 14608146
33410 14608146 7218381 5884704 6336836 8795162 11120041 5925000 -5980591 -11505281
33402a1505281P296221R209908J485740J353854R873658Q711785n997730j3328935
$$ plain form
33402 -11505281 -4209060 5000848 6486588 7840442 17714100 26425885 20428155 7099220
$$ [...]
##END NTUPLES=NMR SPECTRUM
##END=
