##TITLE=31Pdec_BAU-j-PH2T
 CDCl3, 24 sc
 7.3.2019
##JCAMPDX= 6.0         $$ Bruker NMR JCAMP-DX V2.0
##DATA TYPE= NMR SPECTRUM
##DATA CLASS= NTUPLES
##ORIGIN= UXNMR, Bruker Analytische Messtechnik GmbH
##OWNER= root
$$ XWIN-NMR		Version 3.5
$$ Thu Mar  7 16:37:57 2019 Russian Standard Time (UT+4h)  she@DPX200
##.OBSERVE FREQUENCY= 81.013821
##.OBSERVE NUCLEUS= ^31P
##.ACQUISITION MODE= SIMULTANEOUS
##.ACQUISITION SCHEME= undefined
##.AVERAGES= 24
##.DIGITISER RES= 17
##SPECTROMETER/DATA SYSTEM= spect
##.PULSE SEQUENCE= zgpg30
##.SOLVENT NAME= CDCl3
##.SHIFT REFERENCE= (INTERNAL, CDCl3, 0, 182.463)
##AUDIT TRAIL= $$ (NUMBER, WHEN, WHO, WHERE, WHAT)
$$ ##TITLE= Audit trail, XWIN-NMR		Version 3.5
$$ ##JCAMPDX= 5.01
$$ ##ORIGIN= Bruker BioSpin GmbH
$$ ##OWNER= she
$$ F:/spectra/data/she/nmr/P31/1/pdata/1/auditp.txt
$$ ##AUDIT TRAIL=  $$ (NUMBER, WHEN, WHO, WHERE, WHAT)
(   1,<2019-03-07 16:35:38.48 +0400>,<she>,<DPX200>,
      <created by zg, POWCHK disabled, PULCHK disabled
       configuration hash MD5:
       00 E9 B6 7A A2 85 ED C7 34 08 36 98 17 FE 4E 26
       data hash MD5: 32K
       C2 8E 3E D8 79 7F 20 5A F2 0A F4 67 E5 54 3F EB>)
(   2,<2019-03-07 16:35:42.48 +0400>,<she>,<DPX200>,
      <Start of raw data processing
       efp BC_mod = 2 LB = 1 FT_mod = 6 PKNL = 1 PHC0 = -1463.426 PHC1 = 76.99897 SI = 64K 
       data hash MD5: 64K
       54 D0 01 D9 F6 58 97 92 97 29 02 93 55 3E 16 47>)
(   3,<2019-03-07 16:35:58.00 +0400>,<she>,<DPX200>,
      <pk PHC0 = 5.64944 PHC1 = 0 
       data hash MD5: 64K
       BB 8F 22 4F CF 24 16 DD 57 9F 69 B2 D2 EF 00 50>)
$$ ##END=
$$ 
$$ hash MD5
$$ 3D 42 5B BE 47 DE 7A 71 87 B1 A5 AA AD 1E 73 5A
##$RELAX= 
##$RELAX= 
##$RELAX= 
##$RELAX= 
##$RELAX= 
##$RELAX= 
##$RELAX= 
##$RELAX= 
$$ Bruker specific parameters
$$ --------------------------
##$DU= <F:/spectra>
##$EXPNO= 1
##$NAME= <P31>
##$PROCNO= 1
##$TYPE= <nmr>
##$USER= <she>
##$AMP= (0..31)
100 100 100 100 100 100 100 100 100 100 100 100 100 100 100 100 100 100 
100 100 100 100 100 100 100 100 100 100 100 100 100 100 
##$AQSEQ= 0
##$AQ_mod= 1
##$AUNM= <au_zg>
##$AUTOPOS= <>
##$BF1= 81.014009
##$BF2= 200.13
##$BF3= 200.13
##$BF4= 200.13
##$BF5= 200.13
##$BF6= 200.13
##$BF7= 200.13
##$BF8= 200.13
##$BYTORDA= 1
##$CFDGTYP= 0
##$CFRGTYP= 5
##$CHEMSTR= <none>
##$CNST= (0..31)
1 1 145 1 1 1 1 1 1 1 1 1 1 1 1 1 1 1 1 1 1 1 1 1 1 1 1 1 1 1 1 1 
##$CPDPRG= <waltz16>
##$CPDPRG1= <>
##$CPDPRG2= <waltz16>
##$CPDPRG3= <>
##$CPDPRG4= <mlev>
##$CPDPRG5= <mlev>
##$CPDPRG6= <mlev>
##$CPDPRG7= <mlev>
##$CPDPRG8= <mlev>
##$CPDPRGB= <>
##$CPDPRGT= <>
##$D= (0..31)
0 1 0 0 0 0 0 0 0 0 0 0.03 2e-05 3e-06 0 0 0 0 0 0 0 0 0 0 0 0 0 0 0 0 
0 0 
##$DATE= 1551962137
##$DBL= (0..7)
120 120 120 11 120 120 24 19 
##$DBP= (0..7)
150 150 150 150 150 150 150 150 
##$DBP07= 0
##$DBPNAM0= <>
##$DBPNAM1= <>
##$DBPNAM2= <>
##$DBPNAM3= <>
##$DBPNAM4= <>
##$DBPNAM5= <>
##$DBPNAM6= <>
##$DBPNAM7= <>
##$DBPOAL= (0..7)
0.5 0.5 0.5 0.5 0.5 0.5 0.5 0.5 
##$DBPOFFS= (0..7)
0 0 0 0 0 0 0 0 
$$ [...]
##$SUBNAM2= <"">
##$SUBNAM3= <"">
##$SUBNAM4= <"">
##$SUBNAM5= <"">
##$SUBNAM6= <"">
##$SUBNAM7= <"">
##$SUBNAM8= <"">
##$SUBNAM9= <"">
##$SW= 369.568048894756
##$SWIBOX= (0..15)
0 1 3 0 0 0 0 0 0 0 0 0 0 0 0 0 
##$SW_h= 29940.119760479
##$TD= 32768
##$TD0= 1
##$TE= 0
##$TE2= 300
##$TE3= 300
##$TEG= 300
##$TL= (0..7)
0 120 53 12 22 120 120 120 
##$TP= (0..7)
150 150 150 150 150 150 150 150 
##$TP07= 0
##$TPNAME0= <>
##$TPNAME1= <>
##$TPNAME2= <>
##$TPNAME3= <>
##$TPNAME4= <>
##$TPNAME5= <>
##$TPNAME6= <>
##$TPNAME7= <>
##$TPOAL= (0..7)
0.5 0.5 0.5 0.5 0.5 0.5 0.5 0.5 
##$TPOFFS= (0..7)
0 0 0 0 0 0 0 0 
##$TUNHIN= 0
##$TUNHOUT= 0
##$TUNXOUT= 0
##$USERA1= <user>
##$USERA2= <user>
##$USERA3= <user>
##$USERA4= <user>
##$USERA5= <user>
##$V9= 5
##$VALIST= <valist>
##$VCLIST= <CCCCCCCCCCCCCCC>
##$VD= 0
##$VDLIST= <DDDDDDDDDDDDDDD>
##$VPLIST= <PPPPPPPPPPPPPPP>
##$VTLIST= <TTTTTTTTTTTTTTT>
##$WBST= 1024
##$WBSW= 4
##$XGAIN= (0..3)
0 0 0 0 
##$XL= 0
##$YL= 0
##$YMAX_a= 38936
##$YMIN_a= -40356
##$ZGOPTNS= <>
##$ZL1= 120
##$ZL2= 120
##$ZL3= 120
##$ZL4= 120
##$ABSF1= 0
##$ABSF2= 0
##$ABSG= 0
##$ABSL= 0
##$ALPHA= 0
##$AQORDER= 0
##$ASSFAC= 0
##$ASSFACI= 0
##$ASSFACX= 0
##$ASSWID= 0
##$AUNMP= <proc_1d>
##$AZFE= 0.1
##$AZFW= 0.5
##$BCFW= 0
##$BC_mod= 2
##$BYTORDP= 0
##$COROFFS= 0
##$CY= -3
##$DATMOD= 1
##$DC= 0
##$DFILT= <>
##$DTYPP= 0
##$F1P= 0
##$F2P= 0
##$FCOR= 1
##$FTSIZE= 65536
##$FT_mod= 6
##$GAMMA= 0
##$GB= 0
##$INTBC= 1
##$INTSCL= 5.30512e-09
##$ISEN= 30
##$LB= 1
##$LEV0= 0
##$LPBIN= 0
##$MAXI= 10000
##$MC2= 0
##$MEAN= 0
##$ME_mod= 0
##$MI= 50
##$NCOEF= 0
##$NC_proc= -5
##$NLEV= 6
##$NOISF1= 182.463
##$NOISF2= 159.3651
##$NSP= 0
##$NTH_PI= 0
##$NZP= 0
##$OFFSET= 182.463
##$PC= 4
##$PHC0= -1457.777
##$PHC1= 76.99897
##$PH_mod= 1
##$PKNL= yes
##$PPARMOD= 0
##$PSCAL= 0
##$PSIGN= 0
##$REVERSE= no
##$SF= 81.0140089999434
##$SI= 65536
##$SIGF1= 159.3651
##$SIGF2= -187.1042
##$SINO= 113.3802
##$SIOLD= 16384
##$SREGLST= <1H.CDCl3>
##$SSB= 0
##$STSI= 65536
##$STSR= 0
##$SW_p= 29940.119760479
##$SYMM= 0
##$S_DEV= 0
##$TDeff= 32768
##$TDoff= 0
##$TI= <>
##$TILT= no
##$TM1= 0
##$TM2= 0
##$TOPLEV= 0
##$USERP1= <user>
##$USERP2= <user>
##$USERP3= <user>
##$USERP4= <user>
##$USERP5= <user>
##$WDW= 1
##$XDIM= 65536
##$YMAX_p= 401213450
##$YMIN_p= -11796992
$$ End of Bruker specific parameters
$$ ---------------------------------
##NTUPLES= NMR SPECTRUM
##VAR_NAME=  FREQUENCY,     SPECTRUM/REAL,   SPECTRUM/IMAG
##SYMBOL=    X,             R,               I
##VAR_TYPE=  INDEPENDENT,   DEPENDENT,       DEPENDENT
##VAR_FORM=  AFFN,          ASDF,            ASDF
##VAR_DIM=   65536,         65536,           65536
##UNITS=     HZ,            ARBITRARY UNITS, ARBITRARY UNITS
##FACTOR=    0.456856943014862, 1,           1
##FIRST=     14782.0589164792, 0,            0
##LAST=      -15158.0608439998, 0,           0
##MIN=       -15158.0608439998, -11796992,   0
##MAX=       14782.0589164792, 401213450,    0
$$ Real data points
##PAGE= N=1
##DATA TABLE= (X++(R..R)), XYDATA
$$ [...]
43074 168159 -327021 -641405 -396184 -114564 -189278 -277313 -123036 -84771 -359875 -474682
43064 -474682 -87055 370772 415570 316260 584104 1096174 1312231 1070317 660783 341698
43054 341698 225086 428192 883672 1138831 783877 53382 -346995 -40329 643872 1114158
43044 1114158 1128807 902089 751686 760433 770939 627872 346464 58534 -95894 -6163
43034 -6163 325269 679125 785424 686245 710471 951475 1037165 639420 -41226 -561365
43024 -561365 -760297 -721472 -491679 -197830 -180455 -592574 -1079641 -1258429 -1245515 -1250934
43014 -1250934 -996276 -206035 580179 527131 -198811 -502098 119145 912302 1027335 633808
43004 633808 453363 703535 966766 770545 -53149 -1282045 -2279357 -2360065 -1501089 -476507
42994 -476507 -49001 -226180 -491712 -520646 -431217 -487467 -747590 -958559 -779965 -198498
42984 -198498 390100 680344 825629 1022709 1030821 595085 77438 9496 209498 124399
42974 124399 -74275 305766 1126831 1354091 655794 6523 151922 472951 137695 -492082
42964 -492082 -563717 -196220 -197222 -712229 -1157859 -1276907 -1323607 -1315120 -993532 -533416 -468890
42953 -468890 -834349 -1106105 -1098740 -1202989 -1555318 -1664807 -1182943 -487079 -120633 -58275
42943 -58275 103222 512054 961445 1233988 1251613 996404 543641 156635 156638 613408 1196732
42932 1196732 1400510 997663 298003 -125841 -10992 370143 565549 404875 93220
42923 93220 -10931 290003 774379 904533 428319 -203079 -369123 -139126 -78703 -219594
42913 -219594 62298 926531 1580619 1366202 682756 264315 117881 -152654 -479362 -557952
42903 -557952 -537278 -661091 -555708 213998 1096334 1062945 150711 -491823 -256049 153906
42893 153906 -87798 -785085 -1213660 -1109408 -668646 -43648 668953 1242196 1513760 1561232
42883 1561232 1444093 1027772 291432 -432813 -752744 -589411 -157463 226826 267763 -137256
42873 -137256 -799596 -1508153 -2297801 -3144030 -3575183 -3120367 -2083454 -1264408 -867705
42864 -867705 -338938 574220 1309673 1366910 1075600 1051899 1360064 1632144 1604095 1133789
42854 1133789 110599 -1189045 -2012486 -1886848 -1207766 -660140 -349224 30597 457886
42845 457886 599727 436625 317555 385944 396648 151701 -243024 -614444 -918154 -1130551
42835 -1130551 -1173770 -1013644 -695202 -290841 63393 152324 -120285 -542072 -735633 -481913
42825 -481913 143487 842399 1216744 965559 128981 -885089 -1571720 -1615060 -1025315 -194879
42815 -194879 276402 131932 -193410 -133982 143140 -49614 -781903 -1223174 -786992 58157
42805 58157 580303 836562 1311101 1908133 2051840 1620723 1080973 711324 322125 -183768
42795 -183768 -531560 -516223 -281238 4817 352901 645198 504017 -202220 -921703 -857500
42785 -857500 94664 1063262 1068761 167963 -539820 -267277 367574 96560 -1251825 -2453167
42775 -2453167 -2501012 -1771519 -1158027 -796579 -374769 -93115 -328707 -658605 -283843 616848
42765 616848 982519 461031 -80836 37390 323816 81431 -396573 -319155 379942 1012823
42755 1012823 1103221 823561 589931 631678 861172 902136 444514 -201415 -242256 568029
42745 568029 1409255 1402060 828702 712835 1319854 1786360 1358607 381522 -253127 -216061
42735 -216061 87622 230157 253189 431851 773863 898444 458502 -342623 -821910 -567104
42725 -567104 -2771 59272 -582486 -1274875 -1347023 -883096 -445450 -269217 -74450 382038
42715 382038 914969 1196301 1217946 1269667 1517016 1772594 1727427 1310168 733170 213255
42705 213255 -243199 -706437 -1045807 -960828 -376300 322115 630745 482351 282271 392151
42695 392151 794424 1300102 1764130 1905945 1277201 -159259 -1620604 -2213647 -2017702
42686 -2017702 -1891426 -2142595 -2089993 -1266791 -349515 -237997 -701815 -761746 -167099 399662
42676 399662 552310 673860 917076 669458 -398486 -1459052 -1485277 -676222 -119441
42667 -119441 -225968 -328705 110913 667968 640074 44684 -442986 -248457 664788 1831211
42657 1831211 2525469 2293235 1550673 1352416 2147469 2988675 2505166 616282 -1254730
42648 -1254730 -1794564 -1143221 -367279 -24651 250040 871442 1543727 1582581 757753 -435917
42638 -435917 -1325991 -1697828 -1778343 -1707671 -1319884 -586010 3495 -114147 -804126 -1313991
42628 -1313991 -1180469 -664465 -181198 233260 636747 823325 647128 347262 133677
42619 133677 -206019 -825641 -1324670 -1315559 -1117699 -1153381 -990908 34179 1382657 1650746
42609 1650746 558021 -494074 -302997 655614 1204545 1031631 547947 -43996 -639307
42600 -639307 -728854 63478 1236649 1958092 2064921 1865261 1367152 528594 -71006 251557
42590 251557 1232516 1950602 2037922 1825575 1481529 899896 326886 148272 89531 -417000
42580 -417000 -1083955 -1033937 -284687 169442 -13558 -17053 572798 915458 355294 -352080
42570 -352080 -203833 475084 669902 318691 232440 681869 1097122 1116722 1051269 1185357
42560 1185357 1295981 1070946 557686 9402 -442761 -825071 -1137044 -1192053 -740236 59038
42550 59038 430687 -273174 -1589056 -2254447 -1672847 -538729 155731 111578 -472632 -1303214
42540 -1303214 -1815026 -1401424 -377086 34277 -700161 -1577218 -1501839 -761351 -197001
42531 -197001 228397 864404 1116686 230979 -1065679 -1254213 -253246 544142 537597 670950
42521 670950 1550549 2315636 2112367 1473942 1335374 1583069 1498147 979141 457255 61210
42511 61210 -363513 -729325 -850691 -884749 -1132479 -1604215 -2113268 -2499835 -2486202 -1730055
42501 -1730055 -379013 815518 1282395 1164662 821982 305728 -333518 -757369 -798896
42492 -798896 -742469 -750759 -547756 -98347 42007 -354562 -579902 -83462 409443 -135996
42482 -135996 -1357045 -1863527 -1222451 -488576 -589073 -1144419 -1277983 -843050 -339213
42473 -339213 -96364 -33900 18966 131272 293684 438282 501045 514181 547726 612752 753114
42462 753114 1088253 1538708 1678887 1194172 388174 -94444 3890 368841 547434 305958
42452 305958 -268475 -729724 -571597 84170 395290 -157936 -973148 -1151685 -784157 -657507
42442 -657507 -951359 -1159638 -1195635 -1507420 -1978533 -1823626 -943615 -338281 -602618 -944862
42432 -944862 -422270 636940 1271862 1304562 1216482 1090868 632380 -17776 -358772 -297209
42422 -297209 -116533 152494 607758 898305 567751 -105046 -407097 -312769 -468886 -974034
42412 -974034 -1046835 -209320 943204 1556730 1522263 1273470 1088873 1021208 1124942 1326539
42402 1326539 1324022 937819 355818 -166582 -583701 -879902 -945151 -816934 -721783 -716209
42392 -716209 -640732 -547002 -695845 -953106 -759628 -21729 538491 346470 -253907 -679096
42382 -679096 -976327 -1368673 -1476939 -857907 26328 300562 -47160 -315237 -407778 -935158
42372 -935158 -1860100 -2158172 -1313785 -220057 113180 36803 597400 1822601 2587233
42363 2587233 2137200 1002143 218877 144867 289514 49035 -629717 -1258997 -1379033
42354 -1379033 -1071861 -834676 -952865 -1177477 -1111672 -743995 -452953 -588538 -1149500 -1761859
42344 -1761859 -1905377 -1318331 -292663 539363 780099 535797 148485 -125588 -171076
42335 -171076 -18533 143195 181367 230355 408547 437994 44789 -311785 157437 1245000
42325 1245000 1656449 760980 -331172 -239912 715000 1039269 284612 -374393 112930
42316 112930 1335365 2185850 2210558 1741470 1239918 986393 1053149 1173557 910683 278000
42306 278000 -91887 264760 942108 1135254 654322 91054 20803 360009 566951 273710
42296 273710 -359860 -830762 -786391 -349430 54266 150363 15488 -131793 -184138 -181246
42286 -181246 -247006 -520279 -1001770 -1431746 -1464297 -1031814 -451937 -134549 -211278 -395598
42276 -395598 -169325 716167 1773133 2030873 1060944 -384886 -1108624 -754036 8802
42267 8802 500541 729791 986360 1233831 1197499 790132 217596 -193618 -195907 148558
42257 148558 401486 167880 -394942 -780970 -848580 -951041 -1312472 -1720306 -1971057 -2160862
42247 -2160862 -2306470 -2104373 -1380083 -474605 76183 909 -686080 -1726690 -2523420
42238 -2523420 -2508578 -1907601 -1636408 -2056536 -2348246 -1653276 -385093 297243 67405
42229 67405 -245957 114878 907191 1308107 868041 -58176 -626203 -317145 384552 366390
42219 366390 -784006 -2141309 -2526903 -1896985 -1138943 -819199 -812581 -945352 -1184882 -1201080
42209 -1201080 -545330 566073 1332483 1441220 1439131 1814860 2332822 2562518 2465669 2107918
42199 2107918 1376151 435666 -53963 267102 828003 836446 322347 -57009 21746 376494
42189 376494 911739 1701188 2476327 2658935 2070548 1157543 382816 -160506 -398709 -91422
42179 -91422 652338 1119707 766306 -11674 -410986 -366385 -522442 -1036674 -1149368 -315410
42169 -315410 844865 1338672 1139212 961152 892440 202117 -1276020 -2454539 -2261526
42160 -2261526 -1016624 104291 557669 666380 647770 269268 -469822 -1055705 -1132795
42151 -1132795 -957707 -917248 -989904 -948252 -776195 -629794 -632038 -909082 -1561227 -2352079
42141 -2352079 -2667586 -2113538 -1068103 -363022 -388813 -680941 -464724 441230 1354630
42132 1354630 1459352 778523 184355 318462 806234 861885 402487 43611 103352 234814
42122 234814 141815 45315 160646 231790 -18621 -369113 -467657 -430995 -618414 -1005254
42112 -1005254 -1256189 -1328982 -1534449 -1963214 -2258587 -2091036 -1573570 -1068618 -801750 -804354
42102 -804354 -1040583 -1379372 -1526863 -1215652 -527351 97200 278270 86928 -86791 -34834
42092 -34834 45166 -123598 -498234 -775524 -769882 -612228 -619909 -1030030 -1751800 -2304759 -2151770
42081 -2151770 -1205173 136071 1479752 2651736 3320700 2971086 1712993 650548 718907
42072 718907 1390861 1338794 297139 -628523 -623897 -175883 -12969 73796 629569 1371349
42062 1371349 1495382 886094 230608 -21653 -133475 -417124 -672236 -560071 -195500
42053 -195500 -40048 -297989 -666699 -775941 -752239 -1108128 -1976165 -2708073 -2530336 -1455221
42043 -1455221 -213701 567055 721122 305354 -340364 -381760 807673 2528097 3172125
42034 3172125 2184216 879770 798277 1902412 2993518 3251561 2634014 1364584 -26429
42025 -26429 -544660 355156 1791574 2254115 1359097 79158 -674485 -865538 -751789
42016 -751789 -418509 -120260 -305917 -960703 -1496984 -1553689 -1364820 -1145091 -744758 -220506
42006 -220506 -125458 -761726 -1587531 -1835158 -1399758 -704211 18891 838384 1675678 2190783
41996 2190783 2138234 1583971 773107 -22448 -524910 -513710 -19054 523956 450829 -533071
41986 -533071 -1823631 -2260268 -1275360 437062 1639159 1776931 1261822 786288 728913
41977 728913 1034397 1267948 941568 146945 -401553 -378249 -473967 -1320256 -2206341 -1904699
41967 -1904699 -616086 120674 -371468 -1027493 -821259 -242885 -208355 -486695 -277559
41958 -277559 289163 376700 -132792 -499136 -375976 -287022 -686826 -1248566 -1373542 -982009
41948 -982009 -536048 -459574 -652024 -557185 167453 1048713 1211595 508586 -253579 -472140
41938 -472140 -527438 -919074 -1253604 -889072 -157061 30204 -352231 -344446 511710 1439344
41928 1439344 1466597 559008 -570077 -1253018 -1221971 -655794 -144888 -229511 -774054 -1133388
41918 -1133388 -1005411 -675064 -374915 -8763 325006 205483 -377123 -769958 -575843
41909 -575843 -279831 -464218 -915004 -1110860 -1148399 -1446335 -1824031 -1675576 -978070 -402319
41899 -402319 -395784 -785526 -1308639 -1863648 -2135976 -1687580 -695969 1494 -65451 -457188
41889 -457188 -637087 -743106 -1063764 -1286311 -956896 -366628 -243565 -683377 -1072690 -1079135
41879 -1079135 -1072343 -1430961 -1984660 -2352152 -2400398 -2173766 -1745232 -1314243 -1100254 -988869
41869 -988869 -646014 -105984 202448 206618 450960 1246423 1994989 1845662 775354 -404162
41859 -404162 -944207 -740020 -227673 -20464 -428264 -1035288 -1005043 -103162 890124 1112608
41849 1112608 591581 -98266 -676095 -1097051 -1116067 -656779 -291521 -547757 -980305 -788502
41839 -788502 -136843 136726 13464 327955 1175550 1500497 718401 -317215 -572498
41830 -572498 -148038 318125 715996 1160243 1344974 1063750 825619 1106478 1440615 1099657
41820 1099657 282798 -241125 -354236 -524979 -739772 -501204 100066 266166 -322349
41811 -322349 -963724 -901480 -262290 297056 437688 299533 117596 11823 52262 300046
41801 300046 718796 1074162 1048490 644438 373004 657532 1079960 800748 -136435 -641528
41791 -641528 -84156 794370 1053908 884343 948022 1085900 761005 314028 533982 1181969
41781 1181969 1204471 428096 -187416 -147643 -50027 -274107 -242361 436332 1118960 1134888
41771 1134888 804556 727667 792395 678185 708925 1312722 2048000 2049446 1246231 386213
41761 386213 -47981 -282457 -619902 -924282 -858461 -328882 368775 742488 578052 287355
41751 287355 469855 1010721 1080369 289027 -687365 -1061681 -1013328 -1222408 -1713583 -1866600
41741 -1866600 -1398909 -684758 -152870 84285 46094 -160032 -232158 -10590 112432 -377819
41731 -377819 -1276893 -1767423 -1452742 -815934 -520152 -674625 -957633 -1090179 -983288 -708924
41721 -708924 -524862 -716722 -1261192 -1794545 -1969811 -1686776 -1030183 -284414 26309 -449762
41711 -449762 -1321146 -1716083 -1322114 -760946 -651000 -728887 -371305 329008 635858 235533
41701 235533 -389290 -743524 -900813 -1077691 -1178530 -1155984 -1350282 -1912471 -2232881 -1646754
41691 -1646754 -563064 -111417 -593200 -1068973 -754142 -54851 267637 262479 404974 568973
41681 568973 269681 -303472 -386413 217080 851270 977746 781888 672676 760192 987738
41671 987738 1262362 1326613 1005697 648792 738198 988457 552762 -661680 -1635314 -1569181
41661 -1569181 -903960 -544606 -661067 -786711 -616132 -166511 451582 934240 841727 218975
41651 218975 -229066 -22149 456954 639625 570097 503502 286707 -148913 -195174 648166
41641 648166 1723414 1860361 906064 -233627 -937712 -1349863 -1542688 -1168741 -196776
41632 -196776 753137 1126290 964266 545815 18351 -461797 -732583 -928210 -1325137 -1795157
41622 -1795157 -1893772 -1571747 -1285043 -1298319 -1394905 -1374712 -1294452 -1097356 -586954 56536
41612 56536 312027 81743 -149197 -140960 -261908 -699574 -949547 -586665 -21583 108202
41602 108202 -66644 92729 653013 917031 384064 -533133 -947053 -478690 343050 660848
41592 660848 195620 -564261 -1101501 -1485984 -1992348 -2444499 -2461460 -2144502 -1872046 -1511870
41582 -1511870 -600810 642384 1318398 1090803 617362 412580 137004 -478485 -869046
41573 -869046 -551662 -91033 -258082 -782405 -924833 -845371 -1251856 -1898243 -1695911 -470529
41563 -470529 556989 458053 -226722 -564468 -601292 -862206 -1148698 -855600 -224094 -260672
41553 -260672 -1290375 -2415203 -2724705 -2379887 -2033194 -1718284 -1008206 -14539 574553
41544 574553 550476 569332 1136588 1773035 1729161 1154871 890133 1211794 1455605 996481
41534 996481 60387 -672363 -874762 -723512 -519739 -407313 -324711 -112978 216713 365280
41524 365280 131840 -179170 -129948 126374 19586 -487564 -746849 -443756 -128119 -314630
41514 -314630 -614908 -330393 492897 1215585 1545927 1707313 1796459 1580396 976783 284706
41504 284706 -155752 -252950 -113116 58106 61291 -64793 -26500 285403 517691 304932
41494 304932 -184012 -491752 -502568 -430888 -280216 246846 1227555 2182667 2357342 1320349
41484 1320349 -525164 -1952625 -1827340 -307782 1221499 1745913 1696514 1960154 2381409
41475 2381409 2098583 1040010 58834 -401824 -774960 -1321231 -1581254 -1269475 -875140
41466 -875140 -837452 -806575 -319703 352973 665469 624954 509260 173210 -619681 -1464479
41456 -1464479 -1711175 -1451769 -1316948 -1339628 -900520 39295 554922 45377 -849202 -1223076
41446 -1223076 -1169282 -1288569 -1414657 -849274 268680 913794 705795 487888 912763
41437 912763 1387086 1179778 803216 1242421 2261616 2640297 1971074 1104571 727791
41428 727791 585783 370224 330533 558994 600462 291485 125925 248354 -279 -865856
41418 -865856 -1452613 -1067860 -408553 -392059 -648666 -401196 -87168 -610274 -1484802 -1390603
41408 -1390603 -389481 101432 -374644 -695591 -172737 441903 518829 603733 1133391 1445599
41398 1445599 983741 333644 116159 -85796 -689299 -1021217 -426265 384960 335282 -333496
41388 -333496 -609363 -400018 -411207 -738966 -850950 -724178 -788932 -899781 -549728 -24762
41378 -24762 -145735 -813710 -980380 -253453 551002 742575 650774 804783 1076134 1091197
41368 1091197 851149 560970 340196 318344 531070 644828 326676 -151493 -339603 -510022
41358 -510022 -1240864 -2172068 -2293028 -1594240 -1200786 -1531361 -1650543 -1055878 -744963 -1519031
41348 -1519031 -2411550 -2079561 -867175 -90306 67439 424021 977897 878814 217336
41339 217336 219215 1230938 1910023 1162601 -170216 -459316 559304 1661171 1795977
41330 1795977 1103784 408130 303218 772577 1326680 1437399 992942 323246 -226407
41321 -226407 -572007 -741285 -749605 -711973 -764136 -767425 -459164 -32517 -81414 -652793 -848058
41310 -848058 77331 1544517 2268255 1936085 1528773 1812269 2231909 1800103 618790
41301 618790 -165402 170225 1125717 1800303 1987553 2082145 2260013 2315901 2250097 2433837
41291 2433837 2964130 3278224 2786473 1670621 691561 325833 428655 651054 790265
41282 790265 719224 377803 -11769 -10223 569316 1401671 1925861 1728820 712967 -772727
41272 -772727 -1912944 -1956289 -1018190 -86166 -3374 -685628 -1503351 -2050046 -2198613 -1784878
41262 -1784878 -819952 100790 182810 -640648 -1529560 -1625710 -898640 -47886 232369 -148812
41252 -148812 -653221 -682992 -256820 58718 43178 274921 1240704 2317946 2376953 1323951
41242 1323951 223992 -259386 -673360 -1610057 -2562663 -2673323 -2035242 -1387388 -884651
41233 -884651 -134997 666872 677195 -287804 -1233235 -1222043 -517974 -7913 34107 48171
41223 48171 375652 935048 1570257 2175413 2481932 2222247 1623763 1319264 1548074 1771002
41213 1771002 1375834 543876 32377 149771 359320 59940 -568892 -836961 -504203
41204 -504203 -58059 23173 -96890 66158 635738 1300573 1746650 1856579 1601809 1086316
41194 1086316 663771 673800 1040303 1423712 1732962 2076814 2201688 1577037 333414
41185 333414 -446293 50037 1165751 1466219 532206 -616664 -985085 -800746 -899578
41176 -899578 -1483263 -2068774 -2350277 -2437795 -2315016 -1743512 -875625 -359411 -466172 -578574
41166 -578574 -45953 771860 915941 133536 -871603 -1483980 -1757889 -1774810 -1210751 -80694
41156 -80694 717691 417842 -372950 -333239 706471 1447220 906792 -291408 -908182 -720273
41146 -720273 -445975 -414319 -168438 562813 1232954 1174539 506648 -69052 -187065 -126202
41136 -126202 -199429 -198772 324098 1363740 2312597 2574858 2182628 1679810 1458391 1357839
41126 1357839 963182 201960 -483166 -609722 -226255 148424 172491 20421 -93487 -404508
41116 -404508 -1135943 -1744473 -1384189 -274215 223814 -594110 -1625709 -1415025 -198418
41107 -198418 554369 344175 117783 441168 538426 -230254 -1037597 -736028 321117 701559
41097 701559 -90153 -1008062 -966613 -168490 369803 124363 -480933 -731380 -419073 89083
41087 89083 461922 840180 1475128 2133386 2288812 1879286 1378155 1041654 656448 223562
41077 223562 239465 888168 1522432 1480291 983758 705871 843249 1131682 1358145 1296929
41067 1296929 595000 -606811 -1361815 -985599 -69815 370472 366389 642867 1129438 1029576
41057 1029576 337568 56013 666169 1471769 1795545 1805571 1747818 1374301 700998 424344
41047 424344 900288 1447571 1335988 808203 465995 286866 -46227 -430309 -680513 -1013894
41037 -1013894 -1456815 -1388146 -557232 47377 -541666 -1576449 -1450543 -92709 865225
41028 865225 488448 -226530 -49861 691632 861843 271019 -270978 -264244 -10238 91071
41018 91071 22755 -138540 -480184 -1056610 -1700249 -2114481 -2035165 -1401606 -564673 -168185
41008 -168185 -503589 -1064786 -1096506 -546009 -56066 15414 30838 281911 328351 -284459
40998 -284459 -984084 -658580 761581 1973055 1888824 944437 323905 386519 546662 423921
40988 423921 307778 456888 636379 561637 292539 -22306 -360411 -592763 -465961 -53223
40978 -53223 167503 -45571 -323365 -234354 103298 272285 180408 126709 393168 987201
40968 987201 1644468 1950126 1667630 1084475 795749 1007625 1295055 1144175 441398 -634521
40958 -634521 -1786471 -2530512 -2443213 -1741991 -1189865 -1156359 -1219582 -967470 -630612 -481929
40948 -481929 -151489 830019 2133244 2878392 2610819 1602470 415069 -450336 -755664
40939 -755664 -758789 -943180 -1246244 -1079295 -459073 -353397 -1245834 -2138349 -1928418 -1105170
40929 -1105170 -902815 -1286169 -1163345 -331602 301226 452950 874816 1705170 1911676
40920 1911676 1000954 -22593 -199410 25339 -93828 -149037 631998 1832616 2263355
40911 2263355 1594151 585917 -81495 -341687 -271621 73145 374799 287204 -26697 -113716
40901 -113716 77341 223771 245419 351751 523809 480328 181796 -90835 -199481 -295078
40891 -295078 -470088 -618280 -660299 -586864 -279245 384202 1214228 1794990 1924347 1739621
40881 1739621 1405410 924668 303969 -285499 -585013 -438771 28955 379600 170978
40872 170978 -569865 -1336989 -1723682 -1820580 -1918558 -2069225 -2132704 -2024694 -1705032 -1153253
40862 -1153253 -564767 -305129 -418146 -448822 -47285 502073 669346 376681 3144 -99407
40852 -99407 172899 680066 977322 555588 -513620 -1471810 -1759654 -1663112 -1691303 -1754384
40842 -1754384 -1514787 -1136048 -964626 -772982 -133336 619629 649869 -167142 -1072440 -1483183
40832 -1483183 -1450988 -1057160 -264263 459274 325862 -578982 -1164441 -873836 -493113 -776314
40822 -776314 -1106230 -468645 842383 1633348 1672115 1951951 2954750 3719990 3166831
40813 3166831 1624924 397275 192251 619983 1059277 1367873 1619524 1668156 1350890
40804 1350890 900464 762867 1008686 1232812 1122535 853784 756735 827542 836133 751417
40794 751417 718572 677609 394469 -40600 -100981 551904 1533726 2092328 1936816 1498159
40784 1498159 1345743 1517479 1543666 1062680 238306 -507675 -1015693 -1414257 -1688645 -1572128
40774 -1572128 -1025308 -546130 -699395 -1410838 -1945188 -1589501 -302788 1206427 2013833
40765 2013833 1786593 1116778 816373 886593 623840 -157343 -636716 -100802 1035958
40756 1035958 1862671 2105623 1980425 1434815 423502 -420865 -413771 29464 -107499 -829603
40746 -829603 -1099365 -519362 98733 154469 122941 494422 890255 900682 891580 1219157
40736 1219157 1436014 1085701 573858 396675 174829 -584820 -1344121 -1227587 -470065
40727 -470065 -84872 -327695 -557962 -502364 -580345 -923620 -1053931 -705703 -152598 419224
40717 419224 1098179 1712558 1894283 1787392 1889763 2070345 1635982 602142 -56099
40708 -56099 160423 481568 88064 -647327 -839297 -411859 5843 87755 3880 -104061
40698 -104061 -187060 -33542 457061 887525 779051 268142 -81927 -63818 22871 -89283
40688 -89283 -375772 -726902 -994020 -877497 -198021 683423 1074557 673095 -124299 -618656
40678 -618656 -342132 662716 1811666 2337091 1998534 1376562 1181879 1390360 1410532
40669 1410532 1001962 589160 643670 1134048 1639439 1695772 1052923 -32255 -783075 -648214
40659 -648214 -88882 -72855 -662431 -772209 302450 1752287 2268452 1730455 1093298
40650 1093298 829606 429338 -401681 -935512 -367536 958475 1917553 1981675 1655384
40641 1655384 1583757 1767866 1822513 1610349 1328733 1141436 975615 666773 196890 -196361
40631 -196361 -140209 526165 1462503 2005696 1760849 990100 370593 412565 1108718 2014037
40621 2014037 2582614 2518342 1908281 1045055 199531 -346884 -248498 531999 1299159 1082856
40611 1082856 -208140 -1489931 -1717968 -1036216 -274264 296471 984622 1674022 1734149
40602 1734149 1122580 728107 1135826 1683936 1363145 226544 -765426 -1057467 -964334
40593 -964334 -886473 -741441 -347393 151004 526303 794366 1012855 1018450 709525 452829
40583 452829 801774 1714368 2369429 2041622 1023948 316816 353217 446265 -208684 -1335398
40573 -1335398 -1903290 -1507022 -797233 -461832 -414081 -281468 -142854 -312479 -748535 -1125123
40563 -1125123 -1238612 -994314 -334481 399961 425252 -588453 -1859927 -2353461 -2056963
40554 -2056963 -1742634 -1683886 -1430738 -785236 -118212 374875 874474 1220847 895441 38025
40544 38025 -410147 -59386 268649 -160849 -829890 -868749 -438571 -297832 -506698 -568922
40534 -568922 -518234 -790242 -1149771 -822810 213518 1038467 1094929 832589 781686 810159
40524 810159 688650 655224 912144 1128958 952278 562015 264503 -48029 -562089 -1036960
40514 -1036960 -1122028 -897878 -668316 -499540 -403157 -664244 -1436825 -2212694 -2275782 -1632324
40504 -1632324 -985158 -794661 -849149 -821149 -768768 -872650 -1008348 -881862 -507843 -342832
40494 -342832 -830724 -1802754 -2479213 -2290891 -1602200 -1221025 -1202184 -758798 383699 1267584
40484 1267584 979337 107799 29360 954032 1626270 1058323 -252213 -1085271 -852115
40475 -852115 59274 757813 461159 -836401 -2089842 -2104562 -907291 305816 717718
40466 717718 675353 678446 480921 -175779 -698712 -405149 313464 503699 65979 -235549
40456 -235549 -64579 75938 -204163 -624811 -859069 -1065061 -1487505 -1976554 -2160440 -1805784
40446 -1805784 -938196 54848 478734 -32003 -932578 -1357883 -1291099 -1484118 -2150344 -2575603
40436 -2575603 -2343848 -2083059 -2387186 -2727002 -2253438 -1184201 -481042 -428327 -463846 -320173
40426 -320173 -358789 -613959 -426664 522290 1486171 1507122 572588 -566224 -1355688 -1656767
40416 -1656767 -1267443 51870 1965390 3497981 3867178 3148286 1968126 811955 -136964
40407 -136964 -709534 -708060 -199293 414459 752837 769159 642660 513438 443099 510815
40397 510815 771423 1145699 1461334 1570317 1378598 898451 381926 204671 400071 509118
40387 509118 209148 -110966 129278 740239 947835 568816 260230 347385 207316 -620435
40377 -620435 -1428131 -1308810 -669098 -741434 -1725592 -2462741 -2107379 -1165030 -513713 -246521
40367 -246521 -31815 58711 -232176 -727527 -1054535 -1214682 -1351399 -1237377 -642264 -32228
40357 -32228 -168538 -944773 -1275551 -413011 1057887 1845566 1333263 96480 -805997
40348 -805997 -849095 -401474 -224108 -689837 -1525735 -2237317 -2560051 -2436376 -1855002 -968100
40338 -968100 -163633 271081 425306 468144 294182 -197729 -690565 -776671 -583333 -577166
40328 -577166 -792462 -790647 -442316 -213587 -503618 -1140740 -1712922 -1993298 -1877623 -1326365
40318 -1326365 -573242 -7382 313832 614154 754761 257003 -745510 -1259826 -690600
40309 -690600 187446 182523 -756582 -1626470 -1751314 -1350630 -841293 -286057 395745 1193765
40299 1193765 2022907 2569988 2257693 902391 -700650 -1482183 -1374904 -1253422 -1597496
40290 -1597496 -1934764 -1739127 -1137428 -447083 296689 963162 1084899 488984 -251187
40281 -251187 -428679 48195 794466 1412886 1542115 964195 52698 -401799 -258290 -369593
40271 -369593 -1304520 -2288856 -2183595 -1106329 -212389 -100405 -335222 -476992 -660088
40262 -660088 -995388 -1189518 -1049732 -788357 -591983 -397933 -277298 -509238 -1058226 -1467780
40252 -1467780 -1484837 -1318688 -1106288 -664972 -9850 466781 651292 940732 1394040 1279632
40242 1279632 114552 -1329817 -1836358 -1268370 -490499 57217 774712 1776238 2281765
40233 2281765 1653601 443019 -234698 -78003 243848 192948 10382 122218 407835
40224 407835 450741 269239 317342 730535 1002440 664640 705 -297812 -69841 148969
40214 148969 -57875 -434262 -526648 -355039 -249206 -221383 62190 679554 1188847 1118883
40204 1118883 532378 -34571 -99589 353018 860945 825782 21803 -1100310 -1723153 -1455480
40194 -1455480 -780985 -527937 -887362 -1210166 -905607 -258342 -10661 -289157 -455396
40185 -455396 -115481 258437 80412 -372948 -281242 594344 1658009 2324312 2565417 2526110
40175 2526110 2166672 1581459 1218073 1361294 1669916 1631935 1298388 1141772 1262027 1180947
40165 1180947 539320 -335713 -796793 -665688 -419330 -577850 -1092746 -1473716 -1419823 -1099544
40155 -1099544 -784860 -473613 -38030 462198 829409 918761 588452 -271680 -1353458
40146 -1353458 -1878235 -1413758 -523055 -49367 29713 335048 841707 836470 210291 -204543
40136 -204543 54395 352628 44386 -583537 -1064467 -1564250 -2123661 -1928975 -458411
40127 -458411 1203035 1433519 230756 -825365 -667734 255460 1042951 1344614 1186912
40118 1186912 754349 518412 747748 830953 21886 -1103562 -1092351 230725 1287038
40109 1287038 946126 16948 -225497 85328 43728 -353223 -384625 -6944 87551 -331029
40099 -331029 -729010 -688350 -329700 129319 583774 805043 544698 -110069 -863002 -1556180
40089 -1556180 -2063198 -2174660 -2045328 -2312586 -3118942 -3455989 -2353541 -431898 725275
40080 725275 645599 392795 858592 1667157 2045212 1830655 1208769 281421 -605575 -815967
40070 -815967 -234850 451178 743678 998678 1611230 2171619 2078256 1470445 861386 286654
40060 286654 -436970 -965479 -765436 -12339 615473 917509 1191952 1376796 1030878 258254
40050 258254 -196933 -43180 133033 -89687 -217109 301717 1026446 1065960 390996 -116364
40040 -116364 97084 569864 520575 -220463 -1194852 -1914092 -2180301 -1952381 -1216764 -122144
40030 -122144 866287 1159912 567370 -378681 -787354 -237738 794363 1408928 1143444
40021 1143444 316296 -414227 -712894 -751426 -777673 -634458 75024 1258296 2051467 1646884
40011 1646884 345760 -631877 -470381 497780 1467030 2041424 2125550 1508142 234288
40002 234288 -885591 -920057 -5227 760538 734181 415360 477086 729109 519567 -235719
39992 -235719 -961744 -1184177 -947804 -579273 -403838 -638391 -1225839 -1762651 -1829919 -1391249
39982 -1391249 -695990 94329 903795 1434547 1236322 244465 -946125 -1546608 -1320759
39973 -1320759 -798295 -701383 -1167479 -1643103 -1622591 -1316377 -1329755 -1803973 -2279645 -2402214
39963 -2402214 -2274961 -2008243 -1499046 -958445 -1068846 -2067613 -3079287 -2989489 -1767920
39954 -1767920 -371109 458705 704526 562033 110736 -469923 -919139 -1208126 -1427012
39945 -1427012 -1429044 -1056677 -588713 -369796 -101531 776479 1984038 2461855 1739459 569957
39935 569957 -45617 117488 643317 999156 710719 -314318 -1365009 -1504160 -870162
39926 -870162 -687645 -1609890 -2811386 -3208788 -2791917 -2102911 -1179420 97429 1192901
39917 1192901 1470729 1240734 1309085 1657722 1485159 547500 -372217 -479339 167203 936007
39907 936007 1271841 962118 175494 -649187 -1189237 -1474633 -1583493 -1392199 -943493 -705538
39897 -705538 -986359 -1375525 -1276306 -735533 -238760 20788 98480 -158901 -844110 -1490642
39887 -1490642 -1541818 -1161410 -935349 -979750 -1035124 -1189977 -1683441 -2159985 -1998072 -1289766
39877 -1289766 -630756 -58906 815067 1688586 1724341 974082 499868 750438 919383 392088
39867 392088 -227912 -204153 123628 24930 -364891 -275660 573751 1674103 2270462 1860198
39857 1860198 559900 -716141 -937398 -138688 582466 501025 56841 -94601 -59724
39848 -59724 -229185 -505825 -601975 -552890 -401760 70574 790684 1164365 938919 671751
39838 671751 786338 866074 547147 344836 714407 970491 202454 -1196889 -1999309 -1843917
39828 -1843917 -1436835 -1255565 -1099171 -869045 -795256 -784578 -393647 391978 1044607 1270861
39818 1270861 1289941 1282615 1165433 981499 961486 1110899 1179881 1054090 809451 507757
39808 507757 314119 539743 1075986 1132769 185348 -1126834 -1765275 -1659816 -1506516 -1492821
39798 -1492821 -1214626 -749406 -750023 -1333033 -1789682 -1612742 -1032037 -376401 306104 809748
39788 809748 742005 197434 -211993 -221813 -184170 -320804 -380217 -223269 -100517 -154058 -231692
39777 -231692 -309957 -502216 -619397 -401963 -163820 -402826 -791972 -503404 407635 992648
39767 992648 930097 896418 1118572 809766 -376165 -1482833 -1594790 -1066103 -641659 -272550
39757 -272550 357397 961453 1197576 1366139 1703840 1678802 862872 -175749 -755795 -1165641
39747 -1165641 -1869709 -2323836 -1776980 -756983 -482582 -1052248 -1424568 -1084241 -589294
39738 -589294 -460015 -572571 -746562 -993979 -1052278 -521736 359456 804710 493782 -109078
39728 -109078 -482042 -471995 -37976 721142 1262318 1022616 221383 -368375 -432120 -254630
39718 -254630 62275 720122 1523259 1882941 1692685 1468877 1453016 1311960 940217 800981
39708 800981 1131644 1466437 1337739 925612 662058 650429 780174 986332 1118908 955642
39698 955642 590198 437981 662918 960625 1037985 903826 592931 79126 -417546 -542235
39688 -542235 -361644 -285447 -304223 68762 853789 1260829 718868 -253050 -671245 -237811
39678 -237811 522556 978158 898907 498693 259287 524794 1113440 1546955 1678460 1715285
39668 1715285 1632915 1159284 500227 427289 1260931 2266231 2484274 1803581 858607 211806
39658 211806 -26440 -56507 -148800 -316011 -143617 670793 1599862 1724102 1019991 484246
39648 484246 703507 1101329 1046158 860411 1032247 1153913 542202 -554995 -1265852 -1319922
39638 -1319922 -1161074 -1052397 -833448 -445390 -35879 345491 603151 384579 -368764
39629 -368764 -933672 -598268 253957 607154 208221 -279794 -392295 -273031 326 584433
39619 584433 1225931 1312985 834846 540396 853000 1320134 1431139 1274024 1025083 510168
39609 510168 -224600 -545402 -56374 683944 903281 683342 612019 681589 356977 -300210
39599 -300210 -413946 486432 1617729 1796684 844040 -339350 -955848 -1037454 -926039
39590 -926039 -620182 -64096 326074 102030 -367469 -232567 532394 933180 416230 -242502
39580 -242502 -120378 452354 536224 156277 189955 841457 1276327 901639 115003 -455305
39570 -455305 -676951 -609250 -208242 301737 386037 -74604 -502294 -374379 201765 875875
39560 875875 1450949 1642632 1087965 -6404 -775258 -661232 16403 765528 1552793
39551 1552793 2306652 2498078 1869732 1034843 678665 654520 550642 605901 1185767 1774819
39541 1774819 1526101 642354 192463 535294 890796 660102 276102 363975 766386 893377
39531 893377 581342 147384 -134816 -235047 -174811 89639 567874 1067497 1181245 658870
39521 658870 -107622 -315920 242231 775830 525377 -173515 -448961 -185595 6540 -76524
39511 -76524 -4994 380591 691931 740417 759487 733919 351069 -156870 -26229 813779
39501 813779 1426561 1279260 1079279 1521552 2028268 1643381 578136 -131495 -143286 -17051
39491 -17051 -100457 -129187 75261 291387 357419 348879 283938 167161 237315 624078 905245
39480 905245 639743 192884 281285 771837 793632 134935 -357595 -55363 579019 804514
39470 804514 604312 393795 286460 166558 68495 16058 -145152 -325658 15546 1163354
39460 1163354 2508189 3080222 2536743 1291703 -33922 -896547 -908088 -189429 506787
39451 506787 521202 58292 -162963 101757 418366 372143 18553 -367437 -616619 -698692
39441 -698692 -692974 -715295 -699890 -413876 92025 324056 -9582 -486539 -573999 -463200
39431 -463200 -692862 -1150917 -1191521 -680768 -127721 290527 962625 1826016 1983034 901036
39421 901036 -627602 -1373707 -1125594 -672830 -636654 -884141 -941806 -535423 162289 524892
39411 524892 -17063 -1126273 -1602072 -759405 601942 1220375 1036271 1037772 1613750 2019786
39401 2019786 1661688 1032726 911381 1246191 1383464 1020639 428537 -44786 -263559
39392 -263559 -231296 -49309 158016 475198 1132208 1970569 2272389 1532046 216641 -701431
39382 -701431 -903127 -959052 -1397311 -2022182 -2329099 -2167446 -1691313 -986388 -162169 380286
39372 380286 290875 -86738 79984 1006428 1786359 1430123 183970 -733469 -681508 -266265
39362 -266265 -253194 -445133 -184677 455587 742535 443974 177933 456045 1018820 1404559
39352 1404559 1614047 1795646 1732629 1188277 494146 252853 564892 988358 1154144 982805
39342 982805 415496 -518425 -1348070 -1437003 -790668 -138025 -3081 -120612 -38370 125956
39332 125956 -50949 -551042 -901722 -816906 -460903 -94876 203297 440952 621858 819450
39322 819450 1114616 1403357 1456508 1204345 764514 170657 -656063 -1554834 -2016472 -1674260
39312 -1674260 -783003 10666 323789 302238 321178 653626 1407902 2492109 3493873
39303 3493873 3810492 3155621 1897899 707788 -110536 -729738 -1246995 -1354076 -800831
39294 -800831 29603 403372 108114 -298891 -236159 203531 499247 394564 63211 -248771
39284 -248771 -429719 -437028 -330569 -326977 -535051 -697715 -525585 -216450 -203576 -389517
39274 -389517 -189573 490240 906354 477437 -379253 -906023 -1049913 -1200219 -1222757 -612084
39264 -612084 414800 815857 549 -1369188 -2159854 -1921188 -1038582 -195222 36076
39255 36076 -485796 -1174344 -1079229 61936 1370926 1749093 1022843 -94226 -866660
39246 -866660 -1006679 -580463 84008 528289 570687 466400 413967 190260 -361510 -825350
39236 -825350 -730674 -322644 -198525 -344993 -227600 212192 382449 -24777 -580501 -778196
39226 -778196 -558734 -12431 812805 1572045 1746490 1445655 1454565 2055897 2438605 1851008
39216 1851008 771868 211284 288080 346926 223669 448552 1180476 1831498 1990134 1964273
39206 1964273 2035575 1824342 939696 -178111 -692631 -460765 -111161 -65033 -31265 366058
39196 366058 938201 1270053 1404247 1696991 2069503 1949295 1143981 301269 109073 372770
39186 372770 398257 70992 -101084 13485 -108653 -661705 -953844 -378615 538244 741451
39176 741451 82947 -507429 -299119 356857 623650 300321 64328 650494 1919305
39167 1919305 2857230 2637408 1597936 839206 832647 931517 500415 -33718 202501 1231455
39157 1231455 2179949 2376234 1938883 1380418 1142641 1439589 2069664 2464570 2356188
39148 2356188 2186463 2340500 2317545 1475311 366266 271023 1320512 2155102 1775785
39139 1775785 735485 11712 -344206 -746811 -1085688 -1038192 -800868 -699375 -515185
39130 -515185 49841 672069 935679 1127500 1651857 2056510 1635597 726126 302673 392831
39120 392831 90712 -734905 -993958 -78985 1105217 1517199 1469041 1851490 2534241 2579221
39110 2579221 1758173 876106 575273 624635 579606 515256 787880 1451228 2209646 2762843
39100 2762843 3012298 3046461 3025610 3004562 2870060 2566109 2313708 2396605 2755415 3036376
39090 3036376 3046562 2885321 2590456 2014117 1232914 746237 939882 1561475 2075851 2364754
39080 2364754 2639406 2782858 2394147 1614614 1278025 1839196 2647199 2833683 2551519
39071 2551519 2625330 3167602 3398487 2959761 2574136 2961765 3716621 3852290 3125901 2263011
39061 2263011 2020032 2450764 3001477 3020548 2317590 1476298 1383095 2169658 2950880 2984528
39051 2984528 2684063 2904128 3585397 3919669 3715042 3679421 4206801 4736827 4682904 4293011
39041 4293011 4098460 4043806 3727663 3172382 2811101 2852092 3056935 3083426 2807703 2407393
39031 2407393 2261946 2586549 3075819 3194462 2906494 2716006 2851383 2949321 2848506 3093801
39021 3093801 4094257 5250760 5625951 5205261 4774029 4708316 4661347 4460354 4547555 5290194
39011 5290194 6416914 7399167 7950198 7935659 7253743 6123975 5160865 4831718 5022893
39002 5022893 5326408 5525206 5626520 5682079 5796190 6092824 6467804 6591893 6385590 6276089
38992 6276089 6684462 7370591 7590114 6933210 5839867 5223187 5603219 6595493 7303944
38983 7303944 7319479 7217873 7810793 8979243 9682043 9243486 8194268 7548121 7613698
38974 7613698 7929549 8103636 8189666 8294027 8319686 8243613 8308579 8741239 9450789 10131487
38964 10131487 10538121 10581877 10296607 9854617 9578205 9786328 10484786 11174422 11156544 10294982
38954 10294982 9419898 9594045 10850583 12028220 12098406 11307865 10685030 10781201 11369990
38945 11369990 12062460 12556481 12440513 11533023 10503330 10417692 11414698 12471254 12786281
38936 12786281 12735719 13004067 13413109 13302914 12646388 12015096 11650361 11304477 10924006
38927 10924006 10787100 10923984 11032661 11056937 11253313 11577612 11637032 11444211 11554432 12104952
38917 12104952 12346521 11661201 10566916 10075716 10350872 10661352 10534528 10291697 10383603
38908 10383603 10771563 11177701 11524852 11838834 11960522 11649251 10921037 10114893 9586397
38899 9586397 9358455 9108342 8574053 7944678 7652035 7746549 7806223 7640560 7678022 8240729
38889 8240729 8779422 8476725 7492698 6886181 7185804 7742920 7808884 7595833 7724361 8093853
38879 8093853 8019553 7334716 6675444 6568198 6754535 6667022 6240802 5937889 6085074 6464742
38869 6464742 6627164 6452916 6227858 6163692 6090293 5834249 5701106 6150155 6979425 7326631
38859 7326631 6722350 5754373 5352947 5715691 6299239 6591434 6447462 5893989 5154803
38850 5154803 4781831 5180454 5936354 6115702 5360688 4248543 3451939 3037259 2793263
38841 2793263 2722916 2832132 2867031 2749802 2956169 3876639 4959618 5136011 4186868 3143489
38831 3143489 3087421 3968649 4922976 5403581 5531731 5509751 5274357 4857796 4593615 4614525
38821 4614525 4464579 3661533 2490025 1737497 1661558 1761208 1692177 1803454 2404933 3040176
38811 3040176 3060975 2570521 2155959 1937581 1628408 1415124 1894027 2967962 3647405
38802 3647405 3345540 2686760 2539269 2835854 2941520 2697361 2401622 2090988 1594690
38793 1594690 1147230 1207648 1658355 1845420 1541281 1304198 1679487 2488354 3129539 3246707
38783 3246707 2906342 2395656 2016891 1882482 1834450 1748639 1850938 2386269 3017115 3046546
38773 3046546 2368127 1713871 1708343 2092297 2211093 1930538 1673150 1760644 2101190 2416127
38763 2416127 2461961 2100688 1417417 737269 351845 296344 502490 976599 1628186 2133481
38753 2133481 2277442 2317323 2687437 3370239 3840106 3661319 2933162 2109591 1547055 1280991
38743 1280991 1145614 1055534 1134931 1488618 1908248 2051961 1943675 1955414 2148452 2025116
38733 2025116 1245993 252964 -238672 -118198 178327 349899 355967 124136 -213590 23741
38723 23741 1354332 3068459 3774108 3234665 2745561 3228247 3870634 3442281 2210081
38714 2210081 1478611 1633787 1812249 1451836 1017609 923936 770113 205967 -232466 115814
38704 115814 922967 1257998 850292 321080 254759 600829 976268 1063532 679388 -99658
38694 -99658 -808856 -985892 -742795 -542731 -382886 243096 1378706 2220342 2157955 1716388
38684 1716388 1828923 2472229 2764573 2344859 1871263 1972815 2424376 2747460 3014705
38675 3014705 3463929 3729154 3201287 2057244 1248519 1341717 1894486 2167045 1992559
38666 1992559 1681281 1476471 1494429 1914265 2739588 3464367 3466670 2852558 2530977 3199399
38656 3199399 4473271 5311134 5206319 4637660 4309703 4312976 4309941 4300239 4700341 5589713
38646 5589713 6337258 6301572 5645931 5093413 5009155 5086469 4872744 4250108 3430252 2829572
38636 2829572 2900196 3646972 4326712 4178651 3545313 3602602 4679029 5549765 4989699 3465212
38626 3465212 2494356 2666619 3162836 3089821 2378835 1319479 144452 -643013 -406705
38617 -406705 659680 1416558 1208899 801445 1207738 2141982 2531143 2231277 2180044 2815872
38607 2815872 3361773 3056310 2303316 2018700 2342227 2629521 2470819 2128886 2006700
38598 2006700 2138002 2277714 2196827 1819795 1293424 975115 1163294 1768464 2380698 2700276
38588 2700276 2774576 2780029 2730707 2520811 2180956 1953017 2050250 2357766 2438245 1943391
38578 1943391 1064484 461985 602713 1199408 1476106 1033853 299174 964 324915
38569 324915 792207 964815 1008164 1356172 1973275 2309563 2084181 1769286 1964904 2479100
38559 2479100 2497137 1703440 761146 445081 715892 1045955 1327765 1882956 2695753 3278483
38549 3278483 3403307 3388711 3421029 3134173 2263198 1270322 779912 668891 320674 -327701
38539 -327701 -616159 -134102 647908 928219 417708 -518780 -1250614 -1271484 -531149 417964
38529 417964 853009 626516 259857 214921 419584 655841 966042 1345069 1429427 968979
38519 968979 361207 224701 583965 940575 1036548 1045457 1059453 942358 783944 988273
38509 988273 1695940 2504146 2986276 3182768 3374174 3661654 4006677 4431386 4893350 5107772
38499 5107772 4776237 4008056 3393992 3592465 4714770 6010043 6372800 5498261 4400856
38490 4400856 4334699 5265812 5994005 5827927 5392430 5462332 5757382 5538503 4863672 4459845
38480 4459845 4618435 4980804 5294468 5645795 5961751 6008990 5987212 6428145 7301712 7889147
38470 7889147 7876961 7978181 8993857 10703228 12206142 13042338 13413706 13516746 13313891
38461 13313891 13020956 13254772 14397880 16077653 17524441 18343305 18797455 19425751 20502113
38452 20502113 21808954 22829961 23183487 22947189 22560800 22368990 22287880 21993865 21408407
38443 21408407 20826426 20462928 20030042 19027781 17466679 16025308 15312864 15132058 14690852
38434 14690852 13506129 11934502 10799894 10587161 11002706 11288147 10977990 10303206 9756606
38425 9756606 9401013 8933357 8381765 8190429 8378855 8194042 7143937 5967532 5836790
38416 5836790 6744876 7462696 7159270 6315512 5784330 5650695 5501146 5297857 5336048 5530149
38406 5530149 5335826 4471333 3377823 2803701 3030222 3589678 3776858 3427471 3034606
38397 3034606 2976867 2902005 2262622 1288434 851697 1324650 2145617 2682084 2944190 3157057
38387 3157057 3202387 2955468 2753325 2989112 3474190 3654413 3300362 2643313 2027294 1735828
38377 1735828 1913858 2331185 2488712 2293966 2312853 2951448 3726396 3852018 3286949 2674809
38367 2674809 2471763 2659665 3094489 3554499 3623604 3126020 2521551 2273126 2034184 1193906
38357 1193906 67511 -333733 262731 1070725 1497350 1809514 2256155 2427759 2025931
38348 2025931 1560906 1648387 2092633 2242890 1903972 1407387 1092077 1128682 1540264 2019100
38338 2019100 2060096 1636736 1371299 1668653 2120458 2206128 2094580 2162086 2167438 1670779
38328 1670779 990969 904342 1456401 1874188 1760560 1651212 2130090 2968567 3493515 3436997
38318 3436997 3097314 2873522 2876139 2887524 2608867 2039878 1572700 1530446 1705742 1633778
38308 1633778 1242232 875964 713894 586187 426334 444626 651206 607292 -17891 -877392
38298 -877392 -1269297 -941699 -319316 49897 71940 85313 393799 958663 1601525 2376118
38288 2376118 3453008 4559737 4912244 4084588 2744354 2031454 2233473 2572127 2367527
38279 2367527 1853037 1572470 1484367 1137032 425175 -327945 -877417 -1173012 -1082134 -523946
38269 -523946 109515 217958 -150117 -208731 502479 1425819 1795256 1751237 2018607 2671491
38259 2671491 2984436 2602274 2105306 2060152 2143715 1740328 926762 239642 -165844 -417578
38249 -417578 -282832 511123 1418598 1499281 835220 573926 1244011 1987620 1992151 1718699
38239 1718699 1873343 1995239 1236050 52317 -203692 692252 1479219 1306892 838652
38230 838652 944790 1266465 895900 -103015 -747366 -523190 20062 133209 -199174 -394040
38220 -394040 -41536 701961 1399837 1794888 1897788 1771323 1494498 1360786 1767967 2688564
38210 2688564 3520744 3748486 3502816 3169598 2783923 2283602 2019906 2313724 2662865
38201 2662865 2185109 908261 -112848 -121492 558870 1215517 1518596 1403722 947601
38192 947601 685417 1282716 2439230 2866192 1943609 728948 629853 1659850 2761372
38183 2761372 3303359 3354517 2907649 1911505 935191 766274 1270520 1557895 1429498 1739199
38173 1739199 2948467 4132339 4053354 2774646 1585807 1474778 2140898 2558105 2221538
38164 2221538 1637567 1576883 2055068 2403560 2355272 2486836 3211064 3887751 3656306 2826496
38154 2826496 2552208 3172559 3785588 3651336 3159158 3018210 3232888 3422449 3577799
38145 3577799 3864072 4046620 3757406 3167469 2866799 3133127 3696320 4146559 4251870
38136 4251870 3975464 3507156 3208236 3236796 3302565 3068452 2698386 2666596 3032011 3243217
38126 3243217 2789842 1839488 1085335 1062039 1728399 2683607 3638724 4523569 5165803 5193466
38116 5193466 4562282 3992882 4369671 5596406 6515363 6265664 5396349 5243369 6364491
38107 6364491 7966667 8854208 8647266 8015586 7899127 8573609 9434798 9708428 9341482
38098 9341482 9035851 9372427 10141856 10696488 10759423 10638590 10714219 10926034 10816540 10061468
38088 10061468 8985195 8448818 9008040 10217856 11056860 11032697 10518120 10013963 9622997
38079 9622997 9402054 9586951 10050866 10102321 9410952 8708940 8898963 9779507 10400973 10479957
38069 10479957 10620746 11156331 11636729 11678078 11578079 11761180 12205404 12743229 13379460 13950834
38059 13950834 13998475 13431165 12894056 13008402 13584279 14039991 14267652 14551554 14877526
38050 14877526 14929543 14717370 14688961 15160718 15998265 16885836 17605158 18056446 18304590 18616996
38040 18616996 19222994 20072658 21013280 22019666 22966338 23438152 23254198 23000369 23430490
38031 23430490 24394143 25049513 25218287 25753561 27268111 29275999 31139088 33174616 36005362
38022 36005362 39231231 41693443 42982607 43842994 44998349 46376622 47766346 49522362
38014 49522362 52119896 55435122 58943247 62401852 66017501 70163887 75175517 81103783
38006 81103783 87390604 93168849 98338030 104054127 111626292 121088941 131368188 141725614
37998 141725614 152480672 164357728 177710044 192465184 208312133 224835716 241950761
37991 241950761 260257334 280355485 301641657 322439068 341590944 359191232 375269022
37984 375269022 388537508 397314764 401213450 400939158 396629149 387472615 373193455 355085443
37976 355085443 335204567 315058181 295301332 276102511 257399455 239198029 221943524
37969 221943524 206240697 191983724 178270540 164575096 151558059 140215388 130570848
37962 130570848 121774638 113259002 105191641 97884931 91347317 85456644 80081723 74961307
37954 74961307 69916487 65275427 61621933 58938931 56425623 53440559 50288784 47729819
37946 47729819 45919266 44208662 41943997 39177358 36548035 34627750 33435941 32520938
37938 32520938 31468933 30297577 29291953 28508684 27626432 26351221 24809847 23409810
37930 23409810 22388791 21621268 20847933 20016460 19356062 19070770 18957881 18491607 17441510
37921 17441510 16266071 15628772 15606953 15702222 15579688 15368323 15188042 14896091 14504831
37912 14504831 14321613 14309344 13805467 12416485 10811501 9970427 9888053 9765556 9392847
37903 9392847 9505598 10590183 12065053 12998234 13087732 12596103 11852956 11246256 11212626
37894 11212626 11679739 11853465 11134417 10032822 9607899 10120213 10798627 10916141 10547303
37885 10547303 10161820 9951610 9784082 9511505 9116312 8727198 8596949 8889739 9416937
37876 9416937 9746392 9623535 9152804 8598167 8210492 8213603 8665475 9258282 9503291 9243675
37866 9243675 8840993 8783976 9233437 9961766 10574737 10759640 10464492 9888990 9255127 8663395
37856 8663395 8233100 8153072 8364273 8408492 7923508 7128685 6481387 6068891 5785300 5851316
37846 5851316 6487349 7191097 7139092 6361988 5674268 5259595 4314994 2587509 1292742
37837 1292742 1641723 3115065 4153196 4116384 3582669 3037852 2419213 1946082 2257311
37828 2257311 3365160 4342772 4509537 4257229 4240132 4359968 4143161 3666570 3409175
37819 3409175 3382917 3088895 2392745 1904059 2240019 3210324 4004585 4076602 3618500 3169339
37809 3169339 2976060 2896338 2817257 2883574 3186256 3420172 3119541 2260412 1442801 1317226
37799 1317226 1828670 2168360 1645854 576815 9798 445472 1217844 1499370 1482244
37790 1482244 1872811 2523048 2590664 2098754 2165414 3239918 4226523 4115045 3491266 3439590
37780 3439590 3805403 3763957 3442352 3562536 3882667 3494808 2506606 1915271 1820598 1350578
37770 1350578 544032 607705 1793034 2685276 2415453 2014328 2491265 3016998 2415363
37761 2415363 1281576 984122 1372383 1180882 234263 -440158 -502780 -662999 -1061311
37752 -1061311 -811382 471743 1942682 2786821 3160423 3404046 3293549 2672921 2054567
37743 2054567 1942990 2104837 2063722 1880611 1936882 2271168 2573255 2626555 2455413 2216507
37733 2216507 2123136 2264352 2398011 2179924 1650167 1187033 958555 785998 575665 477680
37723 477680 575336 834774 1364432 2209288 2848492 2528216 1317545 278132 270611 1009730
37713 1009730 1559019 1368071 598879 -173041 -363212 131548 680265 561924 -49612
37704 -49612 -279307 187521 762405 1084140 1587630 2423823 2718797 1795677 483256 147932
37694 147932 787256 1185518 830761 535333 972337 1640600 1758677 1401140 1143775 1112755
37684 1112755 1021346 843015 842988 1047386 1171838 1070149 861951 588710 113595 -517867
37674 -517867 -920569 -772035 -196396 412312 785967 840462 548934 45179 -279013 -131825
37664 -131825 270699 516850 667187 1111111 1703244 1690889 821387 -84436 -172983 337993
37654 337993 706319 830428 1058901 1193455 688733 -222886 -616649 -251023 42272 -382891
37644 -382891 -1154334 -1637288 -1746594 -1610604 -1174300 -627543 -553882 -1096074 -1541772 -1282733
37634 -1282733 -657748 -304790 -209379 4987 323921 523544 716739 1106524 1515255 1682895
37624 1682895 1688328 1621922 1301771 803395 705118 1210843 1643700 1517591 1431406 1988701
37614 1988701 2497393 1931827 730117 292663 862992 1233187 613204 -425082 -1037551
37605 -1037551 -1027863 -480991 439591 1074731 701355 -311731 -779805 -413883 -183932 -638584
37595 -638584 -1061238 -853259 -559974 -726360 -814449 -248975 354390 116586 -620222 -870369
37585 -870369 -572029 -419239 -443764 35749 1071448 1773973 1577648 1014432 912013 1368041
37575 1368041 1811699 1740915 1173785 515772 60308 -360728 -1043443 -1750162 -1833959 -1177361
37565 -1177361 -457112 -191265 -150972 -122388 -487981 -1357267 -1840425 -1149060 106677 778006
37555 778006 895173 1285960 1760373 1191877 -406676 -1376104 -614294 891508 1547914
37546 1547914 1232442 939088 1045040 1030325 638376 307405 390819 673327 823781 838906
37536 838906 882354 1024436 1272979 1635749 2058234 2424146 2628575 2568260 2142131 1397646
37526 1397646 618569 154356 197566 734644 1545028 2188071 2224992 1634510 876168 421499
37516 421499 375959 643509 1184655 1874305 2314079 2105195 1269984 224376 -590260 -928833
37506 -928833 -795127 -496594 -456663 -674312 -533737 454519 1796390 2369069 1739343 707735
37496 707735 307264 609548 879836 687323 377328 402364 607870 468418 -131236 -661932
37486 -661932 -564028 76958 625407 643093 386939 456362 1035270 1681998 1892428 1634592
37476 1634592 1184678 701845 311931 433354 1444505 2897815 3638387 3117881 2181544
37467 2181544 2000719 2494624 2493846 1405985 -21042 -771813 -726243 -407358 -151756 -29612
37457 -29612 -148667 -426498 -308984 639891 1899508 2308928 1374225 -87966 -759305
37448 -759305 -81514 1318484 2270130 2110587 1252442 701877 951061 1498631 1560585 972746
37438 972746 171454 -384566 -420002 177224 1059393 1375257 679134 -252513 -235033 703050
37428 703050 1291078 757347 -211333 -610330 -452605 -364881 -432487 -222379 310310 684394
37418 684394 652748 531713 676510 1027787 1281581 1228123 859281 361093 22576 -35889
37408 -35889 -18933 -156434 -329041 -246612 68547 301993 349969 424712 536438 261724
37398 261724 -646279 -1657936 -1920695 -1309440 -623444 -577033 -928809 -923563 -376137 131603
37388 131603 119288 -179800 -245149 48327 422234 602424 482637 122882 -162328 14109
37378 14109 538748 709225 114078 -703346 -958432 -703035 -540837 -503580 -54931 806767
37368 806767 1358847 1274733 1082627 1165710 1132348 674444 268116 343560 417578 -125875
37358 -125875 -874199 -914553 -256283 189198 609 -211214 222646 1175318 2023616 2290075
37348 2290075 1840995 900115 23284 -306357 -178077 -58997 -105112 -43821 252045 527830
37338 527830 606588 689266 1004950 1424082 1562299 1112281 101465 -943833 -1202088 -319750
37328 -319750 1039844 1800986 1635181 1126969 827263 674350 432115 125588 -187587
37319 -187587 -569909 -843227 -550652 363260 1244170 1498939 1326610 1265075 1351586 1253690
37309 1253690 979451 831308 720795 166970 -873216 -1703363 -1720502 -1190918 -825568
37300 -825568 -792225 -582598 135304 931980 1097141 474904 -453514 -1184924 -1544520 -1455581
37290 -1455581 -820144 154576 887225 1037851 942483 1047608 1142675 677754 -244455 -780588
37280 -780588 -363838 671208 1643225 2259042 2568438 2596114 2362590 2039675 1801351 1654426
37270 1654426 1564387 1554317 1556552 1408848 1140454 1016743 1162034 1390883 1525344 1576568
37260 1576568 1500554 1156402 685947 522538 773232 994100 848318 544511 306471 -62567
37250 -62567 -610318 -753355 -26830 1068738 1697031 1866349 2184063 2643601 2578616 1829299
37240 1829299 1035196 575957 77275 -684902 -1155288 -776530 155642 905838 1168068
37231 1168068 1127453 1033084 1069156 1292352 1391546 917494 47249 -385619 -11757 472696
37221 472696 341923 -69954 9928 552725 921663 972894 1071151 1196594 973924 552235
37211 552235 517769 851649 900659 527656 290285 202846 -552945 -2088364 -3043008 -2289822
37201 -2289822 -632520 237850 -58605 -502473 -391249 12580 386358 739640 834031
37192 834031 280479 -568618 -793220 -260942 104487 -247959 -726263 -712912 -513179 -534218
37182 -534218 -393270 283591 878239 630899 8922 115667 930064 1229263 331387 -1044789
37172 -1044789 -1876505 -1959077 -1601041 -923817 20777 868079 1179247 919326 428762 27726
37162 27726 -201963 -326403 -317680 90595 1122353 2429900 3199508 3094608 2699460 2557139
37152 2557139 2243478 1175205 -42786 -180955 740646 1320676 802013 90595 189217
37143 189217 649196 442975 -370010 -842394 -597304 -177830 -110321 -350313 -589498 -576264
37133 -576264 -240307 97329 -106968 -815322 -1137983 -418921 762555 1320733 1077494
37124 1077494 720634 625102 580054 573760 915313 1458249 1553720 1049261 627959 826920
37114 826920 1317561 1521928 1431998 1404301 1511227 1496815 1161665 516407 -264436 -858282
37104 -858282 -977274 -717874 -556387 -842655 -1402630 -1698585 -1293412 -225501 915353
37095 915353 1413825 1162248 813335 940998 1298721 1293141 886540 450192 -35214 -884488
37085 -884488 -1891213 -2399583 -2269552 -2029886 -1963629 -1814195 -1551723 -1567641 -1803991 -1556936
37075 -1556936 -602054 280057 425574 177053 80572 -7122 -271083 -164599 750252 1744594
37065 1744594 1753242 913871 250479 74450 -201031 -725850 -839728 -257096 357735 393735
37055 393735 105235 -5061 9698 -189963 -628739 -1118195 -1598999 -1981614 -1928210 -1212658
37045 -1212658 -193429 387268 115919 -671949 -1193286 -987108 -421477 -266888 -673263
37036 -673263 -913975 -444073 196734 112887 -599724 -991018 -669437 -272270 -395226 -813076
37026 -813076 -1036765 -962494 -618245 97935 980901 1367024 928590 203350 -129818 -99843
37016 -99843 -101607 -137689 4183 134457 -125655 -662053 -967669 -844292 -528238 -227285
37006 -227285 -11262 -44380 -399156 -699522 -478485 122250 519806 530432 460489 330011
36996 330011 -287343 -1374457 -2051631 -1538524 -171746 986365 1309232 980344 435252
36987 435252 -83629 -442442 -497878 -213269 264226 705424 925008 873578 701626 652196
36977 652196 793446 955557 1019569 1117735 1410076 1809693 2091002 2129491 1879463 1313762
36967 1313762 616874 222887 318727 463136 111214 -566714 -863730 -542170 -141690 -147590
36957 -147590 -372562 -429678 -335611 -271840 -178413 -39312 -161880 -588498 -596890 420535
36947 420535 1752727 1973625 855951 -244968 -258788 264417 309474 61895 437569
36938 437569 1431406 2086277 2042027 2011496 2452396 2735744 2173687 1146805 533802 506920
36928 506920 605670 691098 1048779 1613783 1827844 1427305 812868 414757 163359 -127710
36918 -127710 -277724 -51663 309908 333494 -4748 -242110 -70934 346496 745470 1047862
36908 1047862 1119338 628107 -479226 -1564869 -1815801 -1199088 -544137 -562260 -1091479
36899 -1091479 -1491352 -1493923 -1346317 -1276589 -1213335 -1058683 -899947 -802413 -626066 -244107
36889 -244107 192381 406921 364278 329649 572899 1111487 1709920 2036086 1881332 1378044
36879 1378044 975712 1029996 1396212 1599485 1443004 1238176 1327695 1604702 1709876 1527351
36869 1527351 1215441 880738 560975 445971 677181 900522 535527 -309874 -720140
36860 -720140 -156513 705195 881440 462981 358612 839178 1206861 1024877 814538 1123073
36850 1123073 1586800 1498211 852909 251936 65787 234707 653911 1193788 1482549 1226685
36840 1226685 720778 561845 840038 1030123 735591 188103 -64103 280804 1030257
36831 1030257 1620191 1579770 1063932 728540 863306 1004646 781707 684016 1317979 2247508
36821 2247508 2453111 1814508 1192525 998087 684143 -93826 -813083 -1034747 -1106879 -1316560
36811 -1316560 -1174284 -308723 617385 766422 389539 324545 618771 612227 171642 -122348
36801 -122348 26933 322493 585802 947078 1241625 1040954 463724 171906 322916 312420
36791 312420 -112328 -303326 196977 758807 602387 88183 182649 909109 1275943 799292
36781 799292 239278 473201 1262661 1647531 1198501 335881 -422276 -945758 -1174047 -890519
36771 -890519 -166683 344995 68439 -684054 -1064746 -841365 -645446 -942356 -1354064 -1362559
36761 -1362559 -1148573 -1177657 -1352153 -1263678 -1059651 -1280056 -1846006 -1988650 -1381384 -665346
36751 -665346 -526026 -811904 -958580 -805956 -538592 -206005 172186 276701 -197038 -990833
36741 -990833 -1495240 -1462303 -1133289 -738006 -317726 -60755 -308792 -986160 -1379540 -859276
36731 -859276 295969 1118625 1022261 398583 29591 130105 259537 102014 -83990 21523
36721 21523 208669 67508 -295501 -392058 -182018 -207401 -724616 -1226339 -1174775 -794835
36711 -794835 -664364 -773781 -532938 333049 1358398 1888511 1728746 1150074 519024
36702 519024 54966 -218793 -405713 -546718 -485086 -26022 764347 1526048 1872565 1621476
36692 1621476 848630 -109077 -737677 -656714 50181 889040 1369083 1325059 913880 456244
36682 456244 263654 427737 707079 745587 462361 104678 -153014 -502731 -1203746 -2047655
36672 -2047655 -2392597 -1883790 -964846 -392734 -284285 -5525 855736 1798715 2060156
36663 2060156 1684731 1425612 1678758 2099088 2319937 2414384 2414741 2017170 1210822 677977
36653 677977 982741 1703786 1951380 1476647 699215 -65086 -697117 -836726 -236404 472862
36643 472862 306203 -598380 -966164 -246651 436692 -101655 -1292135 -1565736 -539100
36634 -539100 565696 644707 -43208 -562454 -504463 -109745 336195 751633 1077184 1214518
36624 1214518 1174995 1133667 1279865 1613755 1900725 1910534 1730358 1683327 1852369 1911333
36614 1911333 1610925 1188517 1018364 1076128 1084539 971928 787277 395720 -223147 -588145
36604 -588145 -297717 128059 -196283 -1103989 -1474766 -1005353 -826732 -1744738 -2829599
36595 -2829599 -2691769 -1451769 -355212 79486 322716 507805 160045 -655499 -1121342
36586 -1121342 -916702 -635863 -585418 -199003 799534 1597634 1382139 491806 -212780 -449388
36576 -449388 -294062 378858 1339198 1560702 441035 -992989 -1254419 -460989 -7032
36567 -7032 -347662 -497451 114100 701745 585632 386976 928526 1799178 1941326 1162242
36557 1162242 236410 -203160 -203564 -124938 -281424 -797290 -1403034 -1540237 -993696 -202123
36547 -202123 319600 551873 706728 826955 1004264 1510769 2221740 2379554 1563888 507362
36537 507362 212141 544388 549276 36747 -91428 710757 1681091 1710364 770268 -104283
36527 -104283 -68265 640871 1043090 499890 -588484 -1227787 -949258 -232482 283513 596795
36517 596795 1008233 1389939 1359805 975295 647973 463102 182774 -118363 -64163 308582
36507 308582 473321 229649 49222 375050 1024473 1498598 1479452 856174 -290442 -1499344
36497 -1499344 -2123276 -1952129 -1335002 -582905 296594 1114579 1320531 700417 -134503
36488 -134503 -370035 122580 782839 979652 413451 -757806 -1886963 -2201315 -1494451
36479 -1494451 -279641 858180 1714487 2147802 1861964 903070 -41214 -304587 54747
36470 54747 549399 912703 1076273 904206 461070 215427 422285 590152 171393 -464901
36460 -464901 -465011 209389 662962 330178 -312348 -502742 -118094 417153 720813 677909
36450 677909 383834 102287 78385 257042 369327 335864 336317 457894 584379 688657
36440 688657 893490 1127485 1060832 572899 2083 -301597 -465542 -871514 -1518346 -1833654
36430 -1833654 -1222818 188333 1434189 1539614 567456 -406821 -559182 -227119 -181434
36421 -181434 -363449 -65667 747731 1178818 694789 -89102 -375510 -271535 -287081 -268475
36411 -268475 350253 1446186 2170628 2069836 1582725 1251621 997247 463947 -323141
36402 -323141 -977414 -1195039 -948193 -448557 -112014 -306271 -865338 -1063510 -398590 726227
36392 726227 1440758 1446346 1213942 1116220 841369 -18721 -1105294 -1503726 -848654 142007
36382 142007 443525 -134366 -816101 -829108 -235742 353701 681113 1053128 1593584 1760869
36372 1760869 1053900 -62452 -584887 -356192 -324606 -1100484 -1910438 -1626729 -419746
36363 -419746 408402 105541 -786122 -1402892 -1510906 -1253154 -652199 173026 757244 753138
36353 753138 415402 266502 459246 726617 777402 548121 264575 356916 996438 1611758
36343 1611758 1312855 13331 -1338025 -1916911 -1883218 -1707250 -1259394 -245093 881768
36334 881768 1262333 782789 215653 220618 730107 1317714 1712957 1920899 2133689 2444523
36324 2444523 2471336 1641658 200661 -604145 -4160 1073530 1120292 74810 -721327
36315 -721327 -442305 395339 1057192 1446394 1550308 1052961 38098 -680400 -526579
36306 -526579 30139 99767 -566704 -1444568 -1805634 -1259107 -149335 518370 88751 -785816
36296 -785816 -886470 -151482 222522 -455082 -1539301 -2312206 -2917108 -3409724 -3038226
36287 -3038226 -1465823 184015 654019 305902 406276 1137464 1522650 1077063 355230
36278 355230 -106304 -348951 -448851 -362347 -425738 -1132435 -2222795 -2770567 -2397876 -1716392
36268 -1716392 -1332651 -1069836 -483257 392836 1160936 1562456 1611658 1488561 1428732 1493577
36258 1493577 1447634 1122436 797373 854965 1173954 1299654 1106514 793375 322339 -528333
36248 -528333 -1529607 -2041527 -1857734 -1515949 -1581325 -2016369 -2395806 -2374434 -1836639 -948382
36238 -948382 -172516 83870 -78272 -194888 -12790 324163 522070 274001 -585855 -1628199
36228 -1628199 -1863174 -888090 254247 186686 -937619 -1587202 -926445 208282 660919
36219 660919 377914 12600 -164948 -382251 -830343 -1471408 -2099386 -2376867 -2149200 -1793972
36209 -1793972 -1799486 -2001068 -1851934 -1418131 -1262837 -1277222 -689623 433465 836457 -125369
36199 -125369 -1345272 -1465516 -668478 -27104 192582 489269 919685 1087036 1052601 1189229
36189 1189229 1275295 739622 -233722 -789410 -654420 -469629 -747860 -1245635 -1534441 -1551469
36179 -1551469 -1406790 -1178629 -1030023 -1068479 -1051264 -697455 -266545 -298459 -793463 -1201455
36169 -1201455 -1221182 -1048648 -856322 -654594 -676587 -1192142 -1826773 -1781746 -944606 -108023
36159 -108023 166512 217164 490006 789761 817555 842509 1204109 1578620 1402666 756778
36149 756778 217416 36838 81942 422405 1249239 2158320 2258030 1336558 374962 395257
36139 395257 1120943 1348313 516753 -713649 -1535354 -1971488 -2356036 -2386229 -1488614 -8950
36129 -8950 807924 320389 -628777 -753591 163790 1237556 1643423 1351124 867296 676150
36119 676150 891098 1194791 1182693 863627 580385 373141 -82710 -668784 -594924 490158
36109 490158 1720514 2057797 1672392 1464864 1579343 1393896 839970 641948 1082126
36100 1082126 1481707 1254933 745449 654846 1188328 2005783 2516800 2122631 772940
36091 772940 -618147 -980431 -418893 -16732 -243518 -478667 -315730 -249642 -576775 -686449
36081 -686449 -210216 59152 -641257 -1661033 -1815766 -1161660 -806497 -1226497 -1811666
36072 -1811666 -1978523 -1763285 -1276935 -470190 362775 589669 69327 -500435 -330280
36063 -330280 628288 1678199 1995692 1346925 450293 428385 1535222 2653511 2525070
36054 2525070 1292423 278661 353966 1098168 1565376 1308470 531924 -317567 -918790
36045 -918790 -1254771 -1488320 -1598153 -1365408 -877391 -636135 -831178 -971451 -714355 -523333
36035 -523333 -819690 -1029887 -438297 409297 328632 -610493 -1053532 -344794 659619 1066502
36025 1066502 1068892 1098809 936937 369155 -127529 -96718 168661 250188 294420 457496
36015 457496 369477 -132090 -423761 -59514 334221 23919 -582112 -682656 -543356 -982840
36005 -982840 -1732928 -1677008 -717177 -74874 -457777 -1114906 -1168948 -836063 -701890 -661812
35995 -661812 -344882 17470 -80561 -570129 -914170 -833868 -457511 24295 454412 701236
35985 701236 885087 1306964 1836349 1796043 910893 -56435 -218432 232602 436342 228635
35975 228635 245311 688747 877909 294280 -642508 -1227116 -1328776 -1192461 -899155 -535060
35965 -535060 -488872 -979231 -1526849 -1489995 -985896 -679949 -721229 -565423 11035 393406
35955 393406 8612 -758986 -1020513 -477457 392147 1049506 1315884 1168098 624558 -81315
35945 -81315 -614868 -947139 -1307103 -1628845 -1464365 -685323 118903 334937 165620 331064
35935 331064 1044882 1733500 1776610 1128375 158488 -709162 -1069648 -683888 144348 637621
35925 637621 346957 -292123 -539915 -337260 -301971 -774377 -1307026 -1267789 -643799 -13465
35915 -13465 118608 -244111 -732612 -1008169 -1004669 -854722 -626275 -227285 340548 764895
35905 764895 709426 291144 -16156 3377 102388 71294 67982 223267 284080 22888 -254002
35894 -254002 -50239 582799 1053507 926674 280368 -545310 -1188306 -1330489 -934001 -399633
35884 -399633 -136040 -51914 126051 209484 -163876 -689170 -622238 52613 524808 491947
35874 491947 679658 1518619 2206435 1900578 1116421 918991 1223357 1048458 229388 -323689
35864 -323689 -148290 87010 -280711 -998127 -1505204 -1696818 -1673422 -1396763 -1005379 -872341
35854 -872341 -945107 -621439 277156 1003344 882615 268602 -109214 -269129 -719358 -1397170
35844 -1397170 -1649903 -1202834 -508503 -106370 -100098 -249449 -183960 392600 1320370 1938265
35834 1938265 1840303 1497219 1607163 1998379 1853179 1020198 379778 680604 1609205 2327914
35824 2327914 2446376 2096697 1468432 747324 288136 376379 838119 1192864 1205075 1073795
35814 1073795 1071836 1184501 1172019 894977 497792 261746 307446 490104 570441 379832
35804 379832 -181599 -1084672 -1980606 -2325290 -1979719 -1524124 -1631655 -2212360 -2534091 -2149123
35794 -2149123 -1311852 -477249 154544 462005 239512 -456261 -1072239 -1030058 -352142 393342
35784 393342 692222 475035 17909 -357334 -508757 -530674 -620060 -878812 -1238842 -1490429
35774 -1490429 -1335541 -615068 315260 657752 1606 -1035838 -1443912 -1052196 -613117
35765 -613117 -618620 -669922 -284502 266844 395219 63766 -265349 -295000 -74415 274935
35755 274935 626868 822616 891113 1058961 1245357 920400 -91517 -1056345 -1175679 -663963
35745 -663963 -279967 -79353 443920 1082610 906076 -181716 -916001 -322527 911241
35736 911241 1488945 1309019 1275943 1666909 1765011 1190879 630797 791998 1275119 1085549
35726 1085549 -28820 -1307458 -1966382 -1963815 -1687351 -1331865 -917337 -645144 -739749 -945173
35716 -945173 -676753 131506 775668 703506 262722 49884 -61237 -487865 -819332 -189078
35706 -189078 1119213 1567188 425780 -990065 -977517 349900 1467152 1552878 1115053
35697 1115053 736379 332328 -247595 -841634 -1393543 -1922012 -1932201 -786224 1066234
35688 1066234 2203046 2038583 1576776 1742445 1930328 1161241 -95205 -470787 320556
35679 320556 1263343 1663905 1802189 1869469 1430464 368703 -569755 -760942 -576147 -721801
35669 -721801 -1220342 -1573214 -1534364 -1240744 -907526 -803427 -1169620 -1745914 -1770577 -947880
35659 -947880 -41218 81932 -339419 -409945 -1653 127763 -351729 -783020 -559065 8951
35649 8951 307659 349174 539587 885364 999032 730824 323190 32406 -3221 369641
35639 369641 1128961 1788993 1788443 1253793 918369 1101322 1209201 569898 -598939 -1490743
35629 -1490743 -1758643 -1770079 -1883851 -1984805 -1840630 -1478593 -1001254 -396647 197572 359721
35619 359721 -130822 -888753 -1364375 -1508013 -1584945 -1496759 -861758 198576 964473 1062139
35609 1062139 975413 1201521 1332369 603417 -807472 -1712117 -1303182 -113011 706073
35600 706073 701456 339464 127958 28897 -178995 -383449 -307620 -15037 103210 -152049
35590 -152049 -557332 -808043 -825221 -623815 -176846 373876 643549 464389 239305 482451
35580 482451 1131089 1673166 1819352 1603596 951292 -217242 -1393118 -1685121 -924477
35571 -924477 18321 422480 687836 1563634 2816685 3379447 2724499 1491967 681598
35562 681598 638334 939331 1012828 762366 639996 1032017 1611509 1653861 1073949 601564
35552 601564 628651 522617 -340396 -1459529 -1950690 -1934529 -2147946 -2443646 -1914288 -587893
35542 -587893 257363 -107781 -858377 -1040575 -1021585 -1631224 -2564673 -2686390 -1639822 -276112
35532 -276112 433295 243024 -518580 -1333859 -1741824 -1685590 -1575226 -1625050 -1354768 -320438
35522 -320438 850183 955387 -126181 -1044309 -638538 586658 1210661 761692 141457
35513 141457 231505 776932 980696 690548 394326 249790 -144252 -881597 -1369927 -1225040
35503 -1225040 -918568 -919689 -753157 197078 1321544 1350092 224090 -785752 -1030148
35494 -1030148 -1310951 -2269532 -3165881 -3101353 -2439432 -1980345 -1556590 -634033 327028 432230
35484 432230 -93310 -231187 127843 132865 -368764 -464561 258613 1001153 1059246 806678
35474 806678 836227 1037674 1138833 1368585 1891820 2201903 1769444 860729 123588 -264814
35464 -264814 -519879 -689738 -704729 -715867 -914208 -1190600 -1287191 -1072956 -489422 405745
35454 405745 1144398 1086382 252632 -560248 -800914 -748030 -727049 -426631 419603 1273808
35444 1273808 1453333 1115086 860853 760325 542964 409103 768623 1373868 1592200
35435 1592200 1446471 1526087 1891496 1940346 1443445 877476 581254 400881 378212 933513
35425 933513 1983688 2641215 2286020 1342763 546363 36396 -307487 -237442 440931 1200474
35415 1200474 1276943 660687 18108 -239920 -258087 -212882 -63582 162685 329841 477242
35405 477242 699999 716542 72261 -1044570 -1654769 -1004996 504830 1709267 1860397
35396 1860397 1193371 435030 36276 -75104 -186129 -396868 -522675 -332246 181737
35387 181737 800227 1296803 1584429 1669525 1577137 1380489 1243892 1344810 1704764 2096667
35377 2096667 2181547 1835524 1352017 1206795 1566407 2138796 2569488 2802900 2885328 2609665
35367 2609665 1707966 378959 -731668 -1195859 -1182794 -1062331 -934459 -760702 -664121
35358 -664121 -747878 -781533 -448505 136251 479972 277629 -346648 -1104408 -1709850 -1826065
35348 -1826065 -1287924 -465963 17797 82036 261363 798694 1164570 835692 87590 -476842
35338 -476842 -790637 -1097825 -1167902 -518424 615848 1295418 1040046 391043 110052 355671
35328 355671 878148 1460005 1795241 1425532 302146 -879058 -1372801 -1246394 -1162727
35319 -1162727 -1455126 -1815241 -1844018 -1564145 -1344224 -1514711 -2063272 -2590864 -2629010 -2097850
35309 -2097850 -1362617 -794039 -446538 -217496 -71776 -11167 -83333 -486255 -1297624 -2013622
35299 -2013622 -1890025 -1007641 -408456 -699749 -1090997 -510103 785780 1618875 1661496
35290 1661496 1744294 2321880 2700040 2236132 1425374 1089659 1099729 762177 169750 207703
35280 207703 1088679 1714147 1033394 -417830 -1048022 -234402 884451 960498 186582
35271 186582 -189692 220213 488290 -34827 -665513 -530323 12651 -2188 -544474 -618914
35261 -618914 195806 1154266 1396817 837439 -137038 -1126602 -1654838 -1319842 -336229 559467
35251 559467 946611 979805 762262 193556 -370583 -190186 667447 1044727 263768 -767630
35241 -767630 -862844 -338200 -419242 -1227515 -1561636 -719721 556515 1278481 1454350 1629961
35231 1629961 1845302 1678405 1007497 207855 -282550 -259885 246516 973224 1507144 1617963
35221 1617963 1467642 1338715 1256942 1064069 762210 541307 472807 406654 246487 137923
35211 137923 230747 365662 208525 -294585 -789902 -937114 -805776 -711969 -792847 -946354
35201 -946354 -1102262 -1287412 -1430331 -1379718 -1182776 -1083554 -1128580 -1021797 -550875 41094
35191 41094 334361 269250 190375 396272 817437 1159689 1264256 1258666 1315626 1291694 799977
35180 799977 -191937 -1033344 -1017131 -286180 278546 117670 -457834 -862612 -919057 -734810
35170 -734810 -367017 16262 -18656 -720449 -1705818 -2287088 -2099629 -1184239 246973 1747499
35160 1747499 2608234 2416647 1596291 975295 827296 695590 163375 -563567 -935230
35151 -935230 -683762 -92959 241980 -47379 -695811 -1015903 -601588 325486 1312252 2090537
35141 2090537 2435336 2036412 909938 -351192 -1164060 -1576850 -1922453 -2137965 -1927586
35132 -1927586 -1379642 -875484 -539871 -308634 -351430 -809247 -1268388 -1203029 -853248 -877158
35122 -877158 -1147178 -821831 195629 870155 592768 213206 736301 1661538 1619773 380041
35112 380041 -774972 -757438 61493 612658 541321 337498 358245 341953 8644 -322028
35102 -322028 -105555 620488 1264108 1507915 1594455 1627613 1191252 92950 -1044167 -1551897
35092 -1551897 -1642746 -1809861 -1705208 -658505 833529 1354389 544501 -296934 -67841
35083 -67841 686267 832437 277957 -282975 -565860 -747423 -804930 -676484 -742110 -1332774
35073 -1332774 -2020656 -2148233 -1809407 -1554370 -1377737 -832585 8695 551680 571677 326974
35063 326974 -109703 -749811 -982589 -38836 1619271 2412055 1624798 405519 171649
35054 171649 753167 896432 134268 -694087 -652234 243540 1240087 1664290 1409418 850180
35044 850180 393439 122619 -55042 -54752 244025 545688 350732 -229341 -426583 88416
35034 88416 587315 241275 -713034 -1330476 -1188945 -660801 -145927 312903 677121 782281
35024 782281 664496 543716 392951 -26334 -599215 -791285 -330974 427224 991516 1203158
35014 1203158 1051614 484599 -267863 -577133 -90457 686557 921172 462861 -72195
35005 -72195 -169587 28550 89721 -117527 -339698 -274331 97433 439323 368754 -51816
34995 -51816 -272373 74706 611311 659177 159214 -282783 -273453 -50633 127807 472718
34985 472718 1154736 1723132 1593215 946190 583946 851557 1180919 898338 157166 -217558
34975 -217558 295459 1304761 1889193 1498452 423546 -604116 -1159501 -1339167 -1342091
34966 -1342091 -1177162 -900297 -797288 -1021969 -1252589 -1050699 -459828 81303 361938
34957 361938 585324 897920 1045192 641421 -351888 -1485099 -2116478 -1936217 -1296625
34948 -1296625 -890954 -991078 -1208188 -1147904 -959335 -928015 -898275 -603157 -287567 -384969
34938 -384969 -735529 -787489 -493524 -296794 -245272 68084 555922 508263 -227142 -750461
34928 -750461 -358133 361413 356892 -397424 -928632 -551213 447688 1274728 1323247 511617
34918 511617 -666338 -1457022 -1456416 -870414 -147736 378029 464564 53886 -446233 -477936
34908 -477936 -163632 -288297 -1169280 -2121378 -2401666 -2082858 -1583207 -1002587 -445457 -300403
34898 -300403 -545818 -458661 245652 687842 121497 -741657 -769969 -154835 121388 43549
34888 43549 358541 938998 945661 572306 956491 2082214 2414250 1208843 -292366 -755738
34878 -755738 -502517 -410760 -292804 398959 1146839 1035701 390450 463111 1594751 2726365
34868 2726365 2811508 1941540 942376 412717 302930 129069 -440552 -1095684 -1166616 -496490
34858 -496490 330075 788907 970439 1093515 1036312 740745 538762 609856 623437 398917
34848 398917 357846 742142 971327 524801 -33005 220548 1145193 1725918 1482349 843908
34838 843908 252356 -257572 -619803 -704932 -775688 -1217833 -1749788 -1646770 -850909 -94247
34828 -94247 241371 575374 1137174 1330073 630147 -466495 -1015324 -783637 -281008 108743
34818 108743 446049 769775 844386 502517 -69654 -542928 -795129 -953359 -1160656 -1363203
34808 -1363203 -1320853 -853345 -133974 297378 -16653 -858210 -1328916 -760365 330534
34799 330534 630140 -334073 -1383424 -1102837 240981 1043305 577309 -144601 -31641
34790 -31641 589992 832005 736862 913258 1195828 790974 -360105 -1342917 -1481984 -1018755
34780 -1018755 -474734 -44012 218637 233181 130855 154183 175267 -189473 -854939 -1194780
34770 -1194780 -903457 -439988 -340098 -495604 -423481 42851 598900 799547 377333 -541655
34760 -541655 -1382351 -1502851 -825321 27715 343391 2516 -468764 -473483 707 311038
34750 311038 -71382 -740610 -732364 107340 692008 91734 -1141083 -1706905 -1250674 -534151
34740 -534151 -153005 24599 159127 68202 -244529 -397463 -201542 141866 542641 1117267
34730 1117267 1655700 1648707 1053242 413707 12694 -450198 -1069775 -1323692 -899069 -375524
34720 -375524 -537262 -1319049 -1897024 -1680903 -930120 -457564 -795254 -1558276 -1782221 -1115962
34710 -1115962 -348888 -299066 -612467 -441331 67957 58605 -425739 -392144 416015 1099309
34700 1099309 1198819 1360859 1856746 1825432 860856 94247 565985 1538396 1660457 976835
34690 976835 477785 343175 52798 -221817 183149 1001230 1191864 572360 89751 302333
34680 302333 648049 465979 -153087 -802046 -1301294 -1573353 -1571141 -1464056 -1389435 -1064450
34670 -1064450 -224708 686106 981161 792650 890189 1472510 1955011 1999280 1932512 2021951
34660 2021951 2100482 2056926 1982770 1734953 1104075 499229 627611 1345170 1717890 1457228
34650 1457228 1338988 1807945 2133121 1563696 507206 -175723 -406367 -643966 -905586
34641 -905586 -843053 -495224 -200068 83466 660030 1328683 1366411 453046 -790115 -1401422
34631 -1401422 -1058698 -354133 -144211 -646603 -1220463 -1125903 -390901 328424 672547 947262
34621 947262 1467371 1959128 1926366 1388992 945667 1131100 1859068 2505208 2515317 1932999
34611 1932999 1258558 821091 559714 471802 779102 1325741 1351445 469311 -550141 -722234
34601 -722234 -253938 -134554 -559268 -808385 -651678 -705323 -1161470 -1310360 -802326 -362766
34591 -362766 -625974 -1141510 -1249613 -1171477 -1433013 -1830668 -1805683 -1388585 -992216 -643754
34581 -643754 -170782 157253 -94695 -796428 -1385594 -1534310 -1220270 -479663 380385 722647
34571 722647 365596 53245 438327 958611 572981 -600282 -1304887 -826077 170976
34562 170976 649663 391592 -45844 -74536 431232 1072832 1264319 838137 226414 -165512
34552 -165512 -467618 -864325 -1005307 -509824 235784 526440 429282 643007 1307784 1774456
34542 1774456 1670029 1397535 1316919 1148315 595962 17439 -2949 553680 1124633 1163912
34532 1163912 591782 -146050 -403289 16541 521814 384776 -269095 -556890 4131
34523 4131 883590 1227020 754963 -176765 -1020103 -1355276 -1122241 -727519 -650596 -849975
34513 -849975 -870277 -569497 -305464 -295008 -264477 56035 514091 829999 909167 657579
34503 657579 -52453 -947250 -1351505 -1025397 -622737 -874189 -1626956 -2161526 -2190304 -2006538
34493 -2006538 -1816460 -1516496 -1123048 -859594 -682416 -211392 613905 1213298 1076384
34484 1076384 524495 286790 421408 246647 -488214 -982285 -467666 523241 808516
34475 808516 349474 369811 1400395 2272783 1821977 710099 405874 884788 735211
34466 735211 -539073 -1753484 -1909662 -1537587 -1526784 -1698233 -1425349 -886615 -716644
34457 -716644 -904040 -950453 -782293 -661015 -487207 -62361 195155 -257760 -988364 -988169
34447 -988169 -252892 67140 -598702 -1347046 -1199224 -536959 -345970 -659347 -735410 -471198
34437 -471198 -588123 -1364689 -2131087 -2323389 -2240628 -2293557 -2206645 -1638616 -1055509 -1114824
34427 -1114824 -1467024 -1158437 -221639 189712 -415373 -953409 -328462 880364 1234423
34418 1234423 467604 -320322 -307368 242218 853563 1507578 2096807 2064044 1143024 -56785
34408 -56785 -704601 -657683 -368110 -212857 -241132 -298717 -130896 369439 843158 765830
34398 765830 245332 30914 431000 746232 235242 -807271 -1498288 -1552559 -1397923 -1302736
34388 -1302736 -1038537 -435492 221465 475429 130060 -577727 -1046581 -721638 279818
34379 279818 1117799 1109933 502764 74453 196467 658972 1183306 1607963 1700948 1323422
34369 1323422 774037 510358 517831 391658 51495 -117592 51112 148487 -240953 -925056
34359 -925056 -1309107 -1045290 -324424 342741 541628 284802 -2327 67388 379431 411307
34349 411307 -193743 -1211589 -1969864 -1885978 -1014500 -94405 174334 -38084 71932 732068
34339 732068 1122776 516207 -578579 -1036403 -581040 97569 524144 887182 1235546
34330 1235546 1101928 325640 -404039 -367458 208420 494279 157425 -321594 -331830 219667
34320 219667 936143 1379395 1457072 1450536 1649631 1978441 2096868 1845476 1403542 1006080
34310 1006080 724638 564293 555270 684129 915690 1293112 1790528 2078252 1766012 982175
34300 982175 395434 466334 908289 1102227 869246 584001 584917 707161 510451 -86930
34290 -86930 -561625 -341076 443722 1060407 1122190 1051227 1321516 1640407 1393876 645268
34280 645268 56820 -97569 -187698 -455577 -648374 -601884 -578717 -734132 -778044 -531071
34270 -531071 -359898 -627444 -1056092 -1107342 -791155 -655014 -1029916 -1622628 -1877463 -1556746
34260 -1556746 -952358 -596550 -731894 -1077547 -1199382 -1005651 -694803 -377813 -74664
34251 -74664 65617 -25483 -25620 354199 731109 495899 -119748 -228467 304957 533704
34241 533704 -105784 -871692 -869015 -358117 -132421 -202096 -13574 403028 442702 -71449
34231 -71449 -698055 -1108485 -1295265 -1136748 -487674 292083 592344 416945 390702 820603
34221 820603 1313493 1426808 1183669 851579 686979 941621 1617953 2188047 2095545 1561274
34211 1561274 1288729 1346781 1100440 417573 76993 528023 1034050 742872 19179 -129232
34201 -129232 388432 659302 178517 -494943 -679001 -462258 -288752 -172200 158776 587891
34191 587891 617539 58764 -675668 -1090650 -1146820 -1105493 -1048554 -835069 -496405 -399000
34181 -399000 -864899 -1712027 -2296196 -2068500 -1120684 -141792 288059 360385 760441 1625023
34171 1625023 2145451 1596270 485745 75894 789338 1721750 1873607 1260939 551395
34162 551395 192488 288741 808734 1411797 1495168 948142 493100 710607 1072824 627222
34152 627222 -580680 -1506667 -1487069 -939234 -596993 -621972 -660275 -394586 111755 418100
34142 418100 120653 -512852 -586277 325863 1391665 1417300 355250 -728335 -1086791
34133 -1086791 -972156 -869618 -810921 -657755 -453646 -233236 72165 388131 565411 714431
34123 714431 980049 1027363 396609 -611224 -1145934 -1032717 -1009651 -1504705 -1947548 -1650480
34113 -1650480 -680174 509764 1631425 2378999 2429359 2087550 2194967 2839834 2898411
34104 2898411 1568076 -292343 -1181698 -824871 -169504 105221 155425 206063 79511
34095 79511 -417232 -1186333 -1961764 -2396274 -2196862 -1550917 -1167230 -1471457 -2027924 -2157951
34085 -2157951 -1761030 -1072655 -102514 1045152 1761209 1642064 1269350 1459310 2042714
34076 2042714 2272952 2136099 2192550 2297454 1713268 593910 103719 661150 1177211
34067 1177211 635693 -496500 -1127363 -1029831 -688317 -254315 464699 1273410 1629632
34058 1629632 1340891 680414 -81499 -781780 -1122124 -840902 -155668 353797 372901 117067
34048 117067 -15045 203117 802646 1648236 2363184 2421850 1555579 130093 -986459
34039 -986459 -1102486 -321158 612927 1120263 1259490 1318725 1259131 877341 281990 -219007
34029 -219007 -579228 -907283 -973869 -359621 814179 1771183 1880959 1256347 464164 -8037
34019 -8037 78264 656376 1282302 1442694 1106337 721607 604682 638475 600495 389147
34009 389147 -128183 -1016288 -1880941 -2061008 -1443472 -671786 -311277 -208865 72141 570423
33999 570423 955184 924517 389928 -401652 -845333 -565464 -124876 -481153 -1497303 -1800297
33989 -1800297 -631315 937869 1376762 633430 -204109 -654194 -1113380 -1602590 -1478286
33980 -1478286 -623556 69525 -155288 -985472 -1641942 -1812956 -1583280 -990871 -178407
33971 -178407 392734 405671 138646 11275 -100205 -591318 -1295469 -1507804 -965411 -311555
33961 -311555 -279709 -744625 -982552 -695777 -290821 -104974 138441 815217 1709525 2273874
33951 2273874 2392826 2416874 2492082 2352371 1875326 1393853 1219574 1156429 737992 -191365
33941 -191365 -1244826 -1740262 -1270509 -297602 -21363 -1146448 -2806386 -3333539 -2221102
33932 -2221102 -673316 3326 -179102 -464324 -586618 -776764 -1096559 -1491861 -2105624
33923 -2105624 -2845663 -3024020 -2192874 -1042293 -650649 -1032573 -1255180 -874805 -380005
33914 -380005 -191647 -109230 52150 55205 -223542 -477809 -501638 -514455 -682837 -802735
33904 -802735 -731876 -681711 -775194 -713057 -215453 495893 962947 1048546 1002174 1091997 1297859
33893 1297859 1296732 775967 -135759 -906976 -1250363 -1444670 -1695694 -1583771 -747272 208761
33883 208761 312111 -366919 -769596 -384617 120478 18974 -505840 -815120 -563740 277974
33873 277974 1471575 2296897 2010972 886077 112785 297264 750733 659014 166818
33864 166818 -233180 -587742 -1038356 -1166944 -605923 204322 647118 854554 1217937 1446683
33854 1446683 1032176 320176 152711 580219 814312 409812 -306669 -939680 -1353169
33845 -1353169 -1298309 -551452 421879 683750 -37514 -987867 -1360785 -1113919 -655950 -262700
33835 -262700 -61265 -158460 -489079 -794495 -934324 -1033148 -1259946 -1641154 -2045887 -2161171
33825 -2161171 -1651863 -646692 141188 173904 -224147 -375969 -226460 -271495 -700678 -1221144
33815 -1221144 -1616261 -1852641 -1730864 -1108027 -420432 -285885 -592262 -669676 -316803 127149
33805 127149 658553 1553697 2334299 1923025 240514 -1382069 -1928067 -1870379 -1995284
33796 -1995284 -2063275 -1557845 -920637 -894259 -1164194 -815977 146836 845446 935253 890661
33786 890661 892714 530023 -170856 -435415 79317 600881 319897 -425611 -667773 -139077
33776 -139077 532358 774714 640493 424573 219059 32308 -1821 155324 179880 -295757
33766 -295757 -1068952 -1440634 -1108314 -635380 -630602 -763188 -259447 723485 1108768 542932
33756 542932 89151 598080 1176188 364915 -1536316 -2580867 -1709692 -38019 818562
33747 818562 733265 678670 1065856 1397685 1271216 843619 315090 -317867 -878948 -1035107
33737 -1035107 -926658 -1162634 -1818943 -2017039 -1100249 194666 554629 -85993 -487320
33728 -487320 -17900 411746 -78241 -763868 -382346 771378 1135321 214949 -713152
33719 -713152 -611319 -162479 -460870 -1183739 -1147670 -155929 809612 1040932 756144 310785
33709 310785 -327992 -1118427 -1675408 -1743170 -1427900 -790785 260065 1468998 2158938
33700 2158938 1984709 1383962 999724 994706 1199441 1563667 2046798 2265273 1711495 413527
33690 413527 -851669 -1188915 -491759 343679 321382 -463397 -846898 -63533 1170059
33681 1170059 1532143 791110 -58021 -266347 -158308 -350150 -909612 -1610403 -2317389
33672 -2317389 -2670067 -2041218 -445769 990931 1185269 431472 -82754 107857 316705
33663 316705 -159894 -1151537 -1981157 -2210219 -1856998 -1262015 -882590 -928221 -1122731 -1086401
33653 -1086401 -919737 -1030490 -1380352 -1394216 -800027 -121019 -8090 -370094 -535881 -153382
33643 -153382 410028 585158 296431 31011 256734 838637 1123354 664227 -238734 -868298
33633 -868298 -870818 -487204 -64092 335172 742078 1019813 1017131 815327 617584 505481
33623 505481 469374 547234 728428 828755 722042 667218 1113976 2068527 2859190 2738397
33613 2738397 1672851 390786 -351713 -424400 -225902 -112215 -103321 -101756 -146182 -303837
33603 -303837 -453588 -380236 -59592 314951 594524 812478 1037837 1241043 1351281 1300391
33593 1300391 949354 152236 -948224 -1801325 -1837141 -1011714 118838 869519 936085
33584 936085 526266 122624 96087 421181 740305 772153 626441 616289 819040 1014476
33574 1014476 1058733 1067953 1125183 1070521 819743 674365 946134 1364387 1299968 648737
33564 648737 50511 24214 306571 386737 301711 381909 487357 177127 -434107 -725352
33554 -725352 -596100 -697347 -1333214 -1883638 -1848858 -1756390 -2219907 -2640009 -1915305 -246597
33544 -246597 905625 782126 170505 -31128 -37032 -361245 -725345 -648991 -450622 -684913
33534 -684913 -1043370 -823092 -178339 160682 246090 817675 1781673 2001389 1009640 -130977
33524 -130977 -282468 312704 696391 573594 287938 45922 -38494 359521 1201676 1631421
33514 1631421 960909 -206664 -698579 -325344 182579 493124 867967 1202749 1054339
33505 1054339 684881 900977 1643351 1914274 1441346 1183923 1656661 1999507 1496737
33496 1496737 835202 821370 911891 304896 -367044 48673 1142381 1363239 326983
33487 326983 -831615 -1425591 -1992875 -2823531 -3202898 -2740344 -2200734 -2227867 -2256820 -1557222
33477 -1557222 -525466 258 96614 472905 1222113 1736590 1665723 1224390 698522 294522
33467 294522 366725 1175068 2406366 3368590 3621164 3120189 2000741 681735 -46300
33458 -46300 351042 1445650 2235632 2238640 1805187 1410755 1124904 860718 730523 936595
33448 936595 1465081 1972315 1948165 1146339 -23005 -768863 -800057 -654271 -875622 -1226845
33438 -1226845 -1174549 -837253 -818196 -1236720 -1594245 -1617056 -1583059 -1660650 -1524165 -936587
33428 -936587 -276174 -111943 -492054 -945993 -1054852 -805556 -458772 -219146 -45689 220486
33418 220486 551860 691659 483610 45939 -500080 -1180974 -1835981 -2012725 -1594730 -1177559
33408 -1177559 -1281356 -1494968 -1081000 -208408 253237 130427 224574 990588 1783467 1808383
33398 1808383 1121287 258973 -473286 -847636 -479487 575169 1408128 1142481 20864
33389 20864 -933814 -1127039 -737834 -104561 575091 995310 838742 264697 -147012 -86957
33379 -86957 192444 390498 613869 1093134 1662314 1815519 1312704 569487 279576 620710
33369 620710 1022685 902841 434360 209417 259468 -5514 -764537 -1337425 -1161100 -677296
33359 -677296 -665361 -1047381 -1044255 -392727 269026 320968 -72286 -323369 -189730 50067
33349 50067 533 -413430 -814336 -657401 218533 1320479 1903169 1638410 826952 57546
33339 57546 -226583 35795 519865 793247 715221 504228 398034 428248 541343 654073
33329 654073 553987 142893 -153862 206447 855212 622570 -805210 -2052432 -1701682
33320 -1701682 -240031 652622 423257 84427 400305 889496 933610 735931 608004
33311 608004 246229 -546326 -1135231 -862987 -101586 273323 121400 16820 224918 428400
33301 428400 392560 266117 209496 233110 391716 662892 673682 89143 -681862 -730249
33291 -730249 208251 1310972 1634383 1159413 573183 304252 168257 -135799 -545081
33282 -545081 -726764 -460365 157555 791763 1086401 868885 235435 -514777 -1045525 -1164490
33272 -1164490 -935192 -632741 -519843 -585501 -500123 90047 1140230 2099695 2353247 1846546
33262 1846546 1188882 1023116 1339907 1540524 1152346 328061 -388325 -627915 -431258
33253 -431258 -43868 333182 567914 538611 225801 -142115 -228536 -2092 148738 -60110
33243 -60110 -301437 -20764 688047 1052945 629789 -118205 -539060 -647626 -825950 -1054195
33233 -1054195 -1032424 -838633 -819283 -907632 -679612 -95925 417028 690676 1014105 1475372
33223 1475372 1695243 1446794 1029782 785577 697132 688421 853490 1149929 1308554 1260871
33213 1260871 1197727 1034299 379534 -740180 -1750030 -2379555 -2923542 -3313145 -2831195
33204 -2831195 -1393963 -230346 -340377 -978770 -783660 127271 484858 -3622 -287708
33195 -287708 202439 770498 880302 1081284 1813243 2335383 1781106 604638 20974
33186 20974 363671 841963 752830 194616 -377501 -658491 -487137 130922 837045 1163867
33176 1163867 1152610 1392047 2189520 2962679 2843473 1837782 954297 968132 1406054 1211070
33166 1211070 246944 -493841 -305457 270061 307594 -220972 -634833 -635972 -507886 -412849
33156 -412849 -200018 117277 311650 377151 481678 547730 440201 440063 851638 1265714
33146 1265714 1032397 403328 252184 624608 661924 161760 -25737 387060 430279 -392804
33136 -392804 -910083 14382 1531194 1930321 1089076 390563 581882 1143724 1648395
33127 1648395 2302592 2963157 2884186 1839707 540299 -389344 -1003594 -1398936 -1404913 -1181035
33117 -1181035 -1197462 -1309482 -821964 134855 374270 -556858 -1384332 -826114 497594
33108 497594 950895 143535 -820598 -1083351 -911806 -829843 -831800 -687131 -348993 151125
33098 151125 709361 946131 492807 -429344 -1183471 -1508962 -1620921 -1497808 -767638 431427
33088 431427 1148764 707962 -322242 -811712 -490017 -123224 -357574 -954490 -1309304
33079 -1309304 -1279817 -1194493 -1259239 -1273724 -921464 -155843 730295 1329163 1423192 1149589
33069 1149589 840934 643836 401773 60898 18160 678035 1672267 2053243 1532850 1020925
33059 1020925 1416663 2266774 2372607 1546617 865132 1061730 1584967 1648640 1377892 1258781
33049 1258781 1128095 577115 -48127 16798 755949 1361173 1423192 1346914 1468009 1505210
33039 1505210 1147979 574088 87185 -258056 -411006 -191412 328361 754152 927938
33030 927938 1097205 1314029 1234363 829062 662739 988161 1174824 671502 -13004 -81534
33020 -81534 235280 71149 -625715 -1071228 -1026695 -1099771 -1448154 -1281747 -211683 805630
33010 805630 644192 -480953 -1463240 -1807559 -1841728 -1725646 -1200576 -360903 146999 -43443
33000 -43443 -550774 -840588 -813060 -580679 -151809 324770 398809 -143292 -766555 -640879
32990 -640879 372611 1424403 1430946 102381 -1702842 -2660683 -2206819 -1095078 -513791
32981 -513791 -722034 -1017022 -1057623 -1444795 -2525015 -3338817 -2669719 -828610 587596
32972 587596 716250 288484 294848 704911 941569 853550 619616 254000 -187930 -377282
32962 -377282 -278232 -495248 -1398792 -2326979 -2410936 -1833080 -1412089 -1240737 -762318 -76606
32952 -76606 -9105 -701853 -1235401 -1037957 -671067 -704928 -762026 -351134 196937 435211
32942 435211 717302 1487792 2229429 2123514 1373900 869492 792008 571126 65239 -267498
32932 -267498 -382050 -796423 -1542474 -1880570 -1356845 -410545 319711 637605 586488 306316
32922 306316 208419 526637 617871 -355207 -1899532 -2477391 -1663372 -772169 -736890 -711263
32912 -711263 211207 1164095 857346 -153217 -238089 770947 1556349 1616360 1775579 2230444
32902 2230444 1908652 435363 -810742 -566896 569064 1286225 1469607 1802687 2193303
32893 2193303 1901040 940552 201459 186076 521876 743563 766885 535385 -42612 -650267
$$ [...]
##END NTUPLES=NMR SPECTRUM
##END=
