##TITLE=31Pdec_BAU-j-MN
 CDCl3, 24 sc
 3.7.2019
##JCAMPDX= 6.0         $$ Bruker NMR JCAMP-DX V2.0
##DATA TYPE= NMR SPECTRUM
##DATA CLASS= NTUPLES
##ORIGIN= UXNMR, Bruker Analytische Messtechnik GmbH
##OWNER= root
$$ XWIN-NMR		Version 3.5
$$ Wed Jul  3 15:59:46 2019 Russian Standard Time (UT+4h)  she@DPX200
##.OBSERVE FREQUENCY= 81.013821
##.OBSERVE NUCLEUS= ^31P
##.ACQUISITION MODE= SIMULTANEOUS
##.ACQUISITION SCHEME= undefined
##.AVERAGES= 24
##.DIGITISER RES= 17
##SPECTROMETER/DATA SYSTEM= spect
##.PULSE SEQUENCE= zgpg30
##.SOLVENT NAME= CDCl3
##.SHIFT REFERENCE= (INTERNAL, CDCl3, 0, 182.463)
##AUDIT TRAIL= $$ (NUMBER, WHEN, WHO, WHERE, WHAT)
$$ ##TITLE= Audit trail, XWIN-NMR		Version 3.5
$$ ##JCAMPDX= 5.01
$$ ##ORIGIN= Bruker BioSpin GmbH
$$ ##OWNER= she
$$ F:/spectra/data/she/nmr/P31/1/pdata/1/auditp.txt
$$ ##AUDIT TRAIL=  $$ (NUMBER, WHEN, WHO, WHERE, WHAT)
(   1,<2019-07-03 15:58:29.18 +0400>,<she>,<DPX200>,
      <created by zg, POWCHK disabled, PULCHK disabled
       configuration hash MD5:
       00 E9 B6 7A A2 85 ED C7 34 08 36 98 17 FE 4E 26
       data hash MD5: 32K
       CB F0 B9 5F 27 BE D3 53 1D C8 10 86 08 CD 5E B4>)
(   2,<2019-07-03 15:58:34.96 +0400>,<she>,<DPX200>,
      <Start of raw data processing
       efp BC_mod = 2 LB = 1 FT_mod = 6 PKNL = 1 PHC0 = -2578.491 PHC1 = 112.3988 SI = 64K 
       data hash MD5: 64K
       AC 4D 69 29 5E 7A B9 90 DE 6D 81 02 16 3B 3D 49>)
(   3,<2019-07-03 15:58:57.93 +0400>,<she>,<DPX200>,
      <pk PHC0 = 93.90131 PHC1 = -153.8 
       data hash MD5: 64K
       30 4F A1 35 66 B1 48 09 C0 AD D0 1B 05 91 71 E2>)
$$ ##END=
$$ 
$$ hash MD5
$$ D3 5D 09 AA 24 B6 D5 FB 6C 79 F9 D7 A7 4C 57 27
##$RELAX= 
##$RELAX= 
##$RELAX= 
##$RELAX= 
##$RELAX= 
##$RELAX= 
##$RELAX= 
##$RELAX= 
$$ Bruker specific parameters
$$ --------------------------
##$DU= <F:/spectra>
##$EXPNO= 1
##$NAME= <P31>
##$PROCNO= 1
##$TYPE= <nmr>
##$USER= <she>
##$AMP= (0..31)
100 100 100 100 100 100 100 100 100 100 100 100 100 100 100 100 100 100 
100 100 100 100 100 100 100 100 100 100 100 100 100 100 
##$AQSEQ= 0
##$AQ_mod= 1
##$AUNM= <au_zg>
##$AUTOPOS= <>
##$BF1= 81.014009
##$BF2= 200.13
##$BF3= 200.13
##$BF4= 200.13
##$BF5= 200.13
##$BF6= 200.13
##$BF7= 200.13
##$BF8= 200.13
##$BYTORDA= 1
##$CFDGTYP= 0
##$CFRGTYP= 5
##$CHEMSTR= <none>
##$CNST= (0..31)
1 1 145 1 1 1 1 1 1 1 1 1 1 1 1 1 1 1 1 1 1 1 1 1 1 1 1 1 1 1 1 1 
##$CPDPRG= <waltz16>
##$CPDPRG1= <>
##$CPDPRG2= <waltz16>
##$CPDPRG3= <>
##$CPDPRG4= <mlev>
##$CPDPRG5= <mlev>
##$CPDPRG6= <mlev>
##$CPDPRG7= <mlev>
##$CPDPRG8= <mlev>
##$CPDPRGB= <>
##$CPDPRGT= <>
##$D= (0..31)
0 1 0 0 0 0 0 0 0 0 0 0.03 2e-05 3e-06 0 0 0 0 0 0 0 0 0 0 0 0 0 0 0 0 
0 0 
##$DATE= 1562155108
##$DBL= (0..7)
120 120 120 11 120 120 24 19 
##$DBP= (0..7)
150 150 150 150 150 150 150 150 
##$DBP07= 0
##$DBPNAM0= <>
##$DBPNAM1= <>
##$DBPNAM2= <>
##$DBPNAM3= <>
##$DBPNAM4= <>
##$DBPNAM5= <>
##$DBPNAM6= <>
##$DBPNAM7= <>
##$DBPOAL= (0..7)
0.5 0.5 0.5 0.5 0.5 0.5 0.5 0.5 
##$DBPOFFS= (0..7)
$$ [...]
##$SUBNAM2= <"">
##$SUBNAM3= <"">
##$SUBNAM4= <"">
##$SUBNAM5= <"">
##$SUBNAM6= <"">
##$SUBNAM7= <"">
##$SUBNAM8= <"">
##$SUBNAM9= <"">
##$SW= 369.568048894756
##$SWIBOX= (0..15)
0 1 3 0 0 0 0 0 0 0 0 0 0 0 0 0 
##$SW_h= 29940.119760479
##$TD= 32768
##$TD0= 1
##$TE= 0
##$TE2= 300
##$TE3= 300
##$TEG= 300
##$TL= (0..7)
0 120 53 12 22 120 120 120 
##$TP= (0..7)
150 150 150 150 150 150 150 150 
##$TP07= 0
##$TPNAME0= <>
##$TPNAME1= <>
##$TPNAME2= <>
##$TPNAME3= <>
##$TPNAME4= <>
##$TPNAME5= <>
##$TPNAME6= <>
##$TPNAME7= <>
##$TPOAL= (0..7)
0.5 0.5 0.5 0.5 0.5 0.5 0.5 0.5 
##$TPOFFS= (0..7)
0 0 0 0 0 0 0 0 
##$TUNHIN= 0
##$TUNHOUT= 0
##$TUNXOUT= 0
##$USERA1= <user>
##$USERA2= <user>
##$USERA3= <user>
##$USERA4= <user>
##$USERA5= <user>
##$V9= 5
##$VALIST= <valist>
##$VCLIST= <CCCCCCCCCCCCCCC>
##$VD= 0
##$VDLIST= <DDDDDDDDDDDDDDD>
##$VPLIST= <PPPPPPPPPPPPPPP>
##$VTLIST= <TTTTTTTTTTTTTTT>
##$WBST= 1024
##$WBSW= 4
##$XGAIN= (0..3)
0 0 0 0 
##$XL= 0
##$YL= 0
##$YMAX_a= 50050
##$YMIN_a= -53057
##$ZGOPTNS= <>
##$ZL1= 120
##$ZL2= 120
##$ZL3= 120
##$ZL4= 120
##$ABSF1= 0
##$ABSF2= 0
##$ABSG= 0
##$ABSL= 0
##$ALPHA= 0
##$AQORDER= 0
##$ASSFAC= 0
##$ASSFACI= 0
##$ASSFACX= 0
##$ASSWID= 0
##$AUNMP= <proc_1d>
##$AZFE= 0.1
##$AZFW= 0.5
##$BCFW= 0
##$BC_mod= 2
##$BYTORDP= 0
##$COROFFS= 0
##$CY= -3
##$DATMOD= 1
##$DC= 0
##$DFILT= <>
##$DTYPP= 0
##$F1P= 0
##$F2P= 0
##$FCOR= 1
##$FTSIZE= 65536
##$FT_mod= 6
##$GAMMA= 0
##$GB= 0
##$INTBC= 1
##$INTSCL= 5.30512e-09
##$ISEN= 30
##$LB= 1
##$LEV0= 0
##$LPBIN= 0
##$MAXI= 10000
##$MC2= 0
##$MEAN= 0
##$ME_mod= 0
##$MI= 50
##$NCOEF= 0
##$NC_proc= -4
##$NLEV= 6
##$NOISF1= 182.463
##$NOISF2= 159.3651
##$NSP= 0
##$NTH_PI= 0
##$NZP= 0
##$OFFSET= 182.463
##$PC= 4
##$PHC0= -2484.59
##$PHC1= -41.4012
##$PH_mod= 1
##$PKNL= yes
##$PPARMOD= 0
##$PSCAL= 0
##$PSIGN= 0
##$REVERSE= no
##$SF= 81.0140089999434
##$SI= 65536
##$SIGF1= 159.3651
##$SIGF2= -187.1042
##$SINO= 113.3802
##$SIOLD= 16384
##$SREGLST= <1H.CDCl3>
##$SSB= 0
##$STSI= 65536
##$STSR= 0
##$SW_p= 29940.119760479
##$SYMM= 0
##$S_DEV= 0
##$TDeff= 32768
##$TDoff= 0
##$TI= <>
##$TILT= no
##$TM1= 0
##$TM2= 0
##$TOPLEV= 0
##$USERP1= <user>
##$USERP2= <user>
##$USERP3= <user>
##$USERP4= <user>
##$USERP5= <user>
##$WDW= 1
##$XDIM= 65536
##$YMAX_p= 393087226
##$YMIN_p= -14973975
$$ End of Bruker specific parameters
$$ ---------------------------------
##NTUPLES= NMR SPECTRUM
##VAR_NAME=  FREQUENCY,     SPECTRUM/REAL,   SPECTRUM/IMAG
##SYMBOL=    X,             R,               I
##VAR_TYPE=  INDEPENDENT,   DEPENDENT,       DEPENDENT
##VAR_FORM=  AFFN,          ASDF,            ASDF
##VAR_DIM=   65536,         65536,           65536
##UNITS=     HZ,            ARBITRARY UNITS, ARBITRARY UNITS
##FACTOR=    0.456856943014862, 1,           1
##FIRST=     14782.0589164792, 0,            0
##LAST=      -15158.0608439998, 0,           0
##MIN=       -15158.0608439998, -14973975,   0
##MAX=       14782.0589164792, 393087226,    0
$$ Real data points
##PAGE= N=1
##DATA TABLE= (X++(R..R)), XYDATA
$$ [...]
39666c95306k94536m08539k3102L65026K41373r9694j8539L80392M00068m4865
39656A02278k57861K6053J63870k43986n72821j90588M22057L74412k48035n45901
39646i70522j52638L69226M59735K13901m060o7735l5778M4690J23693J52554
39636A33066J62464J85893J47904O668j00547n0995M9465N9172N3849J40368J80730
39625I68037n067k89075l90260k88544k05396k41663k77253j74269Q5324L59719
39615d58447L63191k8525m02425j63619N28890P42981J01195m89501j22161O30966
39605G02545M85510n87925j261253p61028J67954N17576L18088J83678K66712
39596C1857K73731Q9552j42278k98988k86911l7915K51018K08765j41040k93429
$$ y = [-395306, -689842, -1098381, -1121483, -756457, -515084, -614778, -633317, -252925, 147143, 102278, -155583, -129530, 34340, -209646, -782467, -973055, -550998, -176586, -424621, -970522, -1123160, -753934, -294199, -80298, -84358, -152093, -187871, -143181, -19488, 133066, 295530, 481423, 629327, 635995, 535448, 484453, 533918, 593090, 646939, 787307, 968037, 962970, 673895, 283635, -4909, -210305, -451968, -729221, -903490, -818166, -458447, -95256, -123781, -526206, -689825, -160935, 582046, 683241, 193740, 71579, 702545, 1188055, 600130, -661123, -1422151, -1254197, -736621, -418533, -234855, 31857, 305588, 395140, 252862, -46126, -333037, -370952, -119934, 88831, -52209, -345638]
39586c45638j7197K38597N2895k78786k31858J10631K44009N7263p2012P5155
39576a66941K79161K67327L6287k37590l64087k33315N2386K02448Q0987q4946
39566a68283m5225P8161J2897j74843j59707J05935K78430J18614j71047k33170
39556c58238O5K83308L73226K37026j7230k87727m84637m62291j22651L46443
39546d92706N22114K23620j95429k74089m6586R5481M8709Q0433K54520K60319
39536D76386k2507k37829r9258J51346J49682l0877p4424M7674R4317l5421k08221
39525B10868k83789k19745m8057R9640Q0784l4972k9481R5137J03153j4803M0746
39514e19L07993L56147l7425m30580l49038j743J04729n4627j41880r7011j28503
$$ y = [-345638, -362835, -124238, -71343, -350129, -581987, -471356, -227347, -170084, -242096, -166941, 112220, 379547, 415834, 178244, -185843, -419158, -366772, -164324, -83337, -168283, -213508, -135347, -122450, -297293, -457000, -351065, -72635, 45979, -125068, -358238, -358173, -74865, 298361, 535387, 518157, 230430, -254207, -716498, -839149, -492706, 29408, 253028, 57599, -216490, -263076, -167595, -118886, -38453, 216067, 476386, 453879, 216050, 116792, 268138, 417820, 386943, 312519, 360193, 454510, 419089, 210868, -72921, -292666, -340723, -241083, -160299, -195271, -224752, -129615, -26462, -41265, -519, 307474, 663621, 626196, 195616, -153422, -155165, -50436, -105063, -246943, -343954, -472457]
39503d72457k43473k78462k43060j99132j4619L13535L83674j7846l60961p7715
39493a210516M54276M30060p3062k21174J78760L94357M6378k95258j52013R6601
39483c51591j2402k14611o8016K52686L06885J10691l0143o2073p7001J2938K33954
39472A01317K84543l5142l94104l70492p9853O5842M680j0191Q1776J08945L0592
39461b12087l3889o3004j14647j32201k7529J29940K03747J51168l1557l12587
39451d42646m65309k30114K08126L10633j5965j84355J62894N12607K57962l24610
39441b10777n08152k12955R679q8154k06434j29480L986Q1667J66235K41736K21440
39430f31209J71318J66734P1174j52622j62148K25795N05464J56783l98442l31727
$$ y = [-472457, -715930, -994392, -1237452, -1436584, -1451203, -1137668, -753994, -771840, -1132801, -1210516, -756240, -326180, -399242, -620416, -441656, -47299, -921, -296179, -448192, -351591, -363993, -578604, -646620, -393934, -87049, 23642, -6501, -68574, -145575, -132637, 101317, 385860, 350718, -43386, -413878, -493731, -427889, -423209, -433400, -351624, -242679, -212087, -245976, -308980, -423627, -555828, -583357, -453417, -249670, -98502, -130059, -442646, -907955, -1138069, -929943, -619310, -635275, -819630, -656736, -144129, 113833, -210777, -718929, -931884, -922205, -1010359, -1216793, -1346273, -1342287, -1260620, -1094385, -852649, -631209, -459891, -293157, -221983, -374605, -536753, -310958, 194506, 351289, -47153, -378880]
39420c78880K36105L57871k04256n57900r2735N90984O46093J40911k86865l68876
39410H2452k57882q2677N3323k8481k83561l61647j24442J17607J36379J07272
39400f41657J42905L6978k12751k17092P8183J21086k92808m77511O7653O91701
39390g03313N46527l1011p9995M11975N75174J34393k66433k51322j96196l32805
39380a93006l06340M8401K91024J19582j32867j12413L0455O3206N7671L5274
39370i9013k06791n78461n85764j20125K20652M2663j91673M5193M52469M49331
39360e71519J56392Q4973J80561j1309l97093l85328J00892M27957K27102r5456
39350b82828p4613J43558J72085l307j31912j25126o0139L1975J12934M5865j94623
$$ y = [-378880, -142775, 215096, 10840, -547060, -639795, -48811, 597282, 738193, 451328, 82452, -175430, -258107, -204784, -233265, -516826, -878473, -1002915, -885308, -748929, -641657, -498752, -461774, -674525, -891617, -813434, -692348, -985156, -1462667, -1395014, -703313, -156786, -187797, -267792, 144183, 719357, 853750, 587317, 335995, 139799, -193006, -499346, -450945, -159921, -40339, -173206, -285619, -255164, -191958, -134287, -99013, -305804, -884265, -1470029, -1590154, -1369502, -1326839, -1518512, -1473319, -1020850, -571519, -415127, -330154, -149593, -160902, -557995, -943323, -842431, -414474, -187372, -282828, -357441, -213883, -41798, -45105, -177017, -302143, -362282, -330307, -217373, -171508, -366131]
39339c66131l59463k10490J25239L04477K12884N8072L4111Q0269K5481j45994
39329b41545k56895j42665J42540L44318K55942n1133k85765k49483m9837M8638
39319d85885l3280q3781J03951L95121M20059N4122l68295m50600k18937k0021
39309f87546l0749j21373j57635j34239Q01L04441N47503L65284j27322l00827
39299c41662J03451M72674J72287m41683m81519J56919O25769L35959l01703n80700
39289b80208m09891j63374j8464J13073K02496Q9265j73909k79389m1764L51521
39279f10644N35692L48526j4414k09392j03556J13010J97503J35201N5856j088
39269D46694o0140o2662J9425J5597k19065m86471m76239k54650j39832j24233
$$ y = [-366131, -725594, -936084, -810845, -506368, -293484, -235412, -201301, -121032, -95551, -241545, -498440, -641105, -498565, -154247, 101695, 50562, -235203, -484686, -534523, -485885, -519165, -602946, -498995, -103874, 316185, 370307, 2012, -448588, -667525, -687546, -718295, -839668, -997303, -1131542, -1130741, -826300, -278797, 86487, -40835, -341662, -238211, 234463, 406750, -34933, -516452, -359533, 266236, 602195, 300492, -280208, -690099, -853473, -871937, -758864, -556368, -467103, -641012, -920401, -962165, -610644, -74952, 273574, 259160, 49768, -53788, 59222, 256725, 391926, 447782, 446694, 386554, 323892, 343317, 358914, 139849, -346622, -822861, -1077511, -1217343, -1341576]
39259a341576J00632M91403N74200K12053r3804J2277J64605q0395m63996m31589
39249h56190r461L00563L08435K54363K59345K09250J35320J82323K09480n6706
39239I36722m52290m96654j61151L4358j48191k90012l9267K95319K53920o8310
39229a35556k55829k26027k01557k20315j22493O0452J21317P3122J54209L82386
39219c70291M41513J47473k30374k96166k3437K47669K30617l3298k89157l37584
39209e13035j76951M3851J73757J80022J34078Q2185j9736j80886k37398l708
39199e17821L84735M79640O9945m15510l62403K02876O02205M03196n6282k43833
39189E46748j52742j05911j56302j38289j13124k51723l69256j15138L62627M84265
$$ y = [-1341576, -1240944, -749541, -175341, 36712, -57092, -44815, 119790, 39395, -424601, -856190, -865651, -565088, -256653, -2290, 257055, 466305, 601625, 783948, 993428, 936722, 484432, -12222, -173373, -139015, -287206, -577218, -616485, -321166, -67246, -135556, -391385, -617412, -818969, -1039284, -1161777, -1101325, -980008, -906886, -752677, -370291, 71222, 218695, -11679, -307845, -331282, -83613, 147004, 113706, -175451, -513035, -689986, -646135, -472378, -292356, -158278, -76093, -95829, -276715, -514113, -517821, -133086, 346554, 416499, 989, -361414, -158538, 443667, 846863, 790581, 546748, 394006, 288095, 131793, -6496, -119620, -371343, -740599, -855737, -493110, -8845]
39179h845Q6131l04306k37504P5976K08080J19311R064q0510j61694j00148J20687
39168b73758J88614j03871m28525l29552R1155L15043J48748q4651q3327P9785
39158d80339J91749J78508P0057p7647j57870q9629M3259P1187m7796k09538k89918
39147g97977j67214K28333O86385P29283J77096m35002m04974K11645O41901L93337
39137A262813k05899n66561n20584k51185P8371L35101L31484N2681j96601j55719
39127A63901O259n8111l27759m15608j27546K40482K73490m1516l04815j92518
39117g83741J47399K70198m020l36752k92763Q6327L33624J60945k18319m20225
39107a057327l20466m9081K35960M03704L34905N5058j87021j46803J25105L31460
$$ y = [-8845, 77286, -227020, -464524, -388548, -180468, -61157, -52093, -132603, -294297, -394445, -273758, -85144, -189015, -617540, -947092, -855937, -540894, -392146, -476797, -560124, -480339, -288590, -110082, -40025, -117672, -275542, -365171, -321912, -250725, -298521, -508059, -797977, -965191, -736858, -50473, 678810, 855906, 420904, 15930, 227575, 869476, 1262813, 1056914, 490353, -30231, -281416, -203045, 132056, 463540, 516221, 319620, 163901, 170160, 112049, -215710, -631318, -758864, -518382, -244892, -286408, -591223, -783741, -636342, -366144, -370164, -706916, -999679, -913352, -579728, -418783, -637102, -1057327, -1377793, -1426874, -1190914, -787210, -452305, -397247, -584268, -731071, -605966, -274506]
39097b74506K54757l3021k59171k09759N2157K15900N5480k67540l69046j29647
39087i64396J58294J90035M224j57803j55151J6373K92369M82284L42009r2919
39077A15319m27902l87028j82128j39384j67387K7805L53429M31078K48226J88865
39067F0893L23663K10097l41547p90258n73551M4443L28594Q6840j86860j27826
39057i65512O0465Q6421L7811J32089L07920L35342J51568j32570m11094n70418
39047i67978m57280r7583J76029Q5899j75240j79900J14059L06907J70868k7624
39037a051843J3124J60269J15402o6350q0631R6634J57180k8036j86188p5431
39027i45870J27970R8071j48925k81022j13684J75508L15320K48178J02975j1660
$$ y = [-274506, -19749, -52770, -311941, -521700, -469543, -253643, -198163, -465703, -834749, -964396, -806102, -616067, -611843, -769646, -924797, -908424, -616055, -133771, 208238, 115319, -312583, -699611, -881739, -1021123, -1188510, -1160705, -807276, -376198, -127972, 60893, 384556, 594653, 253106, -537152, -1110703, -1066260, -737666, -650826, -837686, -965512, -905047, -818626, -780815, -648726, -340806, -5464, 146104, 13534, -397560, -967978, -1425258, -1522841, -1346812, -1260913, -1436153, -1616053, -1501994, -1195087, -1024219, -1051843, -1038719, -878450, -763048, -829398, -910029, -813395, -656215, -684251, -870439, -945870, -817900, -719829, -868754, -1149776, -1263460, -1087952, -772632, -524454, -421479, -433139]
39017d33139q3835j24954j18615n0466N8511J59964J98118J29304l5300j86767
39007d87179j63623R0229M04063M89998K39974j17275k39563o3326J13310o44
38997B65964l06177m23107j85799J18699J21184j24877k16939J3582K42491J28781
38987c66198j59530j77947J27536L32224J65115j05920j05554R8859J55624k0116
38977e5907j66614j09760J1871K1726j0677J02629L45343M33282J27623l99028
38967C00488o22242k46580L30869M17193o2253m05209r7448M39904M64777j5104
38957E04395l25612j42463J73994K74382K48278K04293q883l84068n42751k84511
38947b82946M8997J07924M8000J17029J12467k35078o28162n44713o2608K45442
$$ y = [-433139, -516974, -641928, -760543, -811009, -752498, -592534, -394416, -265112, -300412, -487179, -650802, -560573, -156510, 333488, 573462, 456187, 216624, 153298, 266608, 265964, -40213, -463320, -649119, -530420, -409236, -534113, -751052, -737470, -494979, -366198, -525728, -703675, -576139, -243915, -78800, -184720, -290274, -191415, -35791, -55907, -222521, -332281, -320410, -298684, -309361, -206732, 138611, 571893, 699516, 300488, -321754, -568334, -237465, 179728, 117475, -287734, -385182, 54722, 519499, 504395, 178783, 36320, 210314, 484696, 732974, 937267, 928384, 544316, 1565, -282946, -233949, -126025, -78025, 39004, 151471, -83607, -711769, -1256482, -1319090, -1073648]
38937a073648J80685R3318J66855J39590r6439j89572Q1708L81687L48372J69064
38927B01620J88956K42568q3705o47163p91943k95935K39050K23920q5602k9684
38917h37918M01700N19317N45n40928l88243K56672N80087K99451p1686j08571
38907A10426l0656j57734l39300l06813j95741k55420l19744o8428L56518N02566
38897g04326K89368N1533n8136k01237l69534k98735R072J74945N5538Q594K80203
38886g62715N39280L68585r4090l72204k89402n5742J15194J60928P2446p2465
38876c90185q3183R3772K23749J18647l7554J5926J47900J7278l52840n57994
38866h04484l81594m5685J61358K00711J41074o095j67455j68410R918J21815
$$ y = [-1073648, -892963, -799645, -632790, -493200, -589639, -779211, -697503, -315816, 32556, 201620, 390576, 633144, 549439, -97724, -889667, -1185602, -946552, -722632, -808234, -837918, -436218, 83099, 83644, -457284, -845527, -588855, -8768, 290683, 218997, 110426, 79770, -77964, -417264, -724077, -919818, -1175238, -1494982, -1563410, -1206892, -704326, -414958, -363425, -421561, -622798, -992332, -1291067, -1281995, -1107050, -1051512, -1042918, -762715, -223435, 145150, 51060, -321144, -610546, -666288, -551094, -390166, -317720, -390185, -473368, -379596, -155847, -37200, -74754, -58828, 89072, 106350, -246490, -804484, -1186078, -1231763, -1070405, -869694, -728620, -734715, -902170, -1070580, -1060662, -938847]
38856i38847l234j57579j8682L51619N13345K07073k71845l97092m3351L64014
38846c94579L70074K2390k53957k33452j21627j65669k58603j11008K99346O54881
38836a92204O61601L42169l5772k17225j49436l421j963j70995l08483k56711
38826c32440j04625j0204N3650J81510K56268O6912k79837l61719N076M43730
38816h1679M60427O5098k96479l62076l19260l95388m53098k10624K67516N67895
38806g57668M33332N6048k07787k27547q9283J08636K59073K02707o4730k46717
38796e33936r7926J53463R1818j98993j83458K75868O00422L22249j90671k75019
38786c6183N7363K22071J003j84860N868L38959M21437K50862Q9408J2098j47196
$$ y = [-938847, -942081, -1099660, -1118342, -766723, -253378, -46305, -318150, -715242, -758593, -394579, -24505, -2115, -256072, -489524, -611151, -776820, -1035423, -1146431, -847085, -192204, 469397, 811566, 775794, 558569, 409133, 405712, 403749, 232754, -75729, -332440, -437065, -447269, -393619, -212109, 44159, 111071, -168766, -530485, -525409, -81679, 378748, 443846, 147367, -214709, -533969, -929357, -1382455, -1593079, -1325563, -757668, -324336, -268288, -476075, -703622, -792905, -684269, -425196, -222489, -287219, -533936, -631862, -478399, -386581, -585574, -769032, -493164, 107258, 429507, 238836, -36183, 21180, 243251, 244254, 59394, 65262, 404221, 825658, 1076520, 1165928, 1178026, 1030830]
38775A030830m60385p08678n84900p6717M02758L94132n2802l85100k36820J06768
38765e70914J60354p9835k51635k32847j80695p5321K43685N75080M60054o4981
38755a7055l64955j10004K20758R3227k65865k68916J23078L87470J88133k82320
38745b96449o26775n80022j18366M61250O75304L60100o6644j29374Q0569J39975
38735a00432k0386j09146o5174j51744m13818n20991l12161q6509j11716j66688
38725b058765J15883O38602Q91827N95808O3588j63055M5647K52159O526n29537
38715a41317p28951l02945L24467O03466N08233L10315K1690m53688q04868n55174
38705a218772J60980O21208M50517M4729j12925p2881r8907j70733j57916j57296
$$ y = [1030830, 570445, -138233, -723133, -799850, -397092, -2960, -55762, -440862, -677682, -570914, -410560, -490395, -742030, -974877, -1155572, -1230893, -987208, -412128, 47926, -17055, -382010, -492014, -271256, -178029, -443894, -712810, -589732, -202262, -14129, -296449, -923224, -1503246, -1621612, -1160362, -485058, -124958, -191602, -320976, -240407, -100432, -120818, -229964, -295138, -446882, -860700, -1381691, -1693852, -1780361, -1892077, -2058765, -1942882, -1304280, -412453, 183355, 246943, 83888, 129535, 381694, 388220, -141317, -870268, -1173213, -848746, -245280, 262953, 573268, 594958, 141270, -663598, -1218772, -1057792, -436584, 13933, 58662, -54263, -127144, -226051, -396784, -554700, -711996]
38695g11996k88421l84248k17664J31202L96118M49110L03396R884k46917k07710
38685g67246P8741K11624K2666j24987O6651K97752J58411j74872k41837m6949
38675e20046M9784N83L8470J14086n725j52722N1442M17007L26646k29570n06582
38664d16627j38454L09373K92887R6728J76567L18305J10999k20457j96782K4034
38654C56573q6278m42104m25900M9565L33832O3033k93677k16717J01011J78184
38644c82478R196n8086N3726J14338O0190Q3763K30109K45646m6724m35566n45612
38633f71498k89793L9619J35846L4463K1079K11942L71536K39750p8842k37949
38623b23847j21766K7074q89q0493J6128K39985L14008J09476k00382l72950l46945
$$ y = [-711996, -1000417, -1384665, -1602329, -1471127, -1075009, -625899, -322503, -312619, -559536, -767246, -688505, -476881, -454215, -579202, -512551, -214799, -56388, -231260, -473097, -520046, -470262, -469679, -431209, -317123, -322848, -475570, -424128, -7121, 319525, 89955, -416627, -555081, -245708, 47179, 143907, 320474, 638779, 749778, 529321, 332539, 356573, 270295, -171809, -597709, -548144, -214312, -151279, -444956, -661673, -560662, -382478, -373282, -431368, -377642, -263304, -203114, -119351, 110758, 356404, 309680, -125886, -671498, -961291, -921672, -785826, -751363, -730284, -518342, -146806, 92944, 14102, -223847, -345613, -318539, -319428, -399921, -383793, -143808, 170200, 279676, 79294, -293656, -640601]
38612f40601k16766o0710J15677K92919L76938K72789J4284k16184k35089l5171
38602c31914K03023K91352K14511J10647Q0404O6340l0994j58488j48733J4024
38592C10172J04005m8328k80755l14340j75863j41897k48517j74353K36732O20892
38582a12252N30493M9484l22782l10938r4026P0482J55693K39245L01889K62909
38572G70197R7873j29009k71079j76578J09099K79278R1266k81465m29303k16205
38562a55926J09263K85998K64720P1253k40167m46581l04367M6668J57254r2285
38552c04170k71140n3063K52656J82400j37492j80718J68113M55568L27128m7972
38542C91310l11312l40909k10572r774J21877R133l01491m56639j88379K94073
$$ y = [-640601, -857367, -918077, -802400, -509481, -132543, 140246, 154530, -61654, -296743, -331914, -128891, 162461, 376972, 487619, 568023, 634363, 603369, 444881, 296148, 310172, 414177, 365849, 85094, -229246, -405109, -547006, -795523, -969876, -733144, -112252, 418241, 467725, 144943, -165995, -260021, -189539, -33846, 205399, 507288, 770197, 868070, 739061, 467982, 291404, 400503, 679781, 771047, 489582, 60279, -155926, -46663, 239335, 504055, 575308, 335141, -111440, -415807, -369139, -211885, -304170, -575310, -628373, -375717, -193317, -330809, -511527, -343414, 112154, 439282, 391310, 79998, -260911, -471483, -481257, -359380, -350247, -651738, -1108377, -1296756, -1002683]
38532a002683N11875K86323q6230k39914j32706M4945J85616L07082L52179J85929
38522D12416j37714l08706j29839J72824K16637l0062k42483k17615q5701p53
38512c50996Q3764J95443J79435k3519j59397J632K64830K49976o0221l19591
38502F1356l26660k16497j29399j6452J25280J28951m5047j29405Q4418L56659
38492a06796K66367j75481m73501k90739R5784J71312j27713l64696k34789M1159
38482a199093J04925J1286J00455M14552N86017L75192K3430r6922K5056R8026
38472D42924m8843k95043m17324l08659n5668J17814N8506j13437j31934M3800
38462g07864J76851J41866J05151J61757Q5064k84076o30393m99391P7556O08584
$$ y = [-1002683, -490808, -204485, -290715, -530629, -663335, -618390, -432774, -125692, 226487, 412416, 274702, -34004, -163843, 8981, 225618, 195556, -46927, -264542, -350243, -350996, -267232, -71789, 107646, 84127, -75270, -73638, 191192, 441168, 380947, 61356, -265304, -481801, -611200, -627652, -502372, -373421, -418468, -547873, -463455, -106796, 159571, -15910, -489411, -780150, -684366, -513054, -640767, -1005463, -1240252, -1199093, -1094168, -1082882, -982427, -567875, 18142, 393334, 416764, 319842, 344898, 442924, 394081, 99038, -318286, -626945, -682613, -564799, -506293, -619730, -751664, -707864, -531013, -389147, -283996, -122239, -37175, -321251, -951644, -1451035, -1373479, -764895]
38452g64895P13807M11287m6285l31237j75406L15380N96392K92963k44546l99226
38442C68234j71512r0116k98954l52206k8603K66699J79886m2632l6838Q8012
38432a18030N3730l9211P0372K61994J74786j88062l88913j21552M02538O81440
38422G89092M23136j65042n49699m26068q6593m4904l24909m52256j89934J43254
38412h83923K42276K42831L02404K09773j78443m96121l61333k4522J4955j72198
38402a104301r6914K85805M85155K84978O9360J64040L26799J69233k24809l97217
38392c7871j11090L42554M33835k7065o05954o76136j90734K32933J65952m8329
38382e21905Q9104L92316L27779m2040j50830Q8112J40296j70866k86425J40782
$$ y = [-764895, -51088, 360199, 313914, -17323, -192729, 122651, 719043, 1012006, 767460, 368234, 196722, 106606, -192348, -544554, -573157, -306458, -126572, -169204, -206042, -118030, -64300, -103511, -33139, 228855, 403641, 215579, -173334, -294886, 107652, 789092, 1212228, 1047186, 497487, 71419, -15174, -60078, -384987, -837243, -1027177, -883923, -641647, -398816, -96412, 113361, -65082, -561203, -922536, -947058, -932103, -1104301, -1201215, -915410, -430255, -145277, -75917, 88123, 414922, 584155, 359346, -37871, -148961, 193593, 627428, 600363, -5591, -681727, -872461, -639528, -473576, -521905, -432801, -40485, 287294, 245254, 94424, 182536, 322832, 151966, -134459, 6323]
38372F323N57370K81061m74412r00756o66686j68245J57219K71789K83988J76344
38362d76005n3896k16229r2281K47145M19448J43755l28179m04991O9244M75534
38352b16455J87074n13688p71901l48014J14007R8217j13912m7932K38244M09363
38342i64997L91226K57377l7344m08460m88966j35859K61294L77241M35022O22267
38332C08801N32911j22286o97740l99874L75251M94436j92207o50028l29448N3547
38322f26637j68562n22107k99478K28464L43769Q8543O3780L36486M06017J42381
38312g344k7684R9458K21508J45917R6871K15088K46309j8224l55655m12176j38098
38301F5970K46758M92683M07243l4367n20654n92217j68431L09838M01966J38599
$$ y = [6323, 563693, 844754, 370342, -530414, -1197100, -1365345, -1208126, -936337, -652349, -476005, -529901, -746130, -838411, -591266, -171818, -28063, -356242, -761233, -691989, -216455, -29381, -543069, -1314970, -1662984, -1548977, -1450760, -1564672, -1612604, -1374360, -964997, -573771, -316394, -353738, -762198, -1251164, -1387023, -1125729, -748488, -313466, 308801, 841712, 719426, 21686, -378188, -2937, 491499, 299292, -350736, -680184, -626637, -795199, -1317306, -1616784, -1388320, -1044551, -956008, -892228, -555742, -149725, -7344, -35028, 64430, 285938, 431855, 528726, 743814, 990123, 971899, 616244, 204068, 65970, 312728, 805411, 1212654, 1178287, 657633, 65416, -103015, 206823, 608789, 747388]
38291G47388j45459k23842p9065J80365L24276J34567k69044m39464j52078K56631
38281C34275L40150J23202o4717j36191k34276k99524j14803K08066K52419n9344
38271C49257k64998l6099L01771K42126j60225l96395k35518K4700N3807q1877
38261b03451j09549L0824J27201k115k65624l89618k24581Q8928L02388L52818
38251b92779L51057L00986N0475l74342o04048l28578K41024N61788L84172l1600
38241B58155l20791m00635l90913l60106k80110j16557J31106L92733M89821K78481
38231c18816r1115k23825N6804M16012L83320l3911l40234j81773K37618M80785
38221C84865M20511K51344Q8779j35902l62759l18727N9248L68591K15532j94512
$$ y = [747388, 601929, 378087, 299022, 479387, 803663, 938230, 669186, 229722, 77644, 334275, 674425, 797627, 732910, 596719, 362443, 62919, -51884, 156182, 408601, 349257, 84259, 48160, 349931, 592057, 431832, 35437, -200081, -175381, -121574, -203451, -313000, -282176, -154975, -157090, -422714, -812332, -1036913, -947985, -645597, -292779, 58278, 359264, 409739, 35397, -568651, -897229, -656205, -94417, 289755, 258155, -62636, -463271, -854184, -1214290, -1494400, -1610957, -1479851, -1087118, -597297, -318816, -409931, -633756, -576952, -160940, 222380, 188469, -151765, -333538, -95920, 384865, 805376, 1056720, 1145499, 1009597, 646838, 328111, 387359, 755950, 971482, 776970]
38211G76970l03615k766K19573K5236k85290k76273l4071L7373j24977j89650
38201a57490J8863K66848K58311L75k30723j54455K54677O55490O02937Q7182
38191A602015l60047l39016j54587l41097p77595p94657j74875M77371N36803
38182c25685J07778k47680k06797J02659L29316J76070l03293n97638k47081M65229
38172g47122P46510L48863j17019j56726q8590l25344n28120j60770M82238N96910
38162E0830Q4709l25283k03555N6260K5212j05443K64J94028J24497j55637k81588
38151e35706j31067N8038Q3226K6077N9916J60984J14866j77371m65672l78178
38141a184887O2014L62341J93243j19330n1738L31207M80720K04052q8469o0830
$$ y = [776970, 473355, 470589, 690162, 715398, 430108, 153835, 119764, 157137, 32160, -157490, -138627, 128221, 386532, 386907, 156184, 1729, 256406, 911896, 1514833, 1602015, 1241968, 902952, 748365, 407268, -370327, -1164984, -1339859, -862488, -325685, -217907, -465587, -672384, -569725, -240409, -64339, -367632, -965270, -1212351, -747122, -612, 348251, 231232, 74506, -14084, -339428, -867548, -1028318, -546080, 50830, 135539, -189744, -393299, -337039, -311827, -417270, -417006, -222978, -98481, -254118, -535706, -666773, -608735, -525509, -499432, -439516, -278532, -163666, -341037, -806709, -1184887, -1122873, -760532, -567289, -686619, -738357, -407150, 73570, 277622, 189153, 128323]
38131A28323J01493J19356O3440Q1052M1442j86396l66820j97910J85098L77553
38121C46631K73622J09470r96j91292m60009n17224j77435L22354N78887M64929
38111G48937J65474j16812l09088l67505k43261k4079N6167r1918k09183Q714
38101c82554M23903N40743J67404k79626l24817m0172J73584J90975J67656R8175
38091G35271j51067l94249k34451K63431N02951J79973k74953l71160k42158k50172
38081b36584k79319L2741N54952P26553L45925j85490m62218m93021m20975k30844
38071f48280O3446K43725J43787r4927k09818j26748M9840K06675K43739Q4094
38061d4467j65979k05553R8407M31908L66043o0502l57660k30841O1325J38981
$$ y = [128323, 229816, 349172, 412612, 493664, 535106, 348710, -18110, -216020, -30922, 346631, 620253, 729723, 728727, 537435, 77426, -439798, -617233, -294879, 284008, 748937, 914411, 797599, 488511, 121006, -122255, -146334, -90167, -182085, -391268, -382554, 41349, 582092, 749496, 469870, 145053, 104881, 278465, 469440, 637096, 735271, 584204, 189955, -44496, 218935, 721886, 901859, 626906, 255746, 13588, -236584, -515903, -483162, 71790, 798343, 1144268, 958778, 496560, 3539, -417436, -648280, -584834, -341109, -197322, -292249, -502067, -628815, -578975, -372300, -128561, -44467, -210446, -415999, -317592, 114316, 480359, 419857, 62197, -168644, -107319, 31662]
38051C1662L0043l263K0400j43211m23405m01459K1069L35101J25049k65222k02259
38040h75495L04367O44901N10065K10623M5446r9814l26522l99590j71531O6498
38030i1052J9759j44736j41110p7945k02793l76884k86534j9992O9644o738R6366
38019a162015L99877M99337K34992k5520K1901J64776Q1153j43429k26311j68174
38009c23413j79851k68041k23021J2644K32619K67122K09195K53161L91674L72743
37999G44832L688n19862p05810l00690L43676O16747L39608q8583k39525j16023
37989G8058Q257k2944j61463k82061k49837j737L04051L61634Q5569k31849k86229
37978c98551j36043k2496K7513J42232K46752J13567j97933l00048l3338K25089
$$ y = [31662, 61705, 58442, 78842, -64369, -487774, -889233, -868164, -533063, -408014, -673236, -875495, -571128, 73773, 583838, 794461, 839907, 740093, 413571, 13981, -157550, -91052, -71293, -216029, -357139, -435084, -637877, -1014761, -1301295, -1321287, -1251643, -1258381, -1162015, -762138, -262801, -27809, -53329, -31428, 133348, 214501, 71072, -155239, -323413, -503264, -771305, -994326, -981682, -749063, -481941, -272746, -19585, 372089, 744832, 748520, 228658, -477152, -777842, -434166, 182581, 522189, 433606, 194081, 78058, 86315, 63371, -98092, -380153, -629990, -631727, -327676, 33958, 119527, -112322, -398551, -534594, -557090, -529577, -387345, -140593, -27026, -224959, -525007, -558345, -333256]
37968c33256P3098k94380l24803R0178M41155L33457K8442j3707J50176J01420
37958B51780j98639l22467r6575R3187m3733j96883m144K55997O9832m16119n32780
37947a140544j04962K96820K55257N2416L9555K7696k41022m58968j80583L59610
37937a094725M77431L7633l45778k00240J97789L07689N5155j81403j02308K19393
37927f29364M65774L63859n5840m25402l93880n5082J56310M3266j17779l8489
37917f86627J41877J10875j04409j71458O0241L64564M48206K66758M86j50330
37907B80183j24443m4720q3577k11885j83585R3720L14606J53118k11500k89536
37897c07619m595J70753o2879l62522k73875P5568J96531k2753k11003j10367
$$ y = [-333256, -260158, -554538, -879341, -789163, -348008, -14551, 13891, 184, 150360, 251780, 53141, -269326, -365901, -272714, -316447, -513330, -517474, -261477, -191645, -607764, -1140544, -1245506, -948686, -693429, -641013, -601458, -573762, -814784, -1273752, -1454335, -1094725, -617294, -579661, -925439, -1125679, -927890, -620201, -565046, -746449, -848757, -629364, -163590, 200269, 144429, -280973, -674853, -729935, -573625, -530359, -648138, -686627, -544750, -433875, -538284, -709742, -649501, -284937, 163269, 430027, 430513, 280183, 155740, 111020, 27443, -184442, -368027, -274307, 40299, 193417, -18083, -307619, -312214, -141461, -204340, -566862, -840737, -765169, -568638, -591391, -802394, -912761]
37887i12761R8974J37615j690j29250j06265O5499K58497K97595J58984N3820
37877g8982J35695K09067K909l31331l66397n9187J57208N2756p0408N1124J71501
37866a26045j9688l29452l56597j15173O5544R8501J65006K79407K47582L8797
37856e2118j61397k64531l31590l40398k15945o1753m2096o9110O1527K67435
37846a209976K80417J20134O1404J28750O5238j49300k20632q6443n4150k18720
37836a283278k34955O6041K97445J07122k39104k62587M1239L17408M00578L52750
37826d37341J71359j21163k58019k4007L20544L07700q9406m27277l84723o5543
37816a007876K66276M42827L88001J46619o4330o8708K3035K160q2067l7328P3523
$$ y = [-912761, -813787, -676172, -677862, -807112, -913377, -847878, -589381, -291786, -132802, -78982, 56713, 265780, 268689, -62642, -429039, -488226, -331018, -278262, -348670, -297546, -126045, -145733, -475185, -831782, -946955, -881411, -782910, -617904, -338497, -90915, -52118, -213515, -478046, -809636, -1150034, -1365979, -1427732, -1469828, -1538938, -1477411, -1209976, -929559, -809425, -748021, -619271, -554033, -703333, -923965, -1010408, -1064558, -1283278, -1518233, -1452192, -1154747, -1047625, -1286729, -1549316, -1508077, -1190669, -790091, -437341, -265982, -387145, -645164, -669171, -348627, -40927, -130333, -557610, -942333, -1007876, -741600, -298773, 89228, 235847, 171517, 102809, 125844, 128004, 45937, 8609, 82132]
37805H2132O47k32295l07995j30023p271j77573m35781m22616p8680L53870O15435
37794g40150N71552K29799k21069m83287l96130p1907K54375M24532L88524J82623
37784A38862n1028j43470p9813j0004k2988k2221R1641K13748J30738j99390n43335
37773d97260n93276k73326J54075L29930J77274k7083j7335J20830J03854j19240
37763f41557k70308j04685K63646M76091L27716N351j06923J02576K69770j2120
37753C09557n80750q07032m09429J50720L15812J66437J50270L20261L24238O0472
37743E56j56585j24743o774L6983O4451P7768p2909l34793l60529L600M28012
37732d44963N18634K76620m9706l06651m19724l01165k1741J40808N5453o6493
$$ y = [82132, 82779, -149516, -457511, -587534, -594805, -772378, -1208159, -1630775, -1709455, -1355585, -740150, -168598, 61201, -159868, -643155, -1039285, -1111192, -856817, -432285, -43761, 138862, 87834, -55636, -135449, -145453, -168441, -190662, -99021, 114727, 245465, 46075, -497260, -1090536, -1363862, -1209787, -879857, -702583, -729666, -747001, -626171, -522317, -641557, -911865, -1016550, -752904, -276813, 50903, 56254, -50669, 51907, 321677, 309557, -271193, -1078225, -1487654, -1336934, -1021122, -854685, -704415, -384154, -59916, 556, -156029, -280772, -287546, -250563, -186112, -108344, -181253, -516046, -876575, -872975, -444963, 73671, 350291, 300585, -6066, -425790, -726955, -748696, -607888, -552435, -618928]
37722f18928l5288J0325r1077j83535q4744K6387r2653k42659k1338N09102Q30867
37711F459O59314K38155r3455k58522k84258j47260O0930J00272r0395k36135
37701d4895p7979K65963M46862K79022j33363n46426p27717n59467j40511K44779
37691i93732L61257K31514Q1540J00794K59034L27741J13916k71788m54135k21987
37681d65846J58636K53564L8375r2840P8244K98055K72997R7168L540o3894k82753
37670B95246n05198l94111l378J88716m7014l40193k57487J09880L79320M48985
37660a25234M64572L78897P848m84410o33348l43498p5632j32211j76303J63593
37650i55726N72172M72131k7586k40055M3144K53921P002k58445j8255M29044
$$ y = [-618928, -654216, -643891, -734968, -918503, -1003247, -976860, -1069513, -1312172, -1333510, -824408, 6459, 665773, 903928, 810473, 551951, 267693, 120433, 181363, 281635, 191240, -44895, -122874, 143089, 589951, 868973, 735610, 189184, -538533, -1098000, -1238511, -993732, -632475, -400961, -319421, -218627, 40407, 368148, 482064, 210276, -243859, -465846, -307210, -53646, -15271, -108111, -29867, 268188, 541185, 638353, 641893, 577999, 295246, -209952, -604063, -607441, -418725, -465739, -805932, -1063419, -953539, -574219, -125234, 339338, 718235, 726083, 241673, -391675, -735173, -810805, -943016, -1119319, -955726, -383554, 88577, 60991, -179064, -135920, 118001, 125003, -133442, -151697, 277347]
37640B77347L81831j81968n71722m04224o6047j1490j14572k8216J86846K08139
37630c24076M2135M2625L40370N99794M55931k9899m74283n78851l33098L9344
37620b20008K14870n717m41477o13871k79673K12766L38788R6441l1168J77776
37610e51273L68455K08353p0508n0306K10900K93721O7709j66467j56319L0074
37600A84339K21907L17840K19003q9792l45127k16976J96821L99001J31984l01491
37590G17509m82072l49709r4140J33190K13089M2232k57204l46118j04754J53191
37580c74786J13296j07035j82576l4953J71011L05561L20742J84871j9990r9950
37570B76191k4953L338p7192l7126J99892K95154P176l44845l35662q9495k6302
$$ y = [277347, 659178, 477210, -94512, -498736, -564783, -576273, -690845, -719061, -532215, -324076, -281941, -239316, 101054, 700848, 1156779, 1126880, 652597, 73746, -259352, -220008, -5138, -10855, -452332, -1066203, -1345876, -1133110, -794322, -697881, -729049, -551273, -182818, 25535, -44973, -95279, 115621, 409342, 477051, 310584, 154265, 184339, 406246, 724086, 943089, 853297, 508170, 291194, 488015, 887016, 1019000, 717509, 235437, -114272, -208412, -75222, 137867, 180099, -77105, -423223, -527977, -374786, -261490, -368525, -551101, -586054, -415043, -109482, 211260, 396131, 376141, 276191, 251238, 254576, 177384, 140258, 340150, 635304, 642480, 297635, -38027, -127522, -153824]
37559a53824j64981j77280J259J18479R5374J00983J76759K08054K09390K31268
37549F45481J02094k74062n14247k19699K76028K87455j38566k69734J11735L70733
37539C77218J14144j85399o4272J64024M8115k02774j62308N1456P1709m6525
37529A65388n4061o9354k95425m61212j97414K35040K59254r0070k14420R4512
37519f27762L80380K74849l6573k31474k53430j52576N7397K31301J44076j52191
37509c66003l38938k88300j81468j07265O8277L12577L17878k404k58244q9566
37499i33456L36718N94535N45026L56784J57665n3780k31625k53008o6165K49817
37489G02511N55834P35926P62120O79009M52024o8333q15005j241565q01095K27890
$$ y = [-153824, -318805, -496085, -494826, -376347, -280973, -179990, -3231, 204823, 414213, 645481, 747575, 473513, -40734, -260433, 15595, 303050, 164484, -105250, 6485, 377218, 491362, 305963, 241691, 405715, 453830, 251056, 88748, 140204, 211913, 165388, 111327, 41973, -253452, -714664, -912078, -677038, -417784, -507854, -722274, -627762, -247382, 27467, -9106, -240580, -494010, -646586, -589189, -357888, -213812, -366003, -704941, -993241, -1174709, -1281974, -1213697, -901120, -583242, -585646, -843890, -933456, -596738, -2203, 542823, 899607, 1057272, 1003492, 771867, 518859, 452694, 702511, 1258345, 1994271, 2756391, 3435400, 3887424, 3819091, 3004086, 1762521, 961426, 1189316]
37479A189316Q26039M00901m73523q15695m48187k5587l1899k57653l01216j46004
37469h3508n2706j45082k97853l12219j01371K07068L37574J70752l2241R3076
37459b16510N03137P58160O06790K85851J13960Q6752R7075K53041O02091P44307
37449C834654K17553p39976j290100r96426l31247R575p3984k25817k58436k52073
37439a06277k33970j53531o9844k6281J33480M57589N51368M8878o44423o74638
37429g17649Q7706P82532P10893K01274m1785M4048L2167j76220k95002k50560
37419C77404k57189l19547j75334J91788M15457K58300p3007k67278k97326l16116
37409d62848l53894k73809L2147M50484O47343L79697j23569l05246K2718L81863
$$ y = [1189316, 2015355, 2416256, 1942733, 1127038, 678851, 653264, 621365, 363712, 62496, -83508, -136214, -281296, -579149, -891368, -992739, -785671, -448097, -277345, -309586, -216510, 286627, 1044787, 1651577, 1937428, 2051388, 2138140, 2235215, 2488256, 3090347, 3834654, 4052207, 3312231, 2022131, 1025705, 694458, 704033, 630049, 404232, 145796, -106277, -340247, -493778, -563622, -589903, -456423, 1166, 552534, 601412, -43011, -717649, -629943, 152589, 863482, 1064756, 1022971, 1067019, 1099186, 922966, 627964, 377404, 120215, -199332, -374666, -182878, 232579, 490879, 417872, 150594, -146732, -462848, -816742, -1090551, -1058404, -607920, 39423, 419120, 295551, -9695, 13023, 394886]
37399C94886K97334k9019j26347n1848j93911m50439l23396J50762L21832k4508
37389c4654k65969M8989M54201L32123j09543k29611N7230L03175K92319J85804
37379A034064N4097j72086l57431k78531n1855P594q7649o0385R3990J19452K8976
37368C30236R2434K50263J08803l23535m66235k6153M72842M22926Q253j21701
37358G48133K03559N58760O36505N97357O79679Q55622R95297J102670J274378
37349G651960J624742K305940L319630M137573L794810J772942j178969l428235
37341B0000393l882715k941722j906952j585991j699515j574330j041892m84516
37333D882760k64982l97717o71983q35949p02197l11034J5183q314k55077l41296
$$ y = [394886, 692220, 663201, 536854, 485006, 291095, -159344, -482740, -331978, -10146, -34654, -300623, -251634, 202567, 534690, 425147, 195536, 252766, 555941, 848260, 1034064, 1088161, 916075, 558644, 280113, 228258, 235852, 148203, 87818, 181808, 301260, 330236, 422670, 672933, 781736, 458201, -8034, -34187, 438655, 861581, 869834, 748133, 951692, 1510452, 2146957, 2744314, 3423993, 4279615, 5274912, 6377582, 7651960, 9276702, 11582642, 14902272, 19039845, 22834655, 24607597, 23428628, 20000393, 16117678, 13175956, 11269004, 9683013, 7983498, 6409168, 5367276, 4882760, 4617778, 4220061, 3548078, 2712129, 2009932, 1698898, 1714081, 1705767, 1450690, 1109394]
37323A109394j48882M8027J3536j52919k41065k10966j23935p833O8772m818j52541
37312A96770r4849K43988N19636M03013M7512j65721j81127k04886k04437O4967
37302F24866N00997O05102J99097k13584j24748K43881K87733q3214l61908k33733
37292A444489K0071M5333o5683n2938P054j51383m60483n25103j76218K81241
37282C66380M59488K99234L095k27013k71946j14688P7708O2263j46761k39110
37272B68650p1626N5360j50255m53745m08697p0713O9074j21392j85088J78816
37262h89616N88848N28813J00222j67441p3504Q6955M7608j01788j53338p7138
37252a10379M292j6928j37410k30537j65267m14O2854J1639Q4232L21919L49886
$$ y = [1109394, 960512, 1008539, 1022075, 869156, 628091, 417125, 293190, 285357, 354129, 349311, 196770, 101921, 345909, 865545, 1268558, 1316070, 1150349, 969222, 764336, 559899, 624866, 1125863, 1730965, 1930062, 1716478, 1591730, 1835611, 2123344, 2040130, 1678222, 1444489, 1464560, 1509893, 1444210, 1391272, 1398326, 1246943, 786460, 261357, 85139, 366380, 825868, 1125102, 1128197, 901184, 629238, 514550, 592258, 654521, 507760, 268650, 197024, 252384, 102129, -351616, -760313, -831026, -761952, -883344, -1068432, -889616, -300768, 228045, 328267, 160826, 87322, 174277, 221885, 120097, -33241, -110379, -106087, -123015, -260425, -490962, -656229, -656643, -593789, -582150, -497918, -175999, 173887]
37241A73887m5860l92754j11897N13958N97029p8934p04359n97585q4569J62388
37231e68696J07227J30106K42821J62339o1472j13559o772m0814k13376k10426
37221e72622J9764K06061K84253M44472N96817L82871j31354l75894j35642R4217
37211H12943o4939k76591j55155K8375j10860k93494m7279L79253L66102M035
37201F42390j8300L93679N25455L8032m37214k98927R0151K6656m36504o35870
37191a10452l01091J62048L25883K08755N0144l3777o6311p2105q077J98121M89300
37180H42438N83276K57409k29415l26581N2160L60148K81253L00768Q88869J477078
37170D487403J022737m49475j644999j568829o75247r1562j96662m63894m09138
$$ y = [173887, 128027, -264727, -376624, 137334, 734363, 655429, -48930, -646515, -731084, -568696, -461469, -331363, -88542, 73797, 12325, -101234, -108006, -148820, -362196, -572622, -552858, -346797, -62544, 381928, 978745, 1361616, 1230262, 854368, 718726, 812943, 748004, 471413, 316258, 344633, 233773, -59721, -107000, 272253, 638355, 642390, 624090, 1017769, 1543224, 1581256, 1144042, 845115, 935266, 961922, 525418, -110452, -411543, -249495, 76388, 285143, 335287, 301510, 235199, 163094, 155017, 353138, 842438, 1425714, 1683123, 1453708, 1127127, 1179287, 1539435, 1820688, 2121456, 3010325, 4487403, 5510140, 5060665, 3415666, 1846837, 1171590, 1080028, 883366, 419472, 10334]
37161A0334j33705M3321N6157N3313J02449R4202p3257k75939k36475R3685L53236
37150H7321K10329j03826o7815L12491M30157j082m48030l48076L6970Q8444j59347
37139C7536j40264K33008L99034R2571k14283j11564P6103j30923n22365m93661
37129g74808o08L46061J67935j76092j58273J85513L87353K49290P6759J63804
37119D66934L25152J78094k30098m15077j57030J29187m791l34385k85651J56430
37109a71235L87047R0309l19946l85648k37475j88447j28729J75923M83509L57063
37099F2371q6322k81334n5744J74661J19398j715N1498J42256R7074M6023J30172
37088C98338J85245K4937k03114k39691j01685J4990M2994Q140j30662l45227
$$ y = [10334, -123371, -80050, -23893, 29420, 131869, 226071, 152814, -123125, -359600, -265915, 87321, 297650, 193824, 126009, 438500, 868657, 867575, 419545, 71469, 108439, 196883, 37536, -102728, 130280, 529314, 621885, 407602, 296038, 372141, 241218, -281147, -774808, -775416, -429355, -261420, -437512, -595785, -410272, -22919, 226371, 303130, 466934, 792086, 970180, 740082, 325005, 167975, 297162, 292371, -42014, -327665, -171235, 215812, 306121, -13825, -399473, -636948, -825395, -954124, -778201, -294692, 62371, -23951, -305285, -361029, -186368, -66970, -68685, -17187, 125069, 222143, 268166, 398338, 583583, 608520, 405406, 165715, 64030, 79020, 122014, 130154, -508, -345735]
37078c45735m11993j96194Q5681J55660P3687O3068J01806K9446p2445j272J36525
37067c81766M2883k13118j90172K46991O23379M47002j44122n49290l85336J51113
37057c52436N20620L70067j09522l74164j68969J39911P8484k43882l15175j8201
37047d73267K12109R2302j21046j32206n8385r8228j23887L5623J84432K7322
37037d55231l23659m72301k68941P6936L18399L45202J52186j02515j26244J53823
37027g02345L93632K73931p843l0217J94656K69366O6411j11751p7079l0338j50212
37016H8211k79226k18901m6320P1077J36233J94947J64039Q994q6166L0514J84802
37005B48204Q5735k30317m06637k30505J04771K64278J57545l5221j38202j49432
$$ y = [-345735, -757728, -953922, -868241, -712581, -638894, -575826, -474020, -444574, -517019, -518291, -381766, -338883, -552001, -742173, -495182, 128197, 575199, 431077, -118213, -503549, -352436, 168184, 538251, 428729, 54565, -114404, 25507, 103991, -139891, -455066, -473267, -261158, -168856, -289902, -422108, -480493, -578721, -702608, -666985, -482553, -455231, -778890, -1251191, -1520132, -1443196, -1124797, -779595, -627409, -729924, -856168, -702345, -308713, -34782, -42625, -72842, 121814, 391180, 457591, 345840, 268761, 238423, 88211, -191015, -409916, -456236, -385159, -248926, -53979, 110060, 119054, 32888, 63402, 248204, 333939, 103622, -303015, -533520, -428749, -164471, -6926, -42147, -180349, -329781]
36995c29781j32273p3943L9984R6081j8556j72333j05155J47660K17288m7901
36985c78929k75135r7545K50729K70220k9672j75261o516J17796j0065r1945J25436
36974c00887L89336L52863J04707n3003p7036r0360o4271M6897P2655q9444j59371
36963A32086J19036M20719K03291m27228p57905m45919O0605K40395J49484Q7591
36953b17845N0639r3758j87842J3731L69603M89456K94290P7052N913p8941k91068
36942D31230m37500l09535k0594J49982J30343P8475Q4753M4538j28887k96043
36932b73238k14844J34250M45286L97150M0797k45730k22052n4276j0196n1116
36922e3969M5718K60734L41496K42720K12767L27318K81528j15270n19995m56887
$$ y = [-329781, -462054, -535997, -496013, -399932, -418488, -590821, -695976, -548316, -331028, -378929, -654064, -751609, -500880, -230660, -260332, -435593, -442109, -324313, -334378, -426323, -300887, 88449, 441312, 546019, 493016, 415980, 325620, 261349, 308246, 380901, 291457, 132086, 251122, 671841, 875132, 447904, -310001, -755920, -695315, -454920, -305436, -217845, -167206, -260964, -448806, -435075, -65472, 423984, 718274, 795326, 801239, 722298, 431230, -6270, -315805, -336399, -186417, -56074, 22401, 107154, 151692, 22805, -273238, -488082, -353832, 91454, 488604, 529401, 283671, 61619, 7343, -2853, -53969, -8251, 252483, 593979, 836699, 1049466, 1376784, 1658312, 1543042, 1023047, 566160]
36912E66160L4746M80482N82860M35059K18829L2324k9009M4606M3267j90457
36902B218867m18782l18080n7834q8586l72853m09795j08809J9169k33082l63480
36892a33265m8002K38477L8521k59492j05636K10914P2001l36719l27142P5305
36882e75038J95661o4330o9554L53230N49835J75546k04701r1880J72306J32862
36872E73937P907J28978K04988j51684o19340n99317j32742K73797M60883N93636
36862G41043N65964J49277l74084m37789o5125J31968r4978l00115j34197J12085
36852B94049N0937j76992j97533j6685O4183l420N4201L29417M81181J83827l25823
36841G37342m45807j2659L87381J67961m20927o28978k73376Q7453J16365J82729
$$ y = [566160, 600906, 1081388, 1664248, 2099307, 2318136, 2350460, 2321451, 2366057, 2409324, 2218867, 1800085, 1482005, 1424171, 1335585, 962732, 552937, 444128, 463297, 230215, -133265, -181267, 57210, 95731, -163761, -269397, -58483, 13518, -323201, -650343, -575038, -379377, -443707, -513261, -160031, 389804, 565350, 360649, 268769, 441075, 573937, 581844, 710822, 915810, 764126, 144786, -454531, -587273, -313476, 147407, 741043, 1307007, 1456284, 1082200, 644411, 579286, 711254, 616276, 316161, 181964, 294049, 344986, 167994, -29539, -46224, 17959, 14539, 68740, 398157, 879338, 1063165, 737342, 291535, 278876, 666257, 834218, 413291, -215687, -489063, -401610, -285245, -102516]
36831a02516N64963P85147L17798m52676o65435j78603L20089L32884O4701j30621
36821H55731k38245l29170k73131J7632L17244L03994m4305l89068l42817J31126
36811H991O00007N74651J04530k58443j96958j3461p2807k32663j78678P927N7907
36800D01003K0815R6006J85916J01678M196J37788L24875K48567L2724j6238k0154
36789A517176k49779m51607j83745L23242M26792J12563m9277M6658o4403m06270
36779A021350m00043O8009L44510J08874r9061J32897L98221K67171K4257N1094
36769A917279J26043p4060l21279k44514P1275L60153N84305O74111L97549j08792
36759C382070k65800O7659K78346J5758j99417N5644L04294O2983k06138Q8139
$$ y = [-102516, 462447, 1247594, 1565392, 1112716, 447281, 268678, 588767, 921651, 986352, 855731, 617486, 288316, 15185, 32817, 350061, 654055, 609750, 220682, -122135, 8991, 608998, 1183649, 1288179, 1029736, 832778, 819317, 746510, 513847, 335169, 343096, 401003, 421818, 517824, 703740, 805418, 809614, 947402, 1272277, 1520844, 1553568, 1537330, 1517176, 1267397, 815790, 632045, 955287, 1382079, 1494642, 1445365, 1492023, 1427620, 1021350, 621307, 689316, 1033826, 1142700, 1043639, 1176536, 1574757, 1841928, 1866185, 1917279, 2043322, 1969262, 1647983, 1403469, 1474744, 1834897, 2419202, 3093313, 3490862, 3382070, 3116270, 3183929, 3462275, 3478033, 3278616, 3334260, 3638554, 3701537, 3495399, 3583538]
36749C583538N45455M62903J17074K72708P81900Q11674K88260k531K53792N17161
36739G631934M72945N39941J014468J488209J499394J225671J185746J589780
36731A6648088K222498K779059L211936L806167M821851O082651P267244Q600104
36723E5439598J0595404J2922195J4354067J4284796J3441030J2542692J1261668
36716A44841450R337882P731219P581456Q817701J0736667J2892920J4340450
36709B16279745J3497756J0530621Q483059R895697J3715649J8061251K3844814
36702C14308592L0937274L1812025J6029335j5819922m7634664o2003132n6610176
36695B11019332m3020251l2035393k5345487k0160546j5615784j2421315j0179856
$$ y = [3583538, 4128993, 4591896, 4708970, 4981678, 5763578, 6575252, 6863512, 6860981, 7114773, 7631934, 8104879, 8644820, 9659288, 11147497, 12646891, 13872562, 15058308, 16648088, 18870586, 21649645, 24861581, 28667748, 33489599, 39572250, 46839494, 55439598, 66035002, 78957197, 93311264, 107596060, 121037090, 133579782, 144841450, 154179332, 161910551, 169492007, 178309708, 189046375, 201939295, 216279745, 229777501, 240308122, 248791181, 258686878, 272402527, 290463778, 314308592, 345245866, 377057891, 393087226, 377267304, 329632640, 267629508, 211019332, 167999081, 135963688, 110618201, 90457655, 74841871, 62420556, 52240700]
36688E2240700q007475o131173n039552m272525l324149k618662k537115k515392
36680A7794657k043053j584519j624163j695159j231117n94737m14444n67292
36672H040173n93555n17464n40028m82680k19160j25873m42076o99238m53163
36663C966936q7507j83249n27983n02454j16313R8277K282o6400m28m0337k16604
36652B326220k70785j63282j42080k38543j57599K01912M97039L95978L4010j76356
36642B306514p2486P9147n5276m09873n45458k28303J83106J89988j19557j97232
36632A130570J05130K93390K6977l27868k79053N0358J96191R0555M2826J33293
36622A462369J14332r1372k19276q7171J24485J56269K0865p9397o4297n6642
$$ y = [52240700, 44233225, 38102052, 33062500, 28789975, 25465826, 22847164, 20310049, 17794657, 15751604, 14167085, 12542922, 10847763, 9616646, 9021909, 8607465, 8040173, 7446618, 6929154, 6389126, 5906446, 5687286, 5561413, 5119337, 4420099, 3966936, 3879429, 3696180, 3168197, 2665743, 2549430, 2647707, 2649989, 2583589, 2583161, 2542824, 2326220, 2055435, 1892153, 1750073, 1511530, 1353931, 1555843, 2052882, 2448860, 2482870, 2306514, 2234028, 2313175, 2257899, 1848026, 1302568, 1074265, 1257371, 1447359, 1327802, 1130570, 1235700, 1529090, 1556067, 1228199, 949146, 999504, 1195695, 1286250, 1329076, 1462369, 1576701, 1485329, 1266053, 1178882, 1303367, 1459636, 1480501, 1401104, 1336807, 1280165]
36612A280165j66413k97393k52056k3512J42379P2697p1778m8109O6132N413j96176
36601E11349k10232L4906J88041K5447j84809j21898Q1236R3482o5627r8745N2796
36590C05946J32323J9752n9625R6256L00474J81521k91988o74767n38973j3686
36580e42767L58449L00371P7512k728l8101k11436l40951j77994P6451O9608n1670
36569d83256J11253M07730L01022j40994k23874K06062M13553j6725m42845k23274
36559i1348K18308J41335k77431l19865O4604L14064K58777J91443J04253k37997
36549C66143n29838j78849N81851P72922J17340m67334k28345L60283M43493M2325
36539A279991k00809q4907M3559J1713Q26O9668K7452j76453l23542k50389l2083
$$ y = [1280165, 1113752, 816359, 564303, 540791, 683170, 755867, 684089, 635980, 702112, 707525, 511349, 301117, 336023, 524064, 549511, 364702, 242804, 324040, 417522, 351895, 253150, 305946, 438269, 458021, 398396, 494652, 795126, 976647, 684659, 9892, -529081, -542767, -184318, 116053, 193565, 190837, 152736, -58700, -399651, -577645, -501194, -431586, -483256, -372003, 35727, 336749, 195755, -28119, 177943, 591496, 574771, 131926, -91348, 126960, 268295, -9136, -329001, -264397, 49667, 308444, 499887, 604140, 366143, -163695, -342544, 239307, 1012229, 1129569, 662235, 433890, 794173, 1237666, 1279991, 1079182, 994275, 1037834, 1049547, 1050373, 1120041, 1147493, 971040, 647498, 397109, 365026]
36528C65026J82931K96549K20748o3992l80149m59975k28475J21883L41803L28453
36518G24802J50116l4799r2339q102J36800K73235L51912K79171K0471k16408
36508A584859j42549J63983K34484j53992n52027l70934K87934P16041N10639
36499B278438L3951j62817n2714k8621k82497n76558n90223k77395J35342L60514
36489H37420K60126k4112j61791J1040K61441K59709N9113n646R2487j4478m14555
36478A160754n95966j97329K85550J25945m99234o97095j79468L43719K93043
36469C9919J6699N6705K60783J99370l2032r5802j27684m34538p19279m06381
36459a242240L34602O91740M07628R8784J83307K52992j05088n23326m32572L2030
$$ y = [365026, 547957, 844506, 1065254, 1001262, 621113, 161138, -67337, 54546, 396349, 724802, 874918, 840119, 747780, 739678, 876478, 1149713, 1501625, 1780796, 1801267, 1584859, 1442310, 1606293, 1840777, 1686785, 1134758, 763824, 1051758, 1767799, 2278438, 2312389, 2149572, 2096858, 2068237, 1785740, 1209182, 618959, 341564, 476906, 837420, 1097546, 1073434, 911643, 922683, 1184124, 1443833, 1502946, 1497300, 1589787, 1575309, 1160754, 564788, 367459, 653009, 778954, 279720, -417375, -596843, -253124, 39919, 56618, 113323, 374106, 573476, 541444, 445642, 317958, -116580, -835859, -1242240, -907638, -215898, 191730, 290514, 473821, 726813, 621725, 98399, -334173, -302143]
36449c02143K81489J51399q929K6898J22539J29470Q1135K6085l5262l9731P2318
36438E05268J85039J12857j26257l20585l30779j91155J4316K08597K81208J60773
36428D99282o3019k09888j96308o5990J12001K56858K47965M9339j45109o3164
36418D21967K84076N22244L20654j65488m10390j42935K64994K15319l42559q05997
36408A61885o79644j77533J47529J35515M8256L1876k7578j45920j59991o2192
36398g27797l3317n4474J29088N18708P12813M52329N344k06773j13196N1499
36388G34224N4574j97628n59554o13382j03604N21695M98584j64878n81229k55098
36378f66296K02243J12851j88441m4792L08704J63107l56647m35403N5360L46262
$$ y = [-302143, -20654, 130745, 121816, 148714, 271253, 400723, 481858, 507943, 472681, 432950, 505268, 690307, 803164, 676907, 356322, 25543, -165612, -151296, 57301, 338509, 499282, 436263, 226375, 30067, -35923, 76078, 332936, 580901, 630240, 485131, 421967, 706043, 1228287, 1548941, 1383453, 973063, 830128, 1095122, 1310441, 967882, 161885, -517759, -695292, -547763, -412248, -363992, -332116, -359694, -505614, -665605, -727797, -761114, -815588, -686500, -167792, 545021, 997350, 1002694, 795921, 682725, 734224, 788798, 591170, 31616, -581766, -685370, -163675, 334909, 170031, -411198, -666296, -464053, -351202, -539643, -584435, -275731, -112624, -469271, -904674, -849314, -503052]
36368e03052P0676j88755K4373K83623Q6226k82515k68492P7285L11150L00888
36358h8593J90508j5679l05099l52931Q1877O09555N90237J1381m85996m66560
36348b31300j61949m982p5915j59304r3329R7333K75339L00043J55591J848M309
36337A07684J16913J46585K5658j11866j43568j17206j29158j26932N8828M55430
36327B82368P83180O72309J06735m62754n91169l39859j12447p3697k7515J29557
36317C66708J99831O0557q8400o4500J010m7448q4497J1280L5135k00478m20588
36306b31390k42710J62303K74049M1501n2097J84817L28627O5142k80776k92061
36296d2595j07184p7172j11944Q9249L55258K06919l01495n05707p8979M52591
$$ y = [-503052, -432376, -621131, -596758, -313135, -226909, -509424, -777916, -700631, -389481, -88593, 101915, 86236, -218863, -571794, -489917, 119638, 709875, 721256, 235260, -231300, -393249, -398231, -474146, -633450, -726779, -629446, -354107, -54064, 101527, 103375, 107684, 224597, 371182, 396840, 284974, 141406, 24200, -104958, -231890, -173062, 282368, 1065548, 1737857, 1844592, 1381838, 790669, 450810, 338363, 264666, 237151, 366708, 566539, 627096, 538696, 474196, 475206, 427758, 343261, 354541, 389676, 189198, -231390, -474100, -311797, -37748, 3753, -48344, 136473, 465100, 530242, 249466, -42595, -149779, -226951, -338895, -249646, 105612, 312531, 11036, -494671, -573650, -121059]
36286a21059M53550L7210k30927k07572k40277m53185m97627j50661K60673L06839
36276h43036N9134p1951M3881J41660N2792k0759J36403L60241L15993Q045j88873
36265f470o1062J22195N447k91520l09408O1921L69688K31035j16484j84508N6816
36254a22350K11235Q8358j08451k03352k27407j40700J53439M06065J61429m69949
36244b51683p24847k41655L37730L26812L1130J29346M55662L11669k24401l29827
36234a80064J69065M62143J03063k75626r5924J81682q6360n65579m80389J21739
36224f46250M97718L67293J41569R1736M1963q1872p0612Q3285Q9344j01830j59984
36213B52360N3996K23509Q7128j56337j73478M9585K62416K56756J5429k60666
$$ y = [-121059, 332491, 369701, 138774, -68798, -309075, -762260, -1259887, -1410548, -1149875, -843036, -783902, -855853, -811972, -670312, -617520, -638279, -501876, -141635, 174358, 182403, -6470, -67532, 54663, 60110, -231410, -540818, -478897, -109209, 121826, 5342, -179166, -122350, 88885, 177243, 68792, -134560, -361967, -502667, -349228, 56837, 218266, -251683, -976530, -1218185, -880455, -553643, -522513, -393167, 62495, 374164, 149763, -180064, -10999, 451144, 554207, 278581, 182657, 364339, 277979, -287600, -767989, -646250, -148532, 218761, 360330, 452066, 494029, 412157, 341545, 424830, 514174, 412344, 252360, 306356, 529865, 616993, 460656, 287178, 336763, 599179, 855935, 871364, 610698]
36203F10698k62778O1362L06745R0435l38640l98955o2498R7726j55070l33384
36193c84359m5350L55002L59331J01799N8498K66090L76249K94488K34930K30544
36183A847222R1570j51429k18164n5210N4049m0759j27573k0060J19376L9760
36173A538782k15716l79816l00791o3971J56114K50546K10518P9404j07506l12146
36163H55418m26948l27164o7441R1345j0962j98052j91350J5059K09081K94318
36153B43304L17492K31887m8634l51120l40820j5163K17570J09413p8390j9154
36143B66385J61913J29327q8714j42566O9824K30111P1261k44819l57894j54012
36133e9184J54579L00545J96548n3632k71423l12539j28601J95084M37456L69994
$$ y = [610698, 347920, 409282, 716027, 806462, 467822, 68867, 6369, 104095, -50975, -384359, -429709, -74707, 284624, 386423, 444921, 711011, 1087260, 1381748, 1616678, 1847222, 1938792, 1787363, 1569199, 1513989, 1568038, 1527279, 1399706, 1379646, 1499022, 1538782, 1323066, 943250, 642459, 578488, 734602, 985148, 1195666, 1275070, 1167564, 855418, 428470, 101306, 33865, 125210, 114248, -83804, -275154, -260095, -51014, 243304, 560796, 792683, 744049, 392929, 52109, 36946, 254516, 363929, 285539, 266385, 428298, 557625, 468911, 326345, 396169, 626280, 697541, 452722, 94828, -59184, 95395, 395940, 592488, 538856, 267433, -45106, -173707, 21377, 458833, 828827]
36123H28827J1227k90953k13532R7534J71209j27482l70593j92061J61769K40026
36113C15971R9309J38269L45146K77273j46787l99993j25307L17952M12905J90060
36103A424798j2108j44318l35115m36938k14229J42229K14508K9883J6462K59864
36093I45036L40002M9421k38056j75159K0160j8006j87926j40826Q9455J23234
36083H07335j43490l49906j98855J05350J32495j81041m15716j94608L00309N14411
36073C76284K27763j55781j67754J16044K99958K92136K93025K79368J4274m00860
36063A174457n16446k21208O3406P3504P0854K47721L05314L1054j99506q213
36053A020937L11790K74190M515m8837P4115q950k60246k95414j04196q938K7580
$$ y = [828827, 840054, 549101, 335569, 433103, 604312, 476830, 106237, -85824, 75945, 315971, 415280, 553549, 898695, 1175968, 1029181, 629188, 503881, 821833, 1234738, 1424798, 1412690, 1268372, 933257, 496319, 282090, 424319, 638827, 668710, 685172, 945036, 1285038, 1334459, 1096403, 921244, 941404, 923398, 735472, 594646, 684101, 807335, 663845, 313939, 115084, 220434, 352929, 171888, -243828, -438436, -138127, 376284, 604047, 448266, 280512, 396556, 696514, 988650, 1281675, 1561043, 1575317, 1174457, 658011, 436803, 500209, 573713, 644567, 892288, 1197602, 1228656, 1029150, 1020937, 1332727, 1606917, 1611432, 1562595, 1636710, 1627760, 1367514, 1072100, 967904, 958966, 986546]
36042I86546L32127P57309P37821K19321j89054j62497n9198j52435j81594J2934
36032B301280R5535j15934k31201K8917L09640K71809J97147L83007M78720J07288
36022C826208l04431r6146N27897P71610M49992J33143J48578K16404J44989J56307
36012E974551L29323L62114J53807P5090L50666O44612O13567M77169O29863R70069
36002A0580831J060281Q20675O50507Q55457J275901J567134J618377J563735
35994A9992898J532586J573662J774258K239420K880287L414680L744518M171455
35986D1323764M990212O014472O881701P755100R215361J1370946J3642660J5694982
35978A16889198J8007307K1019441K4073628K5667927K4425126J9437282J0363287
$$ y = [986546, 1318673, 2075982, 2813803, 3033124, 2844070, 2681573, 2622375, 2469940, 2288346, 2301280, 2396815, 2280881, 2049680, 2078597, 2388237, 2660046, 2857193, 3240200, 3718920, 3826208, 3521777, 3425631, 3953528, 4725138, 5175130, 5308273, 5456851, 5673255, 5818244, 5974551, 6303874, 6665988, 6819795, 6894885, 7245551, 7890163, 8503730, 8980899, 9610762, 10580831, 11641112, 12461787, 13112294, 13967751, 15243652, 16810786, 18429163, 19992898, 21525484, 23099146, 24873404, 27112824, 29993111, 33407791, 37152309, 41323764, 46313976, 52328448, 59210149, 66965249, 76180610, 87551556, 101194216, 116889198, 134896505, 155915946, 179989574, 205657501, 230082627, 249519909, 259883196]
35971B59883196j743464j3870514k2488835k6093461k5894410k3951614k1339867
35964A24501031j8308786j5260665j2730061j0749316q945600p214144n839633
35957D5452826m986400m448672l947773l417721k933829k520571k112939j672653
35949A9412268j295753j125026j109961r95619o98392n25806p63590j188479j337521
35940A0372121j161201r98567r57789q00451m71572k40998k08339j61698p5133
35931E296373k22727n77885o39284j84186K92271K79560m1367k17761k42126l55245
35921C387623m74062l66395j63434j57914k52356j29947J35675J60483j02540
35912B037133k89539k23299j30628j70444j40393J63251N40139N38040l1297p77878
$$ y = [259883196, 258139732, 244269218, 221780383, 195686922, 169792512, 145840898, 124501031, 106192245, 90931580, 78201519, 67452203, 58506603, 51292459, 45452826, 40466426, 36017754, 32069981, 28652260, 25718431, 23197860, 21084921, 19412268, 18116515, 16991489, 15881528, 14885909, 14187517, 13661711, 12898121, 11709642, 10372121, 9210920, 8212353, 7254564, 6454113, 5982541, 5741543, 5533204, 5371506, 5296373, 5073646, 4495761, 3856477, 3672291, 3964562, 4244122, 4202755, 3984994, 3742868, 3387623, 2913561, 2547166, 2383732, 2225818, 1973462, 1843515, 1979190, 2139673, 2037133, 1747594, 1524295, 1393667, 1223223, 1082830, 1246081, 1786220, 2324260, 2292963, 1515085]
35902A515085r96377m09050L77261M88251p4664l86590O7791N92058L20517m43360
35892A050922o77507j38201M21292M42299J55568q1633k64351l54136j21844L15629
35882G48038M06581k8603m22772k80601R6659J48737p2411q4974K07641M00413
35872A118708K20908j30818l13700k43474q9663k1038k1525M6890J97799K42777
35862A006864Q9761k7721J09603K62793L2139m42997n72593j87367J86357J14304
35852E71143j71432k57114j46749l4742J00755K73770K27559j51378m57214k76591
35842c21993J66839L55056K41434J60659J55720k3424l15945l29584J7431L37705
35832D43898L60272K32729J31218M235j41224j13094Q9922J34300j56980m58546
$$ y = [1515085, 518708, 109658, 486919, 975170, 900506, 513916, 581707, 1173765, 1494282, 1050922, 373415, 235214, 656506, 1098805, 1254373, 1172740, 908389, 554253, 432409, 748038, 1154619, 1126016, 703244, 422643, 519302, 668039, 595628, 510654, 718295, 1118708, 1339616, 1208798, 895098, 651624, 561961, 540923, 519398, 566288, 764087, 1006864, 1096625, 1068904, 1178507, 1441300, 1473439, 1030442, 457849, 270482, 456839, 571143, 399711, 142597, -4152, -38894, 61861, 335631, 563190, 411812, -45402, -321993, -155154, 199902, 441336, 601995, 757715, 734291, 418346, 88762, 106193, 443898, 804170, 1036899, 1168117, 1172352, 1031128, 918034, 1007956, 1142256, 985276, 526730]
35822E26730l74484o031K03120O0985k02077k97729j76539M9661K91027M94890
35812E69553N63827L83214j3374l67064m17283k26717j25902k58648l77791k44431
35802e14616j1819M6497L123J17110L18176K63999q8303l68406l18920p5077J55168
35791d73068L15561L13213K9533l11693k27679L07939O54792L63037j47231k13956
35781F10448Q4494J36216k02797m32510k32552J03555J94702P9186j067K0216
35771C59891P3882J26516J50978J21193J19418K28548K84175L8535l64515m53080
35761F85541j14750J73404M1514k33058k15750R566Q8036L1088Q6417J56976o2384
35750F46600m19116l85680R2773M10341J85880j75001j33770J90723L04902J09347
$$ y = [526730, 152246, 146215, 349335, 410320, 208243, -89486, -266025, -216364, 74663, 569553, 1133380, 1516594, 1503220, 1136156, 718873, 492156, 366254, 107606, -270185, -514616, -526435, -479938, -476815, -359705, -41529, 222470, 134167, -234239, -553159, -628236, -473068, -157507, 155706, 185239, -126454, -354133, -46194, 608598, 971635, 824404, 610448, 694942, 831158, 628361, 195851, -36701, 66854, 261556, 340742, 339675, 359891, 433773, 560289, 711267, 832460, 951878, 1180426, 1464601, 1503136, 1138621, 685541, 570791, 744195, 785709, 552651, 336901, 346467, 434503, 465591, 552008, 708984, 646600, 227484, -158196, -65423, 344918, 530798, 355797, 222027, 412750, 717652, 826999]
35740H26999p8641j02059j09231j71258j57635l4763K9761o2034j98422k50112
35730c07395k09391r8792P4320K32184K63495J81187R5464K3261j05709k47544
35720i8920k48226r0241N7416R6798J23065K10537K59162J66470J463j14423j74460
35709A88641k15290j95373q4216J0809m5246k12445l05937k20875l4502J19936
35699i94498K00877K44442K48997J48454o0580k21135j61158N2775J47919k616
35689c96523k07825k39559j16000M2057K35514M35038M11248O0883k47951q7319
35679a10437L38496L98967l2594l77794k30873Q6777J24551k3390k8688P1546
35669B16561L7406q3378q2033j5472p3780j67026o4852J62141K47354J78945J37257
$$ y = [826999, 748358, 646299, 537068, 365810, 208175, 173412, 203173, 141139, -57283, -307395, -516786, -615578, -541258, -309074, -45579, 135608, 231072, 254333, 148624, -98920, -347146, -437387, -379971, -283173, -160108, 50429, 309591, 476061, 477524, 363101, 188641, -26649, -222022, -306238, -295429, -340675, -553120, -859057, -1079932, -1114434, -994498, -793621, -549179, -300182, -151728, -212308, -433443, -594601, -541826, -393907, -396523, -604348, -843907, -959907, -917850, -682336, -247298, 163950, 224833, -23118, -110437, 228059, 627026, 594432, 216638, -14235, 72542, 197093, 173703, 145015, 216561, 253967, 170589, 88556, 73084, -696, -167722, -232574, -70433, 176921, 355866, 493123]
35658D93123P3843j92642m99507m46678l2490K79124K39567J26863K05971K89270
35648E36444R4523k75029m98934m77570l43306j87767j5020J30096J89323K01797
35638f45443K47573L10524K92281J47251m3660j36486q4918l5491j46169k78895
35628c73433j08209L16013M32427o4385o11923m61228K06570N00309J30248k43939
35618b77550j41039M6149j20096l15086q6490K57446J37660k76432l24020N9295
35608a040163L01759K00950J78222M05209M26894l7226n35541n45210k30725r2915
35598i68746j94223k00183J0930K23220K77789K23238J13423k9923p3160J16324
35588e01311L94474M37620J63599j60552k81716k29076j55915j07784m8101L6804
$$ y = [493123, 566966, 374324, -125183, -571861, -604351, -325227, -85660, 41203, 247174, 536444, 630967, 355938, -142996, -620566, -963872, -1151639, -1166659, -1036563, -847240, -645443, -397870, -87346, 204935, 352186, 308526, 172040, 87122, 51631, -94538, -373433, -481642, -165629, 266798, 202413, -409510, -870738, -664168, -163859, -33611, -277550, -418589, -372440, -492536, -807622, -894112, -636666, -499006, -775438, -1099458, -1040163, -738404, -537454, -359232, 45977, 472871, 435645, -99896, -645106, -875831, -968746, -1162969, -1363152, -1352222, -1129002, -851213, -627975, -514552, -544475, -617635, -501311, -106837, 330783, 494382, 333830, 52114, -176962, -332877, -440661, -488762, -451958]
35578d51958J53950K93985L32736J13618k56735l90703j04489K36338J49080k60373
35568a84551l84492K6186M59528L37461j61012l42651L8397M65445L86411q0197
35558E60525l81216k58211L8855J92365J80790J29254K7579k01162m37675m09453
35548e58349o7952K46523J77540j81319l73424j37407K90456M87990L13070k8059
35538A69069k44377j76444J38076M72715N54223L21854n264k03135k80738l33385
35528D12594l09222j26524P9853Q3555q7945j74248o5586N9807L8253l9441N036
35517a23868J58124K13783K7825k60644k98857Q2153N40870N26130J2099l65635
35507E11980j55716K43061J73473k80067m52878j54449Q5722r1632l57268k97142
$$ y = [-451958, -298008, -4023, 328713, 442331, 185596, -205107, -309596, -73258, 75822, -184551, -569043, -542857, -83329, 254132, 93120, -249531, -211134, 254311, 640722, 560525, 179309, -78902, -40047, 152318, 333108, 462362, 489941, 288779, -148896, -558349, -626301, -379778, -202238, -383557, -756981, -894388, -603932, -115942, 197128, 169069, -75308, -251752, -113676, 359039, 913262, 1235116, 1229852, 1026717, 745979, 412594, 103372, -23152, 56701, 140256, 52311, -121937, -187523, -127716, -89463, -128904, -123868, 34256, 248039, 275864, 15220, -283637, -201484, 339386, 865516, 877615, 511980, 356264, 599325, 772798, 492731, 39853, -114596, -28874, -120506, -477774, -774916]
35497g74916j8687J43272J17912R793j29760j91635j2760K83970L21716O0438
35487a90657o2592J66732L67850K15354l6084q5952j46353m48870o55716l83754
35477a260042N9978J37646l2254L9078K86355K34381p3806j09629J88946K92435
35467b36912O782k18994r4475Q3742M7741n902J23715K69469K59902K00292J55533
35456E90893j2483k86085m04624l15396k63002k76984p7223L34614N40556L80013
35446B10279J85502J12143j20646n08519n10189J3133L26291p8969n71128l49636
35436a291739K34622K70480j90461k60571K67583N97944K56473k12350k02473
35427e30492Q0735J46956K1801J7899J08588K7923k15962l34308j78798J02701
$$ y = [-774916, -793603, -650331, -532419, -522626, -652386, -844021, -856781, -572811, -251095, -190657, -253249, -86517, 281333, 496687, 460603, 374651, 228298, -220572, -876288, -1260042, -1200064, -1062418, -1094672, -1055594, -769239, -534858, -608664, -718293, -529347, -236912, -230130, -449124, -543599, -459857, -412116, -418018, -294303, -24834, 235068, 435360, 590893, 578410, 292325, -112299, -427695, -690697, -967681, -1044904, -710290, -169734, 210279, 395781, 507924, 387278, -121241, -631430, -618297, -292006, -370975, -942103, -1291739, -1057117, -786637, -977098, -1237669, -970086, -372142, -115669, -328019, -530492, -449757, -302801, -281000, -263101, -154513, -126590, -342552, -676860, -855658, -752957]
35417g52957K80358K45486O1901p8934k8480J31290J64991j4259k30493k61155
35407d82252o2508K23318L75629K39316r8306l13779j96142M9746L9773k73660
35397d98865n32485m28974l5230L47441M92157L71019J32433j2366J2296P3308
35387g9266L8164l6420n8193j00990k35501k84967l9711L42373M52283J57410
35377A55182k38883l78524j76518K05790M87723M12002R178l21565k45506O0572
35367c0549J67581j930j72841k23882k71292k88009j11159J40480J37993r0110
35357g43718j49945M5990J19193q8183k12032j7631J80185R9935m031J44161K74406
35346c51670L3237l42349l68667p5845J23371J30197J74726K64345J67039r7808
$$ y = [-752957, -472599, -227113, -165212, -244146, -272626, -141336, 23655, 9396, -221097, -482252, -544760, -321442, 54187, 293503, 195197, -118582, -314724, -264978, -225205, -498865, -1031350, -1460324, -1495554, -1148113, -655956, -284937, -152504, -164870, -152574, -79266, -41102, -77522, -135715, -236705, -472206, -757173, -796884, -454511, -2228, 155182, -83701, -462225, -638743, -432953, 54770, 466772, 475950, 154385, -91121, -30549, 137032, 135102, -37739, -261621, -532913, -820922, -932081, -791601, -653608, -743718, -893663, -847673, -728480, -816663, -1028695, -1046326, -866141, -766206, -770237, -626076, -351670, -318433, -660782, -1029449, -1105294, -981923, -851726, -677000, -412655, -245616, -343424]
35336c43424k45626j97938j38007j22055n0998J8958k4891o292K91518N79281
35326b39474L50061k39250m19657O2541N01848K60037l23347n17695k57913m8908
35316h71757q9640r4491Q8941K18282Q7348j64166k78916j61355J29306M39039
35306f97409N39378L15959k4548j59248r6189j56938m27214n21553j16504N01029
35296h43237P30609M17734q125j78105k31424m42410o70889n16160N8256N84168
35286a099583O43018L16986j7455j31464l5815J74375L62544L61879J48507p1215
35276F51777j14009o6557j04327j86614j66965j04094j71338l01089k28685R2825
35266f99076M04941N00576L99307J56902j84721m26722l56067j39231j76838m34678
$$ y = [-343424, -589050, -786988, -924995, -1047050, -1098048, -1079090, -1103981, -1110273, -818755, -239474, 110587, -128663, -548320, -485779, 16069, 276106, -47241, -564936, -822849, -871757, -961397, -1055888, -966947, -748665, -661317, -825483, -1104399, -1265754, -1136448, -697409, -158031, 157928, 133380, -25868, -122057, -278995, -706209, -1227762, -1344266, -843237, -112628, 305106, 296981, 118876, -112548, -554958, -1225847, -1742007, -1683751, -1099583, -456565, -139579, -157034, -288498, -324313, -149938, 212606, 574485, 722992, 651777, 537768, 471211, 366884, 180270, 13305, -90789, -262127, -563216, -791901, -699076, -294135, 206441, 605748, 762650, 577929, 151207, -204860, -344091, -520929, -955607]
35256i55607l74619K00709P01562N46254J2324k07398j0092J30587J7207n5319
35246E608O5570J27472j7774j30439r582J85817K49010K24412J86340K8786k81976
35235F33244n01170m12070j52713k203L563J7666P0474M3381r9647k31271k05708
35224h36454r135K00431K05632j0657j55389L0869L58080M04993J51260j960O9449
35213D07119k0787m46424p04354l26024L24865N31278K55900P1241J74250J54398
35203D21462j81279m08931j82254J90610K31237r065j25288n817Q5336j9601j71564
35192a75154j78020p5097m9576j78684l08567k16611Q8886L12236K23887r400
35182e66100l0349K23916M68834M81709L04274L4399k77612m67104l25009L2962
$$ y = [-955607, -1330226, -1129517, -427955, 118299, 130623, -76775, -86867, 43720, 60927, 5608, 71178, 198650, 180876, 50437, 40855, 226672, 475682, 700094, 886434, 915220, 633244, 132074, -279996, -432709, -434912, -431349, -413683, -343209, -299828, -399475, -630746, -836454, -845589, -645158, -439526, -450183, -605572, -574703, -216623, 188370, 339630, 337670, 407119, 386332, -60092, -764446, -1090470, -765605, -234327, 21573, 92814, 267064, 421462, 240183, -168748, -351002, -160392, 70845, 61780, -63508, -69325, 16011, -3590, -175154, -353174, -428271, -477847, -656531, -965098, -1181709, -1092823, -780587, -556700, -566100, -596449, -372533, 96301, 578010, 882284, 916683, 639071, 171967, -153042, -120080]
35172a20080J79761n7104l31172k87887n2529N5590K9583O3642J34671O5626r5345
35161d15244j04549J01287L34488M23160L06867m9986n46857q10383n14239J36528
35151a138928N56967M88512K57351K17709K40415j1371m85706p16551m03307J74865
35141h20044M32411J29824l39509l86500Q5178N67984N74671K04594o4715j6289
35131C67605J24776J28677J06072K71393N21367M89326O4267l29196j81737L93490
35121A956040O79752K32100n26317q72152p15107n18215m42698k00103K04472
35112b02228K99430j1671j34208K28106M18084j75282r85784r70510j31020N34610
35102a130473M62247N4214j92492k46590j40823J81637M39736J93119l33037l60441
$$ y = [-120080, 59681, 2577, -328595, -616482, -669011, -613421, -583838, -520196, -385525, -319899, -415244, -519793, -418506, -84018, 339142, 646009, 596023, 49166, -761217, -1275456, -1138928, -581961, -93449, 163902, 381611, 622026, 610655, 124949, -591602, -994909, -820044, -387633, -257809, -597318, -983818, -898640, -330656, 244015, 448609, 383894, 367605, 492381, 621058, 727130, 998523, 1519890, 2009216, 2073483, 1744287, 1562550, 1956040, 2635792, 2867892, 2341575, 1469423, 754316, 236101, -206597, -406700, -202228, 97202, 85531, -48677, 179429, 597513, 422231, -563553, -1534063, -1665083, -1130473, -668226, -614012, -806504, -1053094, -1193917, -1012280, -572544, -379425, -712462, -1072903]
35092a072903K34524O19686K93972j38570k9603K47112L3783m19280l81268J16580
35082d95967L61722J17771j29434p1481K0744q5268j79517l4094K07022K71139
35072a7363J12179r8411j51620K8582K33081J12785l11438n09987j47102L29553
35062d19741K71994j91921l46790K9444M11308M04293K33281J61078K3240l19288
35052B56898n50558l49512N5399J97835K9243j12708m7289R0683J61710J72350
35042i5949J22728k9608k11536k46387r5602N6785M0833q0318j18684k2386Q7360
35031e92764J25936J52208K04600J73354j3101j84256j34585K4861L724j85262
35021d25285k22286k4534J01076J5626K9362L22935M97893J57525l66714m08002
$$ y = [-1072903, -838379, -218693, 75279, -63291, -92894, 154218, 188001, -231279, -612547, -495967, -134245, -16474, -145908, -217389, -196645, -281913, -461430, -495524, -288502, -17363, 94816, -3595, -155215, -126633, 106448, 219233, -92205, -602192, -749294, -419741, -147747, -339668, -686458, -657014, -245706, 158587, 391868, 552946, 576186, 256898, -293660, -643172, -587773, -389938, -360695, -473403, -520692, -430009, -268299, -95949, 26779, -2829, -214365, -460752, -556354, -499569, -458736, -539054, -657738, -680124, -592764, -466828, -314620, -110020, 63334, 50233, -134023, -268608, -243747, -240023, -425285, -647571, -672105, -571029, -555403, -526041, -203106, 294787, 452312, 85598, -322404]
35011c22404P3327M48655K89900j94049n75048o22688l02613K20090N48947M09846
35001b6037N1046o3804Q7264J43912J2938l8783O5137R3975p244m4081m4505k41416
34989a1598m89066l19448K36381N20818K10747k18406l13425k82528l85647l27147
34979a379319J59387O49642O15597K76503J94524L38183K36762j58214m48074
34970D84991m77447m06605k17209J96257N19283K94207k76058m74963j17541K05008
34960b70077R0036j19200k9215J38147p889l45507m52583k23372J19836M20032
34950f79792O19023N55584J21342m11982n55643j81171K68676K69898j60793m58944
34940f13802j80141M00852N46715j8938o79921o56350J5282N85132N80713K50437
$$ y = [-322404, -249077, 199578, 489478, 295429, -279619, -902307, -1204920, -984830, -435883, -26037, 25009, -38795, 48469, 192381, 205319, 166536, 231673, 325648, 318404, 274323, 229818, -11598, -500664, -820112, -583731, -62913, 147834, -70572, -383997, -666525, -1052172, -1379319, -1219932, -570290, 45307, 321810, 516334, 854517, 1091279, 933065, 484991, 7544, -399061, -616270, -420013, 99270, 393477, 117419, -357544, -475085, -270077, -180041, -299241, -328456, -190309, -198198, -543705, -996288, -1219660, -1099824, -679792, -60769, 494815, 616157, 204175, -351468, -532639, -263963, 5935, -154858, -613802, -793943, -393091, 153624, 134686, -545235, -1201585, -1186303, -601171, -20458, 229979]
34930B29979j6755k07155l82791l19700J27237N63190M44403j40269n16988l03073
34920e21922J48439L15720J73226L1360l4664k13312m81740n09779j72247J63656
34910a101263J15918j65054k40229k7978J76009K61412M17992O10699M56540j02131
34900D01915m66789j63451L92320M50454K4001j89870P8170L05344P1857k86689
34890F17262k54805P9607K29615K7777k53185l52689k62127r1736L3364J710j39575
34879c64782j40882J32104M20378L65747K9599j75188p9857L8077l8248q5152
34869A01796J61238M58231L24035j87057m34131r4359K90090N8550n46714o62369
34859e30690o1898M87723L31062j86332l48415j26666j5732r6234K6989L91038
$$ y = [229979, 213224, 6069, -376722, -696422, -569185, -5995, 438408, 298139, -218849, -521922, -373483, -57763, 115463, 146823, 112159, -101153, -582893, -1092672, -1264919, -1101263, -985345, -1150399, -1390628, -1418606, -1242597, -981185, -563193, 47506, 504046, 401915, -64874, -228325, 163995, 614449, 638450, 448580, 526750, 832094, 903951, 617262, 362457, 442064, 671679, 699456, 446271, 93582, -168545, -260281, -226917, -225207, -364782, -505664, -373560, 46818, 412565, 442164, 266976, 187119, 225196, 186948, 101796, 263034, 721265, 1045300, 858243, 424112, 329753, 619843, 678393, 131679, -530690, -592588, -104865, 226197, 39865, -308550, -435216, -450948, -547182, -520193, -129155]
34849a29155M87625R5059k98200k21186R1957J28550j31952k96473j87281K1628
34839d39428J79882K97269L47371K55428Q7984L581J3195L485k8911j568J2975
34828G31263j57811m42231m99897j70226K53328L60504J10456j77321k39809j19006
34818c50750j2331j1484l4239M4779K31954L74569K97828N448k87413l64738k21163
34807c27540r970J62029K71166K51812L9417k10237j86129J24734K79772l3171
34797C61883m37056l21313K08908L78897j23909o15617l66677L57044O97026L55608
34787D94794j90174m56690l84599p8722L21926M89412J54707l95506n56763k44386
34777h46001J0148p5430j50353M9424K05595M3431r9695J28139L83451J69260
$$ y = [-129155, 358470, 453529, 155329, -65857, 26100, 154650, 22698, -273775, -461056, -439428, -259546, 37723, 385094, 640522, 728506, 732087, 745282, 748767, 719856, 718288, 731263, 573452, 131221, -368676, -538902, -285574, 74930, 185386, 8065, -231744, -350750, -363081, -374565, -408804, -364025, -132071, 242498, 540326, 545774, 258361, -106377, -327540, -337510, -175481, 95685, 347497, 386914, 176677, -9452, 115282, 395054, 361883, -75173, -396486, -187578, 191319, 67410, -548207, -914884, -557840, 139186, 494794, 304620, -152070, -536669, -615391, -293465, 195947, 350654, -44852, -601615, -846001, -835853, -911283, -1061636, -1012212, -806617, -763186, -862881, -734742, -351291, -182031]
34767a82031k38988j52067M01820O74372L45149p6627j68266j89558m14407n08892
34757e09495j19501L71129L25155j47936l31814J393K86045R5589k16494j52610
34747c98539J13103O0555k86248l70119J8622M08370L51121J9322j67370j57214
34737d08397j57496j67783l6411J52505J66222M7326M7336J44170N7626j89697
34727c44599j95835J44890L39154L995m72890m26803J22669M75553J91362l89647
34717e52151o59946m55039p2639K05441L72852N22856O09699M97633K02542n6935
34707F14313j30773j47166k83951m11009k32342J90100L74770N1780m11202m69873
34697h55353j02805K41942K81235J58576J02702J35749J81063K09058J69935k8270
$$ y = [-182031, -421019, -573086, -171266, 503106, 848255, 771628, 603362, 413804, -603, -509495, -628996, -257867, 67288, -80648, -412462, -411069, -125024, -29435, -245929, -398539, -285436, -224881, -511129, -881248, -862626, -454256, -103135, -83813, -251183, -408397, -565893, -733676, -770087, -617582, -451360, -404034, -356698, -212528, -154902, -344599, -540434, -395544, -56390, -52395, -525285, -952088, -829419, -353866, -162504, -552151, -1212097, -1667136, -1739775, -1534334, -1161482, -638626, -28927, 468706, 671248, 614313, 483540, 336374, 52423, -358586, -590928, -400828, -26058, 25722, -385480, -855353, -958158, -716216, -434981, -276405, -173703, -37954, 143109, 352167, 522102, 493832]
34687D93832l49906n71641n13229k47072J1704J44207J66574J15798L1920J1841
34677g05972J19755K28174J21201j64004k82444l9321K62707K14470o8068r5713
34667d09215K02963L23105o791l56614k89676o4150j23660k73857m6043L63624
34657f80314L18149j50779k98782J23963M40846J42332l32601l66572q3049N3790
34647h33017M7230J69316L27287K38527j792p1367L8293J04072J22642K31705
34637C72896L34218K27383j6618j65666j83378j55735o4978N2604r759k47107
34627A43860k68630R3785L70939J41762k46401k43575k9774j55981n07509m41949
34617a143473J23200N47242M25288K3243k92478m20197k83091J39356M89998L54608
$$ y = [493832, 143926, -427715, -940944, -1188016, -1176312, -1032105, -865531, -749733, -717813, -705972, -586217, -358043, -236842, -400846, -683290, -722611, -459904, -245434, -313502, -409215, -206252, 116853, 110062, -246552, -536228, -600378, -724038, -997895, -1043938, -680314, -362165, -512944, -811726, -687763, -246917, -104585, -437186, -803758, -886807, -833017, -785787, -616471, -289184, -50657, -52449, -123816, -85523, 18549, 141191, 372896, 707114, 934497, 917879, 752213, 568835, 413100, 348122, 400726, 390967, 143860, -124770, -30985, 339954, 481716, 235315, -8260, -38034, -194015, -701524, -1143473, -1020273, -473031, -47743, -24500, -316978, -737175, -1020266, -880910, -390912, -36304]
34607c6304o6678k13161n6055m7536k13908j13285K39074K77398j00568k97223
34597f28246o1371R4468j28968k84956o6316J14028l9955r2028K74836N30904
34587b87604J47990m55555n80137l15520j69635j09678J95190N47721M88394J44133
34577c94701K1322J30361O2536j97172k58986n5797Q3983M9677L7836Q4791O8815
34566c67335Q8206K74714L55460J7395m09642l23718J49556K68409j66134n17014
34556f30103l47738k8294k016q3746Q6149L59288L19048o7882m27729m62957j96378
34545a482358J53527L53123K97314R4404m7870m4267L3344Q8676N2125j00648
34535f02630k30399q1346L50624O66997N33344J16683k14148l90915n02644m19350
$$ y = [-36304, -102982, -316143, -372198, -419734, -633642, -746927, -507853, -230455, -331023, -628246, -689617, -595149, -724117, -1009073, -1075389, -961361, -1001316, -1093344, -818508, -287604, -139614, -595169, -1175306, -1490826, -1660461, -1770139, -1574949, -1027228, -538834, -394701, -373379, -243018, -180482, -377654, -636640, -692437, -608454, -558777, -520941, -436150, -367335, -279129, -4415, 351045, 368440, -41202, -364920, -215364, 53045, -113089, -630103, -977841, -1006135, -1008151, -1091897, -1005748, -646460, -327412, -395294, -823023, -1285980, -1482358, -1328831, -975708, -678394, -583990, -631860, -676127, -642783, -554107, -501982, -602630, -833029, -914375, -563751, 103246, 636590, 753273, 539125, 148210, -354434, -773784]
34525g73784l6566L09667K18997j10769j59432P5391J20235j39579l16925k43485
34515a056250j73720j77491K00L10553L01974j09554m05168k80184p6231p2698
34505a738569J8642M22786P50558N97801K18518O9470R3910n645j51186j06358
34495A69927J468o0342j18337Q6887L07677J31421k52263k71674J04794L00466
34485D00024K4331l44671l83989j43440J06527K12448Q8604k59550n15319k65368
34475a080403L66122O86966L07923k88595l78177N9728M06162K80415m6903j47210
34465A66028o135O9472o2132k06102j42736N6631J43928O3118L1855J97531L79890
34454F91348L25000J07003K6511J19383O3707k94964n98832m30830N1441K92319
$$ y = [-773784, -810350, -500683, -281686, -392455, -551887, -476496, -356261, -495840, -812765, -1056250, -1229970, -1407461, -1407261, -1096708, -794734, -904288, -1309456, -1589640, -1665871, -1738569, -1719927, -1297141, -546583, 51218, 269736, 339206, 433116, 427471, 276285, 169927, 171395, 111053, -7284, 79603, 387280, 518701, 266438, -5236, 99558, 400024, 424355, 79684, -304305, -447745, -341218, -128770, -40166, -299716, -815035, -1080403, -714281, -27315, 280608, -7987, -386164, -326436, 79726, 360141, 313238, 166028, 159893, 229365, 167233, -38869, -181605, -124974, 18954, 82072, 113927, 311458, 691348, 1016348, 1123351, 1149862, 1269245, 1332952, 1037988, 439156, 8326, 59767, 352086]
34444C52086J21154l9796J23376L10318J19196k50785k91669k8850N755l19491
34434A01294m65339j03339K97479K00741j34264r7280K64161L44515k5457l51881
34424C0630k93323r0203k0519K6021J84187K82179J63783k0497j10584j94122
34414d2448l14987k71455m093J46316p0361l42555k25558J61882L11415R3709
34404e58135q9241N8965L22124L29484O5968j41204l7972K69377M32006K37099
34394H88471j55503m03122l70574k11341q2306L1901J70825K73735K88346K40306
34384F70738J32184n0571j90804j21303P7683J10670j07134l09463k76682j12601
34374a77283j036L6427J384j59875l23907j94759K43867N83918N33381K97030
$$ y = [352086, 473240, 433444, 556820, 867138, 986334, 735549, 443880, 415030, 420785, 101294, -364045, -467384, -169905, 30836, -103428, -200708, 63453, 407968, 382511, 30630, -262693, -352896, -373415, -347394, -163207, 118972, 282755, 262258, 151674, -42448, -357435, -628890, -632983, -486667, -557028, -899583, -1125141, -963259, -651844, -558135, -647376, -588411, -266287, 63197, 129165, -12039, -50011, 219366, 651372, 888471, 732968, 329846, -40728, -252069, -334375, -302474, -131649, 142086, 430432, 670738, 802922, 752351, 561547, 440244, 517927, 628597, 521463, 212000, -64682, -177283, -178319, -141892, -140508, -300383, -624290, -819049, -575182, 8736, 542117, 839147]
34364H39147J68585P6231j46909l49104k93725o8244R6291J88281K54547J36195
34354I01295k31294m90933k95783J04050J75385j12449k84060q6990K17731L04151
34344B01103J49270q0746k26964k08701r7129n6093p5000M1680K66490K63475
34334A77385m4021k32992n9898R0738q8941j99491J40091M49833J25018m05742
34324d8020k80826L12968M08524j02043l44422n9612M874l78649l66528L60146
34314d93588P38890j0176r42702p41322K96381Q27903M59901n3878k50687l64138
34304e33416m31069j66485K18198J32420l00987k55655M39416Q84863M53089k83348
34294A57026m85258k15871o0889j13594l3325J98979K62117J12780L9634J02657
$$ y = [839147, 1007732, 1083963, 937054, 587950, 294225, 225981, 322272, 510553, 765100, 901295, 670001, 179068, -116715, -12665, 162720, 50271, -233789, -320779, -103048, 201103, 350373, 269627, 42663, -166038, -263167, -319260, -394260, -352580, -86090, 177385, 133364, -99628, -159526, -68788, -157729, -357220, -217129, 232704, 357722, -48020, -328846, -15878, 392646, 290603, -53819, -113431, -108557, -487206, -853734, -493588, 245302, 235126, -707576, -1448898, -1152517, -324614, 135287, 81409, -169278, -533416, -964485, -1130970, -912772, -780352, -1081339, -1336994, -897578, -12715, 440374, 157026, -328232, -544103, -604992, -718586, -751911, -552932, -290815, -178035, -138401, -35744]
34284c5744K0407k89685m82112k84057Q5925K46095J91687K11477L51865L02564
34274C18422r3558n03702n09270j70472J09344J90677K98713M89110M33530m2605
34264E20189n42395n49915j10096K68132K72342M1836j65414k49583k10178p0867
34254g95949Q8605J90777K52707K93511K24840M389j91779j63630J4433J05771
34244B3675N3723j1799k8924j4791R0724K97571L57468L4134m45224n91053l31436
34233e65932r0009j09762j42960O682Q5387j40370l74835j82461L20657N98443
34223e95160M33430J35926J6904K1111k0681p8941m2701M0875M1596k1692J458
34212f7875J42335K14605M5968k49068l48674j13532K14675L15157J95992J12810
$$ y = [-35744, -15337, -305022, -787134, -1071191, -985266, -739171, -547484, -336007, 15858, 318422, 224864, -278838, -788108, -958580, -849236, -658559, -359846, 129264, 562794, 520189, -22206, -572121, -682217, -414085, -141743, -99907, -265321, -514904, -725082, -795949, -707344, -516567, -263860, 29651, 254491, 258880, 67101, -96529, -82096, 23675, 77398, 65599, 36675, 21884, 112608, 410179, 767647, 801781, 356557, -234496, -565932, -655941, -765703, -908663, -901981, -816594, -956964, -1331799, -1514260, -1193603, -595160, -161730, -25804, -8900, 12211, -8470, -87411, -130112, -89237, -47641, -69333, -67875, 74460, 289065, 335033, 85965, -262709, -376241, -161566, 153591, 349583, 462393]
34202D62393J28010K7854k49265m02002j97027J22640J60737m9960j43795l7562
34192a77977l8205k62257l61639o4092L37242L75217Q8553p8991K2156O6054j66681
34181b60620m10518l23099N726K21905K13044J55922J42064O2003j10711j92790
34171d97074p0909P9970K0982k07615l27496j77848R9788K49376J82492L1714
34161f16620k2122P9662K51641L43463K29967r0182m12750m26007m4146L76585
34151c30509L56328j06482m56204k50340K74591N30762L37277N7212J8757J20038
34141E51430R3371r5786k67860k91879j87548m5536O4742J48895K55248L31751
34131E56828K02998j45455l64349j20804L40876L96849r6653n39492m14540o618
$$ y = [462393, 590403, 618257, 368992, -33010, -230037, -107397, 53340, 3380, -140415, -177977, -216182, -478439, -840078, -904170, -566928, -191711, -103158, -182149, -159993, -93939, -260620, -671138, -994237, -988511, -766606, -553562, -397640, -255576, -193573, -304284, -497074, -567983, -488013, -467031, -674646, -1002142, -1179990, -1080202, -830826, -648334, -616620, -638742, -559080, -307439, 36024, 265991, 175809, -236941, -662948, -707094, -330509, 25819, -80663, -536867, -787207, -512616, 18146, 355423, 412635, 431392, 551430, 644801, 549015, 281155, -10724, -198272, -243808, -179066, -30171, 225077, 556828, 759826, 614371, 250022, 129218, 470094, 866943, 770290, 230798, -183742, -190360]
34121a90360P2846k02777l21353o5564K21968K63254K50132M03524N07268K35870
34111A174808k57078m73927k68049l8127j14414k66833q8741L30388M92906K22966
34101G13899r8666j57434j59969l71022n41301k68582K55428M13919Q0559j75693
34091c08862N2968M38746M60847J31895j42643j59267n2267o934q6078k12123
34081A16282j77579J35748M53809L31662j82990m94933k98011l3137j65763m45144
34071g60056l69821k1075J54568J21656J71360K43503L0296l04204k23706K87618
34061f69861O03238L91913O1374L7116J74676J88425J42178J49444L4921k99787
34051H13637n41400m12784j51987j24962k22129r0952K24139L51152K08312R8773
$$ y = [-190360, -117514, -320291, -641644, -707208, -485240, -221986, 28146, 431670, 938938, 1174808, 917730, 443803, 175754, 137627, 23213, -243620, -332361, -1973, 490933, 713899, 615233, 457799, 297830, -73192, -614493, -883075, -627647, -213728, -133169, -308862, -255894, 182852, 643699, 775594, 632951, 473684, 421417, 414483, 328405, 116282, -61297, 74451, 528260, 859922, 676932, 181999, -116012, -149149, -314912, -760056, -1129877, -1150952, -996384, -874728, -703368, -459865, -429569, -733773, -957479, -669861, -66623, 325290, 386664, 423780, 598456, 786881, 929059, 1078503, 1113424, 813637, 272237, -140547, -292534, -417496, -639625, -730577, -506438, -155286, 53026, 151799]
34041A51799J89345K94046K35290Q0416p2679k52577m40415m90037l61174k22472
34031h88458j71784n1193K61671N44977M84653J52643p3993p7498j35421l63807
34021c18210l97399M9240N78680N43564k1274m13780k44668J21012K47420K14851
34011C59436K36965J91744m9999k32760j21985L3387o5380j87005J9041L04216
34001D87660J45092l92641p51422p09097m69626q2591M81481P78152K86345n85863
33991h12510p97228j64065L56052J69792j20897J12137M55811K90726p4833O177
33981e78838L40166K38542k81001n35403k70898Q0241J90753J87466J97213J51636
33971b80123R4144J71936K82574J66218j40786l33650k88816j35803J8284Q4611
$$ y = [151799, 341144, 635190, 870480, 950896, 878217, 625640, 185225, -304812, -665986, -888458, -1060242, -1111435, -849764, -304787, 179866, 332509, 258516, 181018, 45597, -318210, -715609, -666369, -87689, 455875, 434601, 20821, -223847, -102835, 144585, 359436, 596401, 788145, 738146, 505386, 383401, 416788, 351408, 164403, 183444, 487660, 632752, 240111, -511311, -1220408, -1690034, -1772625, -1291144, -512992, -226647, -812510, -1609738, -1773803, -1417751, -1247959, -1368856, -1256719, -800908, -510182, -585015, -578838, -238672, -130, -281131, -816534, -1087432, -1007191, -816438, -628972, -431759, -280123, -185979, -14043, 268531, 434749, 293963, -39687, -328503, -464306, -446022, -361411]
33961c61411r8501m36823m12708K13313P83889N14685k84021n62192p6997L10545
33951d10221N6660k68584l9901L73281K77845j78605k68843J66937N42514M33794
33941F84877P7369j21348j26909j37817j99963j85149n4218M2016l4303j86773
33931b42218j77123M3930K32080J75437p066o0844K2190L7164q4771j92702j48947
33920d02870N6258L61227N93484M84173L31m44042m43138j69484r5832k34113
33910b94006j57170K05926L68775N6948l47408m09970k43367j66241j48338J1527
33900a123324K35971K92662J83722Q0017K4859j2894L2344J55101J27699j65420
33890a69263m09578k29876K28859M45844K00182k13223m16088l01602K4824L64434
$$ y = [-361411, -459912, -896735, -1309443, -1096130, -312241, 202444, -81577, -643769, -720766, -410221, -353561, -622145, -662046, -288765, -10920, -189525, -458368, -291431, 251083, 684877, 762246, 640898, 513989, 376172, 176209, -8940, -63158, -21142, -55445, -242218, -419341, -375411, -143331, 32106, 25040, -35804, -13614, 23550, -61221, -253923, -402870, -346612, 14615, 608099, 1092272, 1092603, 648561, 205423, 35939, -59893, -294006, -451176, -245250, 123525, 180473, -166935, -576905, -820272, -986513, -1134851, -1123324, -887353, -594691, -410969, -330952, -306093, -318987, -286643, -131542, -3843, -169263, -578841, -808717, -579858, -134014, 66168, -147055, -563143, -864745, -839921, -475487]
33880d75487M66713K27580j04049j56173Q0255K30845P4553j42154p2193K37997
33870C67887M19616K64275n0944k27840j97091j30654j68940k42157j96771k9913
33860a92532Q9064K5980j60033k83987k18945r089J68299J70378M5974k4729J7943
33849c71677K6799r8594k06312j09176J02658J89211J29144J06584J66475J63789
33839I8901O3981L911O217p8685k66574l54291k39714o1674P5789K34048L80134
33828a37957L07167j2525k76244k43706k8978J64660L14409L98619K73355k5141
33818G33659j72245l7156M0949k09531m98954m30228j56510r2642j89878o0383
33808a072919K84874M09823J80566k9701L0669J50916J15157O1428J46701K03662
$$ y = [-475487, -8774, 218806, 114757, -41416, 38839, 269684, 344237, 202083, 129890, 367887, 787503, 1051778, 1000834, 772994, 575903, 445249, 276309, 34152, -162619, -192532, -103468, -77488, -237521, -521508, -740453, -749542, -581243, -410865, -364891, -389620, -371677, -344878, -443472, -649784, -758960, -656302, -467091, -337947, -231363, -64888, 98901, 162882, 166793, 173010, 94325, -172249, -526540, -766254, -827928, -752139, -518091, -137957, 169210, 156685, -119559, -363265, -392243, -227583, 86826, 485445, 758800, 733659, 561414, 524258, 565207, 355676, -143278, -573506, -730016, -822658, -1012536, -1072919, -788045, -378222, -197656, -227357, -196688, -45772, 69385, 130813, 277514, 481176]
33798D81176O624l51077n79306n32796k71436N9976K74445K22135l5064k42920
33788i68243k33394o5087J42699L26439L73774J36343l11131o03577m49631K9596
33778a622212M40662N18323L14511Q1355L2214J46205J91132K3464j79748j46999
33768b01093Q2467K18193J65399J06526R1866q1397m15284n08021j11808L89689
33758b63463M45065R3054j60680j18302o7011j63241j49460J09065K55520j0911
$$ y = [481176, 487800, 136723, -442583, -975379, -1246815, -1186839, -912394, -690259, -725323, -968243, -1201637, -1266724, -1124025, -797586, -423812, -287469, -598600, -1202177, -1651808, -1622212, -1181550, -663227, -348716, -267361, -235147, -88942, 102190, 125654, -54094, -201093, -118626, 99567, 264966, 371492, 463358, 381961, -33323, -541344, -653152, -263463, 181602, 274656, 113976, -4326, -71337, -234578, -384038, -274973, -19453, -30364]
$$ [...]
##END NTUPLES=NMR SPECTRUM
##END=
