##TITLE=31Pdec_BAU-j-LNO2
 CDCl3, 24 sc
 1.7.2019
##JCAMPDX= 6.0         $$ Bruker NMR JCAMP-DX V2.0
##DATA TYPE= NMR SPECTRUM
##DATA CLASS= NTUPLES
##ORIGIN= UXNMR, Bruker Analytische Messtechnik GmbH
##OWNER= root
$$ XWIN-NMR		Version 3.5
$$ Mon Jul  1 14:16:05 2019 Russian Standard Time (UT+4h)  she@DPX200
##.OBSERVE FREQUENCY= 81.013821
##.OBSERVE NUCLEUS= ^31P
##.ACQUISITION MODE= SIMULTANEOUS
##.ACQUISITION SCHEME= undefined
##.AVERAGES= 24
##.DIGITISER RES= 17
##SPECTROMETER/DATA SYSTEM= spect
##.PULSE SEQUENCE= zgpg30
##.SOLVENT NAME= CDCl3
##.SHIFT REFERENCE= (INTERNAL, CDCl3, 0, 182.463)
##AUDIT TRAIL= $$ (NUMBER, WHEN, WHO, WHERE, WHAT)
$$ ##TITLE= Audit trail, XWIN-NMR		Version 3.5
$$ ##JCAMPDX= 5.01
$$ ##ORIGIN= Bruker BioSpin GmbH
$$ ##OWNER= she
$$ F:/spectra/data/she/nmr/P31/1/pdata/1/auditp.txt
$$ ##AUDIT TRAIL=  $$ (NUMBER, WHEN, WHO, WHERE, WHAT)
(   1,<2019-07-01 14:15:05.60 +0400>,<she>,<DPX200>,
      <created by zg, POWCHK disabled, PULCHK disabled
       configuration hash MD5:
       00 E9 B6 7A A2 85 ED C7 34 08 36 98 17 FE 4E 26
       data hash MD5: 32K
       BB 0E 73 75 0A 6C 3A 88 32 64 00 72 17 A3 B4 54>)
(   2,<2019-07-01 14:15:08.42 +0400>,<she>,<DPX200>,
      <Start of raw data processing
       efp BC_mod = 2 LB = 1 FT_mod = 6 PKNL = 1 PHC0 = -2574.324 PHC1 = 159.1996 SI = 64K 
       data hash MD5: 64K
       FD 0D 2F 57 B7 A4 66 7A 7A 11 78 38 BB 98 95 FC>)
(   3,<2019-07-01 14:15:27.29 +0400>,<she>,<DPX200>,
      <pk PHC0 = 4.63338 PHC1 = -15.8 
       data hash MD5: 64K
       B7 16 7C A1 08 1C 92 0E 1B 2D F9 76 0C 76 66 CB>)
$$ ##END=
$$ 
$$ hash MD5
$$ 46 51 B5 AE F4 D2 31 C1 98 7F F8 98 2D 5E CA 34
##$RELAX= 
##$RELAX= 
##$RELAX= 
##$RELAX= 
##$RELAX= 
##$RELAX= 
##$RELAX= 
##$RELAX= 
$$ Bruker specific parameters
$$ --------------------------
##$DU= <F:/spectra>
##$EXPNO= 1
##$NAME= <P31>
##$PROCNO= 1
##$TYPE= <nmr>
##$USER= <she>
##$AMP= (0..31)
100 100 100 100 100 100 100 100 100 100 100 100 100 100 100 100 100 100 
100 100 100 100 100 100 100 100 100 100 100 100 100 100 
##$AQSEQ= 0
##$AQ_mod= 1
##$AUNM= <au_zg>
##$AUTOPOS= <>
##$BF1= 81.014009
##$BF2= 200.13
##$BF3= 200.13
##$BF4= 200.13
##$BF5= 200.13
##$BF6= 200.13
##$BF7= 200.13
##$BF8= 200.13
##$BYTORDA= 1
##$CFDGTYP= 0
##$CFRGTYP= 5
##$CHEMSTR= <none>
##$CNST= (0..31)
1 1 145 1 1 1 1 1 1 1 1 1 1 1 1 1 1 1 1 1 1 1 1 1 1 1 1 1 1 1 1 1 
##$CPDPRG= <waltz16>
##$CPDPRG1= <>
##$CPDPRG2= <waltz16>
##$CPDPRG3= <>
##$CPDPRG4= <mlev>
##$CPDPRG5= <mlev>
##$CPDPRG6= <mlev>
##$CPDPRG7= <mlev>
##$CPDPRG8= <mlev>
##$CPDPRGB= <>
##$CPDPRGT= <>
##$D= (0..31)
0 1 0 0 0 0 0 0 0 0 0 0.03 2e-05 3e-06 0 0 0 0 0 0 0 0 0 0 0 0 0 0 0 0 
0 0 
##$DATE= 1561976105
##$DBL= (0..7)
120 120 120 11 120 120 24 19 
##$DBP= (0..7)
150 150 150 150 150 150 150 150 
##$DBP07= 0
##$DBPNAM0= <>
##$DBPNAM1= <>
##$DBPNAM2= <>
##$DBPNAM3= <>
##$DBPNAM4= <>
##$DBPNAM5= <>
##$DBPNAM6= <>
##$DBPNAM7= <>
##$DBPOAL= (0..7)
0.5 0.5 0.5 0.5 0.5 0.5 0.5 0.5 
##$DBPOFFS= (0..7)
$$ [...]
##$SUBNAM2= <"">
##$SUBNAM3= <"">
##$SUBNAM4= <"">
##$SUBNAM5= <"">
##$SUBNAM6= <"">
##$SUBNAM7= <"">
##$SUBNAM8= <"">
##$SUBNAM9= <"">
##$SW= 369.568048894756
##$SWIBOX= (0..15)
0 1 3 0 0 0 0 0 0 0 0 0 0 0 0 0 
##$SW_h= 29940.119760479
##$TD= 32768
##$TD0= 1
##$TE= 0
##$TE2= 300
##$TE3= 300
##$TEG= 300
##$TL= (0..7)
0 120 53 12 22 120 120 120 
##$TP= (0..7)
150 150 150 150 150 150 150 150 
##$TP07= 0
##$TPNAME0= <>
##$TPNAME1= <>
##$TPNAME2= <>
##$TPNAME3= <>
##$TPNAME4= <>
##$TPNAME5= <>
##$TPNAME6= <>
##$TPNAME7= <>
##$TPOAL= (0..7)
0.5 0.5 0.5 0.5 0.5 0.5 0.5 0.5 
##$TPOFFS= (0..7)
0 0 0 0 0 0 0 0 
##$TUNHIN= 0
##$TUNHOUT= 0
##$TUNXOUT= 0
##$USERA1= <user>
##$USERA2= <user>
##$USERA3= <user>
##$USERA4= <user>
##$USERA5= <user>
##$V9= 5
##$VALIST= <valist>
##$VCLIST= <CCCCCCCCCCCCCCC>
##$VD= 0
##$VDLIST= <DDDDDDDDDDDDDDD>
##$VPLIST= <PPPPPPPPPPPPPPP>
##$VTLIST= <TTTTTTTTTTTTTTT>
##$WBST= 1024
##$WBSW= 4
##$XGAIN= (0..3)
0 0 0 0 
##$XL= 0
##$YL= 0
##$YMAX_a= 38462
##$YMIN_a= -45809
##$ZGOPTNS= <>
##$ZL1= 120
##$ZL2= 120
##$ZL3= 120
##$ZL4= 120
##$ABSF1= 0
##$ABSF2= 0
##$ABSG= 0
##$ABSL= 0
##$ALPHA= 0
##$AQORDER= 0
##$ASSFAC= 0
##$ASSFACI= 0
##$ASSFACX= 0
##$ASSWID= 0
##$AUNMP= <proc_1d>
##$AZFE= 0.1
##$AZFW= 0.5
##$BCFW= 0
##$BC_mod= 2
##$BYTORDP= 0
##$COROFFS= 0
##$CY= -3
##$DATMOD= 1
##$DC= 0
##$DFILT= <>
##$DTYPP= 0
##$F1P= 0
##$F2P= 0
##$FCOR= 1
##$FTSIZE= 65536
##$FT_mod= 6
##$GAMMA= 0
##$GB= 0
##$INTBC= 1
##$INTSCL= 5.30512e-09
##$ISEN= 30
##$LB= 1
##$LEV0= 0
##$LPBIN= 0
##$MAXI= 10000
##$MC2= 0
##$MEAN= 0
##$ME_mod= 0
##$MI= 50
##$NCOEF= 0
##$NC_proc= -3
##$NLEV= 6
##$NOISF1= 182.463
##$NOISF2= 159.3651
##$NSP= 0
##$NTH_PI= 0
##$NZP= 0
##$OFFSET= 182.463
##$PC= 4
##$PHC0= -2569.691
##$PHC1= 143.3996
##$PH_mod= 1
##$PKNL= yes
##$PPARMOD= 0
##$PSCAL= 0
##$PSIGN= 0
##$REVERSE= no
##$SF= 81.0140089999434
##$SI= 65536
##$SIGF1= 159.3651
##$SIGF2= -187.1042
##$SINO= 113.3802
##$SIOLD= 16384
##$SREGLST= <1H.CDCl3>
##$SSB= 0
##$STSI= 65536
##$STSR= 0
##$SW_p= 29940.119760479
##$SYMM= 0
##$S_DEV= 0
##$TDeff= 32768
##$TDoff= 0
##$TI= <>
##$TILT= no
##$TM1= 0
##$TM2= 0
##$TOPLEV= 0
##$USERP1= <user>
##$USERP2= <user>
##$USERP3= <user>
##$USERP4= <user>
##$USERP5= <user>
##$WDW= 1
##$XDIM= 65536
##$YMAX_p= 324553016
##$YMIN_p= -4449629
$$ End of Bruker specific parameters
$$ ---------------------------------
##NTUPLES= NMR SPECTRUM
##VAR_NAME=  FREQUENCY,     SPECTRUM/REAL,   SPECTRUM/IMAG
##SYMBOL=    X,             R,               I
##VAR_TYPE=  INDEPENDENT,   DEPENDENT,       DEPENDENT
##VAR_FORM=  AFFN,          ASDF,            ASDF
##VAR_DIM=   65536,         65536,           65536
##UNITS=     HZ,            ARBITRARY UNITS, ARBITRARY UNITS
##FACTOR=    0.456856943014862, 1,           1
##FIRST=     14782.0589164792, 0,            0
##LAST=      -15158.0608439998, 0,           0
##MIN=       -15158.0608439998, -4449629,    0
##MAX=       14782.0589164792, 324553016,    0
$$ Real data points
##PAGE= N=1
##DATA TABLE= (X++(R..R)), XYDATA
$$ [...]
$$ plain form
39830 68933 -183396 -388465 -484929 -474331 -348677 -117485 153919 378598 497603 493054
39820 493054 392364 262145 159223 87407 28176 -14267 -39916 -80403 -133449 -117203 17508
39809 17508 165968 170996 26066 -135147 -231507 -286607 -303958 -250883 -184635 -224278 -343647
39798 -343647 -355230 -180978 8408 23524 -102613 -208619 -223020 -174017 -84858 12938 36588
39787 36588 -58554 -197541 -281095 -296555 -254163 -105908 152830 365938 334303 42505 -310932
39776 -310932 -497320 -434483 -228741 -79315 -85487 -127926 -18354 230909 410520 402779 307744
39765 307744 236867 161340 46369 -42951 -70028 -87195 -74719 75119 302469 356721 194688
39754 194688 135103 379391 635630 527796 162029 -74173 -107903 -174885 -324467 -356702
$$ packed form
39830F8933k52329k05069r6464J0598J25654K31192K71404K24679J19005m549
39820D93054j00690j30219j02922p1816n9231m2443k5649m0487n3046J6246J34711
39809A7508J48460N028j44930j61213r6360n5100j7351N3075O6248l9643j19369
39798c43647j1583J74252J89386J5116j26137j06006j4401M9003Q9159R7796K3650
39787C6588r5142j38987q3554j5460M2392J48255K58738K13108l1635k91798l53437
39776c10932j86388O2837K05742J49426o172m2439J09572K49263J79611p741r5035
39765C07744p0877p5527j14971q9320k7077j7167J2476J49838K27350N4252j62033
39754A94688n9585K44288K56239j07834l65767k36202l3730o6982j49582l2235
$$ plain form
39744 -356702 -230202 -130984 -110870 -30592 93213 52342 -165335 -301023 -234570 -138138 -117782
39733 -117782 -42367 130394 189831 17428 -194779 -258919 -255594 -300349 -321357 -274811 -305141
39722 -305141 -449007 -444765 -125049 227143 233677 -42238 -238898 -235211 -208100 -245248 -249036
39711 -249036 -197665 -181854 -175257 -61748 87530 56189 -144084 -228352 -70294 81783 -24161
39700 -24161 -269969 -358148 -229659 -81099 -41747 -40563 7247 55891 31901 -28347 -25369
39689 -25369 66773 172985 199169 89990 -161471 -477045 -672526 -588327 -296485 -77251
39679 -77251 -97146 -195149 -112041 142822 325164 321312 275000 319787 388143 374776 316567
39668 316567 288368 259369 192482 177757 313180 519016 613470 535653 374500 213744 72578
$$ packed form
39744c56702J26500R9218K0114Q0278J23805m0871k17677j35688O6453R6432K0356
39733a17782P5415J72761N9437j72403k12207o4140L325m4755k1008M6546l0330
39722c05141j43866M242L19716L52192O534k75915j96660L687K7111l7148l788
39711b49036N1371J5811O597J13509J49278l1341k00273q4268J58058J52077j05944
39700b4161k45808q8179J28489J48560L9352J184M7810M8644k3990o0248K978
39689b5369R2142J06212K6184j09179k51461l15574j95481Q4199K91842K19234
39679g7251j9895r8003Q3108K54863J82342l852m6312M4787O8356j3367n8209
39668C16567k8199k8999o6887j4725J35423K05836R4454p7817j61153j60756j41166
$$ plain form
39657 72578 -16536 1882 108342 182207 116520 -68458 -242697 -291014 -224278 -158299 -164576
39646 -164576 -177790 -109320 -11772 -25634 -173890 -329524 -396960 -401692 -380989 -323113 -253273
39635 -253273 -241766 -276750 -262816 -189461 -149628 -147496 -76512 39239 4570 -212317 -326331
39624 -326331 -117104 216847 325658 197713 119054 220273 334518 300124 166258 53773
39614 53773 -10613 -67672 -151416 -266966 -358612 -321468 -137310 45123 69035 -46298 -183502
39603 -183502 -299009 -377004 -317812 -77245 145743 91161 -201656 -430612 -440960 -390960
39593 -390960 -470639 -652243 -786316 -780248 -613060 -320783 -40941 52963 -67199 -256896
39583 -256896 -377566 -395264 -301046 -92603 122828 168162 19923 -131387 -118095 17566
$$ packed form
39657G2578q9114J8418J06460P3865o5687j84978j74239m8317O6736O5979o277
39646a64576j3214O8470R7548j3862j48256j55634o7436m732K0703N7876O9840
39635b53273J1507l4984J3934P3355L9833K132P0984J15751l4669k16887j14014
39624c26331K09227L33951J08811j27945p8659J01219J14245l4394j33866j12485
39614E3773o4386n7059q3744j15550r1646L7144J84158J82433K3912j15333j37204
39603a83502j15507p7995N9192K40567K22988n4582k92817k28956j0348N0000
39593c90960p9679j81604j34073O068J67188K92277K79842R3904j20162j89697
39583b56896j20670j7698R4218K08443K15431M5334j48239j51310J3292J35661
$$ plain form
39573 17566 134936 173181 142207 52390 -48113 -54623 73807 229866 269629 162470 -21969
39562 -21969 -213810 -369182 -448978 -433771 -337414 -187229 -33600 23817 -92565 -309866
39552 -309866 -431472 -344936 -148457 -32867 -87165 -242991 -352622 -299941 -96914 102173
39542 102173 133705 -9637 -186074 -265174 -221711 -96975 42130 120102 127094 159136 273654
39531 273654 336147 171964 -126756 -238035 -19268 290933 377797 213162 -274 -121282
39521 -121282 -166152 -191361 -217170 -243192 -257206 -251642 -263099 -329047 -382972 -306347 -133110
39510 -133110 -59967 -161403 -241132 -107079 132790 231006 173168 185326 389452 636893
39500 636893 710585 555462 284208 68910 41243 189545 339474 335680 239673 229956 311754
$$ packed form
39573A7566J17370L8245l0974q9817j00503o510J28430J56059L9763j07159j84439
39562b1969j91841j55372p9796J5207R6357J50185J53629N7417j16382k17301
39552c09866j21606Q6536J96479J15590n4298j55826j09631N2681K03027J99087
39542A02173L1532j43342j76437p9100M3463J24736J39105P7972O992L2042J14518
39531B73654O2493j64183k98720j11279K18767L10201Q6864j64635k13436j21008
39521a21282m4870k5209k5809k6022j4014N564j1457o5948n3925P6625J73237
39510a33110P3143j01436p9729J34053K39869R8216n7838J2158K04126K47441
39500F36893P3692j55123k71254k15298k7667J48302J49929l794r6007r717Q1798
$$ plain form
39489 311754 284209 38672 -267448 -421543 -408707 -341251 -244981 -63700 179723 377628
39479 377628 487548 567912 654996 707528 689613 614418 488179 309530 150014 122472 214928
39468 214928 266559 189744 108529 160256 252153 175734 -77422 -278833 -242516 1177 310842
39457 310842 556130 616599 434837 138681 -34117 -2793 95611 154041 220220 295659 233420
39446 233420 -271 -159042 -31855 218878 273154 96162 -89096 -187310 -304980 -469405
39436 -469405 -560347 -550197 -559070 -620726 -618769 -507046 -379493 -272626 -117438 59812 121914
39425 121914 75739 100856 230304 255126 76832 -95784 -73496 21848 -2506 -87729 -79883
39414 -79883 -34075 -93317 -185976 -121228 80810 211933 192580 128290 71366 -36439 -172047
$$ packed form
39489C11754k7545k45537l06120j54095J2836O7456R6270J81281K43423J97905
39479C77628J09920Q0364Q7084N2532j7915p5195j26239j78649j59516k7542R2456
39468B14928N1631p6815q1215N1727R1897p6419k53156k01411L6317K43693L09665
39457C10842K45288O0469j81762k96156j72798L1324R8404N8430O6179P5439o2239
39446B33420k33691j58771J27187K50733N4276j76992j85258r8214j17670j64425
39436d69405r0942J0150q873o1656J957J11723J27553J06867J55188J77250O2102
39425A21914m6175K5117J29448K4822j78294j72616K2288R5344k4354q5223P846
39414g9883M5808n9242r2659O4748K02038J31123j9353o4290n6924j07805j35608
$$ plain form
39403 -172047 -206364 -120599 -62431 -127164 -233993 -272638 -236916 -162213 -59333 30154 27802
39392 27802 -62301 -116572 -41911 102663 191669 188477 160852 173102 211509 216306 163254 88611
39380 88611 17282 -95695 -278564 -417592 -346422 -96311 85289 49799 -59966 -52429 23706
39369 23706 10775 -61075 -43664 29726 -20710 -186474 -237194 -89415 31903 -77829 -307849
39358 -307849 -418041 -374702 -334313 -384371 -461414 -487431 -459315 -410253 -360216 -294392 -161024
39347 -161024 53651 226004 180964 -56034 -220189 -138996 14493 -30737 -231539 -290421
39337 -290421 -108268 71591 43805 -60129 -5773 174862 249027 138327 5533 -2484
39327 -2484 76838 140911 168539 196200 249531 336508 420417 387526 159739 -140005 -279404
$$ packed form
39403a72047l4317Q5765N8168o4733j06829l8645L5722P4703J02880Q9487k352
39392B7802r0103n4271P4661J44574Q9006l192k7625J2250L8407M797n3052p4643
39380H8611p1329j12977j82869j39028P1170K50111J81600l5490j09765P537P6135
39369B3706j2931p1850J7411P3390n0436j65764n0720J47779J21318j09732k30020
39358c07849j10192M3339M0389n0058p7043k6017K8116M9062N0037O5824J33368
39347a61024K14675J72353m5040k36998j64155Q1193J53489m5230k00802n8882
39337b90421J82153J79859k7786j03934N4356J80635P4165j10700j32794q017
39327b484P9322O4073K7628K7661N3331Q6977Q3909l2891k27787k99744j39399
$$ plain form
39316 -279404 -218249 -155904 -211593 -258523 -204526 -214176 -422018 -608863 -477555 -147135 -12811
39305 -12811 -130890 -129014 182984 487823 442305 171516 9955 -19526 -142930 -376153
39295 -376153 -465534 -287112 -35177 54706 -16930 -96878 -112667 -124696 -194240 -274651 -257510
39284 -257510 -119806 20691 50340 13451 16473 20258 -102690 -305385 -374297 -255042 -142584
39273 -142584 -147027 -114278 62134 199122 124423 2358 72798 231746 197615 -9488 -93830
39262 -93830 54486 246858 334585 347712 285060 89041 -110754 -42827 302620 581539
39252 581539 539173 317997 194218 221816 284847 314295 290640 176056 -6534 -136937
39242 -136937 -151314 -122555 -107362 -53102 55072 109982 53662 -19433 -49124 -141892 -368991
$$ packed form
39316b79404O1155O2345n5689m6930N3997r650k07842j86845J31308L30420J34324
39305a2811j18079J876L11998L04839m5518k70789j61561k9481j23404k33223
39295c76153q9381J78422K51935Q9883p1636p9948j5789j2029o9544q0411J7141
39284b57510J37704J40497K9649l6889L022L785j22948k02695o8912J19255J12458
39273a42584m443L2749J76412J36988p4699j22065P0440J58948l4131k07103q4342
39262i3830J48316J92372Q7727J3127o2652j96019j99795O7927L45447K78919
39252E81539m2366k21176j23779K7598O3031K9448k3655j14584j82590j30403
39242a36937j4377K8759J5193N4260J08174N4910n6320p3095k9691r2768k27099
$$ plain form
39231 -368991 -573599 -554628 -344575 -139151 -30401 27376 47363 -26564 -199227 -385501
39221 -385501 -484671 -427282 -203714 76305 222505 155094 -762 -83993 -76441 -31227 63505
39210 63505 219217 337904 320728 225505 172212 148557 63713 -53328 -87431 -56402 -115101
39199 -115101 -308950 -478294 -464281 -289520 -81816 69642 121510 48058 -103276 -198285
39189 -198285 -153144 -51129 -40265 -132919 -193442 -139822 -76437 -160735 -371408 -493929 -362166
39178 -362166 -54121 200665 264359 180192 61048 -10750 26355 205719 447948 551996
39168 551996 361421 -57199 -445138 -576985 -453695 -275456 -226163 -298560 -356121 -333411
39158 -333411 -276148 -174249 83237 474541 712415 545382 119460 -179137 -211778 -182752
$$ packed form
39231c68991k04608J8971K10053K05424J08750N7777J9987p3927j72663j86274
39221c85501r9170N7389K23568K80019J46200o7411j55856q3231P552M5214R4732
39210F3505J55712J18687j7176r5223n3293k3655q4844j17041l4103L1029n8699
39199a15101j93849j69344J4013J74761K07704J51458N1868p3452j51334r5009
39189a98285M5141J02015J0864r2654o0523N3620O3385q4298k10673j22521J31763
39178c62166L08045K54786O3694q4167j19144p1798L7105J79364K42229J04048
39168E51996j90575m18620l87939j31847J23290J78239M9293p2397n7561K2710
39158c33411N7263J01899K57486L91304K37874j67033m25922k98597l2641K9026
$$ plain form
39148 -182752 -245802 -290939 -209173 -108113 -104752 -112324 -25127 47651 -52266 -241753 -290111
39137 -290111 -152559 -18396 -41469 -178134 -292480 -298202 -192571 -45293 45753 51707 46071
39126 46071 98798 189853 269331 320883 312184 186222 -28236 -214004 -349523 -544706 -780856
39115 -780856 -798500 -444205 11326 150231 -67231 -293716 -275864 -109128 -13698 -81805
39105 -81805 -284670 -539826 -721110 -749427 -699041 -683168 -657882 -515379 -343542 -356246 -538843
39094 -538843 -612878 -435416 -197387 -103880 -81698 23569 149268 133683 11468 -36149
39084 -36149 29485 77414 64300 125086 348035 594104 635659 426765 164941 79234 185935
39073 185935 284897 207972 22648 -76491 -44187 -35265 -160900 -322555 -364264 -291257 -235903
$$ packed form
39148a82752o3050m5137Q1766J01060L361p572Q7197P2778r9917j89487m8358
39137b90111J37552J34163k3073j36665j14346n722J05631J47278R1046N954n636
39126D6071N2727R1055P9478N1552q699j25962k14458j85768j35519j95183k36150
39115g80856j7644L54295M55531J38905k17462k26485J7852J66736R5430o8107
39105h1805k02865k55156j81284k8317N0386J5873K5286J42503J71837j2704j82597
39094e38843p4035J77462K38029R3507K2182J05267J25699j5585j22215m7617
39084c6149O5634M7929j3114O0786K22949K46069M1555k08894k61824q5707J06701
39073A85935R8962p6925j85324r9139L2304Q922j25635j61655m1709P3007N5354
$$ plain form
39062 -235903 -271618 -365099 -468413 -549721 -556247 -457812 -328687 -282197 -303575 -249790 -65203
39051 -65203 94584 46252 -162497 -290190 -203246 -29763 48235 62535 191524 449856
39041 449856 599269 438981 77244 -199570 -273525 -284360 -380687 -512098 -526790 -394662
39031 -394662 -246651 -204985 -236920 -207421 -61370 87574 82382 -84409 -263324 -337691 -343223
39020 -343223 -362011 -379613 -323779 -189800 -42134 72750 135182 110715 -8872 -145286
39010 -145286 -203884 -191147 -182885 -198463 -195840 -168744 -147328 -115546 -33501 62892 88577 31335
38998 31335 -55296 -162553 -303196 -393564 -319948 -142420 -67146 -170249 -310649 -372190 -412139
38987 -412139 -481114 -486435 -376137 -290131 -349016 -430993 -364644 -232100 -241273 -363697 -363809 -182332
$$ packed form
39062b35903l5715r3481j03314q1308o526R8435J29125M6490k1378N3785J84587
39051f5203J59787m8332k08749j27693Q6944J73483P7998J4300J28989K58332
39041D49856J49413j60288l61737k76814p3955j0835r6327j31411j4692J32128
39031c94662J48011M1666l1935K9499J46051J48944n192j66791j78915p4367n532
39020c43223j8788j7602N5834J33979J47666J14884O2432k4467j19587j36414
39010a45286n8598J2737Q262j5578K623K7096K1416L1782Q2045R6393K5685n7242
38998C1335q6631j07257j40643r0368P3616J77528P5274j03103j40400o1541l9949
38987d12139o8975n321J10298Q6006n8885q1977O6349J32544r173j22424j12J81477
$$ plain form
38975 -182332 -25214 -20089 -38256 34970 84599 -15429 -153139 -151899 -64290 -66710 -132954
38964 -132954 -56346 201199 410668 392839 249061 176145 200475 224022 221901 237331 237070
38953 237070 134814 -36167 -110231 1501 179455 236747 140610 23162 -18522 -62940
38943 -62940 -250631 -551337 -741466 -678945 -514723 -487348 -551893 -434057 -99536 93916
38933 93916 -109176 -440866 -461514 -182540 5964 -35678 -35736 166986 335106 243611 49176
38922 49176 -42 31061 -63898 -240343 -283013 -164668 -37942 56080 188993 292915 191666
38911 191666 -91801 -301980 -278587 -124239 966 71141 122487 146126 122498 52941 -79508
38900 -79508 -280015 -463925 -521396 -462782 -387351 -322565 -226642 -133744 -140196 -237977 -306269
$$ packed form
38975a82332J57118N125j8167P3226M9629j00028j37710J240Q7609k420o6244
38964a32954P6608K57545K09469j7829j43778p2916K4330K3547k121J5430k61
38953B37070j02256j70981p4064J11732J77954N7292r6137j17448m1684m4418
38943f2940j87691l00706j90129O2521J64222K7375o4545J17836L34521J93452
38933I3916k03092l31690k0648K78974J88504m1642n8K02722J68120r1495j94435
38922D9176m9218L1103r4959j76445m2670J18345J26726R4022J32913J03922j01249
38911A91666k83467k10179K3393J54348J25205P0175N1346K3639k3628o9557j32449
38900g9508k00507j83910n7471N8614P5431O4786R5923R2898o452r7781o8292
$$ plain form
38889 -306269 -277148 -178011 -29490 138629 194331 24093 -250767 -386156 -361243 -390170
38879 -390170 -554186 -671954 -614883 -494948 -410807 -256636 29816 241578 161913 -86443
38869 -86443 -183649 -27040 195583 286709 205758 -4196 -270622 -470162 -503812 -419537 -360368
38858 -360368 -380812 -397734 -328418 -205584 -137597 -185734 -282944 -280346 -113417 95383 179312
38847 179312 155652 185121 296843 324850 183524 29311 24533 88275 40290 -116198 -224779
38836 -224779 -215713 -151960 -86471 -32917 -47354 -181886 -360626 -438337 -388185 -310217 -252428
38825 -252428 -160594 -38755 -20543 -183402 -369359 -315496 25663 383889 450277 216358
38815 216358 -50089 -150631 -142417 -135382 -83823 56938 115431 -85472 -356843 -293856 154036
$$ packed form
38889c06269K9121R9137J48521J68119N5702j70238k74860j35389K4913k8927
38879c90170j64016j17768N7071J19935Q4141J54171K86452K11762p9665k48356
38869h6443r7206J56609K22623R1126q0951k09954k66426j99540l3650Q4275N9169
38858c60368k0444j6922O9316J22834O7987m8137r7210K598J66929K08800Q3929
38847A79312k3660K9469J11722K8007j41326j54213m778O3742m7985j56488j08581
38836b24779R066O3753O5489N3554j4437j34532j78740p7711N0152P7968N7789
38825b52428R1834J21839J8212j62859j85957N3863L41159L58226O6388k33919
38815B16358k66447j00542Q214P035N1559J40761N8493k00903k71371O2987M47892
$$ plain form
38804 154036 564984 617457 493309 510907 606983 470352 52362 -347888 -471674 -349896
38794 -349896 -173862 -92426 -137052 -218115 -206476 -104209 -70507 -185800 -295027 -217907 -8833
38783 -8833 151738 222319 270651 270154 146525 -19701 -56724 45280 138966 160026 160849 118085
38771 118085 -62167 -312861 -403713 -251500 -49320 5132 -49836 -71207 -36921 -12053 4653
38760 4653 57116 104600 49888 -101648 -209101 -166657 -60339 -90245 -326286 -600314 -696853
38749 -696853 -605262 -488302 -432875 -376559 -291877 -266138 -323969 -335146 -207963 -30495 91301
38738 91301 177823 226265 97887 -254172 -599224 -690218 -580721 -457948 -308366 -36082
38728 -36082 207065 164121 -87277 -189584 -30748 114392 38083 -120224 -164100 -127242
$$ packed form
38804A54036M10948N2473j24148J7598R6076j36631m17990m00250j23786J21778
38794c49896J76034Q1436m4626q1063J1639J02267L3702j15293j09227P7120K09074
38783h833J60571P0581M8332m97j23629j66226l7023J02004R3686K1060Q23m2764
38771A18085j80252k50694r0852J52213K02180N4452n4968k1371L4286K4868J6706
38760D653N2463M7484n4712j51536j07453M2444J06318k9906k36041k74028r6539
38749f96853R1591J16960N5427N6316Q4682K5739n7831j1177J27183J77468J21796
38738I1301Q6522M8442j28378l52059l45052r0994J09497J22773J49582K72284
38728c6082K43147m2944k51398j02307J58836J45140p6309j58307m3876L6858
$$ plain form
38718 -127242 -117013 -104804 -36962 31290 62010 131023 262971 323112 204166 -15674 -209313
38707 -209313 -346712 -404088 -306970 -102539 -15668 -160630 -343538 -340385 -242723 -306170 -538772
38696 -538772 -678958 -567457 -324880 -127254 5895 119444 164732 63513 -126872 -233966
38686 -233966 -172618 -47854 -6517 -39852 -21029 76048 113488 -14035 -233360 -416888 -536732
38675 -536732 -592483 -516089 -311130 -174879 -266470 -421236 -337141 -20852 207201 168655
38665 168655 26347 -29448 -29727 -50130 -26932 87626 169175 91620 -75922 -185635 -208633
38654 -208633 -191226 -131499 -26628 61913 107044 176062 286934 326382 233611 141442 184030
38643 184030 266409 193918 -32974 -216086 -223565 -118613 -30409 -5103 3576 59500 165163
$$ packed form
38718a27242J0229J2209O7842O8252L0720O9013J31948O0141j18946k19840j93639
38707b09313j37399n7376R7118K04431Q6871j44962j82908L153R7662o3447k32602
38696e38772j40186J11501K42577J97626J33149J13549M5288j01219j90385j07094
38686b33966O1348J24764M1337l3335J8823R7077L7440j27523k19325j83528j19844
38675e36732n5751P6394K04959J36251r1591j54766Q4095L16289K28053l8546
38665A68655j42308n5795k79k0403K3198J14558Q1549p7555j67542j09713k2998
38654b08633J7407N9727J04871Q8541M5131O9018J10872L9448r2771r2169M2588
38643A84030Q2379p2491k26892j83112p479J04952Q8204K5306Q679N5924J05663
$$ plain form
38632 165163 237692 192660 53620 -81130 -171092 -238115 -250882 -145333 23302 110916 110548
38621 110548 171990 321925 353139 121064 -204150 -334017 -206220 -8312 50013 -107847
38611 -107847 -385335 -535438 -357219 25553 227803 62637 -225182 -326382 -278364 -297095
38601 -297095 -363024 -264797 7555 200153 153661 504 -58399 -7223 32622 -4157 -59437
38590 -59437 -40360 59589 135438 98974 23034 65724 229265 317523 192869 -51806 -255682
38579 -255682 -387400 -473720 -466802 -326218 -138945 -25979 -2736 -27143 -86198 -143934 -130792
38568 -130792 -87392 -169221 -383455 -485876 -297379 34436 256504 320357 278709 70073
38558 70073 -321932 -645022 -625625 -361028 -179600 -179671 -199055 -180689 -234465 -333403 -280491
$$ packed form
38632A65163P2529m5032j39040j34750q9962o7023j2767J05549J68635Q7614l68
38621A10548O1442J49935L1214k32075l25214j29867J27797J97908N8325j57860
38611a07847k77488j50103J78219L82772K02250j65166k87819j01200M8018j8731
38601b97095o5929R8227K72352J92598m6492j53157n8903N1176L9845l6779n5280
38590e9437J9077R9949P5849l6464p5940M2690J63541Q8258j24654k44675k03876
38579b55682j31718q6320O918J40584J87273J12966K3243k4407n9055n7736J3142
38568a30792M3400q1829k14234j02421J88497L31815K22068O3853m1648k08636
38558G0073l92005l23090J9397K64597J81428p1j9384J8366n3776r8938N2912
$$ plain form
38547 -280491 -50187 117153 58761 -102130 -182991 -172570 -139938 -91068 -17007 47880 90597
38536 90597 135965 164071 121657 28475 -42048 -80764 -119252 -117287 -19114 105158 125987 33860
38524 33860 -88095 -206857 -293967 -238926 -26783 100600 -64195 -324784 -326477 -117179
38514 -117179 -85603 -334704 -529047 -448563 -279011 -200980 -100257 87113 127997 -102894
38504 -102894 -294346 -133125 182002 243423 64069 -9781 92143 76157 -186901 -443132
38494 -443132 -469677 -386104 -396023 -467702 -467140 -436350 -516938 -674664 -712738 -568132 -420358
38483 -420358 -432481 -511851 -453912 -253514 -107997 -109288 -113505 5756 140825 126464 2642
38472 2642 -74255 -86130 -123923 -177499 -170625 -155441 -237471 -334625 -267188 -89078 -53480 -209299
$$ packed form
38547b80491K30304J67340n8392j60891q0861J0421L2632M8870P4061O4887M2717
38536I0597M5368K8106m2414r3182p0523l8716l8488J965R8173J24272K0829r2127
38524C3860j21955j18762q7110N5041K12143J27383j64795k60589j693K09298
38514a17179L1576k49101j94343Q0484J69552P8031J00723J87370M0884k30891
38504a02894j91452J61221L15127O1421j79354p3850J01924j5986k63058k56231
38494d43132k6545Q3573r919p1679N62L0790q0588j57726l8074J44606J47774
38483d20358j2123p9370N7939K00398J45517j291m217J19261J35069j4361j23822
38472B642p6897j1875l7793n3576O874J5184q2030r7154O7437J78110L5598j55819
$$ plain form
38460 -209299 -318441 -255120 -196094 -281881 -362996 -260183 -43332 136467 280167 408743
38450 408743 400639 185833 -63142 -155326 -145678 -157593 -105551 137592 420892 460916 251234
38439 251234 48321 -31220 -128155 -324696 -453878 -316043 65428 475615 699433 660466
38429 660466 464517 315840 314631 354190 284623 119577 -12604 -51789 -22866 59037 164492
38418 164492 195693 106088 19668 75096 203141 232529 176220 214907 398376 555692 532576
38407 532576 353879 119956 -99887 -234258 -228099 -149779 -141867 -210951 -201204 -37137 145983
38396 145983 197684 152045 124934 115874 48699 -46096 -36668 110067 246729 223727 88957
38385 88957 26804 102770 162549 50200 -147616 -208657 -108109 -68424 -214518 -357923 -266477
$$ packed form
38460b09299j09142O3321N9026q5787q1115J02813K16851J79799J43700J28576
38450D08743q104k14806k48975r2184R648j1915N2042K43143K83300M0024k09682
38439B51234k02913p9541r6935j96541j29182J37835L81471M10187K23818l8967
38429F60466j95949j48677j209L9559o9567j65046j32181l9185K8923Q1903J05455
38418A64492L1201q9605q6420N5428J28045K9388n6309L8687J83469J57316k3116
38407E32576j78697k33923k19843j34371O159P8320P912o9084R747J64067J83120
38396A45983N1701m5639k7111r060o7175r4795R428J46735J36662k3002j34770
38385H8957o2153P5966N9779j12349j97816o1041J00548L9685j46094j43405R1446
$$ plain form
38374 -266477 -8463 163929 180895 182323 224353 206906 118819 115593 265470 418558 441249
38363 441249 401893 388153 315011 107231 -63757 22578 253224 265167 -46895 -354317
38353 -354317 -349716 -172944 -177815 -398218 -508239 -311149 -15765 81705 1079 -11683 132008
38342 132008 276525 297745 268481 290541 310874 210956 2004 -170933 -195963 -98045 14347
38331 14347 57580 24597 -40811 -97261 -120176 -80509 30785 132847 86538 -132777 -358539
38320 -358539 -425365 -381913 -390161 -459358 -438845 -267249 -60784 71916 139717 149108 42183
38309 42183 -164256 -323647 -345641 -321967 -367304 -434622 -391544 -207698 16872 151811 120564
38298 120564 -33439 -134298 -38626 152606 182073 -19434 -234801 -271946 -195250 -147231
$$ packed form
38374b66477K58014J72392J6966J428M2030j7447q8087l226J49877J53088K2691
38363D41249l9356j3740p3142k07780j70988Q6335K30646J1943l12062l07422
38353c54317M601J76772m871k20403j10021J97090K95384R7470q0626j2762J43691
38342A32008J44517K1220k9264K2060K0333r9918k08952j72937k5030R7918J12392
38331A4347M3233l2983o5408n6450k2915L9667J11294J02062m6309k19315k25762
38320c58539o6826M3452q248o9197K0513J71596K06465J32700O7801R391j06925
38309D2183k06439j59391k1994K3674m5337o7318M3078J83846K24570J34939l1247
38298A20564j54003j00859R5672J91232K9467k01507k15367l7145P6696M8019
$$ plain form
38288 -147231 -124321 -73721 -52624 -125370 -228578 -289470 -349492 -422468 -382463 -179014 -22170
38277 -22170 -131766 -403421 -542607 -451618 -274980 -138943 -64717 -78816 -190884 -301998
38267 -301998 -322381 -313491 -329460 -240047 34387 234923 51077 -360351 -519830 -304712
38257 -304712 -97752 -173961 -334286 -324277 -248626 -297463 -350689 -190143 75290 139567 -27811
38246 -27811 -149979 -70364 57817 45971 -91427 -244206 -372942 -473017 -502748 -449192
38236 -449192 -376365 -313926 -173835 109002 401222 476753 310193 129477 112678 154245
38226 154245 50620 -172486 -286276 -180564 20926 179544 288384 347169 285530 118134
38216 118134 4505 20757 28940 -76012 -155237 -61799 60063 -33833 -289689 -424337 -351457
$$ packed form
38288a47231K2910N0600K1097p2746j03208o0892o0022p2976M0005K03449J56844
38277b2170j09596k71655j39186R0989J76638J36037P4226j4099j12068j11114
38267c01998k0383Q890j5969Q9413K74434K00536j83846m11428j59479K15118
38257c04712K06960p6209j60325J0009P5651m8837n3226J60546K65433O4277j67378
38246b7811j22168P9615J28181j1846j37398j52779j28736j00075k9731N3556
38236d49192P2827O2439J40091K82837K92220P5531j66560j80716j6799M1567
38226A54245j03625k23106j13790J05712K01490J58618J08840N8785o1639j67396
38216A18134j13629J6252Q183j04952p9225R3438J21862r3896k55856j34648P2880
$$ plain form
38205 -351457 -257658 -245109 -184758 -1945 145143 100655 -65030 -199467 -288467 -400070
38195 -400070 -518062 -557314 -483040 -334769 -190627 -152203 -277469 -475663 -557464 -446171
38185 -446171 -255058 -107864 10817 149510 237785 162033 -52868 -253841 -349258 -393378
38175 -393378 -451479 -456643 -284491 33700 262671 201095 -72539 -284675 -282868 -159315 -60192
38164 -60192 -16084 -7318 -48143 -117197 -131022 -83192 -89387 -198323 -291716 -280348 -248370 -268755
38152 -268755 -239843 -81404 60408 13034 -145435 -226920 -234394 -292915 -387367 -412384 -391645
38141 -391645 -403618 -383683 -254311 -147234 -213141 -315869 -236155 -82870 -132441 -322356
38131 -322356 -317367 -75779 79098 7819 -50292 60002 160092 107104 37783 58125 33777
$$ packed form
38205c51457R3799J2549O0351J82813J47088m4488j65685j34437q9000j11603
38195d00070j17992l9252P4274J48271J44142L8424j25266j98194q1801J11293
38185d46171J91113J47194J18681J38693Q8275p5752k14901k00973r5417m4120
38175c93378n8101n164J72152L18191K28971o1576k73634k12136J807J23553R9123
38164f0192M4108Q766m0825o9054j3825M7830o195j08936r3393J1368L1978k0385
38152b68755K8912J58439J41812m7374j58469q1485p474n8521r4452k5017K0739
38141c91645j1973J9935J29372J07077o5907j02728P9714J53285m9571j89915
38131c22356M989K41588J54877p1279n8111J10294J00090n2988o9321K0342k4348
$$ plain form
38120 33777 -108959 -194755 -126028 -92933 -224350 -315773 -164481 74431 140018 67146 67685
38109 67685 173260 243311 202999 72359 -118253 -282669 -294028 -180925 -136659 -217195 -252272
38098 -252272 -182489 -202827 -388667 -487124 -335580 -191288 -324530 -544789 -503291 -258244
38088 -258244 -133815 -167351 -125717 9803 13521 -125293 -121239 145593 426844 486432 410176
38077 410176 394306 435826 390318 213931 21032 -46256 50978 210905 276349 190790 41325
38066 41325 -77634 -162819 -220268 -203906 -119431 -68796 -92111 -92675 -26678 -17916 -145991 -274578
38054 -274578 -258184 -173572 -157623 -158355 -66297 30835 -25066 -159783 -140925 77264 301009
38043 301009 373813 322089 242683 206703 250017 320691 282339 95582 -82774 -113669 -76640
$$ packed form
38120C3777j42736q5796O8727L3095j31417r1423J51292K38912O5587p2872N39
38109F7685J05575P0051m0312j30640j90612j64416j1359J13103M4266q0536l5077
38098b52272O9783k0338j85840r8457J51544J44292j33242k20259M1498K45047
38088b58244J24429l3536M1634J35520L718j38814M054K66832K81251N9588p6256
38077D10176j5870M1520m5508j76387j92899o7288R7234J59927O5444q5559j49465
38066D1325j18959q5185n7449J6362Q4475N0635k3315n64O5997Q762j28075j28587
38054b74578J6394Q4612J5949p32R2058R7132n5901j34717J8858K18189K23745
38043C01009P2804n1724p9406l5980M3314P0674l8352j86757j78356l0895L7029
$$ plain form
38032 -76640 -95189 -92667 62663 274802 328520 221667 150439 192496 227320 162717 40416
38021 40416 -84824 -199127 -264714 -246360 -187481 -145014 -102479 -56981 -91844 -224390 -301112
38010 -301112 -210116 -71713 -33439 -16683 113584 269166 287224 234676 277735 347796 249570
37999 249570 37618 -42088 32594 22725 -171274 -362721 -378420 -253282 -83166 86395
37989 86395 188775 168372 112717 158063 263798 284538 246610 316806 495945 584828 479783
37978 479783 285048 113808 -14921 -74335 -31622 44747 68043 89038 161865 124475 -212285
37967 -212285 -689016 -906958 -727199 -397185 -178284 -118860 -193509 -367441 -494179 -435700
37957 -435700 -310421 -335646 -419967 -253001 157317 408283 273033 -1060 -116326 -125105
$$ packed form
38032g6640j8549K522J55330K12139N3718j06853p1228M2057L4824o4603j22301
38021D0416j25240j14303o5587J8354N8879M2467M2535M5498l4863j32546p6722
38010c01112R0996J38403L8274J6756J30267J55582J8058n2548M3059P0061r8226
37999B49570k11952p9706P4682r869j93999j91447j5699J25138J70116J69561
37989H6395J02380k0403n5655M5346J05735K0740l7928P0196J79139Q8883j05045
37978D79783j94735j71240j28729n9414M2713P6369K3296K0995P2827l7390l36760
37967b12285m76731k17942J79759L30014K18901N9424p4649j73932j26738N8479
37957d35700J25279k5225q4321J66966M10318K50966j35250k74093j15266q779
$$ plain form
37947 -125105 -213081 -355184 -407767 -352447 -262931 -172446 -99571 -66359 -14693 135606 304522
37936 304522 325284 228134 210745 288910 259273 82201 -6004 110637 216928 122520 -35574
37925 -35574 -41692 71267 143069 146602 133080 73020 -62759 -177218 -153026 -5090 153568
37914 153568 203333 54291 -254180 -474249 -368395 -41907 152989 77885 -61603 -85255
37904 -85255 -67884 -115133 -167668 -143484 -66956 21406 83818 -4134 -305527 -578156 -494601
37893 -494601 -134848 94534 74887 93942 260532 277907 1176 -241991 -176816 -22309
37883 -22309 -79325 -239037 -260206 -218540 -293658 -369179 -237088 1648 105045 79618 60187
37872 60187 -17610 -262989 -496738 -442456 -162181 28147 12118 -47963 -21520 64013 148854
$$ packed form
37947a25105q7976j42103n2583N5320Q9516R0485P2875L3212N1666J50299J68916
37936C04522K0762r7150j7389P8165k9637j77072q8205J16641J06291r4408j58094
37925c5574o118J12959P1802L533j3522o0060j35779j14459K4192J47936J58658
37914A53568M9765j49042l08471k20069J05854L26488J94896p5104j39488k3652
37904h5255J7371m7249n2535K4184P6528Q8362O2412q7952l01393k72629Q3555
37893d94601L59753K29382j9647J9055J66590J7375k76731k43167O5175J54507
37883b2309n7016j59712k1169M1666p5118p5521J32091K38736J03397k5427j9431
37872F0187p7797k45379k33749N4282K80275J90328j6029o0081K6443Q5533Q4841
$$ plain form
37861 148854 164565 4091 -326146 -610484 -662494 -545838 -395317 -193583 67759 199724
37851 199724 55782 -189155 -263970 -178525 -128624 -158974 -179041 -194253 -263415 -324445 -293669
37840 -293669 -237286 -242082 -247359 -199574 -199530 -276254 -217769 103426 427626 429523 175565 -39863
37828 -39863 -143718 -245619 -316497 -267879 -222858 -333683 -426487 -212342 203474 403528
37818 403528 241020 -4409 -65715 28717 132026 155938 44344 -183685 -347771 -275877
37808 -275877 -50925 100460 110601 65051 -12471 -131243 -176528 -43121 132559 119931
37798 119931 -78669 -266222 -334729 -294187 -132953 105243 220385 89887 -109042 -155397
37788 -155397 -113267 -140805 -161950 -53874 35697 -50979 -83300 237737 687247 749201 395075
$$ packed form
37861A48854J5711j60474l30237k84338n2010J16656J50521K01734K61342J31965
37851A99724j43942k44937p4815Q5445M9901l0350k0067j5212o9162o1030L0776
37840b93669N6383m796n277M7785M4p6724N8485L21195L24200J897k53958k15428
37828c9863j03855j01901p0878M8618M5021j10825r2804K14145M15816K00054
37818D03528j62508k45429o1306R4432J03309K3912j11594k28029j64086P1894
37808b75877K24952J51385J0141m5550p7522j18772m5285J33407J75680j2628
37798A19931j98600j87553o8507M0542J61234K38196J15142j30498j98929m6355
37788a55397M2130k7538k1145J08076Q9571q6676l2321L21037M49510O1954l54126
$$ plain form
37777 395075 120199 182593 310283 257907 171046 219893 276133 176699 11262 -52185 -9103
37766 -9103 57029 110220 131024 105596 76293 59598 -34930 -223177 -301045 -137214 26005
37755 26005 -98659 -336900 -286662 14711 122109 -113813 -349718 -334766 -238091 -253467
37745 -253467 -292801 -257361 -256501 -355585 -404901 -311650 -229893 -305025 -438048 -445823 -282844 -16799
37733 -16799 247498 378769 328734 229612 203058 144332 -62948 -229004 -90600 216026
37723 216026 299764 100789 -62771 -23657 68415 117694 195856 256490 169151 78162 271426
37712 271426 627222 671060 291308 -80628 -140377 -76726 -95920 -67097 122145 292995
37702 292995 308993 293680 293791 127163 -199568 -333250 -108896 138344 86184 -99537 -97973
$$ packed form
37777C95075k74876O2394J27690n2376q6861M8847N6240r9434j65437o3447M3082
37766i103O6132N3191K0804k5428k9303j6695r4528j88247p7868J63831J63219
37755B6005j24664k38241N0238L01373J07398k35922k35905J4952R6675j5376
37745b53467l9334L5440Q60r9084m9316R3251Q1757p5132j33023p775J62979K66045
37733a6799K64297J31271n0035r9122k6554n8726k07280j66056J38404L06626
37723B16026Q3738j98975j63560L9114R2072M9279P8162O0634q7339r0989J93264
37712B71426L55796M3838l79752l71936n9749O3651j9194K8823J89242J70850
37702B92995J5998j5313J11j66628l26731j33682K24354K47240n2160j85721J564
$$ plain form
37691 -97973 80549 240876 350036 450791 477647 412788 396718 478063 491590 350058 190192
37680 190192 93776 -21738 -111584 18387 289270 324143 41994 -160428 -51638 70121
37670 70121 -63261 -241308 -240019 -275206 -557899 -792469 -597035 -122745 198084 261101
37660 261101 224821 96792 -171472 -387749 -352622 -233395 -321334 -561677 -671484 -577922
37650 -577922 -421405 -275306 -152286 -123247 -167676 -98617 123599 244369 125777 12313
37640 12313 103985 186467 28646 -163627 -81537 168231 272065 195558 89594 -37296
37630 -37296 -179317 -135153 154117 337317 137784 -162769 -158309 37405 49439 -118071
37620 -118071 -204623 -220402 -322891 -375191 -174093 60881 -14439 -242790 -219750 -33329
$$ packed form
37691i7973J78522J60327J09160J00755K6856o4859j6070Q1345J3527j41532j59866
37680A90192r6416j15514q9846J29971K70883L4873k82149k02422J08790J21759
37670G0121j33382j78047J289l5187k82693k34570J95434M74290L20829O3017
37660B61101l6280j28029k68264k16277L5127J19227q7939k40343j09807R3562
37650e77922J56517J46099J23020K9039m4429O9059K22216J20770j18592j13464
37640A2313R1672Q2482j57821j92273Q2090K49768J03834p6507j05964j26890
37630c7296j42021M4164K89270J83200j99533l00553M460J95714J2034j67510
37620a18071q6552j5779j02489n2300K01098K34974p5320k28351K3040J86421
$$ plain form
37610 -33329 -115903 -430342 -469632 -103395 209550 171893 34461 57366 100171 -12920 -131888
37599 -131888 -44872 181239 330130 304672 141298 -71577 -218400 -236822 -174579 -58894
37589 -58894 176209 473289 551324 270112 -93886 -223191 -207659 -288489 -382042 -272034
37579 -272034 -83090 -94802 -221787 -160682 51126 123207 80676 215962 489685 512845
37569 512845 184365 -138914 -195037 -100385 952 138915 260787 181584 -64297 -165476
37559 -165476 34802 332911 484486 468192 373081 277782 276585 387599 440969 295869 112224
37548 112224 136713 303054 360401 316242 396447 615718 744418 676275 503369 274167
37538 274167 -500 -175846 -145676 -95908 -235282 -390048 -259050 44903 144775 2077
$$ packed form
37610c3329q2574l14439l9290L66237L12945l7657j37432K2905M2805j13091j18968
37599a31888Q7016K26111J48891k5458j63374k12875j46823j8422O2243J15685
37589e8894K35103K97080P8035k81212l63998j29305J5532q0830r3553J10008
37579b72034J88944j1712j26985O1105K11808P2081m2531J35286K73723K3160
37569E12845l28480l23279n6123R4652J01337J37963J21872p9203k45881j01179
37559a65476K00278K98109J51575j6294r5111r5299j197J11014N3370j45100j83645
37548A12224K4489J66341N7347m4159Q0205K19271J28700o8143j72906k29202
37538B74167k74667j75346L0170M9768j39374j54766J30998L03953R9872j42698
$$ plain form
37528 2077 -78754 17162 127677 201993 321684 379588 196834 -69637 -83510 138762 284171
37517 284171 270818 270255 280855 160530 13942 52962 151535 56186 -61533 158506 558875
37506 558875 629915 352230 216925 385255 498909 400649 371400 513823 538707 341763
37496 341763 208929 273097 314024 250078 286607 435622 432733 268040 256145 450012 532375
37485 532375 406704 334503 376067 282430 61389 43753 253641 328713 202357 225673 461513
37474 461513 525420 312575 204070 334051 337757 85351 -11741 272185 578418 598267
37464 598267 512679 519096 506641 460753 596103 844053 817709 510719 385519 547666 531583
37453 531583 160633 -110186 -7057 141560 120775 221901 552726 687873 413368 132776
$$ packed form
37528B077q0831R5916J10515P4316J19691N7904j82754k66471j3873K22272J45409
37517B84171j3353n63J0600j20325j46588L9020R8573r5349j17719K20039M00369
37506E58875P1040k77685j35305J68330J13654r8260k9249J42423K4884j96944
37496C41763j32834O4168M0927o3946L6529J49015k889j64693j1895J93867Q2363
37485E32375j25671p2201M1564r3637k21041j7636K09888P5072j26356K3316K35840
37474D61513O3907k12845j08505J29981L706k52406r7092K83926L06233J9849
37464E98267q5588O417j2455m5888J35350K47950k6344l06990j25200J62147j6083
37453E31583l70950k70819J03129J48617k0785J01126L30825J35147k74505k80592
$$ plain form
37443 132776 142151 181755 78446 121811 409111 528502 298023 121625 229706 285021
37433 285021 110988 55837 259696 342220 186606 210118 493323 533141 243251 227812
37423 227812 623557 709908 195222 -175225 107106 503843 532450 574505 874485 863347
37413 863347 284202 -114276 149149 435203 266071 270565 869881 1235021 692425 30366
37403 30366 187632 703959 723299 514063 704232 976547 815415 622060 850642 1006745
37393 1006745 703385 629357 1238410 1679340 1329509 1058896 1557064 1876920 1234067 680866
37383 680866 1200827 1789471 1420113 1169055 2153207 3199209 3074541 3080816 4582467 6054275
37373 6054275 5884132 5892312 8218518 11088433 12269118 14152234 19687115 26152071 30999111
$$ packed form
37443A32776R375L9604j03309M3365K87300J19391k30479j76398J08081N5315
37433B85021j74033n5151K03859Q2524j55614K3512K83205L9818k89890j5439
37423B27812L95745Q6351n14686l70447K82331L96737K8607M2055K99980j1138
37413H63347n79145l98478K63425K86054j69132M494N99316L65140n42596o62059
37403C0366J57266N16327J9340k09236J90169K72315j61132j93355K28582J56103
37393A006745l03360p4028O09053M40930l49831k70613M98168L19856o42853n53201
37383F80866N19961N88644l69358k51058R84152J046002j24668O275J501651J471808
37373F054275j70143Q180K326206K869915J180685J883116N534881O464956M847040
$$ plain form
37364 30999111 41766776 68554748 104127995 123330007 109892553 76003297 47170610
37357 47170610 34041455 28406489 21783035 15585327 12951759 11609187 8794890 6174767
37349 6174767 5831377 6174015 5190680 3962817 3991126 4175907 3149817 1967644 1995501
37340 1995501 2358920 1755257 864051 853728 1187123 874249 417957 673855 1087240 790182
37330 790182 287366 424903 731169 348973 -294702 -251031 279700 427791 164344 68001
37320 68001 144936 39294 -74013 146135 404652 264939 -10443 37864 207204 89256
37310 89256 -113733 -33731 91119 -111456 -368664 -245103 29449 -11586 -220066 -167200
37300 -167200 46354 56444 -31365 102519 311717 257129 82195 150977 372562 423196
$$ packed form
37364C0999111J0767665K6787972L5573247J9202012j3437454l3889256k8832687
37357D7170610j3129155n634966o623454o197708k633568j342572k814297k620123
37349F174767l43390L42638r83335j227863K8309J84781j026090j182173K7857
37340A995501L63419o03663q91206j0323L33395l12874m56292K55898M13385k97058
37330G90182n02816J37537L06266l82196o43675M3671N30731J48091k63447r6343
37320F8001P6935j05642j13307K20148K58517j39713k75382M8307J69340j17948
37310H9256k02989Q0002J24850k02575k57208J23561K74552m1035k08480N2866
37300a67200K13554J0090q7809J33884K09198n4588j74934O8782K21585N0634
$$ plain form
37290 423196 387356 547734 769312 712992 463650 354401 348470 166492 -135958 -268033
37280 -268033 -234249 -246236 -246784 -31954 268540 318089 95526 -128161 -227401 -254381 -183777
37269 -183777 -11866 54595 -104455 -223500 -50973 164902 44395 -262271 -285471 21309
37259 21309 257691 224553 110399 59984 14843 -11795 79178 192458 125117 -50996 -58290
37248 -58290 117203 181653 -4809 -254295 -386247 -430634 -444300 -403609 -335943 -316550 -300248
37237 -300248 -177417 -264 73792 49950 68557 134824 134935 100236 171161 296309 265808
37226 265808 80415 -6123 123044 293531 347633 323451 231254 -46570 -465562 -696288
37216 -696288 -515282 -129499 105488 130617 122353 134059 79905 11017 111113 381000 574125
$$ packed form
37290D23196l5840J60378K21578n6320k49342j09249n931j81978l02450j32075
37280b68033L3784j1987n48K14830L00494M9549k22563k23687r9240k6980P0604
37269a83777J71911O6461j59050j19045J72527K15875j20507l06666k3200L06780
37259B1309K36382l3138j14154n0415m5141k6638R0973J13280o7341j76113p294
37248e8290J75493O4450j86462k49486j31952m4387j3666M0691O7666J9393J6302
37237c00248J22831J77153P4056k3842J8607O6267J11l4699P0925J25148l0501
37226B65808j85393q6538J29167J70487N4102k4182r2197k77824m18992k30726
37216f96288J81006L85783K34987K5129q264J1706n4154o8888J00096K69887J93125
$$ plain form
37205 574125 531463 378051 279134 194418 37382 -85575 -25367 115252 104278 -21070
37195 -21070 34418 347113 592135 495354 226134 117248 185128 201773 111042 58991 62472
37184 62472 -30944 -223915 -298707 -145468 77771 202122 245642 254469 164128 -35837 -174448
37173 -174448 -102867 90273 206746 183907 89716 -24288 -120756 -100169 113568 416527
37163 416527 569231 427922 86348 -216512 -303799 -184826 1668 145550 232749 260760
37153 260760 183056 7706 -136107 -145474 -96724 -122755 -192639 -168533 -47276 30599 10901
37142 10901 -11792 14909 19287 -37146 -76399 -42937 10628 48789 139750 325578 496958
37131 496958 497390 316624 116288 69145 186256 295548 216423 -24692 -206701 -175588 -13077
$$ packed form
37205E74125m2662j53412r8917q4716j57036j22957O0208J40619j0974j25348
37195b1070N5488L12695K45022r6781k69220j08886O7880J6645r0731n2051L481
37184F2472r3416j92971p4792J53239K23239J24351M3520Q827r0341j99965j38611
37173a74448P1581J93140J16473k2839r4191j14004r6468K0587K13737L02959
37163D16527J52704j41309l41574l02860q7287J18973J86494J43882Q7199K8011
37153B60760p7704j75350j43813r367M8750k6031o9884K4106J21257P7875j9698
37142A0901k2693K6701M378n6433l9253L3462N3565L8161R0961J85828J71380
37131D96958M32j80766k00336m7143J17111J09292p9125k41115j82009L1113J62511
$$ plain form
37120 -13077 108333 126476 57156 -106474 -318003 -414574 -304063 -129690 -72774 -79170 22133
37109 22133 212295 323316 329973 357649 418670 379690 201467 -3415 -160839 -277985 -299972
37098 -299972 -150617 66633 140904 71521 92892 317699 561145 609110 487792 366790
37088 366790 324313 303664 229448 116608 97191 301628 648202 835453 659329 254709
37078 254709 -95338 -270047 -292447 -177946 -21746 -62247 -364266 -578143 -348855 142017
37068 142017 409975 360247 330296 470958 550616 446224 371897 451207 459086 213235 -97239
37057 -97239 -207745 -142595 -59643 42801 230687 419412 479447 444694 435079 457394 430112
37046 430112 342319 270397 267664 300479 278052 149408 -1253 -20842 90281 134040 -3469
$$ packed form
37120a3077J21410J8143o9320j63630k11529r6571J10511J74373N6916o396J01303
37109B2133J90162J11021O657K7676O1021l8980j78223k04882j57424j17146k1987
37098b99972J49355K17250P4271o9383K1371K24807K43446M7965j21318j21002
37088C66790m2477k0649p4216j12840j9417K04437L46574J87251j76124m04620
37078B54709l50047j74709k2400J14501J56200m0501l02019k13877K29288M90872
37068A42017K67958m9728k9951J40662P9658j04392p4327P9310P879k45851l10474
37057i7239j10506O5150Q2952J02444J87886J88725O0035l4753r615K2315k7282
37046D30112q7793p1922k733L2815k2427j28644j50661j9589J11123M3759j37509
$$ plain form
37035 -3469 -169189 -189565 -131682 -124566 -108432 -9853 32618 -76453 -112392 119565 351655
37024 351655 221501 -81220 -57197 296098 483291 314715 132470 150458 136216 -80958
37014 -80958 -297305 -338087 -321133 -312809 -152334 167964 361183 307139 262493 391089 479013
37003 479013 357570 225058 277593 370186 323132 245882 278525 304592 197547 88681 119649
36992 119649 159237 21242 -224038 -365579 -317221 -131101 71548 99298 -154463 -495866
36982 -495866 -625391 -571147 -612214 -762370 -730976 -451882 -211355 -149691 -88270 22764
36972 22764 -35714 -277611 -383627 -253492 -204902 -388251 -489355 -294291 -84224 -152463
36962 -152463 -350508 -426765 -418551 -410612 -304300 -121825 -133954 -382420 -481173 -200957 154543
$$ packed form
37035c469j65720k0376N7883P116J6134R8579M2471j09071l5939K31957K32090
37024C51655j30154l02721K4023L53295J87193j68576j82245J7988j4242k17174
37014h0958k16347m0782J6954Q324J60475L20298J93219n4044m4646J28596Q7924
37003D79013j21443j32512N2535R2593m7054p7250L2643K6067j07045j08866L0968
36992A19649L9588j37995k45280j41541M8358J86120K02649K7750k53761l41403
36982d95866j29525N4244m1067j50156L1394K79094K40527O1664O1421J11034
36972B2764n8478k41897j06016J30135M8590j83349j01104J95064K10067o8239
36962a52463j98045p6257Q214P939J06312J82475j2129k48466r8753K80216L55500
$$ plain form
36951 154543 262836 248960 309379 301207 82379 -123912 -80222 90831 207759 346401
36941 346401 549034 603150 425605 283292 333379 347855 176250 34708 49071 3930
36931 3930 -151983 -103210 178965 179525 -326819 -776787 -655003 -262734 -109486 -96771 85434
36920 85434 272097 202499 147584 487971 1024588 1318011 1358140 1332336 1134947 700597
36910 700597 407100 525304 681572 496773 312014 580024 969392 855551 353636 70722
36900 70722 110204 96888 -37615 -40971 74853 112210 156227 344879 424681 155592 -142098
36889 -142098 -89311 46849 -155143 -438237 -297116 90521 183674 44010 138472 418243
36879 418243 451215 276256 272098 342839 91937 -321992 -354911 -16436 174018 97451 119883
$$ packed form
36951A54543J08293j3876O0419q172k18828k06291M3690J71053J16928J38642
36941C46401K02633N4116j77545j42313N0087J4476j71605j41542J4363m5141
36931C930j55913M8773K82175N60n06344m49968J21784L92269J53248J2715J82205
36920H5434J86663o9598n4915L40387N36617K93423M0129k5804j97389m34350
36910G00597k93497J18204J56268j84799j84759K68010L89368j13841n01915k82914
36900G0722L9482j3316j34503l356J15824L7357M4017J88652P9802k69089k97690
36889a42098N2787J36160k01992k83094J41121L87637R3153j39664R4462K79771
36879D18243L2972j74959m158P0741k50902m13929l2919L38475J90454p6567K2432
$$ plain form
36868 119883 336190 480884 519902 618143 629125 319788 -54730 -115178 -81994 -368567
36858 -368567 -700137 -502039 36928 208151 -44040 -116946 160636 341660 239895 141254
36848 141254 146134 87857 57901 260437 456120 302696 63648 184114 411077 218154
36838 218154 -156155 -69292 353530 438763 178331 168052 466541 576493 460154 519448
36828 519448 665503 466553 112216 152999 402700 213686 -282978 -373592 -77959 -61930
36818 -61930 -327171 -233969 216868 374818 177941 155218 253516 -43910 -490586 -321294
36808 -321294 314339 544845 359916 549800 1087619 1115235 606920 474852 872332 948210
36798 948210 472584 172033 266815 203591 -10283 230561 728986 672821 288640 580117
$$ packed form
36868A19883K16307J44694L9018R8241J0982l09337l74518o0448L3184k86573
36858c68567l31570J98098N38967J71223k52191p2906K77582J81024j01765r8641
36848A41254M880n8277k9956K02536J95683j53424k39048J20466K26963j92923
36838B18154l74309Q6863M22822Q5233k60432j0279K98489J09952j16339N9294
36828E19448J46055j98950l54337M0783K49701j89014m96664r0614K95633J6029
36818f1930k65241R3202M50837J57950j96877k2723R8298k97426m46676J69292
36808c21294O35633K30506j84929J89884N37819K7616n08315j32068L97480P5878
36798I48210m75626l00551R4782o3224k13874K40844M98425n6165l84181K91477
$$ plain form
36788 580117 1364622 1443768 824194 751740 1354047 1392567 667315 438865 1011467 1165801
36778 1165801 558596 387131 996103 1143839 423728 95015 652752 895262 315835
36769 315835 74790 632642 799347 151290 -32043 703406 1012780 401708 266163 1114825
36759 1114825 1432559 590950 136926 816085 1166209 536977 524387 1782041 2479791
36750 2479791 1697907 1206918 2010299 2407568 1498425 1160420 2350721 3030157 2124520
36741 2124520 1785722 3173112 3982501 2948514 2557426 4235897 5383285 4541107 4593463
36732 4593463 7073923 8658720 7585976 7660562 10971128 13237743 12263638 13607335 20665991
36723 20665991 27406913 29931310 35853936 50626253 65985423 79676006 115276784
$$ packed form
36788E80117P84505P9146o19574p2454O02307L8520p25252k28450N72602J54334
36778A165801o07205j71465O08972J47736p20111l28713N57737K42510n79427
36769C15835k41045N57852J66705o48057j83333P35449L09374o11072j35545Q48662
36759A114825L17734q41609m54024O79159L50124o29232j2590J257654O97750
36750B479791p81884m90989Q03381L97269r09143l38005J190301O79436r05637
36741B124520l38798J387390Q09389j033987l91088J678471J147388q42178N2356
36732D593463K480460J584797j072744P4586L310566K266615r74105J343697P058656
36723B0665991O740922K524397N922626J4772317J5359170J3690583L5600778
$$ plain form
36716 115276784 193784668 285944723 324553016 277643449 186592911 115959402 85587885
36709 85587885 71462243 54709277 40548178 34834101 30352365 21815779 15132281 14688769
36701 14688769 15066262 11596894 8135713 8513693 9416197 7305135 4781355 4868607 5411221
36692 5411221 3921623 2424809 3077736 3848255 2608622 1187422 1608376 2249322 1261837
36683 1261837 195697 855340 1820276 1285739 402894 788254 1429171 912748 239790
36674 239790 737433 1460209 1155101 649369 971982 1214504 478484 -114668 477485 1115213
36664 1115213 597299 -54422 444035 1234461 1003033 367775 481469 817148 396003
36655 396003 -210706 -68685 269965 -41410 -401933 2963 501045 214647 -201761 167883
$$ packed form
36716A15276784P8507884R2160055L8608293m6909567r1050538p0633509l0371517
36709H5587885j4125642j6752966j4161099n714077m481736q536586o683498m43512
36701A4688769L77493l469368l461181L77980R02504k111062k523780Q7252N42614
36692E411221j489598j496814O52927P70519j239633j421200M20954O40946r87485
36683A261837j066140O59643R64936n34537q82845L85360O40917n16423o72958
36674B39790M97643P22776l05108n05732L22613K42522p36020n93152N92153O37728
36664A115213n17914o51721M98457P90426k31428o35258J13694L35679m21145
36655C96003o06709J42021L38650l11375l60523M04896M98082k86398m16408L69644
$$ plain form
36645 167883 703250 446309 -55016 173397 682924 533583 75381 138064 379192 63561
36635 63561 -390383 -220453 163984 3940 -297788 2224 454998 218526 -348514 -370454
36625 -370454 -37187 -67841 -274010 -83851 154976 -173930 -607049 -319460 353858 495520
36615 495520 197526 224021 550249 565288 323129 320562 407413 131343 -205204 -5601
36605 -5601 471031 544921 319151 351979 529732 368776 51577 70713 218517 -1360
36595 -1360 -342320 -251841 57843 30170 -155850 4380 264853 61403 -365314 -380907
36585 -380907 -123234 -160105 -354909 -199066 81059 -91864 -478806 -418144 -94257 -204734
36575 -204734 -602738 -515333 34045 256553 -12528 -146257 49802 82865 -196975 -365403
$$ packed form
36645A67883N35367k56941n01325K28413N09527j49341m58202O2683K41128l15631
36635F3561m53944J69930L84437j60044l01728L00012M52774k36472n67040k1940
36625c70454L33267l0654k06169J90159K38827l28906m33119K87589O73318J41662
36615D95520k97994K6495L26228J5039k42159k567Q6851k76070l36547J99603
36605e601M76632P3890k25770L2828J77753j60956l17199J9136J47804k19877
36595a360l40960R0479L09684k7673j86020J60230K60473k03450m26717j5593
36585c80907K57673l6871j94804J55843K80125j72923l86942O0662L23887j10477
36575b04734l98004Q7405N49378K22508k69081j33729J96059L3063k79840j68428
$$ plain form
36565 -365403 -300466 -321534 -406399 -201925 164990 205236 -6495 58309 362760 338807 -49684
36554 -49684 -226494 -38646 43568 -168065 -355786 -441231 -684789 -970802 -852945 -399137
36544 -399137 -165470 -257336 -232935 6353 67707 -121593 -184259 -53213 -48400 -133359 71027
36533 71027 462563 503073 177678 42520 205446 155127 -229769 -409313 -165272 6740
36523 6740 -213580 -480127 -481834 -394802 -336871 -78406 408486 781611 971968 1323313 1835477
36512 1835477 1963978 1481441 893694 686166 747172 803728 822757 715885 261212 -392416
36502 -392416 -720827 -587103 -441567 -537529 -566800 -332526 -145862 -236573 -366257 -353505
36492 -353505 -409154 -617384 -644628 -319965 9743 42170 -49602 -47862 -49263 -97193 27929
$$ packed form
36565c65403O4937k1068q4865K04474L66915M0246k11731O4804L04451k3953l88491
36554d9684j76810J87848Q2214k11633j87721q5445k43558k86013J17857M53808
36544c99137K33667r1866K4401K39288O1354j89300o2666J31046M813q4959K04386
36533G1027L91536M0510l25395j35158J62926n0319l84896j79544K44041J72012
36523F740k20320k66547j707Q7032N7931K58465M86892L73125J90357L51345N12164
36512A835477J28501m82537n87747k07528O1006N6556J9029j06872m54673o53628
36502c92416l28411J33724J45536r5962k9271K34274J86664r0711j29684J2752
36492c53505n5649k08230k7244L24663L29708L2427r1772J740j401m7930J25122
$$ plain form
36481 27929 336997 460966 273031 173480 414247 640317 471590 75565 -206002 -358103
36471 -358103 -462254 -399703 -152417 -6753 -120653 -264591 -268244 -288510 -359987 -191224
36461 -191224 241766 424383 59241 -388216 -377980 -91370 -25065 -184301 -242794 -192255
36451 -192255 -248369 -324101 -156246 171916 334840 306044 343561 487067 488636 247608 -42619
36440 -42619 -223772 -365761 -562664 -732466 -707294 -451651 -150060 -43763 -128852 -109808
36430 -109808 194183 518703 493011 201078 41728 92885 60716 -128421 -186228 -19480
36420 -19480 69395 -79990 -218281 -178076 -176533 -355613 -447975 -224287 86467 150571 3620
36409 3620 -121819 -164119 -159696 -67945 83629 128286 37008 1031 70525 22439 -239795
$$ packed form
36481B7929L09068J23969j87935r9551K40767K26070j68727l96025k81567j52101
36471c58103j04151O2551K47286J45664j13900j43938l653k0266p1477J68763
36461a91224M32990J82617l65142m47457J0236K86610O6305j59236n8493N0539
36451a92255n6114p5732J67855L28162J62924k8796L7517J43506J569k41028k90227
36440d2619j81153j41989j96903j69802K5172K55643L01591J06297q5089J9044
36430a09808L03991L24520k5692k91933j59350N1157l2169j89137n7807J66748
36420a9480Q8875j49385j38291M0205J543j79080r2362K23688L10754O4104j46951
36409C620j25439m2300M423R1751J51574M4657r1278l5977O9494m8086k62234
$$ plain form
36398 -239795 -495522 -595076 -672146 -776333 -692071 -357024 -66589 -9254 12314 145494
36388 145494 190953 28554 -79099 67166 247925 244572 225380 378044 542042 541889 493747
36377 493747 453100 196408 -279790 -511411 -247424 82742 47736 -114534 -33695 67601
36367 67601 -174451 -501204 -432954 -117471 -42397 -139983 63605 551078 815255 703959
36357 703959 564818 549445 435364 186380 71008 135719 116256 -36255 -56424 122137
36347 122137 239880 176541 82279 -10584 -230588 -463374 -404452 -114336 -29067 -282198
36337 -282198 -490918 -383568 -182837 -155297 -198976 -131723 -43569 -99306 -247407 -340297 -340274
36326 -340274 -265245 -137261 -75030 -203297 -402282 -406706 -209080 -71970 -81472 -23729 195727
$$ packed form
36398b39795k55727r9554p7070j04187Q4262L35047K90435N7335K1568J33180
36388A45494M5459j62399j07653J46265J80759l353j9192J52664J63998j53m8142
36377D93747m0647k56692m76198k31621K63987L30166l5006j62270Q0839J01296
36367F7601k42052l26753O8250L15483P5074r7586K03588M87473K64177j11296
36357G03959j39141j5373j14081k48984j15372O4711j9463j52511k0169J78561
36347A22137J17743o3339r4262r2863k20004k32786N8922K90116Q5269k53131
36337b82198k08720J07350K00731K7540m3679O7253Q8154n5737j48101r2890K3
36326c40274P5029J27984O2231j28267j98985m424J97626J37110r502N7743K19456
$$ plain form
36315 195727 358767 310240 203086 194886 200006 132461 113965 233633 351904 349219 335392
36304 335392 408782 441871 326469 202907 193815 122177 -203381 -575168 -592851 -228993 114914
36293 114914 132823 -60346 -187077 -175967 -150286 -179812 -197991 -148928 -99647 -141525 -226518
36282 -226518 -201598 -30655 118908 90701 -41342 -80534 28232 177607 294713 392290
36272 392290 431680 318235 85542 -68320 -15919 128650 157971 26381 -116084 -113392
36262 -113392 27049 158135 170692 119225 125019 175427 129246 -52108 -217377 -244418 -201306
36251 -201306 -175993 -101721 77880 212594 143531 3534 61490 304205 438387 326807
36241 326807 168481 174664 288275 338211 300070 265906 260668 220655 119501 30476 50582
$$ packed form
36315A95727J63040m8527j07154q200N120o7545j8496J19668J18271k685j3827
36304C35392P3390L3089j15402j23562r092p1638l25558l71787j7683L63858L43907
36293A14914J7909j93169j26731J1110K5681k9526j8179M9063M9281m1878q4993
36282b26518K4920J70943J49563k8207j32043l9192J08766J49375J17106R7577
36272C92290L9390j13445k32693j53862N2401J44569K9321j31590j42465K692
36262a13392J40441J31086J2557n1467N794N0408m6181j81354j65269k7041M3112
36251b01306K5313P4272J79601J34714o9063j39997N7956K42715J34182j11580
36241C26807j58326O183J13611M9936l8141l4164n238m0013j01154q9025K0106
$$ plain form
36230 50582 169779 228452 73314 -212092 -342626 -189472 16050 -13607 -219032 -296796
36220 -296796 -141854 47538 102357 86835 120070 195717 261778 323054 380466 390005 347472
36209 347472 307250 273732 190502 78615 59081 178466 322154 358901 274879 122837 -51625
36198 -51625 -185704 -218283 -194325 -238836 -362121 -411826 -306014 -191210 -241794 -398036 -456764
36187 -456764 -359921 -216111 -55584 228040 625412 891269 831334 592665 478441 531465
36177 531465 523669 370784 306749 524322 850976 976195 857918 684498 539949 365649
36167 365649 205401 204732 333792 364323 198518 6435 -49383 -26807 -40242 -62505 -5774
36156 -5774 139969 340754 557440 686297 618190 426630 329242 388677 430132 330738 187379
$$ packed form
36230E0582J19197N8673j55138k85406j30534J53154K05522k9657k05425p7764
36220b96796J54942J89392N4819j5522L3235P5647O6061O1276N7412R539m2533
36209C47472m0222l3518q3230j11887j9534J19385J43688L6747q4022j52042j74462
36198e1625j34079l2579K3958m4511j23285m9705J05812J14804n0584j56242n8728
36187d56764R6843J43810J60527K83624L97372K65857n9935k38669j14224N3024
36177E31465p796j52885o4035K17573L26654J25219j18277j73420j44549j74300
36167C65649j60248o69J29060L0531j65805j92083n5818K2576j3435k2263N6731
36156e774J45743K00785K16686J28857o8107j91560r7388N9435M1455r9394j43359
$$ plain form
36145 187379 99452 4406 -134999 -189288 -70933 97436 180097 211216 225148 113379 -141200
36134 -141200 -274056 -34253 448672 818572 917358 854779 757204 666373 623531 650716 677098
36123 677098 633652 576015 587033 622064 575484 440448 302667 245718 328028 538041 706827
36112 706827 625765 347573 194547 343024 577760 607685 451126 330344 333204 373203
36102 373203 383011 376799 382914 419104 460084 390747 132521 -155920 -204444 -5381 168761
36091 168761 176273 162282 225324 242072 156879 128916 220821 247101 117616 24195 83842
36080 83842 108539 -45573 -206885 -204424 -155216 -192547 -207930 -112565 -47929 -76808 17824
36069 17824 346560 640045 649489 512199 436358 351619 174514 81987 193709 306425 262137
$$ packed form
36145A87379q7927r5046j39405n4289J18355J68369Q2661L1119J3932j11769k54579
36134a41200j32856K39803M82925L69900R8786o2579r7575r0831m2842K7185K6382
36123F77098m3446n7637J1018L5031m6580j35036j37781n6949Q2310K10013J68786
36112G06827q1062k78192j53026J48477K34736K9925j56559j20782K860L9999
36102C73203R808o212O115L6190M0980o9337k58226k88441m8524J99063J74142
36091A68761P512j3991O3042J6748q5193k7963R1905K6280j29485r3421N9647
36080H3842K4697j54112j61312K461M9208l7331j5383R5365O4636k8879R4632
36069A7824L28736K93485R444j37290p5841q4739j77105r2527J11722J12716m4288
$$ plain form
36058 262137 241889 379040 455269 322836 232566 366161 450703 249909 27054 72732
36048 72732 181622 79655 -30275 134342 370249 352905 215146 233520 284700 151015
36038 151015 26616 173840 397987 392995 287117 342501 463461 491255 591470 856689
36028 856689 967991 758635 621862 828126 981983 724179 384113 340835 391165 386293
36018 386293 739396 1550255 2024829 1639467 1101642 1224747 1655237 1713250 1643709 1929378
36008 1929378 2215899 2089854 2057501 2557980 2969520 2848392 3021613 4035218 4817731
35999 4817731 4554854 4475896 5801444 7393207 7741771 7777901 9082826 10887319 11894524
35990 11894524 13459256 17435965 22561598 27051737 32855914 42389308 53631138 65809192
$$ packed form
36058B62137k0248J37151P6229j32433r0270J33595Q4542k00794k22855M5678
36048G2732J08890j01967j09930J64617K35907j7344j37759J8374N1180j33685
36038A51015j24399J47224K24147m992j05878N5384J20960K7794J00215K65219
36028H56689J11302k09356j36773K06264J53857k57804l40066m3278N0330m872
36018C86293L53103Q10859M74574l85362n37825J23105M30490N8013o9541K85669
36008A929378K86521j26045l2353N00479M11540j21128J73221J013605P82513
35999D817731k62877p8958J325548J591763L48564L6130J304925J804493J007205
35990A1894524J564732L976709N125633M490139N804177R533394J1241830J2178054
$$ plain form
35982 65809192 87709490 128599373 177764002 204892003 189794058 145208022 101758244
35975 101758244 75805822 61400201 48851626 37841811 31021396 26258199 20722438
35968 20722438 15973711 14129772 13463158 11653642 9717490 9285073 9123724 7556202
35960 7556202 5679072 5203537 5340318 4560520 3469850 3350035 3581091 2968446 2122357
35951 2122357 2197692 2592345 2099866 1193098 1077516 1487341 1391117 988085 1124695 1505238
35941 1505238 1261605 646152 522647 770611 703554 487299 705568 1072471 944184 577795
35931 577795 591129 724689 413564 37901 315951 946013 1112070 894036 953524 1234915
35921 1234915 1181585 877970 822154 896328 660775 337069 428680 691930 532509 105262
$$ packed form
35982F5809192K1900298M0889883M9164629K7128001j5097945m4586036m3449778
35975A01758244k5952422j4405621j2548575j1009815o820415m763197n535761
35968B0722438m748727j843939o66614j809516j936152m32417j61349j567522
35960G556202j877130m75535J36781p79798j090670j19815K31056o12645q46089
35951B122357P5335L94653m92479r06768j15582M09825r6224m03032J36610L80543
35941A505238k43633o15453j23505K47964o7057k16255K18269L66903j28287l66389
35931E77795J3334J33560l11125l75663K78050O30062J66057k18034N9488K81391
35921A234915n3330l03615n5816P4174k35553l23706R1611K63250j59421m27247
$$ plain form
35911 105262 -5111 131018 48172 -100985 156837 591892 590850 259578 196682 396646
35901 396646 379491 195227 287756 534136 417614 23921 -95188 70878 54706 -146827
35891 -146827 -128567 38889 -75628 -343778 -209817 292579 560508 445907 387069 525158
35881 525158 547491 416442 412948 445864 155994 -279301 -297347 56477 145826 -168921 -320625
35870 -320625 -48039 218785 180474 94122 151448 155716 58291 143443 434113 539721 333280
35859 333280 190777 329514 472634 395526 263650 199222 28871 -295503 -492462 -403919
35849 -403919 -242750 -190252 -131281 33343 169345 166851 112146 94575 111893 195848 348462
35838 348462 382478 137890 -202167 -334216 -266816 -188786 -76041 159582 321160 203462
$$ packed form
35911A05262j10373J36129q2846j49157K57822M35055j042l31272o2896J99964
35901C96646j7155j84264R2529K46380j16522l93693j19109J66066j6172k01533
35891a46827J8260J67456j14517k68150J33961N02396K67929j14601n8838J38089
35881E25158K2333j31049l494L2916k89870m35295j8046L53824Q9349l14747j51704
35870c20625K72586K66824l8311q6352N7326M268r7425Q5152K90670J05608k06441
35859C33280j42503J38737J43120p7108j31876o4428j70351l24374j96959Q8543
35849d03919J61169N2498N8971J64624J36002k494n4705j7571J7318Q3955J52614
35838C48462L4016k44588l40057j32049O7400P8030J12745K35623J61578j17698
$$ plain form
35828 203462 31549 102399 187418 -114377 -605291 -733097 -479080 -302953 -285251 -69938
35818 -69938 349949 551936 455272 436816 571934 487445 124607 -62331 124919 323931
35808 323931 294177 269971 398160 433052 247079 84493 70764 11691 -111596 -11210
35798 -11210 329195 517020 418355 380702 543420 532393 153162 -193037 -152379 38810
35788 38810 30678 -81519 -46030 103910 237652 391578 559347 574951 437879 375971 401177
35777 401177 253566 -20895 38297 569401 1065028 1103833 904431 805604 700569 403989
35767 403989 129663 141459 283461 281651 199826 208727 205718 43513 -133257 -127911 -21641
35756 -21641 29349 65868 137555 130944 26577 15458 132695 125169 -86313 -203879 -64015
$$ packed form
35828B03462j71913P0850Q5019l01795m90914j27806K54017J76127J7702K15313
35818f9938M19887K01987r6664j8456J35118q4489l62838j86938J87250J99012
35808C23931k9754k4206J28189L4892j85973j62586j3729n9073j23287J00386
35798a1210L40405J87825r8665l7653J62718j1027l79231l46199M0658J91189
35788C8810q132j12197L5489J49940J33742J53926J67769J5604j37072o1908K5206
35777D01177j47611k74461N9192N31104M95627L8805j99402r8827j05035k96580
35767D03989k74326J1796J42002j810q1825Q901l009j62205j76770N346J06270
35756b1641N0990L6519P1687o611j04367j1119J17237p526k11482j17566J39864
$$ plain form
35745 -64015 67936 -1295 -42922 109548 180540 -43589 -254996 -114002 176650 246116
35735 246116 162734 194031 266537 157362 -22604 -15161 113188 122867 46709 81613 204872
35724 204872 266769 291466 348888 325693 151577 32432 126448 224870 97486 -89739 -59831
35713 -59831 113092 187365 162700 150783 83965 -87272 -159115 3530 176697 161440 140190
35702 140190 259041 224464 -189081 -577971 -442950 -10600 108746 -115774 -176141 79565
35692 79565 260540 147433 -13311 -11346 44260 46716 68745 127361 126858 85007 107273 151335
35680 151335 121786 123279 278852 399839 226338 -95498 -193184 -50201 23747 -51015 -46228
35669 -46228 113980 247912 272915 263775 174683 -79945 -286775 -115923 345972 668406
$$ packed form
35745f4015J31951o9231m1627J52470P0992k24129k11407J40994K90652O9466
35735B46116q3382L1297P2506j09175j79966P443J28349R679p6158L4904J23259
35724B04872O1897K4697N7422k3195j74116j19145R4016R8422j27384j87225K9908
35713e9831J72923P4273k4665j1917o6818j71237p1843J62645J73167j5257k1250
35702A40190J18851l4577m13545l88890J35021M32350J19346k24520o0367K55706
35692G9565J80975j13107j60744J965N5606K456K2029N8616n03m1851K2266M4062
35680A51335k9549J493J55573J20987j73501l21836r7686J42983P3948p4762M787
35669d6228J60208J33932K5003r140q9092k54628k06830J70852M61895L22434
$$ plain form
35659 668406 692763 651238 670837 620576 491573 460727 495414 342527 7725 -187853 -131421
35648 -131421 -68010 -117825 -89228 85999 178001 103003 115022 337711 511074 458759 431012
35637 431012 680698 1011422 1076778 904959 814357 948472 1145633 1180681 969288 619834
35627 619834 373196 368272 429265 272637 -48514 -167142 58460 319027 305962 116985
35617 116985 28687 97422 194679 258129 296217 267870 143613 8464 -30825 17982 65851
35606 65851 40737 -81676 -249608 -329695 -252165 -150005 -198417 -335299 -334091 -146564 45039
35595 45039 125286 157727 172796 97563 -38423 -70559 38123 119186 73469 19824 80307
35584 80307 206803 302725 336999 275401 92919 -84901 -60925 138474 249045 126628
$$ packed form
35659F68406K4357m1525J9599n0261j29003l0846L4687j52887l34802j95578N6432
35648a31421O3411m9815K8597J75227R2002p4998J2019K22689J73363n2315k7747
35637D31012K49686L30724O5356j71819r0602J34115J97161L5048k11393l49454
35627F19834k46638m924O0993j56628l21151j18628K25602K60567j3065j88977
35617A16985q8298O8735R7257O3450L8088k8347j24257j35149l9289M8807M7869
35606F5851k5114j22413j67932q0087P7530J02160m8412j36882J208J87527J91603
35595D5039Q0247L2441J5069p5233j35986l2136J08682Q1063m5717n3645O0483
35584H0307J26496R5922L4274o1598j82482j77820K3976J99399J10571j22417
$$ plain form
35574 126628 -77974 -174900 -158337 -88556 36126 170786 167851 -38227 -312093 -473019
35564 -473019 -468571 -354046 -212655 -112565 -35882 118079 340834 428463 270048 81005
35554 81005 80018 84125 -201907 -606443 -670438 -378681 -189850 -268160 -238180 110758 419514
35543 419514 357994 147863 112783 123722 -65157 -261447 -112630 270928 451907 304885
35533 304885 81414 -81909 -280032 -471882 -424149 -123873 91816 -25437 -300142 -388676
35523 -388676 -206171 43671 153302 88436 -60922 -176286 -158640 4321 160923 79437
35513 79437 -262718 -525120 -341662 160975 433669 215525 -106017 -77032 169821 216750
35503 216750 81180 126653 356146 367522 66732 -131772 15943 214867 185688 120914
$$ packed form
35574A26628k04602r6926J6563O9781J24682J34660k935k06078k73866j60926
35564d73019M448J14525J41391J00090P6683J53961K22755Q7629j58415j89043
35554H1005r87M107k86032m04536o3995K91757J88831p8310K9980L48938L08756
35543D19514o1520k10131l5080J0939j88879j96290J48817L83558J80979j47022
35533C04885k23471j63323j98123j91850M7733L00276K15689j17253k74705q8534
35523c88676J82505K49842J09631o4866j49358j15364J7646J62961J56602q1486
35513G9437l42155k62402J83458N02637K72694k18144l21542K8985K46853M6929
35503B16750j35570M5473K29493J1376l00790j98504J47715J98924k9179o4774
$$ plain form
35493 120914 263879 423690 287945 -61451 -302192 -331194 -262233 -154589 -27601 23835
35483 23835 -20761 -6835 137696 243698 195613 137221 159362 66040 -262161 -546632 -490987
35472 -490987 -244070 -124910 -106593 31389 225197 236875 119759 132723 248962 177854
35462 177854 -124776 -365650 -379233 -333568 -395360 -487440 -473235 -351269 -192923 -68903
35452 -68903 -63812 -188760 -283187 -181750 44577 195422 237146 277608 294972 148712 -132613
35441 -132613 -315527 -262477 -86184 31769 26118 -59348 -127704 -83795 50212 117466 40742
35430 40742 -33398 46225 179430 169725 37264 -45076 -51955 -102671 -204838 -238381 -175801
35419 -175801 -105218 -56699 -7666 -21516 -159428 -284408 -188799 84769 271763 244336 132344
$$ packed form
35493A20914J42965J59811j35745l49396k40741k9002O8961J07644J26988N1436
35483B3835m4596J3926J44531J06002m8085n8392K2141r3322l28201k84471N5645
35472d90987K46917J19160J8317J37982J93808J1678j17116J2964J16239p1108
35462A77854l02630k40874j3583M5665o1792r2080J4205J21966J58346J24020
35452f8903N091j24948r4427J01437K26327J50845M1724M0462J7364j46260k81325
35441a32613j82914N3050J76293J17953n651q5466o8356M3909J34007O7254p6724
35430D0742p4140P9623J33205r705j32461q2340o879n0716j02167l3543O2580
35419a75801P0583M8519M9033j3850j37912j24980R5609K73568J86994k7427j11992
$$ plain form
35408 132344 68922 16021 -115068 -325006 -535845 -626536 -487659 -164607 110394 164881
35398 164881 87756 46914 30558 -45309 -118171 -115960 -181778 -461006 -753294 -707939 -333596
35387 -333596 6839 101269 72036 47677 -18834 -146514 -239364 -278973 -345808 -396147 -283466
35376 -283466 -54424 52457 -29744 -106403 -62577 -9210 -5235 64319 209092 226408 36418
35365 36418 -138195 -105321 20976 57998 32163 12436 -106837 -394032 -620432 -508405
35355 -508405 -161747 25938 -113374 -327498 -307723 -66382 141599 169868 136159 232912
35345 232912 469798 673034 712987 632537 528972 429153 350330 357415 447572 497322 458777
35334 458777 477535 640556 742621 542372 159188 -47513 54520 278725 449577 545308
$$ packed form
35408A32344o3422n2901j31089k09938k10839r0691J38877L23052K75001N4487
35398A64881p7125m0842j6356p5867p2862K211o5818k79228k92288M5355L74343
35387c33596L40435R4430k9233k4359o6511j27680r2850l9609o6835n0339J12681
35376b83466K29042J06881q2201p6659M3826N3367L975O9554J44773J7316j89990
35365C6418j74613L2874J26297L7022k5835j9727j19273k87195k26400J12027
35355e08405L46658J87685j39312k14124J9775K41341K07981K8269l3709R6753
35345B32912K36886K03236L9953q0450j03565r9819p8823P085R0157M9750l8545
35334D58777J8758J63021J02065k00249l83184k06701J02033K24205J70852R5731
$$ plain form
35324 545308 531401 354053 135128 95652 225400 274669 125623 -70077 -171336 -218958
35314 -218958 -270280 -297298 -302960 -319326 -270934 -83397 78944 -16607 -257241 -289814 -79100
35303 -79100 28765 -112273 -229849 -155620 -124547 -299452 -412345 -222387 17361 -47891
35293 -47891 -279798 -272619 -2419 172276 74266 -113571 -212305 -252330 -285820 -268307 -187973
35282 -187973 -119390 -99047 -78524 -18737 60524 106501 49305 -136469 -327496 -324596 -108230
35271 -108230 110846 176121 156471 139263 58788 -119575 -245705 -203504 -107882 -92852 -81346
35260 -81346 28424 134036 124956 126094 266000 358000 134403 -296103 -547539 -471876 -282670
35249 -282670 -185025 -161700 -137384 -107159 -71806 -39012 -85686 -243174 -367337 -319919 -207120
$$ packed form
35324E45308j3907j77348k18925l9476J29748M9269j49046j95700j01259m7622
35314b18958n1322k7018n662j6366M8392J87537J62341r5551k40634l2573K10714
35303g9100J07865j41038j17576P4229L1073j74905j12893J89958K39748o5252
35293d7891k31907P179K70200J74695r8010j87837r8734m0025l3490J7513Q0334
35282a87973O8583K0343K0523N9787P9261M5977n7196j85774j91027K900K16366
35271a08230K19076O5275j9650j7208q0475j78363j26130M2201R5622J5030J1506
35260h1346J09770J05612r080J138J39906R2000k23597m30506k51436P5663J89206
35249b82670R7645K3325K4316L0225L5353L2794m6674j57488j24163M7418J12799
$$ plain form
35238 -207120 -202683 -218328 -53229 176503 123111 -232862 -472935 -326390 -42977 19218
35228 19218 -93679 -97237 34024 41184 -194834 -467301 -536749 -435738 -379898 -459246 -534116
35217 -534116 -448152 -255990 -154931 -220216 -326424 -355647 -343760 -334209 -230529 40123 310070
35206 310070 327957 112869 -55408 -36248 -23018 -236092 -567663 -691302 -481163 -178288
35196 -178288 -96188 -243858 -339546 -202467 -14516 -77931 -370270 -525837 -309453 63316
35186 63316 203470 24354 -219444 -302020 -257093 -228781 -239018 -187330 -32595 107876 88111
35175 88111 -52591 -98125 54065 205819 104814 -186765 -367421 -317165 -210100 -184382
35165 -184382 -161915 -81688 -51175 -124155 -160048 -67026 29403 30399 56408 200961 311310
$$ packed form
35238b07120M437j5645J65099K29732n3392l55973k40073J46545K83413O2195
35228A9218j12897l558J31261P160k36018k72467o9448J01011N5840p9348p4870
35217e34116Q5964J92162J01059o5285j06208k9223J1887R551J03680K70652K69947
35206C10070J7887k15088j68277J9160J3230k13074l31571j23639K10139L02875
35196a78288Q2100j47670r5688J37079J87951o3415k92339j55567K16384L72769
35186F3316J40154j79116k43798q2576M4927K8312j0237N1688J54735J40471j9765
35175H8111j40702m5534J52190J51754j01005k91579j80656N0256J07065K5718
35165a84382K2467Q0227L0513p2980l5893R3022R6429R96K6009J44553J10349
$$ plain form
35154 311310 244495 139265 177607 261815 209337 102351 134999 244636 218066 72105 7666
35143 7666 45898 21213 -98340 -177589 -180870 -200223 -235664 -203161 -135897 -129023 -122980 2102
35131 2102 159899 150098 -26207 -204606 -345412 -497953 -555907 -380953 -114376 -9749
35121 -9749 432 180886 463637 488783 217943 43695 166382 305661 210556 38440
35111 38440 -5593 -29126 -175293 -301241 -229295 -70711 -17279 -16812 75812 196177 173343
35100 173343 7225 -167925 -283996 -334914 -296708 -201297 -165179 -221624 -261039 -234183 -243317
35089 -243317 -334271 -393412 -360017 -338239 -389690 -428571 -422645 -455693 -489133 -347279 -67729
35078 -67729 55213 -51585 -63336 214804 494070 466734 290368 260221 300479 182402
$$ packed form
35154C11310o6815j05230L8342Q4208n2478j06986L2648J09637k6570j45961o4439
35143G666L8232k4685j19553p9249l281j9353l5441L2503O7264O874O043J25082
35131B102J57797r801j76305j78399j40806j52541n7954J74954K66577J04627
35121i749J0181J80454K82751K5146k70840j74248J22687J39279r5105j72116
35111C8440m4033k3533j46167j25948P1946J58584N3432M67R2624J20365k2834
35100A73343j66118j75150j16071n0918L8206R5411L6118n6445l9415K6856r134
35089b43317r0954n9141L3395K1778n1451l8881N926l3048l3440J41854K79550
35078f7729J22942j06798j1751K78140K79266k7336j76366l0147M0258j18077
$$ plain form
35068 182402 -747 -7480 96296 87766 35219 154781 344629 318173 122886 70542 191455
35057 191455 212503 69775 -19533 -30952 -207287 -556742 -722252 -518220 -209721 -69380
35047 -69380 -10118 126589 238547 176466 42828 21544 88224 109165 76547 50585 5004
35036 5004 -89451 -147630 -97832 -17589 -2472 -16174 -4407 -27866 -129997 -198866 -141571 -99824
35024 -99824 -288767 -658364 -902764 -824206 -549042 -343363 -309597 -321350 -220432 -27154
35014 -27154 75777 -27300 -228659 -336123 -320487 -307516 -337736 -288477 -88915 122309
35004 122309 158637 31097 -67188 4298 181633 276432 180369 -12743 -106629 -37808 49377
34993 49377 22629 -21718 113401 424117 682595 715722 567301 372702 218380 158249
$$ packed form
35068A82402j83149o733J03776q530n2547J19562J89848k6456j95287n2344J20913
35057A91455K1048j42728q9308j1419j76335l49455j65510K04032L08499J40341
35047f9380N9262J36707J11958o2081j33638k1284O6680K0941l2618k5962m5581
35036E004r4455n8179M9798Q0243J5117j3702J1767k3459j02131o8869N7295M1747
35024i9824j88943l69597k44400P8558K75164K05679L3766j1753J00918J93278
35014b7154J02931j03077k01359j07464J5636J2971l0220M9259J99562K11224
35004A22309L6328j27540r8285P1486J77335R4799r6063j93112r3886O8821Q7185
34993D9377k6748m4347J35119L10716K58478L3127j48421j94599j54322o0131
$$ plain form
34983 158249 225291 360349 429847 366220 218868 62036 -49939 -50104 82478 230832 253402
34972 253402 192223 204630 286652 268940 120273 22176 57852 61473 -87363 -233068 -186102
34961 -186102 -24064 45323 -4123 -32134 35771 162860 308949 432198 462510 409346 401926
34950 401926 486208 500793 321950 109908 98846 229574 227709 10816 -210393 -240605 -108133
34939 -108133 60651 199344 286243 302213 255166 178770 104794 77246 129457 192366 142739
34928 142739 26910 68525 312704 464225 301928 56733 79473 300931 381869 272410
34918 272410 213116 263383 281204 333411 629014 1030585 1171665 1129450 1394003 2043857
34908 2043857 2611584 2972558 3608394 4678539 5796258 7355940 10924329 16905875 22452848
$$ packed form
34983A58249O7042J35058O9498o3627j47352j56832j11975j65J32582J48354K2570
34972B53402o1179J2407Q2022j7712j48667r8097L5676L621j48836j45705M6966
34961a86102J62038O9387m9446k8011O7905J27089J46089J23249L0312n3164p420
34950D01926Q4282J4585j78843k12042j1062J30728j865k16893k21209l0212J32472
34939a08133J68784J38693Q6899J5970m7047p6396p3976k7548N2211O2909m9627
34928A42739j15829M1615K44179J51521j62297k45195K2740K21458Q0938j09459
34918B72410n9294N0267J7821N2207K95603M01571J41080m2215K64553O49854
34908B043857N67727L60974O35836J070145J117719J559682L568389N981546N546973
$$ plain form
34899 22452848 23523986 19303361 13190846 8950158 7144503 6031926 4606592 3363515
34891 3363515 2739654 2345159 1824108 1391182 1231955 1118345 897654 785216 900964
34882 900964 980375 809345 573353 531110 646492 758900 849570 934579 924448 779384
34872 779384 612316 490407 331410 126763 45697 162000 289711 261113 167881 148021
34862 148021 139276 59890 46074 248907 529864 633042 575517 587782 702575 690774 452032
34851 452032 221066 265926 534545 727267 649980 406185 263535 373654 619444 741131
34841 741131 617898 381096 223461 174391 140022 92551 92476 142885 149825 55288 -80290
34830 -80290 -158574 -137273 -25104 135658 240269 153231 -147289 -483047 -616658 -497689
$$ packed form
34899B2452848J071138m220625o112515m240688j805655j112577j425334j243077
34891C363515o23861l94495n21051m32926j59227j13610k20691j12438J15748
34882I00964P9411j71030k35992m2243J15382J12408R0670Q5009j0131j45064
34872G79384j67068j21909j58997k04647q1066J16303J27711k8598r3232j9860
34862A48021q745p9386j3816K02833K80957J03178n7525J2265J14793j1801k38742
34851D52032k30966M4860K68619J92722p7287k43795j42650J10119K45790J21687
34841G41131j23233k36802j57635m9070l4369m7471p5N0409O940r4537j35578
34830h0290p8284K1301J12169J60762J04611q7038l00520l35758j33611J18969
$$ plain form
34820 -497689 -313701 -267982 -358034 -426977 -387208 -296215 -219999 -144883 -69331 -60562 -127104
34809 -127104 -138499 -601 163442 157056 -7795 -127797 -86948 41473 168993 296840
34799 296840 412130 436940 349571 245627 222714 284988 375864 412529 302918 56471 -136529
34788 -136529 -89935 119148 242152 198095 121253 76358 -19886 -146119 -118433 103443 297768
34777 297768 306021 253999 303601 400799 428473 399987 336114 164378 -79573 -173862 -39721
34766 -39721 74280 -29267 -159117 -55333 159147 175405 -3326 -102782 -21744 91029
34756 91029 140740 163328 145607 49499 -33240 -13903 -19188 -190650 -364517 -277817 -23306
34745 -23306 60020 -82470 -172813 -87770 -16491 -82134 -167532 -194929 -237655 -267617 -133832
$$ packed form
34820d97689J83988M5719r0052o8943L9769R0993P6216P5116P5552Q769o6542
34809a27104j1395J37898J64043o386j64851j20002M0849J28421J27520J27847
34799B96840J15290K4810q7369j03944k2913O2274R0876L6665j09611k46447j93000
34788a36529M6594K09083J23004m4057p6842m4895r6244j26233K7686K21876J94325
34777B97768Q253n2022M9602R7198K7674k8486o3873j71736k43951r4289J34141
34766c9721J14001j03547j29850J03784K14480J6258j78731r9456Q1038J12773
34756I1029M9711K2588j7721r6108q2739J9337n285j71462j73867Q6700K54511
34745b3306Q3326j42490r0343Q5043P1279o5643q5398k7397m2726k9962J33785
$$ plain form
34734 -133832 101273 147014 -55896 -188488 -33804 197534 209269 18915 -174037 -276125
34724 -276125 -272460 -141181 21895 7180 -206920 -363821 -298362 -170997 -164214 -186110 -81968
34713 -81968 79564 154267 163192 172160 120863 -10096 -51952 100372 271201 280639 253542
34702 253542 376534 512231 375704 -5350 -322803 -429669 -454863 -494554 -472985 -350219
34692 -350219 -235044 -215088 -228054 -163701 -3411 162557 205325 77532 -97920 -142735
34682 -142735 -69169 -80350 -265111 -468061 -559272 -623743 -734243 -756994 -590051 -393145
34672 -393145 -340609 -333372 -225450 -154119 -321183 -584311 -620916 -417851 -245169 -188986 -71419
34661 -71419 161524 322408 307719 241879 237031 273870 360904 542361 706367 659317 439579
$$ packed form
34734a33832K35105M5741k02910j32592J54684K31338J1735j90354j92952j02088
34724b76125L665J31279J63076j4715k14100j56901O5459J27365O783k1896J04142
34713h1968J61532P4703Q925Q968n1297j30959m1856J52324J70829R438k7097
34702B53542J22992J35697j36527l81054l17453j06866k5194l9691K1569J22766
34692c50219J15175J9956j2966O4353J60290J65968M2768j27793j75452m4815
34682a42735P3566j1181j84761k02950r1211o4471j10500k2751J66943J96906
34672c93145N2536P237J07922P1331j67064k63128l6605K03065J72682N6183J17567
34661g1419K32943J60884j4689o5840m848L6839Q7034J81457J64006m7050k19738
$$ plain form
34650 439579 284521 245371 137788 -65769 -137734 -13771 27902 -204299 -499290 -576064
34640 -576064 -476200 -381923 -269994 -30222 231593 299870 174616 47513 13744 18590 32677
34629 32677 72967 87177 10644 -85145 -79288 -17690 -64002 -235452 -363910 -346719 -272615
34618 -272615 -243391 -214201 -100384 53464 109108 -2700 -219805 -415061 -474360 -350827
34608 -350827 -118191 41191 -13357 -214104 -340727 -293387 -232791 -349779 -562425 -612567
34598 -612567 -461709 -379203 -543652 -755993 -724357 -483953 -308817 -300158 -316198 -276685 -269281
34587 -269281 -316584 -283002 -105079 81747 153554 178170 278350 439323 545317 506281
34577 506281 291963 -37887 -289178 -270906 -48972 87738 -7909 -173994 -227121 -226251 -303239
$$ packed form
34650D39579j55058l9150j07583k03557p1965J23963M1673k32201k94991p6774
34640e76064R9864R4277J11929K39772K61815O8277j25254j27103l3769M846J4087
34629C2677M0290J4210p6533r5789N857O1598m6312j71450j28458J7191P4104
34618b72615K9224K9190J13817J53848N5644j11808k17105j95256n9299J23533
34608c50827K32636J59382n4548k00747j26623M7340O0596j16988k12646n0142
34598f12567J50858Q2506j64449k12341L1636K40404J75136Q659j6040L9513P404
34587b69281m7303L3582J77923J86826P1807K4616J00180J60973J05994l9036
34577E06281k14318l29850k51291J8272K21934J36710r5647j66085n3127Q70p6988
$$ plain form
34566 -303239 -403802 -389200 -269549 -140604 5258 195972 296303 150103 -123130 -212829
34556 -212829 -25760 195632 216682 88512 -897 2972 22366 24115 65414 181604 308746
34545 308746 331751 192540 -41958 -226279 -279634 -269036 -305564 -377709 -361105 -198863 5437
34534 5437 104675 55393 -87833 -262780 -422513 -506495 -467696 -336048 -200907 -113045 -47027
34523 -47027 19298 43252 -9912 -73355 -46276 47719 71086 -22511 -95989 -22993 106483
34512 106483 89375 -123329 -383159 -552530 -631333 -659099 -610892 -450770 -220905 -25318
34502 -25318 49624 -1642 -78134 -35124 153844 320452 279042 63641 -116965 -144810 -85796
34491 -85796 -20912 61285 166739 235149 237067 212296 166401 59533 -58632 -61368 37891
$$ packed form
34566c03239j00563J4602J19651J28945J45862J90714J00331j46200k73233q9699
34556b12829J87069K21392K1050j28170q9409L869J9394J749M1299J16190J27142
34545C08746K3005j39211k34498j84321n3355J0598l6528p2145J6604J62242K04300
34534E437R9238m9282j43226j74947j59733q3982L8799J31648J35141Q7862O6018
34523d7027O6325K3954n3164o3443K7079R3995K3367r3597p3478P2996J29476
34512A06483j7108k12704k59830j69371p8803k7766M8207J60122K29865J95587
34502b5318P4942n1266p6492M3010J88968J66608m1410k15401j80606k7845N9014
34491h5796O4884Q2197J05454O8410J918k4771m5895j06868j18165k736R9259
$$ plain form
34480 37891 50823 -99986 -229910 -165995 -16011 7097 -103626 -210170 -294322 -434836
34470 -434836 -576974 -556531 -354600 -134664 -14595 24308 -2121 -115947 -236700 -202111
34460 -202111 -11578 115370 28142 -140841 -167443 -34407 90250 98909 31355 -48485 -127615
34449 -127615 -185642 -175582 -114357 -120861 -291626 -556242 -715333 -638543 -392149 -150644 -17841
34438 -17841 16150 -35079 -212102 -507011 -767712 -802201 -588895 -317422 -183912 -181474 -140789
34427 -140789 32920 230104 288069 220708 193571 264180 284187 148491 15576 107072 349928
34416 349928 432259 231306 -26177 -105041 -65685 -98663 -218634 -294155 -278689 -239977 -218727
34405 -218727 -206962 -219780 -253606 -222593 -75767 69345 61513 -48715 -69592 45572 134795
$$ packed form
34480C7891J2932j50809j29924O3915J49984K3108j10723j06544q4152j40514
34470d34836j42138K0443K01931K19936J20069L8903k6429j13826j20753L4589
34460b02111J90533J26948q7228j68983k6602J33036J24657Q659o7554p9840p9130
34449a27615n8027J0060O1225o504j70765k64616j59091P6790K46394K41505J32803
34438a7841L3991n1229j77023k94909k60701l4489K13306K71473J33510K438M0685
34427a40789J73709J97184N7965o7361k7137P0609K0007j35696j32915R1496K42856
34416C49928Q2331k00953k57483p8864L9356l2978j19971p5521J5466L8712K1250
34405b18727J1765j2818l3826L1013J46826J45112p832j10228k0877J15164Q9223
$$ plain form
34394 134795 67392 -99585 -237870 -291814 -268067 -197731 -150591 -187702 -267477 -292023 -261141
34383 -261141 -266063 -311309 -285598 -169880 -134603 -320215 -611213 -749198 -637410 -445744
34373 -445744 -421464 -638409 -916958 -979957 -729555 -370419 -191924 -236092 -292704 -234105
34363 -234105 -187304 -281377 -386624 -286407 -23013 134471 59627 -81747 -93526 504
34353 504 49252 -6364 -107754 -187221 -200236 -112846 35517 99027 -31205 -266260 -406272
34342 -406272 -379959 -288068 -210345 -107633 42778 155884 174279 182861 274994 391487 418129
34331 418129 368265 320743 234395 6609 -291992 -429971 -309564 -96292 6519 -18674
34321 -18674 -68157 -77226 -37265 38779 90533 47489 -43047 -37012 87448 164174 91342 10330
$$ packed form
34394A34795o7403j66977j38285n3944K3747P0336M7140l7111p9775k4546L0882
34383b61141m922m5246K5711J15718L5277j85612k90998j37985J11788J91666
34373d45744K4280k16945k78549o2999K50402L59136J78495m4168n6612N8599
34363b34105M6801r4073j05247J00217K63394J57484p4844j41374j1779R4030
34353E04M8748n5616j01390p9467j3015Q7390J48363O3510j30232k35055j40012
34342d06272K6313R1891P7723J02712J50411J13106J8395Q582R2133J16493K6642
34331D18129m9864m7522q6348k27786k98601j37979J20407K13272J02811k5193
34321a8674m9483r069L9961P6044N1754m3044r0536O035J24460P6726p2832q1012
$$ plain form
34309 10330 85195 214481 147412 -161349 -482913 -589934 -465104 -240318 -55233 8397
34299 8397 -47616 -146038 -211541 -232395 -223701 -190940 -172053 -223772 -295587 -226605 27173 275131
34287 275131 337778 299397 343151 435716 397509 228456 115102 115936 89906 -12289 -23378
34276 -23378 169435 419211 513622 433909 295655 145855 -46015 -260250 -406910 -413970
34266 -413970 -278929 -64424 128795 233688 279499 325751 340563 241084 59043 -62733
34256 -62733 -80054 -120877 -269908 -396999 -319496 -68513 130847 131089 18548 -19188 77334
34245 77334 182189 151160 13124 -58297 19400 102193 -6288 -290622 -527473 -534345 -327350
34234 -327350 -53076 133593 134572 -27453 -182768 -150159 58825 231138 170116 -117804
$$ packed form
34309A0330P4865J29286o7069l08761l21564j07021J24830K24786J85085O3630
34299H397n6013r8422o5503k0854Q694L2761J8887n1719p1815O8982K53778K47958
34287B75131O2647l8381M3754R2565l8207j69053j13354Q34k6030j02195j1089
34276b3378J92813K49776R4411p9713j38254j49800j91870k14235j46660p060
34266d13970J35041K14505J93219J04893M5811M6252J4812r9479j82041j21776
34256f2733j7321m0823j49031j27091P7503K50983J99360K42j12541l7736R6522
34245G7334J04855l1029j38036p1421P7697Q2793j08481k84334k36851o872K06995
34234c27350K74274J86669R79j62025j55315L2609K08984J72313o1022k87920
$$ plain form
34224 -117804 -438932 -562515 -393133 -70134 140235 128822 66063 152809 334181 402214
34214 402214 311165 212473 211476 264897 295409 237515 10125 -358933 -621754 -556683 -305516
34203 -305516 -210460 -323922 -375045 -247043 -147483 -207357 -254078 -148543 -31805 -29939 -9857
34192 -9857 124814 172993 -31848 -268857 -249011 -98736 -150065 -372801 -416180 -178247 54578
34181 54578 74255 4855 -6888 -43365 -199729 -352563 -335367 -199981 -132133 -193072 -287574
34170 -287574 -335630 -346017 -328962 -246150 -92478 32756 16460 -100975 -135677 -3315 125686
34159 125686 34360 -234555 -447802 -521795 -568247 -588581 -409730 -37244 211490 127156
34149 127156 -77032 -111368 -52838 -141878 -307162 -256728 25771 232136 188677 55514
$$ packed form
34224a17804l21128j23583J69382L22999K10369j1413o2759Q6746J81372O8033
34214D02214r1049r8692r97N3421L0512n7894k27390l69058k62821O5071K51167
34203c05516R5056j13462n1123J28002R9560n9874m6721J05535J16738J866K0082
34192i857J34671M8179k04841k37009J9846J50275n1329k22736m3379K37933K32825
34181E4578J9677o9400j1743l6477j56364j52834J7196J35386O7848o0939r4502
34170b87574m8056j0387J7055Q2812J53672J25234j6296j17435l4702J32362J29001
34159A25686r1326k68915k13247p3993m6452k0334J78851L72486K48734q4334
34149A27156k04188l4336N8530q9040j65284N0434K82499K06365m3459j33163
$$ plain form
34139 55514 21099 70018 122362 162489 147638 2828 -201919 -256980 -93036 101830 137994
34128 137994 61417 41040 124271 194918 120510 -101832 -314457 -333715 -163931 -9556 4516
34117 4516 11466 164048 351454 373461 294768 347191 519620 543498 305837 -6570 -222778
34106 -222778 -373030 -491437 -510181 -452966 -474281 -582670 -568605 -342747 -107263 -35951
34096 -35951 -16837 103621 235550 216999 90351 -14266 -123335 -322638 -533619 -607702
34086 -607702 -554640 -476828 -367294 -182313 -33948 -76593 -236089 -275610 -134351 2257
34076 2257 -675 -48555 -7734 70108 27081 -156140 -294134 -200584 71291 248545 142470
34065 142470 -114988 -234376 -138351 -26646 -68688 -208655 -329812 -423426 -489149 -446812
$$ packed form
34139E5514l4415M8919N2344M0127j4851j44810k04747n5061J63944J94866L6164
34128A37994p6577k0377Q3231P0647p4408k22342k12625j9258J69784J54375J4072
34117D516O950J52582J87406K2007p8693N2423J72429K3878k37661l12407k16208
34106b22778j50252j18407j8744N7215k1315j08389J4065K25858K35484P1312
34096c5951J9114J20458J31929j8551j26648j04617j09069j99303k10981p4083
34086f07702N3062P7812J09534J84981J48365m2645j59496l9521J41259J36608
34076B257k932m7880M0821P7842m3027j83221j37994R3550K71875J77254j06075
34065A42470k57458j19388R6025J11705m2042j39967j21157r3614o5723M2337
$$ plain form
34055 -446812 -296473 -216928 -336457 -528548 -607341 -605775 -659832 -718019 -603832 -326292 -97946
34044 -97946 -36507 -48406 -36210 -37084 -94920 -145220 -114811 -46097 -42422 -124333 -187532 -113650
34032 -113650 68270 160862 18258 -228381 -307890 -194426 -154628 -312482 -397516 -131914
34022 -131914 315379 528587 383662 111797 -91175 -218330 -254314 -145719 1615 -10042
34012 -10042 -143612 -138258 78645 259570 216084 64326 -39932 -152392 -346967 -492052
34002 -492052 -429861 -221359 -28625 101749 171303 112592 -62287 -151054 -26217 118873
33992 118873 36063 -171451 -187495 28210 181566 83979 -119992 -222743 -214848 -184837 -149584
33981 -149584 -88941 -6943 120128 320483 487043 416595 84801 -250696 -325122 -136064
$$ packed form
34055d46812J50339P9545j19529j92091p8793J566n4057n8187J14187K77540K28346
34044i7946O1439j1899J2196q74n7836n0300L0409O8714L675q1911o3199P3882
34032a13650J81920R2592j42604k46639p9509J13464L9798j57854q5034K65602
34022a31914M47293K13208j44925k71865k02972j27155l5984J08595J47334j1657
34012a0042j33570N354K16903J80925m3486j51758j04258j12460j94575j45085
34002d92052O2191K08502J92734J30374O9554n8711j74879q8767J24837J45090
33992A18873q2810k07514j6044K15705J53356r7587k03971j02751P895L0011L5253
33981a49584O0643Q1998J27071K00355J66560p0448l31794l35497p4426J89058
$$ plain form
33971 -136064 141304 371743 483920 419386 220538 79706 136726 282353 308335 197358
33961 197358 105533 98008 80490 -5314 -85861 -88450 -33129 42517 127650 175310 116144 -28568
33949 -28568 -161770 -266875 -421550 -621836 -739744 -714360 -633254 -546499 -366901 -75931
33939 -75931 132256 84728 -108842 -212504 -192100 -188835 -227888 -176762 5241 175345 204226
33928 204226 112966 -16418 -128592 -169064 -109749 -31955 -54946 -154347 -182780 -100002 -43238
33917 -43238 -123027 -277061 -374033 -342968 -164658 126373 379798 410970 219082 9448
33907 9448 -58465 -24854 13244 48805 97142 128892 158037 257750 397854 409008 212875
33896 212875 -46131 -201733 -260438 -291595 -274965 -181634 -61991 65145 244881 384093
$$ packed form
33971a36064K77368K30439J12177o4534j98848j40832N7020J45627K5982j10977
33961A97358r1825p525j7518q5804q0547k589N5321P5646Q5133M7660n9166j44712
33949b8568j33202j05105j54675k00286j17908K5384Q1106Q6755J79598K90970
33939g5931K08187m7528j93570j03662K0404L265l9053N1126J82003J70104K8881
33928B04226r1260j29384j12174m0472N9315P7794k2991r9401k8433Q2778N6764
33917d3238p9789j54034r6972L1065J78310K91031K53425L1172j91888k09634
33907I448o7913L3611L8098L5561M8337L1750K9145R9713J40104J1154j96133
33896B12875k59006j55602n8705l1157J6630R3331J19643J27136J79736J39212
$$ plain form
33886 384093 235652 -218007 -577989 -490592 -130401 64598 -7491 -106648 -124867 -175417
33876 -175417 -246631 -176427 -23304 -72388 -351292 -498863 -297305 -22028 -33691 -279911
33866 -279911 -462331 -496055 -511806 -530285 -439129 -260026 -169341 -213503 -214064 -41194 165161
33855 165161 167374 -39604 -194937 -101057 98177 80135 -218707 -478977 -412711 -165250
33845 -165250 -111448 -325554 -502045 -415160 -198746 -74319 -32701 46432 124369 60331 -127601
33834 -127601 -232034 -92285 225760 485327 487167 258116 32157 -18310 4649 -98862
33824 -98862 -290219 -346795 -250747 -241382 -387607 -407902 -114316 226045 252175 42168 -35344
33813 -35344 110507 212901 107289 -55332 -108335 -108424 -171600 -273744 -326551 -310306 -243455
$$ packed form
33886C84093j48441m53659l59982Q7397L60191J94999p2089r9157j8219n0550
33876a75417p1214P0204J53123m9084k78904j47571K01558K75277j1663k46220
33866b79911j82420l3724j5751j8479R1156J79103R0685m4162n61J72870K06355
33855A65161K213k06978j55333R3880J99234j8042k98842k60270O6266K47461
33845a65250N3802k14106j76491Q6885K16414J24427M1618P9133P7937o4038j87932
33834a27601j04433J39749L18045K59567J840k29051k25959n0467K2959j03511
33824i8862j91357n6576R6048R365j46225k0295K93586L40361K6130k10007p7512
33813c5344J45851J02394j05612j62621n3003q9o3176j02144n2807J6245O6851
$$ plain form
33802 -243455 -134204 -28445 -2537 -51705 -72305 5541 142802 259467 293440 202915 20438
33791 20438 -104783 -46797 114882 185206 116142 17597 -87905 -301702 -579969 -662146 -419703
33780 -419703 -103725 -58601 -295191 -526261 -553873 -445023 -357488 -358226 -420783 -472975 -430733
33769 -430733 -281888 -137246 -105623 -130983 -69831 65111 76392 -145930 -438353 -547622
33759 -547622 -434449 -288715 -267661 -326228 -329883 -246541 -157247 -116809 -90017 -42300 -25057
33748 -25057 -112241 -274155 -373158 -299325 -82418 139873 246352 223232 148711 90189 21521
33737 21521 -120495 -284165 -285569 -28208 311024 443923 316055 151312 121813 131813
33727 131813 19377 -178094 -311374 -361465 -403451 -391911 -204410 95428 254848 153993
$$ packed form
33802b43455J09251J05759K5908m9168k0600P7846J37261J16665L3973r0525j82477
33791B0438j25221N7986J61679P0324o9064r8545j05502k13797k78267q2177K42443
33780d19703L15978M5124k36590k31070k7612J08850Q7535p38o2557n2192M2242
33769d30733J48845J44642L1623k5360O1152J34942J1281k22322k92423j09269
33759e47622J13173J45734K1054n8567l655Q3342Q9294M0438K6792M7717J7243
33748b5057q7184j61914r9003P3833K16907K22291J06479k3120p4521n8522o8668
33737B1521j42016j63670j404K57361L39232J32899j27868j64743k9499J0000
33727A31813j12436j97471j33280n0091m1986J1540J87501K99838J59420j00855
$$ plain form
33717 153993 -52354 -188386 -261942 -308104 -232594 3798 204926 175057 31956 39064 192716
33706 192716 245719 115512 -26709 -99627 -224778 -398081 -375011 -74563 189979 141017
33696 141017 -43504 -48828 36249 -121234 -503401 -717994 -576790 -319309 -193853 -173945
33686 -173945 -209374 -407949 -763259 -986828 -859074 -544640 -332369 -247643 -158465 -88011
33676 -88011 -137717 -218279 -151164 21788 104016 85637 148575 331567 458449 442260 408736
33665 408736 435919 398377 190373 -79361 -251947 -334459 -409395 -436944 -306532 -42489
33655 -42489 175212 206689 97567 12898 51860 138110 109825 -71097 -253357 -294540 -258194
33644 -258194 -303119 -422753 -448009 -311191 -144551 -66741 -16681 115681 302611 417168
$$ packed form
33717A53993k06347j36032p3556m6162P5510K36392K01128k9869j43101P108J53652
33706A92716N3003j30207j42221p2918j25151j73303K3070L00448K64542m8962
33696A41017j84521n324Q5077j57483l82167k14593J41204K57481J25456J9908
33686a73945l5429j98575l55310k23569J27754L14434K12271Q4726Q9178P0454
33676h8011m9706q0562O7115J72952Q2228j8379O2938J82992J26882j6189l3524
33665D08736K7183l7542k08004k69734j72586q2512p4936k7549J30412K64043
33655d2489K17701L1477j09122q4669L8962Q6250k8285j80922j82260m1183L6346
33644b58194m4925j19634k5256J36818J66640P7810N0060J32362J86930J14557
$$ plain form
33634 417168 389777 253728 90570 -15543 -24800 10373 -9587 -115875 -251129 -353371
33624 -353371 -373613 -236594 67292 343675 338455 92924 -31363 193951 548440 656036
$$ packed form
33634D17168k7391j36049j63158j06113r257L5173j9960j06288j35254j02242
33624c53371k0242J37019L03886K76383n220k45531j24287K25314L54489J07596
$$ [...]
##END NTUPLES=NMR SPECTRUM
##END=
