##TITLE=31Pdec_BAU-j-GID
 CDCl3, 124 sc
 2.7.2019
##JCAMPDX= 6.0         $$ Bruker NMR JCAMP-DX V2.0
##DATA TYPE= NMR SPECTRUM
##DATA CLASS= NTUPLES
##ORIGIN= UXNMR, Bruker Analytische Messtechnik GmbH
##OWNER= root
$$ XWIN-NMR		Version 3.5
$$ Tue Jul  2 14:53:44 2019 Russian Standard Time (UT+4h)  she@DPX200
##.OBSERVE FREQUENCY= 81.013821
##.OBSERVE NUCLEUS= ^31P
##.ACQUISITION MODE= SIMULTANEOUS
##.ACQUISITION SCHEME= undefined
##.AVERAGES= 124
##.DIGITISER RES= 17
##SPECTROMETER/DATA SYSTEM= spect
##.PULSE SEQUENCE= zgpg30
##.SOLVENT NAME= CDCl3
##.SHIFT REFERENCE= (INTERNAL, CDCl3, 0, 182.463)
##AUDIT TRAIL= $$ (NUMBER, WHEN, WHO, WHERE, WHAT)
$$ ##TITLE= Audit trail, XWIN-NMR		Version 3.5
$$ ##JCAMPDX= 5.01
$$ ##ORIGIN= Bruker BioSpin GmbH
$$ ##OWNER= she
$$ F:/spectra/data/she/nmr/P31/1/pdata/1/auditp.txt
$$ ##AUDIT TRAIL=  $$ (NUMBER, WHEN, WHO, WHERE, WHAT)
(   1,<2019-07-02 14:52:51.53 +0400>,<she>,<DPX200>,
      <continue with go, POWCHK disabled, PULCHK disabled
       configuration hash MD5:
       00 E9 B6 7A A2 85 ED C7 34 08 36 98 17 FE 4E 26
       data hash MD5: 32K
       1B CC 1B BA 35 76 37 93 E3 67 9A EA 5D E9 32 05>)
(   2,<2019-07-02 14:52:53.70 +0400>,<she>,<DPX200>,
      <Start of raw data processing
       efp BC_mod = 2 LB = 1 FT_mod = 6 PKNL = 1 PHC0 = -2485.543 PHC1 = -48.20122 SI = 64K 
       data hash MD5: 64K
       F2 34 74 86 B6 75 4C 43 04 A6 20 98 50 90 F6 65>)
(   3,<2019-07-02 14:53:14.59 +0400>,<she>,<DPX200>,
      <pk PHC0 = -99.02844 PHC1 = 160.6001 
       data hash MD5: 64K
       F7 02 99 3B A2 4D C5 EE C0 A3 8E 0B 6B 24 2F 20>)
(   4,<2019-07-02 14:53:22.45 +0400>,<she>,<DPX200>,
      <abs ABSG = 5 
       data hash MD5: 64K
       42 04 99 62 70 70 D8 6E 65 68 74 3D A9 2F AC 13>)
$$ ##END=
$$ 
$$ hash MD5
$$ 30 10 96 F5 59 7E 64 6C 0F 59 EA F3 D6 3D 7C 21
##$RELAX= 
##$RELAX= 
##$RELAX= 
##$RELAX= 
##$RELAX= 
##$RELAX= 
##$RELAX= 
##$RELAX= 
$$ Bruker specific parameters
$$ --------------------------
##$DU= <F:/spectra>
##$EXPNO= 1
##$NAME= <P31>
##$PROCNO= 1
##$TYPE= <nmr>
##$USER= <she>
##$AMP= (0..31)
100 100 100 100 100 100 100 100 100 100 100 100 100 100 100 100 100 100 
100 100 100 100 100 100 100 100 100 100 100 100 100 100 
##$AQSEQ= 0
##$AQ_mod= 1
##$AUNM= <au_zg>
##$AUTOPOS= <>
##$BF1= 81.014009
##$BF2= 200.13
##$BF3= 200.13
##$BF4= 200.13
##$BF5= 200.13
##$BF6= 200.13
##$BF7= 200.13
##$BF8= 200.13
##$BYTORDA= 1
##$CFDGTYP= 0
##$CFRGTYP= 5
##$CHEMSTR= <none>
##$CNST= (0..31)
1 1 145 1 1 1 1 1 1 1 1 1 1 1 1 1 1 1 1 1 1 1 1 1 1 1 1 1 1 1 1 1 
##$CPDPRG= <waltz16>
##$CPDPRG1= <>
##$CPDPRG2= <waltz16>
##$CPDPRG3= <>
##$CPDPRG4= <mlev>
##$CPDPRG5= <mlev>
##$CPDPRG6= <mlev>
##$CPDPRG7= <mlev>
##$CPDPRG8= <mlev>
##$CPDPRGB= <>
##$CPDPRGT= <>
##$D= (0..31)
0 1 0 0 0 0 0 0 0 0 0 0.03 2e-05 3e-06 0 0 0 0 0 0 0 0 0 0 0 0 0 0 0 0 
0 0 
##$DATE= 1562064551
##$DBL= (0..7)
120 120 120 11 120 120 24 19 
##$DBP= (0..7)
150 150 150 150 150 150 150 150 
##$DBP07= 0
##$DBPNAM0= <>
##$DBPNAM1= <>
$$ [...]
##$SUBNAM3= <"">
##$SUBNAM4= <"">
##$SUBNAM5= <"">
##$SUBNAM6= <"">
##$SUBNAM7= <"">
##$SUBNAM8= <"">
##$SUBNAM9= <"">
##$SW= 369.568048894756
##$SWIBOX= (0..15)
0 1 3 0 0 0 0 0 0 0 0 0 0 0 0 0 
##$SW_h= 29940.119760479
##$TD= 32768
##$TD0= 1
##$TE= 0
##$TE2= 300
##$TE3= 300
##$TEG= 300
##$TL= (0..7)
0 120 53 12 22 120 120 120 
##$TP= (0..7)
150 150 150 150 150 150 150 150 
##$TP07= 0
##$TPNAME0= <>
##$TPNAME1= <>
##$TPNAME2= <>
##$TPNAME3= <>
##$TPNAME4= <>
##$TPNAME5= <>
##$TPNAME6= <>
##$TPNAME7= <>
##$TPOAL= (0..7)
0.5 0.5 0.5 0.5 0.5 0.5 0.5 0.5 
##$TPOFFS= (0..7)
0 0 0 0 0 0 0 0 
##$TUNHIN= 0
##$TUNHOUT= 0
##$TUNXOUT= 0
##$USERA1= <user>
##$USERA2= <user>
##$USERA3= <user>
##$USERA4= <user>
##$USERA5= <user>
##$V9= 5
##$VALIST= <valist>
##$VCLIST= <CCCCCCCCCCCCCCC>
##$VD= 0
##$VDLIST= <DDDDDDDDDDDDDDD>
##$VPLIST= <PPPPPPPPPPPPPPP>
##$VTLIST= <TTTTTTTTTTTTTTT>
##$WBST= 1024
##$WBSW= 4
##$XGAIN= (0..3)
0 0 0 0 
##$XL= 0
##$YL= 0
##$YMAX_a= 23340
##$YMIN_a= -23388
##$ZGOPTNS= <>
##$ZL1= 120
##$ZL2= 120
##$ZL3= 120
##$ZL4= 120
##$ABSF1= 182.463
##$ABSF2= -187.1042
##$ABSG= 5
##$ABSL= 3
##$ALPHA= 0
##$AQORDER= 0
##$ASSFAC= 0
##$ASSFACI= 0
##$ASSFACX= 0
##$ASSWID= 0
##$AUNMP= <proc_1d>
##$AZFE= 0.1
##$AZFW= 0.5
##$BCFW= 0
##$BC_mod= 2
##$BYTORDP= 0
##$COROFFS= 0
##$CY= -3
##$DATMOD= 1
##$DC= 0
##$DFILT= <>
##$DTYPP= 0
##$F1P= 0
##$F2P= 0
##$FCOR= 1
##$FTSIZE= 65536
##$FT_mod= 6
##$GAMMA= 0
##$GB= 0
##$INTBC= 1
##$INTSCL= 5.30512e-09
##$ISEN= 30
##$LB= 1
##$LEV0= 0
##$LPBIN= 0
##$MAXI= 10000
##$MC2= 0
##$MEAN= 0
##$ME_mod= 0
##$MI= 50
##$NCOEF= 0
##$NC_proc= -7
##$NLEV= 6
##$NOISF1= 182.463
##$NOISF2= 159.3651
##$NSP= 0
##$NTH_PI= 0
##$NZP= 0
##$OFFSET= 182.463
##$PC= 4
##$PHC0= -2584.571
##$PHC1= 112.3989
##$PH_mod= 1
##$PKNL= yes
##$PPARMOD= 0
##$PSCAL= 0
##$PSIGN= 0
##$REVERSE= no
##$SF= 81.0140089999434
##$SI= 65536
##$SIGF1= 159.3651
##$SIGF2= -187.1042
##$SINO= 113.3802
##$SIOLD= 16384
##$SREGLST= <1H.CDCl3>
##$SSB= 0
##$STSI= 65536
##$STSR= 0
##$SW_p= 29940.119760479
##$SYMM= 0
##$S_DEV= 0
##$TDeff= 32768
##$TDoff= 0
##$TI= <>
##$TILT= no
##$TM1= 0
##$TM2= 0
##$TOPLEV= 0
##$USERP1= <user>
##$USERP2= <user>
##$USERP3= <user>
##$USERP4= <user>
##$USERP5= <user>
##$WDW= 1
##$XDIM= 65536
##$YMAX_p= 386373909
##$YMIN_p= -60078792
$$ End of Bruker specific parameters
$$ ---------------------------------
##NTUPLES= NMR SPECTRUM
##VAR_NAME=  FREQUENCY,     SPECTRUM/REAL,   SPECTRUM/IMAG
##SYMBOL=    X,             R,               I
##VAR_TYPE=  INDEPENDENT,   DEPENDENT,       DEPENDENT
##VAR_FORM=  AFFN,          ASDF,            ASDF
##VAR_DIM=   65536,         65536,           65536
##UNITS=     HZ,            ARBITRARY UNITS, ARBITRARY UNITS
##FACTOR=    0.456856943014862, 1,           1
##FIRST=     14782.0589164792, 0,            0
##LAST=      -15158.0608439998, 0,           0
##MIN=       -15158.0608439998, -60078792,   0
##MAX=       14782.0589164792, 386373909,    0
$$ Real data points
##PAGE= N=1
##DATA TABLE= (X++(R..R)), XYDATA
$$ [...]
##PAGE= N=2
##DATA TABLE= (X++(I..I)), XYDATA
5030A2989396l706550j797115j157862m400054n707552k142602J589900K228554
$$ 12989396 9282846 7485731 6327869 1927815 -3779737 -5922339 -4332439 -2103885
5022b103885K564125L916622K766429j251128k420901J159564K933400q69953
$$ -2103885 460240 4376862 7143291 5892163 3471262 4630826 7564226 6694273
5014F694273l442049J124726N898432J310300p733500p686886K121222P255751
$$ 6694273 3252224 4376950 10275382 11585682 3852182 -3834704 -1713482 5542269
5006E542269J90002p929594m292866O472330R815673K331169n127869m051018
$$ 5542269 5732271 -2197323 -6490189 -17859 9797814 12128983 7001114 2950096
4998B950096J405630K753893j109856m537242l660012j69923K210691K109820
$$ 2950096 4355726 7109619 5999763 1462521 -2197491 -2367414 -156723 1953097
4990A953097J147196J437957K814018K736353l91363m315344n010811j848584
$$ 1953097 3100293 4538250 7352268 10088621 9697258 5381914 371103 -1477481
4982a477481J329543J229527q51620j771932j462126k090416l072205p91336N382214
$$ -1477481 -147938 1081589 229969 -1541963 -3004089 -5094505 -8166710 -8958046 -3575832
4973c575832J0037190P587795l43010o435300o170885k070624P97880Q40117K30353
$$ -3575832 6461358 14049153 13706143 7270843 1099958 -970666 -172786 667331 897684
4964H97684J107433L147799M160334K147129k508615o407137n891110j306997
$$ 897684 2005117 5152916 9313250 11460379 8951764 2544627 -3346483 -4653480
4956d653480K598104J596550l476856p825546p315749j357969P156817J3226858
$$ -4653480 -2055376 -458826 -3935682 -11761228 -19076977 -20434946 -13278129 -51271
4948e1271J2423010M667703m569449q523088n192454J265899M879497L041761
$$ -51271 12371739 17039442 12469993 3946905 -1245549 20350 4899847 7941608
4940G941608j947337n533667n350844l417492l246637m748079l849622J801023
$$ 7941608 5994271 460604 -4890240 -8307732 -11554369 -16302448 -20152070 -18351047
4932a8351047Q755017J1377638Q252673K880909j015077k602766k929838l076546
$$ -18351047 -9596030 1781608 10034281 12915190 11900113 9297347 6367509 3290963
4924C290963l381153l094185j181578J478903K035529m57002k656196r52432L363855
$$ 3290963 -90190 -3184375 -4365953 -2887050 -851521 -1308523 -3964719 -4917151 -1553296
4915a553296N817637M630812J764909j005934l368689m195373k049528J514790
$$ -1553296 4264341 8895153 10660062 9654128 6285439 2090066 40538 1555328
4907A555328K802738R38573j197875j472475n99780M85435J423238K54876m736746
$$ 1555328 4358066 5296639 4098764 2626289 2026509 2511944 3935182 4190058 -546688
4898e46688r869310q104664J298377J0148156J1395868P028171K399999j882253
$$ -546688 -10415998 -18520662 -17222285 -7074129 4321739 11349910 13749909 11867656
4890A1867656p027645r685099n787357J410621M249045J164218j944503j077600
$$ 11867656 4840011 -4845088 -10632445 -9221824 -4972779 -3808561 -5753064 -6830664
4882f830664R94665M58342j949673l074535j614245J261481L086436J642231j871801
$$ -6830664 -5835999 -5377657 -7327330 -10401865 -12016110 -10754629 -7668193 -6025962 -7897763
4873g897763j884601N144036J3595463J3332834K834407p594988q503028k573696
$$ -7897763 -9782364 -4638328 8957135 22289969 25124376 17529388 9026360 6452664
4865F452664P22199j705766l971846r63495M047441L588133l912375j0689093
$$ 6452664 7174863 5469097 1497251 533756 4581197 8169330 4256955 -6432138
4857f432138p906063L105501J0922703P396288k034396n539025l03419N177732
$$ -6432138 -14338201 -11232700 -309997 7086291 5051895 -487130 -790549 4387183
4849D387183L895293j351454m303140l548244r68037K697431O129742N536911
$$ 4387183 8282476 6931022 2627882 -920362 -1888399 809032 6938774 12475685
4841A2475685l05603n965441n304217L87146M604642M251565J720181k19491j170373
$$ 12475685 12170082 6204641 900424 1287570 5892212 10143777 11863958 11644467 10474094
4832A0474094j250065j40312J972583M509404O501642N422891p30983q204013
$$ 10474094 9224029 9083717 11056300 15565704 22067346 27490237 26759254 18555241
4824A8555241r094730k068851L693284Q61833m926570l965637K093039L674708
$$ 18555241 9460511 7391660 11084944 11946777 7020207 3054570 5147609 8822317
4816H822317n33701k318208J203832L256602L64707j588312J274011L458335l8184
$$ 8822317 8288616 5970408 7174240 10430842 10795549 9207237 10481248 13939583 13901399
4807A3901399n049473n684360l005963k81404K974920N929882L322924n044947
$$ 13901399 8851926 3167566 161603 -119801 2855119 8785001 12107925 7062978
4799G062978r392514l263268N384948O048918J619588J141009L109047k62067
$$ 7062978 -2329536 -5592804 -207856 5841062 7460650 8601659 11710706 11448639
4791A1448639o419998n418049J950534M402422n42147k761151K011003M939937
$$ 11448639 5028641 -389408 1561126 5963548 5421401 2660250 4671253 9611190
4783I611190N87139l469013q77778K265686o64883m655286k660856J823950K020427
$$ 9611190 10198329 6729316 5851538 8117224 7452341 2797055 136199 1960149 3980576
4774C980576q0524R11724L173343K453245J152459K590102K522867k988053p606164
$$ 3980576 3900052 4811776 7985119 10438364 11590823 14180925 16703792 13715739 6109575
4765F109575m417276N17462k224657p629609l791048O075891O830050l368876
$$ 6109575 1692299 2209761 -14896 -7644505 -11435553 -5359662 1470388 -1898488
4757a898488r174251k808693M801283L946908P49801K821995N080070J360210
$$ -1898488 -11072739 -13881432 -9080149 -5133241 -4383440 -1561445 3518625 4878835
4749D878835k117695K066190P585978M353083l904955n999238j721283K71315
$$ 4878835 2761140 4827330 12413308 16766391 12861436 6862198 5140915 5412230
4741E412230q44377J601623O175755L362474o993524j2306969n761368L648623
$$ 5412230 4567853 6169476 12345231 15707705 8714181 -3592788 -9354156 -5705533
4733e705533N296967J041212j583754j806741l307486n400216m507429j028588
$$ -5705533 -408566 632646 -951108 -2757849 -6065335 -11465551 -15972980 -17001568
4725a7001568J782326L285629M502704M377909K176404J012021L474318N880009
$$ -17001568 -15219242 -11933613 -7430909 -3053000 -876596 135425 3609743 9489752
4717I489752K821365l876035o991424m469887j779809k575546l185371O25719
$$ 9489752 12311117 8435082 1443658 -3026229 -4806038 -7381584 -10566955 -9941236
4709i941236O334780Q309561N704187K334575L18075j753329m391677m964538
$$ -9941236 -3606456 4703105 10407292 12741867 13059942 11306613 6914936 1950398
4701A950398j542735L255176M470466N86266m187783m159043J267916O125004
$$ 1950398 407663 3662839 8133305 8719571 4531788 372745 1640661 7765665
4693G765665M364841k455116o428748l301902J689318Q55855n318621q959880
$$ 7765665 12130506 9675390 3246642 -55260 1634058 2489913 -2828708 -11788588
4685a1788588n511453J135462M891450M214428J108894k027045k322754K167499
$$ -11788588 -17300041 -16164579 -11273129 -7058701 -5949807 -7976852 -10299606 -8132107
4677h132107Q025890Q209608J989048k137787J280494N153755N16157q005747
$$ -8132107 -106217 8103391 10092439 7954652 9235146 14388901 14905058 6899311
4669F899311q003716J398197P944764N020822j08271p29930j438915p138086j1397243
$$ 6899311 -1104405 293792 8238556 13259378 13151107 12421177 10982262 3844176 -7553067
4660g553067o003081M465647Q372763L634211j526632k424793k667383n085633
$$ -7553067 -13556148 -9090501 -717738 2916473 1389841 -1034952 -3702335 -8787968
4652h787968o790557n091555j647590J223177L250694L983049K447330J5065l80221
$$ -8787968 -15578525 -20670080 -22317670 -21094493 -17843799 -13860750 -11413420 -11398355 -11778576
4643a1778576J661105M179366O421679Q168672O891331R33208n320940n440703
$$ -11778576 -10117471 -5938105 483574 8652246 15543577 16476785 11155845 5715142
4635E715142j20876L418520J400871k865834n373293n228561j904244M333640
$$ 5715142 5594266 9012786 10413657 7547823 2174530 -3054031 -4958275 -624635
4627f24635Q321380L812583o495826j1882833p191247J276579N943710O510246
$$ -624635 7696745 11509328 5013502 -6869331 -14060578 -12783999 -6840289 -330043
4619c30043N034005P02190n336512p402531l681294n74281k350055l321084K043668
$$ -330043 4703962 5406152 69640 -7332891 -11014185 -11588466 -13938521 -17259605 -15215937
4610a5215937P882472N475351j969402l862312J355588N470748M994528M877930
$$ -15215937 -7333465 -1858114 -3827516 -7689828 -6334240 -863492 4131036 9008966
4602I008966O575708L738195n998108j4209565j2664065m626807Q60595J340985
$$ 9008966 15584674 19322869 13324761 -884804 -13548869 -18175676 -17315081 -15974096
4594a5974096J414800L627872M989850K458027k371483n304093m373654j479496
$$ -15974096 -14559296 -10931424 -5941574 -3483547 -5855030 -11159123 -15532777 -17012273
4586a7012273M99074J362842L067830N473808N256723J008006l171005k530033
$$ -17012273 -16513199 -15150357 -12082527 -6608719 -1351996 -343990 -3514995 -6045028
4578f045028J693709M355687L737639K526866K447448K558958K417383K170550
$$ -6045028 -4351319 4368 3742007 6268873 8716321 11275279 13692662 15863212
4570A5863212j55419o237868j2253967j1768055m652279K413192N238944N848525
$$ 15863212 15707793 9469925 -2784042 -14552097 -19204376 -16791184 -11552240 -5703715
4562e703715N734724K722773k469454l893393O63815M756042K845757j106297
$$ -5703715 31009 2753782 284328 -3609065 -2945250 1810792 4656549 3550252
4554C550252j102435L86115k410780o938856n481906J539568N080695J253468
$$ 3550252 2447817 2833932 423152 -6515704 -11997610 -10458042 -5377347 -4123879
4546d123879l025328r43169M697605O755035L410200j435443l926923k972783
$$ -4123879 -7149207 -8092376 -3394771 3360264 6770464 5335021 1408098 -1564685
4538a564685L58051L420550L633832J156311j555319l069974l375178j406168
$$ -1564685 -1206634 2213916 5847748 7004059 5448740 2378766 -996412 -2402580
4530b402580L599547P952020O050157j100050n353485k454645J744502L85018
$$ -2402580 1196967 9148987 15199144 14099094 8745609 6290964 8035466 8420484
4522H420484m153775n055470k196273j137592k898993k566420J470260M109779
$$ 8420484 4266709 -788761 -2985034 -4122626 -7021619 -9588039 -8117779 -4008000
4514d008000J761994j712412q21913L527590N494412J984581l832089o071462
$$ -4008000 -2246006 -3958418 -4780331 -1252741 4241671 6226252 2394163 -3677299
4506c677299k097473M474475O992923L240740j568317j698109J067896O43287
$$ -3677299 -5774772 -1300297 5692626 8933366 7365049 5666940 6734836 7378123
4498G378123l344967m843893j254137K576670K583555J301803J650758Q90722
$$ 7378123 4033156 -810737 -2064874 511796 3095351 4397154 6047912 6938634
4490F938634l773424q218806o404127M53194N519690N222430J561403k121185
$$ 6938634 3165210 -5053596 -11457723 -11004529 -5484839 -262409 1298994 -822191
4482h22191k791032J899776R147218J0050715J48200j1746179j3350290n573812
$$ -822191 -3613223 -1713447 7433771 17484486 17632686 5886507 -7463783 -13037595
4474a3037595j4422r07716r24808L503531N064856q28386o266641k952811M176288
$$ -13037595 -13052017 -13959733 -14884541 -11381010 -6316154 -7144540 -13411181 -16363992 -12187704
4465a2187704M916709l44486k570424J462509N977397O079062K768110j339299
$$ -12187704 -7270995 -7615481 -10185905 -8723396 -2745999 3333063 6101173 4761874
4457D761874m266358l091365L098295Q564367N696655m677162j3190809j2875746
$$ 4761874 495516 -2595849 502446 9066813 14763468 10086306 -3104503 -15980249
4449a5980249n359403L785858J0128005J0349664L655243m598989o279077l94580
$$ -15980249 -21339652 -17553794 -7425789 2923875 6579118 1980129 -4298948 -4693528
4441d693528M976201L584202p82826r12217K930779M046909m50639n864576p136859
$$ -4693528 282673 3866875 3084049 2171832 5102611 9149520 8698881 2834305 -4302554
4432d302554n598393n767448p496469n280843L457902J2588986J3511014O192871
$$ -4302554 -9900947 -15668395 -23164864 -28445707 -24987805 -12398819 1112195 7305066
4424G305066o56772j273066M86242j090322m398398m412197j965036k189868n013658
$$ 7305066 6648294 5375228 5861470 4771148 372750 -4039447 -6004483 -8194351 -13208009
4415a3208009m270515K586877R444078Q563223m05295r886536j1170092k204063
$$ -13208009 -17478524 -14891647 -5447569 3115654 2710359 -7176177 -18346269 -20550332
4407b0550332R359157J2461279M566910n095917p246260l535320r80945l72286
$$ -20550332 -11191175 1270104 5837014 741097 -6505163 -10040483 -11021428 -11393714
4399a1393714J821649L809294R94886l576039k405285K955497L419553j466912
$$ -11393714 -9572065 -5762771 -4767885 -8343924 -10749209 -7793712 -4374159 -5841071
4391e841071j978740L944581N613487j274140m968320K623097R854234L037861
$$ -5841071 -7819811 -3875230 1738257 464117 -4504203 -1881106 7973128 11010989
4383A1010989j0030711j0989923P20340Q022803K869798m224746l159964K290672
$$ 11010989 980278 -10009645 -9289305 -1266502 1603296 -2621450 -5781414 -3490742
4375c490742M501419L207319J097872k084644n507430n205421r64847J654988
$$ -3490742 1010677 4217996 5315868 3231224 -2276206 -7481627 -8446474 -6791486
4367f791486J93541q23329J275576K036381j850464o112330o027734l463551j377891
$$ -6791486 -6597945 -7421274 -6145698 -4109317 -5959781 -12072111 -18099845 -21563396 -22941287
4358b2941287J989919P177048Q497979K810226k535060M11350O884890O213996
$$ -22941287 -20951368 -13774320 -5276341 -2466115 -5001175 -4589825 2295065 8509061
4350H509061r35447l525902J822786N406572J24694p640428q454281l240515P53528
$$ 8509061 7573614 4047712 5870498 11277070 11401764 3761336 -4692945 -7933460 -7179932
4341g179932J825887L693827O315156M870290j786100p981759q526642m905131
$$ -7179932 -5354045 -1660218 4654938 9525228 7739128 -242631 -8769273 -13674404
4333a3674404j880151j014441l99906Q74905J112034r32295l467761l450856l55245
$$ -13674404 -15554555 -16568996 -16968902 -16093997 -14981963 -15914258 -19382019 -22832875 -23188120
4324b3188120L108142M416384M262188M777323N330794K694506l417123p507868
$$ -23188120 -20079978 -15663594 -11401406 -6624083 -1293289 1401217 -2015906 -9523774
4316i523774m142003M218189Q879831N284754j488890l562538n6789K931908R35058
$$ -9523774 -13665777 -9447588 -567757 4716997 3228107 -334431 -391220 2540688 3475746
4307C475746l523751m491940N85102Q137798J1413880O367717l987615j1501579
$$ 3475746 -48005 -4539945 -3954843 4182955 15596835 21964552 17976937 6475358
4299F475358j0811279m931964j080731j679112k523208l4219L434099L603453
$$ 6475358 -4335921 -9267885 -10348616 -12027728 -14550936 -14585155 -11151056 -7547603
4291g547603Q40065n55649J142327K389921o13714n794075o421338O06146R440629
$$ -7547603 -6707538 -7263187 -6120860 -3730939 -4344653 -10138728 -16560066 -15953920 -6513291
4282f513291J1190690N007363p81741k28937K469959Q73786k987400l008499q30006
$$ -6513291 4677399 9684762 8903021 8674084 11144043 12017829 9030429 6021930 5191924
4273E191924l462780r276435p317612N661026J7308982J5238731K945537o930479
$$ 5191924 1729144 -7547291 -14864903 -9203877 8105105 23343836 26289373 19358894
4265A9358894q841712n987137j424462L153625L530346k478465q569920p066263
$$ 19358894 10517182 4530045 3105583 6259208 9789554 7311089 -1258831 -8325094
4257h325094q80630Q51886k237579j692984M497636P893291L716983j708004k403019
$$ -8325094 -9205724 -8353838 -10591417 -12284401 -7786765 106526 3823509 2115505 -287514
4248b87514j869628m370192n691058q39956N537171N563008P53629q41663K340306
$$ -287514 -2157142 -6527334 -12218392 -13058348 -7521177 -1958169 -1204540 -2046203 294103
4239B94103M248303K398828J259607K897170K263812m202915j1023372j0059879
$$ 294103 4542406 6941234 8200841 11098011 13361823 9158908 -1864464 -11924343
4231a1924343j679668N520800N581966J500479m14423R57738J729540J12972q82728
$$ -11924343 -13604011 -8083211 -2501245 -1000766 -1415189 -457451 1272089 1385061 502333
4222E02333J041781L072836J557811j780532k111447J068424L269566J895111
$$ 502333 1544114 4616950 6174761 4394229 2282782 3351206 6620772 8515883
4214H515883n84348j286058p02707m46171r58057k928064o983525j0105320o894747
$$ 8515883 7931535 6645477 5942770 5496599 4538542 1610478 -5373047 -15478367 -22373114
4205b2373114K434702R547121P860458J713193M25433N172617P757696K577500
$$ -22373114 -19938412 -10391291 -2530833 -817640 -392207 4780410 12538106 15115606
4197A5115606n836732r434481o628889k168602N75441K724063N194045N388527
$$ 15115606 9278874 -155607 -6784496 -8953098 -8377657 -5653594 -459549 4928978
4189D928978J608813k132398p56728L118202J416358o398558r532303n82909J1673085
$$ 4928978 6537791 4405393 3648665 6766867 8183225 1784667 -7747636 -8330545 3342540
4180C342540J2597166J642023p711764p286919l014950k293102k915425l2120
$$ 3342540 15939706 17581729 9869965 2583046 -431904 -2725006 -5640431 -5672551
4172e672551M105209M549853K368984J859291K552821M88531m440490p667391
$$ -5672551 -1567342 2982511 5351495 7210786 9763607 10252138 5811648 -1855743
4164a855743n687935M22658N868923N217956k216298r190826p643185k5467L285505
$$ -1855743 -7543678 -7121020 -1252097 3965859 1749561 -7441265 -15084450 -15109917 -11824412
4155a1824412k85847j617196L974827P472316J268525o495160m367198L480293
$$ -11824412 -12110259 -13727455 -9752628 -2280312 -1011787 -7506947 -11874145 -8393852
4147h393852M632152n83939j006207M732934N802795j326625o657130m157244
$$ -8393852 -3761700 -4345639 -5351846 -618912 5183883 3857258 -2799872 -6957116
4139f957116j179317l886164o006150q25433N945280N306763n84816l182938j301809
$$ -6957116 -8136433 -12022597 -18028747 -18854180 -12908900 -7602137 -8186953 -11369891 -12671700
4130a2671700j68427l62404K421160P868343J0169149P269872L887731L640303
$$ -12671700 -12840127 -13202531 -10781371 -2913028 7256121 14525993 18413724 22054027
4122B2054027L729073N2875n880138q019264k849658N985687J0484361O076951
$$ 22054027 25783100 25835975 19955837 11936573 9086915 15072602 25556963 31633914
4114C1633914l554870j0358285j0021086m604628J591382N360882M451047j172882
$$ 31633914 28079044 17720759 7699673 3095045 4686427 10047309 14498356 13325474
4106A3325474p018464p556786l509094j196752l040631m024375m72344L216889
$$ 13325474 6307010 -1249776 -4758870 -5955622 -8996253 -13020628 -13492972 -10276083
4098a0276083J413732l412649m096790P04065N044791M212913J02490k435144
$$ -10276083 -8862351 -12275000 -16371790 -15667725 -10622934 -6410021 -6307531 -8742675
4090h742675j408504J067088J774523J23754j059552P58413L924636M676056K656129
$$ -8742675 -10151179 -9084091 -7309568 -7185814 -8245366 -7486953 -3562317 1113739 3769868
4081C769868R48759O48546j94431j568828o91967K130859K491804o06491k082262
$$ 3769868 4718627 5367173 5172742 3603914 2911947 5042806 7534610 6928119 4845857
4072D845857P31958K988139O61441j940185M47622M158316J929821n228612r667159
$$ 4845857 5577815 8565954 9227395 7287210 7734832 11893148 13822969 8594357 -1072802
4063a072802q642337o281808n075707l271951o11879Q65613K129517N894061R380484
$$ -1072802 -9715139 -15996947 -21072654 -24344605 -24956484 -24090871 -21961354 -16067293 -6686809
4054f686809O291746k022393n376736J528309J1053934J2967750P092721L33140
$$ -6686809 -395063 -2417456 -7794192 -6265883 4788051 17755801 24848522 25181662
4046B5181662m010022p444236r753020q174062k908974J823606L215876K829304
$$ 25181662 21171640 13727404 3974384 -4199678 -7108652 -5285046 -2069170 760134
4038G60134L173805M003431L220629j30204m731310q047154q152108n213847j441475
$$ 760134 3933939 7937370 11157999 11027795 6296485 -1750669 -9902777 -15116624 -16558099
4029a6558099Q61915J354372J589105K849228M135668K744614k270254p224310
$$ -16558099 -15696184 -14341812 -12752707 -9903479 -5767811 -3023197 -5293451 -12517761
4021a2517761o322161J305174Q635860P817435m1934n568749k834781K969078
$$ -12517761 -18839922 -17534748 -8898888 -1081453 -1123387 -6692136 -9526917 -6557839
4013f557839K651876m273530q697938m354371L534280N586700J151897j925262
$$ -6557839 -3905963 -8179493 -16877431 -21231802 -17697522 -12110822 -10958925 -12884187
4005a2884187k0713R34929l745208p910161k967283P784821J2196036O235287
$$ -12884187 -12904900 -11969971 -15715179 -23625340 -26592623 -18807802 -6611766 -376479
3997c76479j068007j567942J784661K612656J019246P0685r77388l224893l362502
$$ -376479 -1444486 -3012428 -1227767 1384889 2404135 2474820 1497432 -1727461 -5089963
3988e089963N62754L530557J276677j190025K308673O822225K941037o655006
$$ -5089963 -4527209 -996652 280025 -910000 1398673 8220898 11161935 4506929
3980D506929r427616j994862N143676M376054R25289J453354L269157J539263
$$ 4506929 -4920687 -6915549 -1771873 2604181 3529470 4982824 8251981 9791244
3972I791244j249882n45970K013774K805232L172788N044356M636217j595793
$$ 9791244 8541362 7995392 10009166 12814398 15987186 21031542 25667759 24071966
3964B4071966q563347q401364k437757P72858j599997l484862k27966M839385
$$ 24071966 15508619 7107255 4669498 5442356 3842359 357497 129531 4968916
3956D968916O116968K903409j283249k935279o57698L775950N387927K90041q469883
$$ 4968916 11085884 13989293 12706044 9770765 9113067 12889017 18276944 18566985 10097102
3947A0097102j2303569o588273L068146O596805J021287o072923n633066J848386
$$ 10097102 -2206467 -8794740 -5726594 870211 1891498 -4181425 -9814491 -7966105
3939g966105P037319L769510l086030m629980m2196L280357Q17462l582354m392613
$$ -7966105 -928786 2840724 -245306 -4875286 -4917482 -1637125 -819663 -4402017 -8794630
3930h794630j359394K339941M365908L307485j280496o452797p385329l471895
$$ -8794630 -10154024 -7814083 -3448175 -140690 -1421186 -7873983 -15259312 -18731207
3922a8731207J035038L743377O042260O950375K664411m454558n086774L154170
$$ -18731207 -17696169 -13952792 -7910532 -960157 1704254 -2750304 -7837078 -4682908
3914d682908R546460N577546j897951k482996Q28817q93075m589650j62532R783745
$$ -4682908 4863552 10441098 8543147 6060151 6888968 5995893 1406243 1243711 11027456
3905A1027456J1719790K998498m374610m255638m175382p742237o300955K965495
$$ 11027456 22747246 25745744 21371134 17115496 12940114 5197877 -1103078 1862417
3897A862417O677761l848677j4356930o622702J2821319K0453371Q423601p364016
$$ 1862417 8540178 4691501 -9665429 -16288131 -3466812 16986559 25410160 18046144
3889A8046144j1658573o910050k867982k307582k798291l264868k916200j7597
$$ 18046144 6387571 -522479 -3390461 -5698043 -8496334 -11761202 -14677402 -14694999
3881a4694999M026743M863341K362929J600898L936513L991349o05329l604844
$$ -14694999 -10668256 -5804915 -3441986 -1841088 2095425 6086774 5481445 1876601
3873A876601n4216M381528J625868n441092o555027L62652N889646K894445l753588
$$ 1876601 1822385 6203913 7829781 2388689 -4166338 -3803686 2085960 4980405 1226817
3864A226817n224655j334854M83503l174388o786696l897197L996116R626391
$$ 1226817 -3997838 -5332692 -4849189 -8023577 -14810273 -18707470 -14711354 -5084963
3856e084963R162867N461155K109762j590981p176855j1582692r551578j026220
$$ -5084963 4077904 9539059 11648821 10057840 2880985 -8701707 -18253285 -19279505
3848a9279505P714160J1004576Q838738M288357o01591m523970n706301l993899
$$ -19279505 -11565345 -560769 8277969 12566326 11964735 7440765 1734464 -2259435
3840b259435k267893k847393l768215j671991K487089M167122J855533n94833
$$ -2259435 -4527328 -7374721 -11142936 -12814927 -10327838 -6160716 -4305183 -4900016
3832d900016L47666K927293L290891J391146K35343K24633j517906n247079o230217
$$ -4900016 -4552350 -1625057 1665834 3056980 3292323 3516956 1999050 -3248029 -9478246
3823i478246j349262M912114N563575Q85648j979226N78291M126112L912978J492637
$$ -9478246 -10827508 -5915394 -351819 533829 -1445397 -867106 3259006 7171984 8664621
3814H664621r1406k453925p251841r413548l036095P269820R633067R93413q076312
$$ 8664621 8573215 6119290 -1132551 -10546099 -13582194 -6312374 3320693 4314106 -3762206
3805c762206p947289k022225R60527L99326K044142O326219P043232J712840l918698
$$ -3762206 -11709495 -13731720 -12771193 -12371867 -10327725 -4001506 3041726 4754566 835868
3796H35868l878929M54616L442112K501291m17904k624936l185376k161397M45112
$$ 835868 -3043061 -2588445 853667 3354958 2937054 312118 -2873258 -5034655 -4589543
3787d589543L969134N916625L287154l361030q204362n623625K141617O315386
$$ -4589543 -620409 5296216 8583370 5222340 -2982022 -8605647 -6464030 -148644
3779a48644K252749m672483o349442j614882M638899Q420617Q258624L306958
$$ -148644 2104105 -2568378 -8917820 -10532702 -5893803 2526814 10785438 14092396
3771A4092396m287989p610803k368776N265936N405388j536893n534320k170863
$$ 14092396 9804407 2193604 -175172 5090764 10496152 8959259 3424939 1254076
3763A254076J724412K34823k830969k230537n48612k391285n193985l391929J893893
$$ 1254076 2978488 3213311 382342 -1848195 -2396807 -4788092 -9982077 -13374006 -11480113
3754a1480113M416378J915964k118466l971826k282503K422910O373669M196256
$$ -11480113 -7063735 -5147771 -7266237 -11238063 -13520566 -11097656 -4723987 -527731
3746e27731l086137n943289J389884J0857723J0829388K722345k229929m22320
$$ -527731 -3613868 -9557157 -8167273 2690450 13519838 16242183 14012254 13589934
3738A3589934R65248j977644m249595k609415j114359k128483j556155K160720
$$ 13589934 14555182 12577538 8327943 5718528 4604169 2475686 919531 3080251
3730C080251L340257j020762m967709l491026r07572k432699m761108k811661
$$ 3080251 6420508 5399746 432037 -3058989 -3966561 -6399260 -11160368 -13972029
3722a3972029Q99746J983406K733842N673362N126380l273595j0044694k763058
$$ -13972029 -13072283 -11088877 -8355035 -2681673 2444707 -828888 -10873582 -13636640
3714a3636640J2820061J7403811M955186r333112j1563004o123521l764715m706718
$$ -13636640 -816579 16587232 21542418 12209306 646302 -5477219 -9241934 -13948652
3706a3948652l044643N68728J063876j037634q80244K150894M369632M168268
$$ -13948652 -16993295 -16424567 -15360691 -16398325 -17278569 -15127675 -10758043 -6589775
3698f589775K610064J53416k015815p74564L240730L025099m515553r969433k761394
$$ -6589775 -3979711 -3826295 -5842110 -6616674 -3375944 -350845 -4866398 -14835831 -17597225
3689a7597225J1326268J5350799M568013p003000p008810p12503L13237l877861
$$ -17597225 -6270957 9079842 13647855 6644855 -363955 -1076458 -763221 -4641082
3681d641082m892729j405572M0980k157991j911779L032211O207375L000743j434047
$$ -4641082 -9533811 -10939383 -10898403 -13056394 -14968173 -11935962 -5728587 -2727844 -4161891
3672d161891n33905K813461Q06697o546252j0604156o292869R98577L000467j133382
$$ -4161891 -4695796 -1882335 -1075638 -7621890 -18226046 -24518915 -23520338 -20519871 -21653253
3663b1653253n053070l362541L114335R011244R487933M448251j110473j839466
$$ -21653253 -26706323 -30068864 -26954529 -17943285 -8455352 -4007101 -5117574 -6957040
3655f957040K234781O019115N575878J714774l024023p274148q904197m548754
$$ -6957040 -4722259 1296856 6872734 8587508 5563485 -1710663 -10614860 -15163614
3647a5163614M805781J1106323P629648j565396o201182k964175J733421J940302
$$ -15163614 -10357833 748490 8378138 6812742 611560 -2352615 -619194 1321108
3639A321108j420306n233974q347730q711859l336701N035473P719615J734019
$$ 1321108 -99198 -5333172 -13680902 -22392761 -25729462 -20693989 -12974374 -11240355
3631a1240355m146433j303038N874391O810639O71369l544909j311341K225261
$$ -11240355 -15386788 -16689826 -10815435 -4004796 -3333427 -6878336 -8189677 -5964416
3623e964416K076657J60081q8928Q96309J553103J911823J369950j225661l680363
$$ -5964416 -3887759 -3727678 -3816606 -2920297 -1367194 544629 1914579 688918 -2991445
3614b991445k150642J846905K639959M29647K055147Q134037Q627268j835097
$$ -2991445 -5142087 -3295182 -655223 -225576 1829571 9963608 18590876 16755779
3606A6755779j2514823j0479236j70846K885834m651285r851049l935090N401528
$$ 16755779 4240956 -6238280 -6409126 -3523292 -8174577 -18025626 -21960716 -16559188
3598a6559188P105237K557469Q66825M497996P510089N412256Q6171m515614o707540
$$ -16559188 -9453951 -6896482 -6029657 -1531661 5978428 11390684 11476855 6961241 253701
3589B53701o844826n966224n059451m017698j764849J487745L475055K793723
$$ 253701 -6591125 -12557349 -17616800 -21634498 -23399347 -21911602 -18436547 -15642824
3581a5642824J064465O18935J571591K715267L500890L328339Q85242l405402
$$ -15642824 -14578359 -13959424 -12387833 -9672566 -6171676 -2843337 -1958095 -5363497
3573e363497n964504l892492P49504L093566J331618j743601k475004K95958M790382
$$ -5363497 -11328001 -15220493 -14470989 -11377423 -10045805 -11789406 -14264410 -13968452 -9178070
3564i178070P297497M688024j843157o592892n400826q87773J136507n55006j991991
$$ -9178070 -1880573 2807451 964294 -5628598 -11029424 -11917197 -10780690 -11335696 -13327687
3555a3327687o50135J603563K925321M397641O314744N481721j2212n675104m891294
$$ -13327687 -13977822 -12374259 -9448938 -5051297 1263447 6745168 6732956 1057852 -3833442
3546c833442J803441N966387J643963o441671q459715k168581M211375L413398
$$ -3833442 -2030001 3936386 5580349 -861322 -9321037 -11489618 -7278243 -3864845
3538c864845o28365J286149R157321J2140377L711164p751765r299032o35545
$$ -3864845 -4493210 -3207061 5950260 18090637 21801801 14050036 4751004 4115459
3530D115459O376840M599304K4626Q32505M960125M205351k891034q645315o607952
$$ 4115459 10492299 15091603 15116229 15948734 20908859 25114210 22223176 13577861 6969909
3521F969909M01311M387996J844220k789072k937915K132952O219899L447975
$$ 6969909 7371220 11759216 13603436 10814364 7876449 10009401 16229300 19677275
3513A9677275m439642r823944q029567k154157J565698Q97579j454803k282850
$$ 19677275 15237633 5413689 -2615878 -4770035 -3204337 -2306758 -3761561 -6044411
3505f044411j027473Q40652J739253J220575L07799N42012K176991L694223L528956
$$ -6044411 -7071884 -6231232 -4491979 -3271404 -2963605 -2421593 -244602 3449621 6978577
3496F978577J753864l15708j599809k018755k282854k962005l310265j637913
$$ 6978577 8732441 8416733 6816924 4798169 2515315 -446690 -3756955 -5394868
3488e394868K056526M713430L497141M2521j077811J649017M737488M437781J041072
$$ -5394868 -3338342 1375088 4872229 4914750 3836939 5485956 10223444 14661225 15702297
3479A5702297k488436m051023l535343k206350j806718k764212l182345j419563
$$ 15702297 13213861 9162838 5627495 3421145 1614427 -1149785 -4332130 -5751693
3471e751693J035462K092057L243929O610081Q539396K932770p615852j1656714
$$ -5751693 -4716231 -2624174 619755 7229836 15769232 18702002 11086150 -570564
3463e70564m136365M982035L675382n747201j0710046n520844L380950P825780
$$ -570564 -4706929 275106 3950488 -1796713 -12506759 -18027603 -14646653 -6820873
3455f820873O217351J676485j702557m91868M653967P269470K112726o500060
$$ -6820873 -603522 1072963 -629594 -1121462 3532505 10801975 12914701 6414641
3447F414641r268029m495944N05329R04434j90064N31333R79610o27108j121495
$$ 6414641 -2853388 -7349332 -6844003 -5939569 -6129633 -5598300 -4618690 -5245798 -6367293
3438f367293J608560L078154j650829r358050j1568743m930625N136193J0710732
$$ -6367293 -4758733 -1680579 -3331408 -12689458 -24258201 -29188826 -24052633 -13341901
3430a3341901Q936036L700190Q68282J513141R06662l836951p629458m003671
$$ -13341901 -4405865 -705675 162607 1675748 2582410 -1254541 -8883999 -12887670
3422a2887670L792051N903518P51279k015678L133879Q279669M586228l365333
$$ -12887670 -9095619 -3192101 -2440822 -4456500 -1322621 6957048 11543276 8177943
3414H177943m835248K71141K085336l199379p747199m195681M121816Q272139
$$ 8177943 3342695 3613836 5699172 2499793 -5247406 -9443087 -5321271 2950868
3406B950868M460329l102772p399486m998303J133112M804936L666988J764829
$$ 2950868 7411197 4308425 -3091061 -8089364 -6956252 -2151316 1515672 3280501
3398C280501L240072N944600M808801l78129m782672n041806k064950J540467
$$ 3280501 6520573 12465173 17273974 16895845 12113173 7071367 5006417 6546884
3390F546884K966363k65159o628370r080940k964908N554693N731361k691649
$$ 6546884 9513247 9248088 2619718 -6461222 -9426130 -3871437 1859924 -831725
3382h31725p998638k431523P373133J0233517N158654L54312O83965K464908N49978
$$ -831725 -8830363 -11261886 -3888753 6344764 11503418 11857730 12541695 15006603 15556581
3373A5556581m334242p125570m979814l37186K356225J757134J49289r80102l268105
$$ 15556581 11222339 4096769 -883045 -1220231 1135994 2893128 3042417 2062315 -1205790
3364a205790p515332j0064610p003640n93402L134179K927599L441175O934500
$$ -1205790 -8721122 -18785732 -25789372 -26382774 -23248595 -20320996 -16879821 -9945321
3356i945321R012253N176173k309979p142090o060635r91582L636003M056873
$$ -9945321 -933068 4243105 1933126 -5208964 -11269599 -12261181 -8625178 -4568305
3348d568305P9111l792397k710109K149976M852878L022797L90866k50556q67752
$$ -4568305 -4489194 -8281591 -10991700 -8841724 -3988846 -966049 -575183 -825739 -1693491
3339a693491k182174l95799N006062O415420j344746j0184656p889504L852006
$$ -1693491 -3875665 -4271464 734598 7150018 5805272 -4379384 -12268888 -8416882
3331h416882J0589373M968844m325601o623312l250057j701708k909215k231928
$$ -8416882 2172491 7141335 2815734 -3807578 -7057635 -8759343 -11668558 -13900486
3323a3900486N95666P88850k629610m131281M12971P712027J1262537Q805693
$$ -13900486 -13304820 -12515970 -15145580 -19276861 -18863890 -11151863 110674 8916367
3315H916367L464846q60761l128583m470045n251130l864253Q00085O137557P296322
$$ 8916367 12381213 11520452 8391869 3921824 -1329306 -5193559 -4393474 1744083 9040405
3306I040405L143177j305740r12621K577376K946338j560279n704902m701514
$$ 9040405 12183582 10877842 9965221 12542597 15488935 13928656 8223754 3522240
3298C522240n13467J566647j10704k875168m271927m212960l327272j808889J58290
$$ 3522240 3008773 4575420 4464716 1589548 -2682379 -6895339 -10222611 -12031500 -11873210
3289a1873210K513622N319813P282103N814007Q98993k845383j496545J909854
$$ -11873210 -9359588 -4039775 3242328 9056335 9955328 7109945 5613400 7523254
3281G523254R29620m599402p670299m391251K40950K94155j955423j63191N342705
$$ 7523254 8452874 3853472 -3816827 -8208078 -7967128 -7672973 -9628396 -9791587 -4448882
3272d448882P218727J865996m718930m402013K705493Q432707O479551l90428
$$ -4448882 2769845 4635841 -83089 -4485102 -1779609 6653098 13132649 12742221
3264A2742221m311620k213661R04585m69320m524063n263060j601526J727950
$$ 12742221 8430601 6216940 7121525 6652205 2128142 -3134918 -4736444 -3008494
3256c008494K066686J668287J381000j820171p647370r478079l950284K130174
$$ -3008494 -941808 726479 2107479 287308 -7360062 -16838141 -20788425 -18658251
3248a8658251J327544k758217j528560M542946P300626M404719J373265N37040
$$ -18658251 -17330707 -20088924 -21617484 -17074538 -9773912 -5369193 -3995928 -3458888
3240c458888j484633m076894j499422N180174O052943j980578p705059j755155
$$ -3458888 -4943521 -9020415 -10519837 -5339663 713280 -1267298 -8972357 -10727512
3232a0727512Q289684Q879900L53997n099724j822719L846961N406680L473629
$$ -10727512 -2437828 6442072 6796069 1696345 -126374 3720587 9127267 12600896
3224A2600896M44042l454384o692494n953896j543253J966268K138550J068911
$$ 12600896 13044938 9590554 2898060 -3055836 -4599089 -2632821 -494271 574640
3216E74640N76315J7431m35010L10218M48795k670559n849843k545950N730236
$$ 574640 1150955 1168386 733376 1043594 1492389 -1178170 -7028013 -9573963 -3843727
3207c843727Q334118K22307r338167q964786l21614O137821O147645M109183L299209
$$ -3843727 4490391 4712698 -4625469 -13590255 -13911869 -7774048 -1626403 2482780 5781989
3198E781989K437576J481238K417468L318414n06017p392712r054340k798083
$$ 5781989 8219565 9700803 12118271 15436685 14930668 7537956 -1516384 -4314467
3190d314467L303890K327041j233793J03050L723476J303931o492910r562199
$$ -4314467 -1010577 1316464 82671 185721 3909197 5213128 -1279782 -10841981
3182a0841981l191236N311675P396541L544243o99917k818891l122780j432893
$$ -10841981 -14033217 -8721542 -1325001 2219242 1519325 -1299566 -4422346 -5855239
3174e855239J299829J966166L84243J534920P644666J1848890O342939n450506
$$ -5855239 -4555410 -2589244 -2205001 -670081 6974585 18823475 25166414 19715908
3166A9715908j2069170q901462l033602k212678n098293n002516Q76003Q485282
$$ 19715908 7646738 -1254724 -4288326 -6501004 -11599297 -16601813 -15725810 -7240528
3158g240528J0932911M773409n453431r806178l630545N481277O299290j318066
$$ -7240528 3692383 8465792 3012361 -6793817 -10424362 -4943085 1356205 38139
3150C8139o572150k946291L878884N596784J912143k264396m474432m718570k175558
$$ 38139 -6534011 -9480302 -5601418 -4634 1907509 -356887 -4831319 -9549889 -11725447
3141a1725447K938488O968818O585402L031577l73991k575217l957687l951605
$$ -11725447 -8786959 -1818141 4767261 7798838 7424847 4849630 891943 -3059662
3133c059662k278674k93183R51753J554467R03122j238397j505219L444079R233859
$$ -3059662 -5338336 -5631519 -4679766 -3125299 -2222177 -3460574 -4965793 -1521714 7712145
3124G712145P372646j109622m747791J127704O237811J717278n308309l934826
$$ 7712145 15084791 13975169 9227378 10355082 16592893 18310171 13001862 9067036
3116I067036K243936K176036l291003l767624J915859M267755J44053l223960
$$ 9067036 11310972 13487008 10196005 6428381 8344240 12611995 12756048 9532088
3108I532088k742412m039508q305874p984526p17630M632951K241324j417758
$$ 9532088 6789676 2750168 -5555706 -13540232 -14257862 -9624911 -7383587 -8801345
3100h801345L90676L612263K458378K22830J943191M193760J933879j174160M30242
$$ -8801345 -8410669 -4798406 -2340028 -2117198 -174007 4019753 5953632 4779472 5209714
3091E209714K681195j711532r203457r462048j971652K733250p97446n699429
$$ 5209714 7890909 6179377 -3024080 -12486128 -14457780 -11724530 -12521976 -18221405
3083a8221405m249849J822819O079930O014281L195615l45421k296398l86393
$$ -18221405 -22471254 -20648435 -14568505 -8554224 -5358609 -5704030 -8000428 -8386821
3075h386821M067761N763995J825982l373407l134590K623088O623679L333280
$$ -8386821 -4319060 1444935 3270917 -102490 -3237080 -613992 6009687 9342967
3067I342967l723128o365921k534872J368445L14359j961016N0055L383666J130846
$$ 9342967 5619839 -746082 -3280954 -1912509 -1598150 -3559166 -3509111 -125445 1005401
3058A005401m660801m601163K206326M854523k061872q463874m270819M310203
$$ 1005401 -3655400 -8256563 -6050237 -1195714 -3257586 -11721460 -15992279 -11682076
3050a1682076M993179q85252j965686L575831O206104K361922m23055J674751
$$ -11682076 -6688897 -7574149 -9539835 -5964004 242100 2604022 2180967 3855718
3042C855718K008395l236265o759675k748514K092766m26345n376075k101976
$$ 3855718 5864113 2627848 -4131827 -6880341 -4787575 -5213920 -10589995 -12691971
3034a2691971Q030401J2678870O651609j198999j411333L762989N569638J084456
$$ -12691971 -4661570 8017300 14668909 13469910 12058577 15821566 21391204 22475660
3026B2475660m493626n819745l732157l137530o189679q949923n932848K326607
$$ 22475660 17982034 12162289 8430132 5292602 -897077 -9847000 -15779848 -13453241
3018a3453241Q803852Q445122M216894J839914J333006j315527n523496n572747
$$ -13453241 -4649389 3795733 8012627 9852541 11185547 9870020 4346524 -1226223
3010a226223N9666M806378K848771k678543m748357k414893m52775q45511n04792
$$ -1226223 -1166557 3639821 6488592 3810049 -938308 -3353201 -3805976 -4651487 -5156279
3001e156279K269473M339528K562019j721744n020088n658205l839939n48943
$$ -5156279 -2886806 1452722 4014741 2292997 -2727091 -8385296 -12225235 -12774178
2993a2774178K102579K200288Q74983N00863o73447o637392j4011017j1559812
$$ -12774178 -10671599 -8471311 -7596328 -7095465 -7768912 -14406304 -28417321 -39977133
2985c9977133M386666J9988378J8695526L076832q309928n304451L286932N449331
$$ -39977133 -35590467 -15602089 3093437 6170269 -2139659 -7444110 -4157178 1292153
2977A292153J477400j498561j550088j168759n25068J130428J454151j130236
$$ 1292153 2769553 1270992 -279096 -1447855 -1972923 -842495 611656 -518580
2969e18580l113919j388314O88336r81563l206532n43392M626763N270341J323099
$$ -518580 -3632499 -5020813 -4332477 -5314040 -8520572 -9063964 -4437201 833140 2156239
2960B156239l40529K635683M933938L014735J57373j19943P74205M23756q67262
$$ 2156239 1815710 4451393 9385331 12400066 12557439 12437496 13211701 13635457 12768195
2951A2768195k334538l842285l442204O55907M643144K382636m005064m654091
$$ 12768195 10433657 6591372 3149168 3805075 8448219 10830855 6825791 2171700
2943B171700L241549R270051M599623m259236m941884K537762O895639K765667
$$ 2171700 5413249 14683300 19282923 15023687 10081803 12619565 19515204 22280871
2935B2280871l229788m311401k428460k226294l207709k374633L5374J914577
$$ 22280871 19051083 14739682 12311222 10084928 6877219 4502586 4537960 6452537
2927F452537L252639M687613M365955L04818n234456p377588m529391K0609K338432
$$ 6452537 9705176 14392789 18758744 19063562 13829106 6451518 1922127 1942736 4281168
2918D281168J453596j187409l581153m110787k534728n16896L16061Q27053K860543
$$ 4281168 5734764 4547355 966202 -3144585 -5679313 -6196209 -5880148 -5053095 -2192552
2909b192552N230721M146930j045790n274855l255775M003540J0232083R975296
$$ -2192552 3038169 7185099 6139309 864454 -2391321 1612219 11844302 21819598
2901B1819598K200874r374337j6844579j2442127K534850J5117474J3359065J320270
$$ 21819598 24020472 14646135 -2198444 -14640571 -12105721 3011753 16370818 17691088
2893A7691088n466649m86519N669279J395716r284232j3159663o222803K577224
$$ 17691088 12224439 11737920 17407199 18802915 9518683 -3640980 -9863783 -7286559
2885g286559M484392L11452m107580n641229m565528j613820K558971O391479
$$ -7286559 -2802167 -2490715 -6598295 -12239524 -16805052 -18418872 -15859901 -9468422
2877i468422P815896N728190J159362k833792l504256j259913J064916J963552
$$ -9468422 -1652526 4075664 5235026 2401234 -1103022 -2362935 -1298019 665533
2869F65533K082084J243001j624179m599507l527460J094867L084277k19398l191821
$$ 665533 2747617 3990618 2366439 -2233068 -5760528 -4665661 -1581384 -1800782 -4992603
2860d992603j080791J767886n51288m684141k971739M095661R017437Q623771
$$ -4992603 -6073394 -4305508 -4856796 -9540937 -12512676 -8417015 600422 9224193
2852I224193N566049N08516p314986j2690521q494532J772557O293399K118248
$$ 9224193 14790242 15298758 7983772 -4706749 -13201281 -11428724 -5135325 -3017077
2844c017077p85052L618416P723779L713563l378510m563325j145160o12799l603227
$$ -3017077 -3802129 -183713 7540066 11253629 7875119 3311794 2166634 1553835 -2049392
2835b049392m482054j811360N74213J399121K970114M772607L078539k138644
$$ -2049392 -6531446 -8342806 -7768593 -6369472 -3399358 1373249 4451788 2313144
2827B313144n468210l073302K039827L493335j206559p596542q337861j173709
$$ 2313144 -3155066 -6228368 -4188541 -695206 -1901765 -9498307 -17836168 -19009877
2819a9009877P656383J0107944N658878M16017k022422l090742k799156J477448
$$ -19009877 -11353494 -1245550 4413328 4829345 2806923 -283819 -3082975 -1605527
2811a605527P508161P642424J32300o412086n319063j420155j768177l912079
$$ -1605527 5902634 13545058 13677358 7265272 1946209 526054 -1242123 -5154202
2803e154202j852541K334320K775938J404140M436068R511259P494574k662644
$$ -5154202 -7006743 -4672423 -1896485 -492345 3943723 13454982 20949556 18286912
2795A8286912j0966176j0083923l500780K183440N318921O662567N518309K061644
$$ 18286912 7320736 -2763187 -6263967 -4080527 1238394 7900961 13419270 15480914
2787A5480914j240892l191746m814365n395184k544392J995022J989259m599942
$$ 15480914 14240022 11048276 6233911 838727 -1705665 289357 2278616 -2321326
2779b321326j0771824q254073K162519J1331012J1886433N486348j69850n78712
$$ -2321326 -13093150 -21347223 -19184704 -7853692 4032741 9519089 9349239 8770527
2771H770527P17354j761328n902532l948223M635795R421956L469386n128280
$$ 8770527 9487881 7726553 1824021 -2124202 2511593 11933549 15402935 10274655
2763A0274655m697471J890196J747246p140676j2053807m903489N833905P956020
$$ 10274655 5577184 7467380 9214626 2073950 -9979857 -14883346 -9049441 -1093421
2755a093421J726213l388944k345324J629194L452825J362106k379729l055489
$$ -1093421 632792 -2756152 -5101476 -3472282 -19457 1342649 -1037080 -4092569
2747d092569J821924P848914P492611J50131o123981n208695m00021J685273N4195
$$ -4092569 -2270645 5578269 13070880 13221011 7097030 1888335 1488314 3173587 3227782
2738C227782j506489m78476K715599O038824O194708J086341n790266p543361
$$ 3227782 1721293 1242817 3958416 9997240 16191948 17278289 11488023 3944662
2730C944662l030868Q25691j040903m655149l837526N56610L272670K610108N10618
$$ 3944662 913794 1739485 698582 -3956567 -7794093 -7237483 -3964813 -1354705 -844087
2721h44087j957174l909463k491955K919207O749925L340067m397160p916527
$$ -844087 -2801261 -6710724 -9202679 -6283472 466453 3806520 -590640 -8507167
2713h507167l898272K631190N488288L428385m34728j790999J354973N458268
$$ -8507167 -12405439 -9774249 -4285961 -857576 -1292304 -3083303 -1728330 3729938
2705C729938L909243l937759r574700o058761J615285L547661m40712j640083
$$ 3729938 7639181 3701422 -5873278 -11932039 -10316754 -6769093 -7209805 -8849888
2697h849888L030856O743072M626909R45427N80273J084879j331370l859568j452367
$$ -8849888 -5819032 924040 5550949 6496376 7076649 8161528 6830158 2970590 1518223
2688A518223M673572Q733232Q013203L871203k252104q524509j0699349o402733
$$ 1518223 6191795 14925027 22938230 26809433 24557329 16032820 5333471 -1069262
2680a069262l33659Q16501j772339o93945N492063Q796315L535080m781632p319285
$$ -1069262 -1402921 -586420 -2358759 -3052704 2439359 11235674 14770754 9989122 2669837
2671B669837m063377j895688l285387l912987j245253J309997Q28022J4449K399656
$$ 2669837 -1393540 -3289228 -6574615 -10487602 -11732855 -10422858 -9594836 -9580387 -7180731
2662g180731N925250N454992K48414m623797m457250l29492K432910N80757k971632
$$ -7180731 -1255481 4199511 4447925 -175872 -4633122 -4962614 -2529704 -1948947 -4920579
2653d920579k504346K622636N899450K197798m084964m579280M52764K112548
$$ -4920579 -7424925 -4802289 1097161 3294959 -790005 -5369285 -4916521 -2803973
2645b803973l216381p696783l909545M049860P452141N299494K572176O39222
$$ -2803973 -6020354 -13717137 -17626682 -13576822 -6124681 -825187 1746989 2386211
2637B386211k196106l672435l17873M129614K443722l788038m982980J580915
$$ 2386211 190105 -3482330 -3800203 329411 2773133 -1014905 -5997885 -4416970
2629d416970O829995L319482m358028p260785l769947J459146N031992O106700
$$ -4416970 2413025 5732507 1374479 -5886306 -9656253 -8197107 -3165115 2941585
2621B941585M030988l47411l470002k941445o45150M56553J24201n33250j260405
$$ 2941585 6972573 6625162 3155160 213715 -431435 25118 149319 -383931 -1644336
2612a644336j587586o32784M95161m61986k416537j402539K983576O085695M850211
$$ -1644336 -3231922 -3864706 -3369545 -3831531 -6248068 -7650607 -4667031 1418664 6268875
2603F268875J413701j513173l688277m100251o21754M691800N960177J831793
$$ 6268875 7682576 6169403 2481126 -1619125 -2240879 2450921 8411098 10242891
2595A0242891k560754m235052n565233o196429j144141P992589R918414k76105
$$ 10242891 7682137 3447085 -2118148 -8314577 -9458718 -1466129 8452285 8176180
2587H176180j0730090q404644K148446O676768K177628k251294j877783q99143
$$ 8176180 -2553910 -10958554 -8810108 -2133340 44288 -2207006 -4084789 -4983932
2579d983932j627674j114997N86106o53626m148642l764235J684018N716850M263752
$$ -4983932 -6611606 -7726603 -7140497 -7794123 -11942765 -15707000 -14022982 -8306132 -4042380
2570d042380J069500O25698K226110L295137K958542Q03276k528988l056200K051358
$$ -4042380 -2972880 -2347182 -121072 3174065 6132607 6935883 4406895 1350695 3402053
2561C402053P540639N089202l736732p804733k301465M040276K274527l479416
$$ 3402053 10942692 16031894 12295162 4490429 2188964 6229240 8503767 5024351
2553E024351k935513M618549R054449L286847p274587j1130801m066815O327125
$$ 5024351 2088838 6707387 15761836 19048683 11774096 643295 -3423520 2903605
2545B903605R712001M533403j921077l844897k864341k955740m498453n647537
$$ 2903605 12615606 17149009 15227932 11383035 8518694 5562954 1064501 -4583036
2537d583036m962898n78172P831390J4471728J2122876L702863k44105J407750
$$ -4583036 -9545934 -10124106 -2292716 12179012 24301888 28004751 27760646 29168396
2529B9168396j483020r917454j0070978J836565P920337j701135p533641P025708
$$ 29168396 27685376 17767922 7696944 9533509 17453846 15752711 8219070 15244778
2521A5244778K1558553J0764600m477904J6089284N7500387N5012561j0783672
$$ 15244778 36803331 47567931 43090027 59179311 116679698 171692259 160908587
2514A60908587p4339744p0858310k1163599Q088941k039588j5498770r167941
$$ 160908587 86568843 15710533 -5453066 2635875 596287 -14902483 -24070424
2507b4070424J660772K879585K775433O656441M928637l837900o126982Q50423
$$ -24070424 -22409652 -19530067 -16754634 -10098193 -5169556 -9007456 -15134438 -14284015
2499a4284015J853734q463223j3997958m557691P016112P508151L397351M668254
$$ -14284015 -12430281 -20893504 -34891462 -39449153 -32433041 -24924890 -21527539 -16859285
2491a6859285O410948J696906k540050J353764N374411q08718j0212985q947781
$$ -16859285 -10448337 -8751431 -11291481 -9937717 -4563306 -5372024 -15585009 -24532790
2483b4532790J200573P014364N578827N611475R409594Q932056J084774n852787
$$ -24532790 -23332217 -16317853 -10739026 -5127551 4282043 13214099 14298873 8446086
2475H446086m497572J989563O029187N076616J878499o04025j975036l667492
$$ 8446086 3948514 5938077 11967264 17043880 18922379 18318354 16343318 12675826
2467A2675826o192049p336985n072886j919543k220724m662640l238858K932044
$$ 12675826 6483777 -853208 -5926094 -7845637 -10066361 -14729001 -17967859 -15035815
2459a5035815P518612P039845N346364M709742J280794n329928p283045q81619
$$ -15035815 -7517203 -477358 4869006 9578748 10859542 5529614 -1753431 -2635050
2451b635050M960276J848631m347792l561816J708844K121788j580345j295425
$$ -2635050 2325226 4173857 -173935 -3735751 -2026907 94881 -1485464 -2780889
2443b780889K204812N68336n645463o693826r99822J911654j193747j612953M149590
$$ -2780889 -576077 -7741 -5653204 -12347030 -13346852 -11435198 -12628945 -14241898 -10092308
2434a0092308N863564l094649j1856357o683211Q610960J7940521J3469419J173022
$$ -10092308 -4228744 -7323393 -19179750 -25862961 -17252001 688520 14157939 15330961
2426A5330961r893449j4584787j1064942k224172L961040K921619K84475L146432
$$ 15330961 5437512 -9147275 -20212217 -22436389 -18475349 -15553730 -15269255 -12122823
2418a2122823P804039N201928l575660p909632l968955M38853j65190q15201K938290
$$ -12122823 -4318784 883144 -2692516 -10602148 -14571103 -14132250 -14297440 -15112641 -12174351
2409a2174351N657057J516392m075226k043983N289882O911721j72738o582398
$$ -12174351 -6517294 -5000902 -9076128 -11120111 -5830229 1081492 908754 -5673644
2401e673644m585410J809944M474193K399772K90815K35251L71972j47928J55885
$$ -5673644 -10259054 -8449110 -3974917 -1575145 -1284330 -1049079 -677107 -825035 -669150
2392f69150J845109L550731M055433K861142m40750m598774n784284j998891K384751
$$ -669150 1175959 4726690 8782123 11643265 11202515 6603741 819457 -1179434 1205317
2383A205317J124630m510844o009864P43443Q885504R171867J545579o170099
$$ 1205317 2329947 -2180897 -8190761 -7447318 1438186 10610053 12155632 5985533
2375E985533q540505o509598k452356L104924Q690438J0237571N038655m273905
$$ 5985533 -2554972 -9064570 -11516926 -8412002 278436 10516007 15554662 11280757
2367A1280757j1388598j1486348m891766L021178N845652K019908l257340l812259
$$ 11280757 -107841 -11594189 -16485955 -13464777 -7619125 -5599217 -8856557 -12668816
2359a2668816J15655K739082Q65956k161141j850461J214925K955500J780107
$$ -12668816 -12553161 -9814079 -8948123 -11109264 -12959725 -11744800 -8789300 -7009193
2351g009193L17525J485618M648921O254103L961961k42840k067872n79703Q5819
$$ -7009193 -6691668 -5206050 -557129 5696974 9658935 9416095 7348223 6768520 6854339
2342F854339l163797o640700m456178J983792M606425J26480m669291k454834
$$ 6854339 3690542 -2950158 -7406336 -5422544 -816119 -689639 -5358930 -7813764
2334g813764M246718O864079K335658l834069m997190j36925O194710Q039496
$$ -7813764 -3567046 3297033 5632691 1798622 -3198568 -3335493 2859217 10898713
2326A0898713K993739n001695r310641q411078p032466p709794o216375L94316
$$ 10898713 13892452 8890757 -419884 -8830962 -15863428 -23573222 -29789597 -29395281
2318b9395281O565547N972649K376293L990731R389342R166057J565174m290781
$$ -29395281 -22829734 -16857085 -14480792 -10490061 -1100719 8065338 9630512 5339731
2310E339731l152341j034183l114595m205948J185482P200275M562692m443085
$$ 5339731 2187390 1153207 -1961388 -6167336 -4981854 2218421 6781113 2338028
2302B338028q554742l396592L602051M332223o14840m914203m134526R68960N909229
$$ 2338028 -6216714 -9613306 -6011255 -1679032 -2293872 -7208075 -11342601 -10373641 -4464412
2293d464412O479383K689676j808391m466034n395465l986280J029117O370603
$$ -4464412 2014971 4704647 2896256 -1569778 -6965243 -10951523 -9922406 -3551803
2285c551803N350053k098832p032431m133933K45801o93004k527634J430340O371653
$$ -3551803 1798250 -300582 -7333013 -11466946 -11221145 -11914149 -14441783 -13011443 -6639790
2276f639790L496688l294007k334885N879208Q452401R41368n908066l848308
$$ -6639790 -3143102 -6437109 -8771994 -2892786 5559615 6500983 592917 -3255391
2268c255391J689463L222999J967665R68855j301652l947058j116332O318900
$$ -3255391 -1565928 1657071 3624736 4593591 3291939 -655119 -1771451 4547449
2260D547449P499317j566924q823699m105878M225665L164514l569429l106427
$$ 4547449 12046766 10479842 1656143 -2449735 1775930 4940444 1371015 -1735412
2252a735412M005931N471800j162924n156186j642737J173577k496601o466263
$$ -1735412 2270519 7742319 6579395 1423209 -219528 954049 -1542552 -8008815
2244h008815m005680J550062L716620K472463J319213R61646P95391J569715K628350
$$ -8008815 -12014495 -10464433 -6747813 -4275350 -2956137 -1994491 -1199100 370615 2998965
2235B998965J180355k549968m252850k390751j015906k801781m553090l125668
$$ 2998965 4179320 1629352 -2623498 -5014249 -6030155 -8831936 -13385026 -16510694
2227a6510694o57397K18740J578663N600839Q518055M951285l486131r124623
$$ -16510694 -17168091 -16949351 -15370688 -9769849 -1251794 3699491 213360 -8911263
2219h911263p546570k028136J708227K047246J446327J697695J545081l91175
$$ -8911263 -16457833 -18485969 -16777742 -14730496 -13284169 -11586474 -10041393 -10432568
2211a0432568k168005p38278K709678L526042R08739k68469K246137L403831l78476
$$ -10432568 -12600573 -13338851 -10629173 -7103131 -6194392 -6462861 -4216724 -812893 -1191369
2202a191369l117065K219122J0851036J1567973L498435k921518k364208j187854
$$ -1191369 -4308434 -2089312 8761724 20329697 23828132 20906614 18542406 17354552
2194A7354552m572352p510160m395982Q07957J202942k105017k852558M02181
$$ 17354552 12782200 5272040 876058 1684015 2886957 781940 -2070618 -1668437
2186a668437L459012L226145L69615k843062l772748p87793L758327M752187R53474
$$ -1668437 1790575 5016720 5386335 2543273 -1229475 -2017268 1741059 6493246 7446720
2177G446720k966171l193057j418536l16272P44391K292645K010226q42340k835307
$$ 7446720 4480549 1287492 -131044 -447316 297075 2589720 4599946 3757606 922299
2168I22299j882436o87435j283682j586551j057926l233620p810580p617502q8166
$$ 922299 -960137 -1647572 -2931254 -4517805 -5575731 -8809351 -16619931 -24237433 -24325599
2159b4325599N745059K337964l291706m20685P088441O478943k708921p291682
$$ -24325599 -18580540 -16242576 -19534282 -19954967 -12866526 -6387583 -9096504 -16388186
2151a6388186r71219P178326Q053627M384866K113148L80748l015939m489327
$$ -16388186 -17359405 -10181079 -2127452 2257414 4370562 4751310 1735371 -2753956
2143b753956p65445L651646K568447k263139m146956j149824K962052N072349
$$ -2753956 -3519401 132245 2700692 437553 -3709403 -4859227 -1897175 3175174
2135C175174M721180J837658k534254m953415l652761k117095l882399n806933
$$ 3175174 7896354 9734012 7199758 2246343 -1406418 -3523513 -7405912 -13212845
2127a3212845k391034M386329O477950J708383k660463q57259L368411L936558
$$ -13212845 -15603879 -11217550 -4739600 -3031217 -5691680 -6548939 -3180528 756030
2119G56030J961880J816036J820361k962542j0060819j0543192k180575O373125
$$ 756030 2717910 4533946 6354307 3391765 -6669054 -17212246 -19392821 -13019696
2111a3019696P920820N820165N809058N931361K076320k098764l18429M358223
$$ -13019696 -5098876 721289 6530347 12461708 14538028 12439264 12120835 16479058
2103A6479058K956200m842329r590131o340906k86327L616461O527048Q038111
$$ 16479058 19435258 14592929 5002798 -1338108 -1624435 1992026 8519074 16557185
2095A6557185L244700o742491j1006838l417995O581248O324240k853467r297554
$$ 16557185 19801885 13059394 2052556 -1365439 5215809 11540049 8686582 -610972
2087f10972p152394l13740N783085P979330M292622k895082n481344O72058P709364
$$ -610972 -7763366 -8077106 -2294021 5685309 9977931 7082849 1601505 2273563 9982927
2078I982927N471576l914699r755156q017425l346249J372801O594379Q731575
$$ 9982927 15454503 11539804 1784648 -6232777 -9579026 -8206225 -1611846 7119729
2070G119729L025097n544352n679245L635230J0499178P137040l81238l366593
$$ 7119729 10144826 4600474 -1078771 2556459 13055637 20192677 19811439 16444846
2062A6444846k136380j412303j975426k333345k788339l541740l649930m129475
$$ 16444846 14308466 12896163 10920737 8587392 5799053 2257313 -1392617 -5522092
2054e522092o337558o422571M82283R151141P645374m550558j2587387o407008
$$ -5522092 -11859650 -18282221 -17799938 -8648797 -1003423 -5553981 -18141368 -24548376
2046b4548376N379627R357473N405664J487770j077627n421006q036091k619332
$$ -24548376 -19168749 -9811276 -4405612 -2917842 -3995469 -9416475 -17452566 -20071898
2038b0071898P201475J0375445L838859l695885m203399Q23634N095357N180747
$$ -20071898 -12870423 -2494978 1343881 -2352004 -6555403 -5731769 -636412 4544335
2030D544335K341977O34707K957661O383951M206373l990087r032943m458226
$$ 4544335 6886312 7521019 10478680 16862631 21069004 17078917 8045974 3587748
2022C587748L059609L305558k053478l454168L20774J478327j853326k325970
$$ 3587748 6647357 9952915 7899437 4445269 4766043 6244370 4391044 2065074
2014B065074K666107N350678P85499m328687k682061J882770J387520l474246
$$ 2065074 4731181 10081859 10867358 6538671 3856610 5739380 7126900 3652654
2006C652654n786023l861224k168624k618517k249925N43366L431157M358891
$$ 3652654 -2133369 -5994593 -8163217 -10781734 -13031659 -12488293 -9057136 -4698245
1998d698245L736554K060842m53753j621137R15493M833678M571367p88125n432146
$$ -4698245 -961691 1099151 645398 -975739 -60246 4773432 9344799 8556674 3124528
1989C124528n051554k792760l138959l836608M5307O012903N586908k932695r969460
$$ 3124528 -1927026 -4719786 -7858745 -11695353 -11650046 -5637143 -50235 -2982930 -12952390
1980a2952390o643532L741468J0717417R436699L523744j847925m105174k373353
$$ -12952390 -19595922 -15854454 -5137037 4299662 7823406 5975481 1870307 -503046
1972e03046J785107L574579J72115m167043l509758O67304K136431J52317r74501
$$ -503046 1282061 4856640 5028755 861712 -2648046 -1980742 155689 308006 -666495
1963f66495j593684n820455j0005982m302796R771386J5842217N128871q573963
$$ -666495 -2260179 -8080634 -18086616 -22389412 -12618026 3224191 8353062 -220901
1955b20901p677273M213242R748608M208993j255050n29052k69257m417368n999655
$$ -220901 -7898174 -3684932 6063676 10272669 9017619 8488567 8219310 3801942 -2197713
1946b197713m81974M686589J869623m296875m721999K35308L114953J383949q60242
$$ -2197713 -2679687 2006902 3876525 -420350 -5142349 -4907041 -1792088 -408139 -1268381
1937a268381q84281n1341M36375Q98034P64960o90478j782485m82089J730581
$$ -1268381 -2152662 -2204003 -1767628 -869594 -104634 -795112 -2577597 -3059686 -1329105
1928a329105J920914P12247J033363K426031J433840j820758k558396J020021
$$ -1329105 591809 1304056 2337419 4763450 6197290 4376532 1818136 2838157
1920B838157L663240O07603m047620k059302O539109J1632548N842504n481259
$$ 2838157 6501397 7109000 3061380 1002078 7541187 19173735 25016239 19534980
1912A9534980j1104442p715407j783704Q49315J007740J033717l4645k779656
$$ 19534980 8430538 715131 -1068573 -219258 788482 1822199 1787554 -992102
1904i92102l823949o47451L190585K525960j792473m523501l720827j854906l06004
$$ -992102 -4816051 -5463502 -2272917 253043 -1539430 -6062931 -9783758 -11638664 -11944668
1895a1944668J818384L412209J587400k513617l321084J246607N741516M381795
$$ -11944668 -10126284 -6714075 -5126675 -7640292 -10961376 -9714769 -3973253 408542
1887D08542p91095k791887P72824M760157L355883k597938o500491l654383L112220
$$ 408542 -382553 -3174440 -2401616 2358541 5714424 3116486 -3384005 -7038388 -3926168
1878c926168O430746K874626l107722m616980m1605O169583Q857850O081575q23170
$$ -3926168 2504578 5379204 2271482 -2345498 -2387103 3782480 12640330 18721905 17898735
1869A7898735q073533j0950358p591614j499865K039614J863590R35215J073272
$$ 17898735 9825202 -1125156 -8716770 -10216635 -8177021 -6313431 -5378216 -4304944
1861d304944R24714n55072j821405j079031J323776L694081M407781K306454k126832
$$ -4304944 -3380230 -3935302 -5756707 -6835738 -5511962 -1817881 2589900 4896354 2769522
1852B769522n696988n065007j117441J527192M22387j355427O73727O146587R524301
$$ 2769522 -2927466 -7992473 -9109914 -7582722 -7160335 -8515762 -7842035 -1695448 7828853
1843G828853O332717r94392m857724j222234M726107M790692p52949k958291K568445
$$ 7828853 14161570 13167178 8309454 7087220 11813327 16604019 15851070 12892779 15461224
1834A5461224Q073885M294561n839014j1097039p121783j45276L767291N312813
$$ 15461224 23535109 27829670 21990656 10893617 3771834 3626558 7393849 12706662
1826A2706662O383710N140637J40569n507582p640756n699480j814861J782835
$$ 12706662 19090372 24231009 24371578 18863996 11223240 5523760 3708899 5491734
1818E491734L014754R19940k189010k730209j109440j412731m655179o292708
$$ 5491734 8506488 9426428 7237418 4507209 3397769 1985038 -2670141 -8962849
1810h962849k460834M552736R038376P671340J745184l677858k884770M393110
$$ -8962849 -11423683 -6870947 2167429 9838769 11583953 7906095 5021325 9414435
1802I414435J0118019O155228m313023r691337n696404j058894l964861r759430
$$ 9414435 19532454 25687682 21374659 11683322 5986918 4928024 963163 -8796267
1794h796267q345297Q26766Q312634P474471J689660j370334J335028N734453
$$ -8796267 -17141564 -16314798 -8002164 -527693 1161967 -208367 1126661 6861114
1786F861114N416369q80428o501382l991670M845186J0123523O409516r24033
$$ 6861114 12277483 11397055 4895673 904003 5749189 15872712 22282228 21358195
1778B1358195m483494m410978m521701l903471P80917P092125Q054215J772563
$$ 21358195 16874701 12463723 7942022 4038551 4819468 11911593 19965808 21738371
1770B1738371n607231p634404m409443n69791Q04803R21491K952536P373880R921232
$$ 21738371 16131140 8496736 4087293 3517502 4322305 5243796 8196332 15570212 25491444
1761B5491444O019333k469774q105878p013239l618011l604480n693122m473914
$$ 25491444 31510777 29041003 20935125 13921886 10303875 6699395 1006273 -3467641
1753c467641R66351N684403N214770o4123o016692p690896k788784N155691Q997564
$$ -3467641 -2501290 3183113 8397883 8333760 2317068 -5373828 -8162612 -3006921 5990643
1744E990643O115607J894464J949886M082419K658764j791012l572877j218288
$$ 5990643 12106250 14000714 15950600 20033019 22691783 20900771 17327894 16109606
1736A6109606P60204j02727q65031L61604N00771k698640n659803l908559J142712
$$ 16109606 16869810 16767083 15902052 16263656 16764427 14065787 8405984 4497425 5640137
1727E640137M523026M650857L736306K718382N08306j954389j724642R75825K140040
$$ 5640137 10163163 14814020 18550326 21268708 21777014 19822625 18097983 19073808 21213848
1718B1213848N25309J63622L055054M305060K4827m350316j587069M506648M063047
$$ 21213848 21739157 21902779 24957833 29262893 29287720 24937404 23350335 27856983 31920030
1709C1920030j840071j697320O352686Q965492q81626j0383095o144316M764539
$$ 31920030 30079959 28382639 34735325 43700817 42819191 32436096 26291780 31056319
1701C1056319P225138J959592L22240K548366J54994m395554p77037Q053824Q568855
$$ 31056319 38281457 40241049 40563289 43111655 43266649 38871095 38094058 46147882 54716737
1692E4716737Q98067r15732N651421Q694246O777443J0901842J7582876J1158189
$$ 54716737 55614804 54699072 60350493 69044739 75822182 86724024 104306900 115465089
1684A15465089J286402J8943910N4369503M2185320n0326235j52154921j60648888
$$ 115465089 116751491 135695401 190064904 232250224 181923989 29769068 -130879820
1677a30879820p1726697J7382160L5357623J0679355M197379K1987625K9598201
$$ -130879820 -202606517 -185224357 -149866734 -139187379 -134990000 -113002375 -83404174
1670h3404174J6160111K119240l78052J133096J688441M836918Q366507N628101
$$ -83404174 -67244063 -65124823 -65502875 -64369779 -62681338 -57844420 -49477913 -43849812
1662d3849812M2180O31842M643303J307520p713800q098146M706538J7101012
$$ -43849812 -43807632 -43175790 -38532487 -37224967 -44938767 -53036913 -48330375 -31229363
1654c1229363J6007424N144873k720231k186298J660186K380266k51816j454024
$$ -31229363 -15221939 -10077066 -12797297 -14983595 -13323409 -10943143 -11194959 -12648983
1646a2648983J321102L958532J186961m404276m766247R50097L806805r65910
$$ -12648983 -11327881 -7369349 -6182388 -10586664 -15352911 -14402814 -10596009 -11561919
1638a1561919n645120k349866L789842L047736k834762l884750J574890M896180
$$ -11561919 -17207039 -19556905 -15767063 -12719327 -15554089 -19438839 -17863949 -12967769
1630a2967769J703249j899638k94415L039671K112779k406067n216167l954023
$$ -12967769 -11264520 -13164158 -13458573 -10418902 -8306123 -10712190 -15928357 -19882380
1622a9882380q57446J050332O06024j325768k376106n11677L081275M115488J47154
$$ -19882380 -20739826 -19689494 -19083470 -20409238 -22785344 -23297021 -20215746 -16100258 -15953104
1613a5953104n207369n589321k36416L877992J184792l588869j323388P051006
$$ -15953104 -21160473 -26749794 -26986210 -23108218 -21923426 -25512295 -26835683 -19784677
1605a9784677J0011737K675035m088246O37976J0254138R989802m52126o864829
$$ -19784677 -9772940 -7097905 -11186151 -10548175 -294037 9695765 9243639 2378810
1597B378810k544578L305819J994103k406788k629129L21574J611612L58058k545827
$$ 2378810 -165768 3140051 5134154 2727366 98237 419811 2031423 2389481 -156346
1588a56346o915573r115018l709973O134042R128213K155223l776506m13866N425909
$$ -156346 -7071919 -16186937 -19896910 -13762868 -4634655 -2479432 -6255938 -6669804 -1243895
1579a243895M786258J183761J567606K349032k649746q105517n348830J106704
$$ -1243895 3542363 4726124 6293730 8642762 5993016 -2112501 -7461331 -6354627
1571f354627L40472n341169l654229N632738Q485077n06453q201494k731200Q616313
$$ -6354627 -6014155 -11355324 -15009553 -9376815 -891738 -1398191 -9599685 -12330885 -3714572
1562c714572J0582317J533393o070474m114157J122212m70424p564045q531004
$$ -3714572 6867745 8401138 2330664 -1783493 -661281 -1131705 -8695750 -17226754
1554a7226754J597849J1517608P571525n955472j0914787p76433R949507P328181
$$ -17226754 -15628905 -4111297 3460228 -2495244 -13410031 -14186464 -4236957 3091224
1546C091224k617041n659522q32468K134026K01125j320411p55475j291744k365360
$$ 3091224 474183 -5185339 -6017807 -3883781 -3682656 -5003067 -5758542 -7050286 -9415646
1537i415646j013538J44461k942334n865038j371202O936112Q463075K290012
$$ -9415646 -10429184 -10284723 -13227057 -19092095 -20463297 -13527185 -5064110 -2774098
1529b774098k124185p60916P70710k31624P57725M805277N866223J228704m017501
$$ -2774098 -4898283 -5659199 -4888489 -5120113 -4362388 442889 6309112 7537816 3520315
1520C520315n816017n661396m409465o57030L014226J513257l178969l079801
$$ 3520315 -2295702 -7957098 -12366563 -13023593 -10009367 -8496110 -11675079 -14754880
1512a4754880L284775Q262702O436141J84268o322860r732156n350842O691721
$$ -14754880 -11470105 -3207403 3228738 3413006 -2909854 -12642010 -17992852 -11301131
1504a1301131J4604675P317273p045403r809879R43828Q281448L352323l806896
$$ -11301131 3303544 10620817 3575414 -6234465 -5290637 2990811 6343134 2536238
1496B536238m543294l566474l954539N13427Q909317Q266816l389364q264394
$$ 2536238 -2007056 -5573530 -9528069 -9014642 -105325 8161491 4772127 -3492267
1488c492267K772667J1894050K350113j2596359j0759995K786752N643075m605636
$$ -3492267 -719600 11174450 13524563 928204 -9831791 -7045039 -1401964 -6007600
1480f007600r103813n17901P669985N934752Q53415j419709m601487r413333p754419
$$ -6007600 -15111413 -15629314 -7959329 -2024577 -1171162 -2590871 -7192358 -16605691 -24360110
1471b4360110K897800J2118735J0809491L182422j252944K01208L618125M158081
$$ -24360110 -21462310 -9343575 1465916 4648338 3395394 3596602 7214727 11372808
1463A1372808r00664q903876j1362925l567332O529328P419918M51445k970038
$$ 11372808 10472144 1568268 -9794657 -13361989 -6832661 587257 1038702 -1931336
1455a931336N70572L148188Q63235j66939L471368N409324M47544o589862q344534
$$ -1931336 -1360764 1787424 2650659 2483720 5955088 11364412 11811956 5222094 -3122440
1446c122440m236470J755678O248143O421273J145749n451587p323311m387049
$$ -3122440 -7358910 -5603232 644911 7066184 8211933 2760346 -4562965 -8950014
1438h950014j080841J939620O490508Q733401L093808n906526p734237k573001
$$ -8950014 -10030855 -8091235 -1600727 7132674 10226482 4319956 -3414281 -5987282
1430e987282p89137m030044k226510O397933R300513J529332l301687M182563
$$ -5987282 -6776419 -10806463 -13032973 -6635040 2665473 4194805 893118 5075681
1422E075681J1090760K922305j0808497j1022334l31885J856494p956800j1860991
$$ 5075681 16166441 19088746 8280249 -2742085 -3073970 -1217476 -9174276 -21035267
1414b1035267m85533J1631072Q653432l999013j0264497n928412O30644L527407
$$ -21035267 -21520800 -9889728 -1236296 -5235309 -15499806 -21428218 -20797574 -17270167
1406a7270167M371608N060288M772745L997560M746468N899505L585589k247712
$$ -17270167 -12898559 -7838271 -3065526 932034 5678502 11578007 15163596 12915884
1398A2915884n893501l147135K332283L424321q73407m312938k502402J074092
$$ 12915884 7022383 3875248 6207531 9631852 8758445 4445507 1943105 3017197
1390C017197R36070k091075l176428j824335j850988l596398k925337P63514K299005
$$ 3017197 3953267 1862192 -1314236 -3138571 -4989559 -8585957 -11511294 -10747780 -8448775
1381h448775p67084l784286k843299q72558j173146q17335L352110P285325N605097
$$ -8448775 -9215859 -13000145 -15843444 -16716002 -17889148 -18706483 -15354373 -8069048 -2463951
1372b463951J005920j06700J571766L55673l252251k747467K855247O660920M742873
$$ -2463951 -1458031 -1564731 7035 362708 -2889543 -5637010 -2781763 3879157 8622030
1363H622030J090204q50065l458590p719125q220912j375585O837389Q007871
$$ 8622030 9712234 8862169 5403579 -2315546 -10536458 -11912043 -5074654 2933217
1355B933217K806188r37261M32214L049736K755311Q4579k546322m190868m565027
$$ 2933217 5739405 4802144 5234358 8284094 11039405 11123984 8577662 4386794 -178233
1346a78233l044704R963K741246L441466J593861k340779o359038o868187k180463
$$ -178233 -3222937 -3212974 -471728 2969738 4563599 2222820 -4136218 -11004405 -13184868
1337a3184868L758521M500218o20511m342468j68420Q834241J3077175P555949
$$ -13184868 -9426347 -4926129 -5546640 -9889108 -10057528 -1223287 11853888 19409837
1329A9409837l001373j0035837r445326l471019K869473N595550L917488N74736
$$ 19409837 16408464 6372627 -3072699 -6543718 -3674245 1921305 5838793 6413529
1321F413529p41169O03751J795515R01000m68862m33011l78239k249394m110720
$$ 6413529 5672360 6276111 8071626 8972626 8503764 8070753 7692514 5443120 1332400
1312A332400k490335J387126K168009k017618o630007p080874m243905j204222
$$ 1332400 -1157935 229191 2397200 379582 -6250425 -13331299 -17575204 -18779426
1304a8779426J938941O371076J0037618R122653L525809k494784n216176m541903
$$ -18779426 -16840485 -10469409 -431791 8690862 12216671 9721887 4505711 -36192
1296c6192k423291o25561q8761m41278j96167R29280Q17894j579336k971044J65478
$$ -36192 -2459483 -3085044 -3173805 -3615083 -3811250 -2881970 -2064076 -3643412 -6614456 -6448978
1286f448978M766481L700543l569689q352630m171253M024914P279367N364720
$$ -6448978 -1682497 2018046 -1551643 -9904273 -14075526 -10050612 -2771245 2593475
1278B593475M936782O914430M606394m059825j1113328r916119m834027l133126
$$ 2593475 7530257 14444687 19051081 14991256 3877928 -6038191 -10872218 -14005344
1270a4005344l104138J267745P728507Q104808K234029j137127R57304P71966
$$ -14005344 -17109482 -15841737 -8113230 -8422 2225607 1088480 2045784 2817750
1262B817750n997863j1159455o487165K693711N567222J940344K87202L049889
$$ 2817750 -3180113 -14339568 -20826733 -18133022 -12565800 -10625456 -10338254 -7288365
1254g288365M433539K037901O05527K721279M290611J849890k329857m794358
$$ -7288365 -2854826 -816925 -211398 2509881 6800492 8650382 6320525 1526167
1246A526167m900774k746395J175500L241124j5074m896254m115436J256620K056073
$$ 1526167 -3374607 -6121002 -4945502 -1704378 -1719452 -6615706 -10731142 -9474522 -7418449
1237g418449l899599o593540R26819J1135906J3485282R499447P117392O122757
$$ -7418449 -11318048 -17911588 -16984769 -5848863 7636419 17135866 24253258 30376015
1229C0376015K94555r121692j3407649r696343m602528l218137k734893O97642
$$ 30376015 30670570 21548878 8141229 -1555114 -6157642 -9375779 -12110672 -11413030
1221a1413030N478833P584176N235617r41723p890911r804983l372087N830922
$$ -11413030 -5934197 1649979 6885596 5943873 -1947038 -11752021 -15124108 -9293186
1213i293186Q261017L240909L33797N199250J0878275Q026695j669468q599886
$$ -9293186 -1032169 2208740 2542537 7741787 18620062 26646757 24977289 16377403
1205A6377403q329475n019222l341904l379989l711716l850296k215909L249962
$$ 16377403 8047928 3028706 -313198 -3693187 -7404903 -11255199 -13471108 -10221146
1197a0221146R876613J0130356R03448r962433j1718373m240502K224738J459853
$$ -10221146 -344533 9785823 10689271 726838 -10991535 -15232037 -13007299 -11547446
1189a1547446j149033J113516M700192J479045p349743j1454446n491774M525136
$$ -11547446 -12696479 -11582963 -6882771 -5403726 -12753469 -24207915 -29699689 -25174553
1181b5174553J0467417J0816329P889786L223322o91056k08617L609387M277194
$$ -25174553 -14707136 -3890807 3998979 7222301 6531245 6322628 9932015 14209209
1173A4209209q01298n795873n528161k763760j149331J917554P954256J0085977
$$ 14209209 13407911 7612038 2083877 -679883 -1829214 88340 8042596 18128573
1165A8128573L023228n384110m322883K234767J240049p757855j1300872l923978
$$ 18128573 21151801 15767691 11444808 13679575 14919624 7161769 -4139103 -8063081
1157h063081L314108J311569l205178l46606O722962P945780J992742l668086
$$ -8063081 -4748973 -3437404 -6642582 -6989188 -266226 7679554 9672296 6004210
1149F004210m421745k358978p52395p17290j840015k154985M20924M129620M401480
$$ 6004210 1582465 -776513 -1528908 -2246198 -4086213 -6241198 -5820274 -1690654 2710826
1140B710826J099221k06603K877720N179817K474613j509879j666457L85401M55321
$$ 2710826 3810047 3603444 6481164 11660981 14135594 12625715 10959258 11344659 11799980
1131A1799980r42068j505714k729425o187766q397188n898717j683389j58970
$$ 11799980 10857912 9352198 6622773 435007 -7962181 -13860898 -15544287 -15703257
1123a5703257K69666K788024M652016K058936j137550J493101P580335Q739854
$$ -15703257 -15433591 -12645567 -7993551 -5934615 -7072165 -5579064 2001271 10741125
1115A0741125L419770j811684l084622k745032k383803r83471l31761l787255
$$ 10741125 14160895 12349211 9264589 6519557 4135754 3152283 2820522 -966733
1107i66733q724762q350661k279421K568371K874599K600814M008684L354465
$$ -966733 -9691495 -18042156 -20321577 -17753206 -14878607 -12277793 -8269109 -4914644
1099d914644j479772o399435p365321n101046j401560K876351M749144J475757
$$ -4914644 -6394416 -12793851 -20159172 -25260218 -26661778 -23785427 -19036283 -17560526
1091a7560526k512316M55183Q347838J0069144K467253l647792M7444O959598
$$ -17560526 -20072842 -19617659 -11269821 -1200677 1266576 -2381216 -2333772 4625826
1083D625826O876233P63028m108687o008657o582412l620040M059526R663955
$$ 4625826 11502059 12265087 8156400 2147743 -4434669 -8054709 -3995183 5668772
1075E668772O273447k123828o361190n091312l329698k134981O39822K781645
$$ 5668772 11942219 9818391 3457201 -1634111 -4963809 -7098790 -6458968 -3677323
1067c677323R82198j138377J469783M351063o65978j0264331j2197887l375681
$$ -3677323 -2695125 -3833502 -2363719 1987344 1321366 -8942965 -21140852 -24516533
1059b4516533O094406Q333827O204427M333615K415472O15308J706031M178034
$$ -24516533 -18422127 -10088300 -3883873 449742 2865214 3480522 5186553 9364587
1051I364587K286047l689560o216077k654959Q01986N32086M53198J700913j121810
$$ 9364587 11650634 7961074 1744997 -909962 -107976 424110 877308 2578221 1456411
1042A456411p675791p906367J607815Q823869L903306m807823m599981J033117
$$ 1456411 -6219380 -14125747 -12517932 -3694063 209243 -4598580 -9198561 -8165444
1034h165444J17357o227285o172140J777373O257861K208449j961642O06865N463599
$$ -8165444 -8048087 -14275372 -20447512 -18670139 -12412278 -10203829 -12165471 -11558606 -6095007
1025f095007O488358M892082L553608J010144l496991n863868l316903L96178
$$ -6095007 393351 5285433 8839041 9849185 6352194 488326 -2828577 -2432399
1017b432399M47751k587065n105556n506941m062506j257803J633079L477471
$$ -2432399 -1984648 -4571713 -9677269 -15184210 -19246716 -20504519 -18871440 -15393969
1009a5393969N583002R197743J0903355O146147k268804o078801l477918j614675
$$ -15393969 -9810967 -613224 10290131 16436278 14167474 8088673 4610755 2996080
1001B996080m314271n382468N65282P670679O593976j825734q314684q175553
$$ 2996080 -1318191 -6700659 -6135377 1535302 8129278 6303544 -2011140 -10186693
993a0186693n341997m015989k747732J506394P491494J0206823O354306j539664
$$ -10186693 -15528690 -19544679 -22292411 -20786017 -13294523 -3087700 3266606 1726942
985A726942o740495n017408O60552M079610L585565K407337J809462n55082m262041
$$ 1726942 -5013553 -10030961 -9370409 -5290799 -1705234 702103 2511565 1956483 -2305558
976b305558m319435Q86594N329090L624817r24511j864243N35985J037370j266816
$$ -2305558 -6624993 -5738399 -409309 3215508 2290997 426754 962739 2000109 733293
967G33293j885874J200198M120825K500399l395632r516022j1327248o380581
$$ 733293 -1152581 47617 4168442 6668841 3273209 -6242813 -17570061 -23950642
959b3950642L499185J2197982J3768535P705327r45856o357555o327332l146867
$$ -23950642 -20451457 -8253475 5515060 13220387 12274531 5916976 -410356 -3557223
951c557223q73222q07036Q104L905253P407281M958368k395429p195192n383959
$$ -3557223 -4430445 -5237481 -5229377 -1324124 6083157 11041525 8646096 1450904 -3933055
942c933055n85053K747738M302602L967934l145n364760n607716P4772L755858
$$ -3933055 -4518108 -1770370 2532232 6500166 6497021 1132261 -4475455 -4400683 -644825
933f44825R77390k002279J22907J661433k971825o618122n10866Q420150O424815
$$ -644825 332565 -1669714 -1546807 114626 -2857199 -9475321 -9986187 -1566037 4858778
924D858778m316025p979466N4166O887772L535419k791040l422679j224062j019955
$$ 4858778 542753 -7436713 -7382547 -494775 3040644 249604 -3173075 -4397137 -5417092
915e417092P51323P055157J0587438L954088o964706j0157994l860427L178418
$$ -5417092 -4665769 2389388 12976826 16930914 9966208 -191786 -4052213 -873795
907h73795M767429K552786K06967o89831M359P05450j334543n457685o496937
$$ -873795 3893634 6446420 6653387 5963556 5967915 6673365 5338822 -118863 -6615800
898f615800k018650L170496M085679K731813L041105L329787L27812l285441k871906
$$ -6615800 -8634450 -5463954 -1378275 1353538 4394643 7724430 8052242 4766801 1894895
889A894895n12452j891799o233106p072262k362553L426719O925002Q376747O611388
$$ 1894895 1382443 -509356 -6742462 -13814724 -16177277 -12750558 -5825556 2551191 9162579
880I162579n97674r498400j1083442k332697Q469593J0982571L663869o807247
$$ 9162579 8564905 -933495 -12016937 -14349634 -5880041 5102530 8766399 1959152
872A959152j3091164j1959808n228038J487567L598550K726267M139719Q175299
$$ 1959152 -11132012 -23091820 -28319858 -26832291 -23233741 -20507474 -16367755 -8192456
864h192456Q740699K640792m431073n375385j474081N97418o45888j21484M411091
$$ -8192456 548243 3189035 -1242038 -6617423 -8091504 -7494086 -8139974 -8261458 -3850367
855c850367P587132M017608l398845p032494m653556j394220j257838j319454
$$ -3850367 3736765 7754373 4355528 -2676966 -7330522 -8724742 -9982580 -11302034
847a1302034K547966P301356N438662l636810j0171016n445599O323991J2261508
$$ -11302034 -8754068 -1452712 3985950 349140 -9821876 -15267475 -8943484 3318024
839C318024O619152k506882m213678J433172M965890J087632n017113o378376
$$ 3318024 9937176 7430294 3216616 4649788 9615678 10703310 5686197 -692179
831f92179l880781k731839k861640M45763O916354R435711M010228m491347r772497
$$ -692179 -4572960 -7304799 -10166439 -9720676 -2804322 6631389 10641617 6150270 -3622227
822c622227j1481602j0947365n831055M251139J1820246R783312K627728M88157
$$ -3622227 -15103829 -26051194 -31882249 -27631110 -15810864 -6027552 -3399824 -2911667
814b911667L822465L605010l419381r615955q252005j415543N961950J1253974
$$ -2911667 910798 4515808 1096427 -8519528 -16771533 -18187076 -12225126 -971152
806i71152J1137561L027761p142323q401783m31259M244678q91829o275555k661413
$$ -971152 10166409 13194170 6051847 -2349936 -2781195 1463483 571654 -5703901 -8365314
797h365314L576711K448265j867208J168670R253329J0545948L117312l128194
$$ -8365314 -4788603 -2340338 -4207546 -3038876 6214453 16760401 19877713 16749519
789A6749519l372115l315788o233765o874888j827240L999620N373187L402188
$$ 16749519 13377404 10061616 3827851 -3047037 -4874277 -874657 4498530 7900718
781G900718Q32130k195501m516721k803366K399220N105630J665711m498687q330160
$$ 7900718 8732848 6537347 2020626 -782740 1616480 6722110 8387821 3889134 -4441026
772d441026q729891o624795k146030L604925P530820P548780M431647K25607k750444
$$ -4441026 -13170917 -19795712 -21941742 -18336817 -10805997 -3257217 1174430 1400037 -1350407
763a350407k283009J059395L130218J729923L31499J747479K047805k361143n677124
$$ -1350407 -3633416 -2574021 556197 2286120 2617619 4365098 6412903 4051760 -1625364
754a625364k23378R520111J1425674L588270l890086n635207o996137j0575951
$$ -1625364 -1848742 7671369 19097043 22685313 18795227 13160020 6163883 -4412068
746d412068r741930j338137O443746O139214J623327m11365o93183j581984J81647
$$ -4412068 -14153998 -15492135 -9048389 -2909175 -1285848 -1697213 -2390396 -3972380 -3790733
737c790733O061586Q724331K310098o411985p300412k300647j052235m597089
$$ -3790733 2270853 10995184 13305282 6893297 -407115 -2707762 -3759997 -8357086
729h357086m689621J675890P483289O661087J550950k576633m053170l663083
$$ -8357086 -13046707 -11370817 -3887528 2773559 4324509 1747876 -2305294 -5968377
721e968377j732502J383430M478071O113674M936648N92343m358377o024668m477371
$$ -5968377 -7700879 -6317449 -1839378 4274296 9210944 9803287 5444910 -579758 -5057129
712e057129l914072n396036m374945J008092M902641K559286j171448O62314N375095
$$ -5057129 -8971201 -14367237 -18742182 -17734090 -12831449 -10272163 -11443611 -10781297 -5406202
703e406202M828304j262073n129125l286468m52134m01612p67087R31572K583813
$$ -5406202 -577898 -1839971 -6969096 -10255564 -10707698 -11109310 -11876397 -10944825 -8361012
694h361012J650929p52993k376353k647247j248860K410182O465090O741647K029373
$$ -8361012 -6710083 -7463076 -9839429 -12486676 -13735536 -11325354 -4860264 1881383 3910756
685C910756l036740k783056K563007O411954K904557n750349j0501348n773139
$$ 3910756 874016 -1909040 653967 7065921 9970478 4220129 -6281219 -12054358
677a2054358K933649N512758N06498l755894j923407J613778J729461Q65164K842050
$$ -12054358 -9120709 -3607951 -3101453 -6857347 -8780754 -7166976 -5437515 -4572351 -1730301
668a730301M821714K544161j278453j331834J270405J733794P2765n87639j000753
$$ -1730301 3091413 5635574 4357121 3025287 4295692 6029486 6102251 5514612 4513859
659D513859l209121m013924L17389N300624L516160l030433n538951k409382l73815
$$ 4513859 1304738 -2709186 -2391797 2908827 6424987 3394554 -2144397 -4553779 -4927594
650d927594j806564j818313P45538N70983l049266l294457J813274M542071N26710
$$ -4927594 -6734158 -8552471 -7806933 -7235950 -10285216 -13579673 -11766399 -7224328 -6697618
641f697618l149011p8705M163461J734274l609197k751800L100055L954354k912643
$$ -6697618 -9846629 -9925334 -5761873 -4027599 -7636796 -10388596 -7288541 -3334187 -6246830
632f246830q514806n475345K214991O223369M933406K913465K629899J901983
$$ -6246830 -14761636 -20236981 -18021990 -11798621 -6865215 -3951750 -1321851 580132
624E80132p38925k822282k260986j573857l708351n448002q76009Q058283J1348256
$$ 580132 -158793 -2981075 -5242061 -6815918 -10524269 -15972271 -16848280 -8789997 2558259
615B558259M625527l614548l995177O58099J764438p92563p17526J809659O35541
$$ 2558259 7183786 3569238 -425939 232160 1996598 1204035 486509 2296168 2931709
606B931709l778068l805937J871038N161061J801053k455137k557390j243432
$$ 2931709 -846359 -4652296 -2781258 2379803 4180856 1725719 -831671 -2075103
598b075103r45295J565230O652348P338388O16339n127674k383274K984283R39358
$$ -2075103 -3020398 -1455168 5197180 12535568 13151907 8024233 5640959 8625242 9564600
589I564600o608642r160593l820619J918819K547051P90965Q45289K464993L415669
$$ 9564600 2955958 -6204635 -10025254 -8106435 -5559384 -4768419 -3923130 -1458137 1957532
580A957532K912421J286121o10778j365761o81396l48593j541492k675921j906590
$$ 1957532 4869953 6156074 5545296 4179535 3498139 3149546 1608054 -1067867 -2974457
571b974457K84625K684778M756088M907579J236341l926781m817750m05951L212482
$$ -2974457 -2689832 -5054 4751034 9658613 10894954 6968173 2150423 1744472 4956954
562D956954J959636l28580L49614O50453l322271o900634k848364O301379J0220439
$$ 4956954 6916590 6588010 6937624 7588077 4265806 -2634828 -5483192 818187 11038626
553A1038626M598228l851587o721757l101022J346772J114124l696192p280234
$$ 11038626 15636854 11785267 5063510 1962488 3309260 4423384 727192 -6553042
545f553042m973083l40289r39301o126428o396658J724105Q735878O527409J237795
$$ -6553042 -11526125 -11866414 -12805715 -18932143 -25328801 -23604696 -14868818 -8341409 -7103614
536g103614K525342P219852N394238k102676n212901j757597j6634l778049o760496
$$ -7103614 -4578272 2641580 8035818 5933142 720241 -1037356 -1053990 -4832039 -11592535
527a1592535m225512J41288J940796J979639J769654Q50559O91225L712920O918649
$$ -11592535 -15818047 -15676759 -13735963 -11756324 -9986670 -9136111 -8444886 -4731966 2186683
518B186683M597748j124048j433546N074845Q838529L624382m543896p522730
$$ 2186683 6784431 5660383 4226837 9301682 18140211 21764593 17220697 9697967
510I697967n886699m099492k249753J079876L566953K871782J042867L40300o88200
$$ 9697967 3811268 -288224 -2537977 -1458101 2108852 4980634 6023501 6363801 5675601
501E675601k762165k819433J77289K019084N90536M06946M226737O292792J008405
$$ 5675601 2913436 94003 271292 2290376 2880912 3287858 7514595 13807387 14815792
492A4815792o791962q174210l019577J319671J662479J424715K815940L939358
$$ 14815792 8023830 -150380 -3169957 -1850286 -187807 1236908 4052848 7992206
484G992206L311902J231559k732512p998114r893681m651831L104658M577815
$$ 7992206 11304108 12535667 9803155 1805041 -8088640 -12740471 -9635813 -5057998
476e057998j007192m908574j121867N759613P508864K466404m095231o495111
$$ -5057998 -6065190 -10973764 -12095631 -6336018 1172846 3639250 -455981 -6951092
468f951092l129725K904517N795142K113727m476284o220553o89915N572106N218255
$$ -6951092 -10080817 -7176300 -1381158 732569 -3743715 -9964268 -10654183 -5082077 136178
459A36178m91430l753394n04113N000354O298401K306580k921395n885249o378402
$$ 136178 -355252 -4108646 -4612759 387595 6685996 8992576 6071181 185932 -6192470
450f192470n266988k734004J97283J020066j097158l050393j287863L195559N874890
$$ -6192470 -11459458 -14193462 -13996179 -12976113 -14073271 -17123664 -18411527 -15215968 -9341078
441i341078M359392O39669k082467k335656l05651K508672L438332J069123k216020
$$ -9341078 -4981686 -4342017 -6424484 -8760140 -9065791 -6557119 -3118787 -2049664 -4265684
432d265684k576500L51870L335467L923461J982789k213697p183002q110267j217190
$$ -4265684 -6842184 -6490314 -3154847 768614 2751403 537706 -6645296 -14755563 -15972753
423a5972753Q806095J1765598M860737k924588k805933K499730M027183q94246
$$ -15972753 -7166658 4598940 9459677 6535089 3729156 6228886 10256069 9361823
415I361823o635184p486569l151198K725729N847826M092375l30445k889138k552411
$$ 9361823 2726639 -4759930 -7911128 -5185399 662427 4754802 4424357 1535219 -1017192
406a017192k892777n471932o122171j319363N423567Q005566N754781K461162
$$ -1017192 -3909969 -9381901 -15504072 -16823435 -11399868 -3394302 2360479 4821641
398D821641l8425k348313l559348k053543O20229J192177n77273k228843k546402
$$ 4821641 4783216 2434903 -1124445 -3177988 -2557759 -1365582 -1942855 -4171698 -6718100
389f718100j694486P74998M077170M393378l96783n901240o187465k160935L59012
$$ -6718100 -8412586 -7637588 -3560418 832960 436177 -5465063 -11652528 -13813463 -13454451
380a3454451k65286k61714K096875L944075L317445J627162k35889k930838m770365
$$ -13454451 -13719737 -13981451 -11884576 -7940501 -4623056 -2995894 -3231783 -6162621 -10932986
371a0932986k227456L914010P847300O274292K339186J28965l99699p32347k54572
$$ -10932986 -13160442 -9246432 -1399132 4875160 7214346 7343311 6943612 6211265 5956693
362E956693J576615K675957R42012k567514n051920m789957j626451K891118N145642
$$ 5956693 7533308 10209265 11151277 8583763 3531843 -1258114 -2884565 6553 5152195
353E152195K336590l192166n729489l487217o34968n74908j065816J389688N524014
$$ 5152195 7488785 4296619 -1432870 -4920087 -5555055 -6129963 -7195779 -5806091 -282077
344b82077O904985L784761j185702m070914l135156l94446o1141l559437o418803
$$ -282077 6622908 10407669 9221967 5151053 2015897 1621451 1560310 -1999127 -8417930
335h417930l388286L461207O387898K825821p67228J305065N530279N103341L19508
$$ -8417930 -11806216 -8345009 -1957111 868710 101482 1406547 6936826 12040167 12359675
326A2359675k713959j640019r3399n82871o90981J922061M798893L841568p62685
$$ 12359675 9645716 8005697 7912298 7329427 6638446 8560507 13359400 17200968 16438283
317A6438283m520189m205416j371639L54203j17501j105355j621162k366934l060286
$$ 16438283 11918094 7712678 6341039 6695242 6577741 5472386 3851224 1484290 -1575996
308a575996k074839n4864n7123j686399K02367O562912R069225J336299q741465
$$ -1575996 -3650835 -3705699 -3762822 -5449221 -5246854 1316058 10385283 11721582 2980117
299B980117p918038K635857Q171950K421160l734739o52375N147127L181364l768634
$$ 2980117 -4937921 -2302064 5869886 8291046 4556307 3903932 9051059 12232423 8463789
290H463789n880287k829632j812653l218213j035006L865283L360440l718932
$$ 8463789 2583502 -246130 -2058783 -5276996 -6312002 -2446719 913721 -2805211
282b805211q176395m386868J779346L035751O47998m68875j1225l32260j070072
$$ -2805211 -10981606 -15368474 -13589128 -10553377 -9905379 -10374254 -10385479 -10717739 -11787811
273a1787811p15421j19497m37211m96944O25746J449038J260605K079636M554587
$$ -11787811 -12503232 -12622729 -13059940 -13556884 -12931138 -11482100 -10221495 -8141859 -3587272
264c587272N469750K776236j74852O58469L678373M039796M85013l911949o287330
$$ -3587272 1882478 4658714 4483862 5142331 8820704 12860500 13345513 9433564 3146234
255C146234n852130k686367J805144M255716K534964r44264j925688K80825K623557
$$ 3146234 -2705896 -5392263 -3587119 668597 3203561 2259297 333609 614434 3237991
246C237991K712077P26101k268412m996293n445900k670516Q53020J439125q45213
$$ 3237991 5950068 6676169 4407757 -588536 -6034436 -8704952 -7851932 -6412807 -7258020
237g258020j922708Q21869M830652N290083P27690n162883p101090l591986J429401
$$ -7258020 -9180728 -8358859 -3528207 1761876 2489566 -2673317 -9774407 -13366393 -11936992
228a1936992L161679J790845J601455M028005N201028K432307p67650j93730J621071
$$ -11936992 -8775313 -6984468 -5383013 -1355008 3846020 6278327 5510677 5316947 6938018
219F938018q60928o458562p810069k351114L435989L237667p47534k283696j40890
$$ 6938018 6077090 -381472 -8191541 -10542655 -7106666 -3868999 -4616533 -6900229 -7041119
210g041119J547168p8149l361782m828307k754056J291589L276361O17510l826109
$$ -7041119 -5493951 -5572100 -8933882 -13762189 -16516245 -15224656 -11948295 -11330785 -15156894
201a5156894m208296N85914N033806M862609K849088L308618M850641L729077
$$ -15156894 -19365190 -18779276 -13745470 -8882861 -6033773 -2725155 2125486 5854563
193E854563J226916J378672L193738K088193j498252k202614Q01433J848403j567110
$$ 5854563 7081479 8460151 11653889 13742082 12243830 10041216 10842649 12691052 11123942
184A1123942m396782k797572m70885j362792k182202J364853N643844L950824
$$ 11123942 6727160 3929588 3458703 2095911 -86291 1278562 6922406 10873230
176A0873230k469294n874492l369345L32001J413821J448614K302089K530614
$$ 10873230 8403936 2529444 -839901 -507900 905921 2354535 4656624 7187238
168G187238P80249j829596m152311n666218m155939J953873P934292N854483l840881
$$ 7187238 7967487 6137891 1985580 -3680638 -7836577 -5882704 2051588 7906071 4065190
159D065190j0158546n519700L497008N368089m34742m028175l310N873342O123810
$$ 4065190 -6093356 -11613056 -8116048 -2747959 -3182701 -7210876 -7214186 -1340844 4782966
150D782966J576008j471375n39443O68060j403547m616704l819388J574659N420380
$$ 4782966 6358974 4887599 4348156 5016216 3612669 -1004035 -4823423 -3248764 2171616
141B171616K509805l471547m165969J235200L919622j531967p995519n630763
$$ 2171616 4681421 1209874 -2956095 -1720895 2198727 666760 -7328759 -12959522
133a2959522L239041P102816J908591l831261k347016K799005L815505M34398
$$ -12959522 -9720481 -2617665 -709074 -4540335 -6887351 -4088346 -272841 161557
125A61557j577475l23954N10916p35365n56108L318899O786587M273525l055191
$$ 161557 -1415918 -1739872 -1228956 -1964321 -2520429 798470 7585057 11858582 8803391
116H803391p800158n500282k84084P51448l032786n399633k143137L514801O320646
$$ 8803391 1003233 -4497049 -4781133 -4029685 -7062471 -12462104 -14605241 -11090440 -4769794
107d769794O168069O131684N844476K167410l899994o575902l339671R55962Q39273
$$ -4769794 1398275 7529959 13374435 15541845 11641851 5065949 1726278 2682240 3521513
98C521513k543017m394298l566916k597879k103065P2444L980591O105270M283960
$$ 3521513 978496 -3415802 -6982718 -9580597 -11683662 -11611218 -7630627 -1525357 2758603
89B758603J048757J4648R57094P74148j698952m168352m200371k214147l89606
$$ 2758603 3807360 3822008 4779102 5553250 3854298 -314054 -4514425 -6728572 -7118178
80g118178K33444L56708N80771M02436m94395j094054k94829J239197J734027
$$ -7118178 -6884734 -6528026 -5947255 -5544819 -6039214 -7133268 -7428097 -6188900 -4454873
71d454873P55188k31938o0956N00620J6589j427104k092929n07417K780184N211456
$$ -4454873 -3699685 -3931623 -3992579 -3491959 -3475370 -4902474 -6995403 -7502820 -4722636 488820
61D88820M211774j15611m351801m856676j830974P26770k63771l193060l658037
$$ 488820 4700594 4584983 233182 -4623494 -6454468 -5727698 -5991469 -9184529 -12842566
52a2842566L02295N770542P783881M228899j972031n379509l105000K305661N326359
$$ -12842566 -12540271 -6769729 1014152 5243051 3271020 -2108489 -5213489 -2907828 2418531
43B418531L043068k034764n011454l938297j357365n53590j290996m16679L360654
$$ 2418531 5461599 3426835 -1584619 -5522916 -6880281 -7433871 -8724867 -9141546 -5780892
34e780892O902759O216200J672026k417846l262189k181253j297237n73224L59298
$$ -5780892 1121867 7338067 9010093 6592247 3330058 1148805 -148432 -721656 -362358
25c62358L71989o97543m26373K157128L421414J69749m258598m180572o30137
$$ -362358 9631 -687912 -1114285 1042843 4464257 4634006 375408 -3805164 -4435301
16d435301Q3941k961500l210653K470594P650746N624978m66042k531263R11074
$$ -4435301 -4351360 -7312860 -10523513 -8052919 -402173 5222805 4756763 2225500 3136574
7C136574M004704K579233j570219m816734n494852l501145K70262
$$ 3136574 7141278 9720511 8150292 3333558 -2161294 -5662439 -5392177
0e392177
$$ -5392177
##END NTUPLES=NMR SPECTRUM
##END=
