##TITLE=31Pdec_BAU-j-FPPPh
 CDCl3, 24 sc
 5.3.2019
##JCAMPDX= 6.0         $$ Bruker NMR JCAMP-DX V2.0
##DATA TYPE= NMR SPECTRUM
##DATA CLASS= NTUPLES
##ORIGIN= UXNMR, Bruker Analytische Messtechnik GmbH
##OWNER= root
$$ XWIN-NMR		Version 3.5
$$ Tue Mar  5 14:26:53 2019 Russian Standard Time (UT+4h)  she@DPX200
##.OBSERVE FREQUENCY= 81.013821
##.OBSERVE NUCLEUS= ^31P
##.ACQUISITION MODE= SIMULTANEOUS
##.ACQUISITION SCHEME= undefined
##.AVERAGES= 24
##.DIGITISER RES= 17
##SPECTROMETER/DATA SYSTEM= spect
##.PULSE SEQUENCE= zgpg30
##.SOLVENT NAME= CDCl3
##.SHIFT REFERENCE= (INTERNAL, CDCl3, 0, 182.463)
##AUDIT TRAIL= $$ (NUMBER, WHEN, WHO, WHERE, WHAT)
$$ ##TITLE= Audit trail, XWIN-NMR		Version 3.5
$$ ##JCAMPDX= 5.01
$$ ##ORIGIN= Bruker BioSpin GmbH
$$ ##OWNER= she
$$ F:/spectra/data/she/nmr/P31/1/pdata/1/auditp.txt
$$ ##AUDIT TRAIL=  $$ (NUMBER, WHEN, WHO, WHERE, WHAT)
(   1,<2019-03-05 14:25:38.09 +0400>,<she>,<DPX200>,
      <created by zg, POWCHK disabled, PULCHK disabled
       configuration hash MD5:
       00 E9 B6 7A A2 85 ED C7 34 08 36 98 17 FE 4E 26
       data hash MD5: 32K
       B8 FB 47 35 65 89 FE CA 77 41 8E 79 40 1F 37 AE>)
(   2,<2019-03-05 14:26:15.07 +0400>,<she>,<DPX200>,
      <Start of raw data processing
       efp BC_mod = 2 LB = 1 FT_mod = 6 PKNL = 1 PHC0 = -1402.41 PHC1 = -31.40108 SI = 64K 
       data hash MD5: 64K
       2D A1 2F 45 63 10 CD 3E DA 87 AB 16 8F A2 D8 B0>)
$$ ##END=
$$ 
$$ hash MD5
$$ 3F 8F C1 86 36 0B A2 E7 A4 81 2E 23 F6 84 37 60
##$RELAX= 
##$RELAX= 
##$RELAX= 
##$RELAX= 
##$RELAX= 
##$RELAX= 
##$RELAX= 
##$RELAX= 
$$ Bruker specific parameters
$$ --------------------------
##$DU= <F:/spectra>
##$EXPNO= 1
##$NAME= <P31>
##$PROCNO= 1
##$TYPE= <nmr>
##$USER= <she>
##$AMP= (0..31)
100 100 100 100 100 100 100 100 100 100 100 100 100 100 100 100 100 100 
100 100 100 100 100 100 100 100 100 100 100 100 100 100 
##$AQSEQ= 0
##$AQ_mod= 1
##$AUNM= <au_zg>
##$AUTOPOS= <>
##$BF1= 81.014009
##$BF2= 200.13
##$BF3= 200.13
##$BF4= 200.13
##$BF5= 200.13
##$BF6= 200.13
##$BF7= 200.13
##$BF8= 200.13
##$BYTORDA= 1
##$CFDGTYP= 0
##$CFRGTYP= 5
##$CHEMSTR= <none>
##$CNST= (0..31)
1 1 145 1 1 1 1 1 1 1 1 1 1 1 1 1 1 1 1 1 1 1 1 1 1 1 1 1 1 1 1 1 
##$CPDPRG= <waltz16>
##$CPDPRG1= <>
##$CPDPRG2= <waltz16>
##$CPDPRG3= <>
##$CPDPRG4= <mlev>
##$CPDPRG5= <mlev>
##$CPDPRG6= <mlev>
##$CPDPRG7= <mlev>
##$CPDPRG8= <mlev>
##$CPDPRGB= <>
##$CPDPRGT= <>
##$D= (0..31)
0 1 0 0 0 0 0 0 0 0 0 0.03 2e-05 3e-06 0 0 0 0 0 0 0 0 0 0 0 0 0 0 0 0 
0 0 
##$DATE= 1551781537
##$DBL= (0..7)
120 120 120 11 120 120 24 19 
##$DBP= (0..7)
150 150 150 150 150 150 150 150 
##$DBP07= 0
##$DBPNAM0= <>
##$DBPNAM1= <>
##$DBPNAM2= <>
##$DBPNAM3= <>
##$DBPNAM4= <>
##$DBPNAM5= <>
##$DBPNAM6= <>
##$DBPNAM7= <>
##$DBPOAL= (0..7)
0.5 0.5 0.5 0.5 0.5 0.5 0.5 0.5 
##$DBPOFFS= (0..7)
0 0 0 0 0 0 0 0 
##$DE= 6
##$DECBNUC= <off>
##$DECIM= 4
##$DECNUC= <off>
##$DECSTAT= 4
##$DIGMOD= 1
##$DIGTYP= 9
##$DL= (0..7)
0 0 52 120 120 21 21 25 
##$DP= (0..7)
$$ [...]
##$SUBNAM2= <"">
##$SUBNAM3= <"">
##$SUBNAM4= <"">
##$SUBNAM5= <"">
##$SUBNAM6= <"">
##$SUBNAM7= <"">
##$SUBNAM8= <"">
##$SUBNAM9= <"">
##$SW= 369.568048894756
##$SWIBOX= (0..15)
0 1 3 0 0 0 0 0 0 0 0 0 0 0 0 0 
##$SW_h= 29940.119760479
##$TD= 32768
##$TD0= 1
##$TE= 0
##$TE2= 300
##$TE3= 300
##$TEG= 300
##$TL= (0..7)
0 120 53 12 22 120 120 120 
##$TP= (0..7)
150 150 150 150 150 150 150 150 
##$TP07= 0
##$TPNAME0= <>
##$TPNAME1= <>
##$TPNAME2= <>
##$TPNAME3= <>
##$TPNAME4= <>
##$TPNAME5= <>
##$TPNAME6= <>
##$TPNAME7= <>
##$TPOAL= (0..7)
0.5 0.5 0.5 0.5 0.5 0.5 0.5 0.5 
##$TPOFFS= (0..7)
0 0 0 0 0 0 0 0 
##$TUNHIN= 0
##$TUNHOUT= 0
##$TUNXOUT= 0
##$USERA1= <user>
##$USERA2= <user>
##$USERA3= <user>
##$USERA4= <user>
##$USERA5= <user>
##$V9= 5
##$VALIST= <valist>
##$VCLIST= <CCCCCCCCCCCCCCC>
##$VD= 0
##$VDLIST= <DDDDDDDDDDDDDDD>
##$VPLIST= <PPPPPPPPPPPPPPP>
##$VTLIST= <TTTTTTTTTTTTTTT>
##$WBST= 1024
##$WBSW= 4
##$XGAIN= (0..3)
0 0 0 0 
##$XL= 0
##$YL= 0
##$YMAX_a= 30964
##$YMIN_a= -32325
##$ZGOPTNS= <>
##$ZL1= 120
##$ZL2= 120
##$ZL3= 120
##$ZL4= 120
##$ABSF1= 0
##$ABSF2= 0
##$ABSG= 0
##$ABSL= 0
##$ALPHA= 0
##$AQORDER= 0
##$ASSFAC= 0
##$ASSFACI= 0
##$ASSFACX= 0
##$ASSWID= 0
##$AUNMP= <proc_1d>
##$AZFE= 0.1
##$AZFW= 0.5
##$BCFW= 0
##$BC_mod= 2
##$BYTORDP= 0
##$COROFFS= 0
##$CY= -3
##$DATMOD= 1
##$DC= 0
##$DFILT= <>
##$DTYPP= 0
##$F1P= 0
##$F2P= 0
##$FCOR= 1
##$FTSIZE= 65536
##$FT_mod= 6
##$GAMMA= 0
##$GB= 0
##$INTBC= 1
##$INTSCL= 5.30512e-09
##$ISEN= 30
##$LB= 1
##$LEV0= 0
##$LPBIN= 0
##$MAXI= 10000
##$MC2= 0
##$MEAN= 0
##$ME_mod= 0
##$MI= 50
##$NCOEF= 0
##$NC_proc= -4
##$NLEV= 6
##$NOISF1= 182.463
##$NOISF2= 159.3651
##$NSP= 0
##$NTH_PI= 0
##$NZP= 0
##$OFFSET= 182.463
##$PC= 4
##$PHC0= -1402.41
##$PHC1= -31.40108
##$PH_mod= 1
##$PKNL= yes
##$PPARMOD= 0
##$PSCAL= 0
##$PSIGN= 0
##$REVERSE= no
##$SF= 81.0140089999434
##$SI= 65536
##$SIGF1= 159.3651
##$SIGF2= -187.1042
##$SINO= 113.3802
##$SIOLD= 16384
##$SREGLST= <1H.CDCl3>
##$SSB= 0
##$STSI= 65536
##$STSR= 0
##$SW_p= 29940.119760479
##$SYMM= 0
##$S_DEV= 0
##$TDeff= 32768
##$TDoff= 0
##$TI= <>
##$TILT= no
##$TM1= 0
##$TM2= 0
##$TOPLEV= 0
##$USERP1= <user>
##$USERP2= <user>
##$USERP3= <user>
##$USERP4= <user>
##$USERP5= <user>
##$WDW= 1
##$XDIM= 65536
##$YMAX_p= 360609423
##$YMIN_p= -4124203
$$ End of Bruker specific parameters
$$ ---------------------------------
##NTUPLES= NMR SPECTRUM
##VAR_NAME=  FREQUENCY,     SPECTRUM/REAL,   SPECTRUM/IMAG
##SYMBOL=    X,             R,               I
##VAR_TYPE=  INDEPENDENT,   DEPENDENT,       DEPENDENT
##VAR_FORM=  AFFN,          ASDF,            ASDF
##VAR_DIM=   65536,         65536,           65536
##UNITS=     HZ,            ARBITRARY UNITS, ARBITRARY UNITS
##FACTOR=    0.456856943014862, 1,           1
##FIRST=     14782.0589164792, 0,            0
##LAST=      -15158.0608439998, 0,           0
##MIN=       -15158.0608439998, -4124203,    0
##MAX=       14782.0589164792, 360609423,    0
$$ Real data points
##PAGE= N=1
##DATA TABLE= (X++(R..R)), XYDATA
$$ [...]
40964a299423K16898L36700Q0438q1323J77048O03277P12852L80361r4778l99516
40954F32534m65018l52229j23495J04543J71794N6286p5042r0913n7073q4678
40944b83291j49054j81803k19357l00360l10856j20375J74267L30135K79192J94177
40934e87325K06276K20521R1008j33520k46708j34694Q4308J82448N8446j68323
40924d27563k96946k41007o1697J33568K51278K28565J00685J482k6194j24290
40914d62119l29595l32160J15651O24176N19615j34295m64563l4252M48040J84922
40904A35420m75370o00127j14362J98313J1371j61228m721Q4700j45624k56300
40894a327928P8067L93577J82647k15566j57468K52910L83266J19706m3296J03778
$$ plain form
40964 -1299423 -1082525 -745825 -665387 -746710 -569662 33615 746467 1126828 1032050 632534
40954 632534 167516 -184713 -308208 -203665 -31871 24415 -50627 -141540 -198613 -283291
40944 -283291 -432345 -614148 -833505 -1133865 -1444721 -1565096 -1390829 -1060694 -781502 -587325
40934 -587325 -381049 -160528 -69520 -203040 -449748 -584442 -500134 -317686 -259240 -427563
40924 -427563 -724509 -965516 -1027213 -893645 -642367 -413802 -313117 -311635 -337829 -462119
40914 -462119 -791714 -1123874 -1008223 -384047 135568 1273 -463290 -497542 -49502 135420
40904 135420 -339950 -940077 -1054439 -856126 -844755 -1005983 -1010704 -926004 -1071628 -1327928
40894 -1327928 -1249861 -856284 -673637 -889203 -1046671 -793761 -410495 -290789 -334085 -230307
40884b30307K01748J9945j72531j29894l3087j16578k64725k49406j01127R454
40874a066508O7091J58748K51824K23933N4530j39093k13405q9310J85408M13376
40864a53406L91946J55810r206J18855M15250N15307K01458l49533p23782o82926
40854a20227l87131j52635m9062J01042L37364M32426K52924r15j00356r8837
40844B14593j08516j9675K25615L03962r7174o70620p62073k49770L17708N06853
40834c39097M30177K86260J3277l42873m18059p7045K18067K9917l56696l37311
40824h93383J13227M48927L71817J46804O7351M8775j05344l48476m68833l37864
40814i56999M123L58341M49198J84406j56768j99326N4317K48929J84616L4095
$$ plain form
40884 -230307 -28559 -8614 -181145 -311039 -344126 -460704 -725429 -974835 -1075962 -1066508
40874 -1066508 -999417 -840669 -588845 -364912 -310382 -449475 -662880 -752190 -566782 -153406
40864 -153406 238540 394350 385144 503999 919249 1434556 1636014 1286481 562699 -120227
40854 -120227 -507358 -659993 -709055 -608013 -270649 161777 414701 413786 313430 214593
40844 214593 106077 86402 312017 615979 518805 -151815 -913888 -1163658 -845950 -339097
40834 -339097 91080 377340 390617 47744 -370315 -447360 -229293 -199376 -556072 -893383
40824 -893383 -780156 -331229 40588 187392 254743 303518 198174 -150302 -619135 -956999
40814 -956999 -952876 -594535 -145337 39069 -117699 -317025 -262708 -13779 170837 204932
40804B04932j0746k6831j46550k84166k66864r3557J04684K50124L15599K37754
40794B84379p874k98081m56458m29556k89457j10600P4253K35748L41818L78611
40784b77217L49131K72232J75939N4633j18723k69843k21159K3631J11963k46912
40774a46325p42905p18641n7266N71399N61162J06885k04700k07739j47573j07645
40764a093348M2297K21699J78371k0998j3302K49940L64988J21004j45405j04165
40754a98919L7487p9564l28177k82430P8068K93142R4113k07140j57901K31870
40744e19451N23646M00138Q627k62517k34299o7677K0923K3246L5642L1955p0021
40733a09788j83565j32076M5286J15256K2188k9840M1855L2319j61164k73277
$$ plain form
40804 204932 194186 167355 20805 -263361 -530225 -623782 -519098 -268974 46625 284379
40794 284379 276505 -21576 -478034 -907590 -1197047 -1307647 -1233394 -997646 -655828 -277217
40784 -277217 71914 344146 520085 574718 455995 186152 -35007 -11376 100587 -146325
40774 -146325 -889230 -1607871 -1665137 -1093738 -532576 -425691 -630391 -838130 -985703 -1093348
40764 -1093348 -1051051 -829352 -650981 -671979 -685281 -435341 -70353 50651 -94754 -198919
40754 -198919 -161432 -240996 -569173 -851603 -773535 -480393 -386280 -593420 -751321 -519451
40744 -519451 4195 404333 412960 150443 -83856 -151533 -130610 -107364 -71722 -39767 -109788
40733 -109788 -293353 -425429 -380143 -264887 -242699 -272539 -230684 -198365 -359529 -632806
40723f32806o5241K42707K61503J0157j39806k0854J65630K23114J80824J07799
40713C33027j0223j36594j56258n7747L5401N2105K2823n3702j84763k32935m5846
40702d34712K32382K51795o1511l71098l81257j73564K9012J71993K63373J98681
40692b74906n5886k58442j34084K31527M48903K69963j54122m46886l55349L5948
40682f93334L72174L55310M7626k07315j74746N2542K18980J58826j10613l90050
40672c70600m03826r5769K04744J59026p0955l1776K90384L96146O3430k78766
40662a37962k38703n0541q3730j93099o0846J60912J29135k5175O3881K70301
40652a65827J59931j87548k51317K1724J15390j24492k06185J05893L37944J47149
$$ plain form
40723 -632806 -698047 -455340 -193837 -183680 -323486 -344340 -178710 44404 225228 333027
40713 333027 322804 186210 29952 -27795 7606 59711 82534 28832 -155931 -388866 -434712
40702 -434712 -202330 49465 -12046 -383144 -764401 -937965 -908953 -736960 -473587 -274906
40692 -274906 -330792 -589234 -723318 -491791 -42888 227075 72953 -373933 -729282 -693334
40682 -693334 -321160 34150 81776 -125539 -300285 -247743 -28763 130063 19450 -370600
40672 -370600 -774426 -870195 -665451 -506425 -577380 -609156 -318772 77374 140804 -137962
40662 -137962 -376665 -427206 -510936 -704035 -764881 -603969 -474834 -500009 -436128 -165827
40652 -165827 -5896 -193444 -444761 -423037 -307647 -432139 -638324 -532431 -194487 -47338
40642d7338o8696P5612K06184j32641n44750l32143L07437M94553K1034l47432
40632c68180p8125L62023K95922j74704m37687k82291n9567o5460j71448j00221
40622a079738J83813M42416M19400R2780k91684m45088k97985o323K61020M25504
40612b95885M12469J56888k11016l47330m6752M29660N56503J32718m41520n87064
40602b41329k07315K15280K28477n2495j90039p6987k8732k06132l17095r3920
40592i70287K41148L04891J34242O1258J32956Q2841j29783j89448M6947K67905
40582a7330J67075q8837j02729K01113M91210M29342J7457m19168n41038l34240
40572a97145j13634r4552q5251J61847M30838K85644j86929l81617n6064L06889
$$ plain form
40642 -47338 -116034 -40422 165762 33121 -511629 -843772 -536335 -41782 -20748 -368180
40632 -368180 -446305 -84282 211640 36936 -400751 -683042 -742609 -808069 -979517 -1079738
40622 -1079738 -895925 -453509 -34109 58671 -233013 -678101 -976086 -982409 -721389 -295885
40612 -295885 116584 273472 62456 -284874 -331626 98034 654537 787255 345735 -241329
40602 -241329 -448644 -233364 -4887 -57382 -247421 -324408 -353140 -559272 -876367 -970287
40592 -970287 -729139 -424248 -290006 -228748 -95792 -12951 -142734 -332182 -285235 -17330
40582 -17330 149745 60908 -41821 159292 650502 1079844 1097301 678133 137095 -197145
40572 -197145 -310779 -405331 -490582 -328735 102103 387747 200818 -180799 -236863 70026
40562G0026K72124P2324P1558R9802j41146m03514k73064M5838L0525k30146j67301
40551e52974K30175L14806j25842m50039j64066L29390M17084J47178p3105j77663
40541a05056k98398k99314k9089K29960J31697j12794m4129K58934K83407p6828
40531f1610l49834k07047J36578L37961L16541J30127j53438l52195k79252m6836
40521e29005M8839j7364n600J17279J36144P0102K11472N40172N93613J58414
40511A324066l57566n22638m25703l13109j14524K64306N45359M38620J26663
40502I65474m8455j26530l06574m39007k61557M6886J00399l2537K6607K34142
40492A58848J53023k53939m76345k49556O3010J00591K0937J10788L02719L82044
$$ plain form
40562 70026 342150 414474 486032 585834 444688 41174 -231890 -186052 -155527 -385673 -552974
40551 -552974 -322799 -7993 -133835 -583874 -747940 -418550 -1466 145712 72607 -105056
40541 -105056 -403454 -702768 -731857 -501897 -370200 -482994 -527123 -268189 15218 -61610
40531 -61610 -411444 -618491 -481913 -143952 172589 302716 149278 -202917 -482169 -529005
40521 -529005 -480166 -497530 -503130 -385851 -249707 -179605 31867 572039 1165652 1324066
40511 1324066 966500 443862 18159 -294950 -409474 -145168 400191 838811 965474
40502 965474 917019 790489 483915 44908 -216649 -169763 -69364 -101901 -75294 158848
40492 158848 311871 57932 -418413 -667969 -604959 -504368 -483431 -372643 -69924 312120
40482C12120L34308K08199n5977l94862n23847l44269j54820j75632j69672J26069
40472h38383M80550M83341J70444p5793j01036m7691L0265J89949K90004R3017
40462F74667k88706m37465k08715O0693L3571k08993l46262j99027J61654N01843
40452b56740N59809K75692p4392j58883j5501K5316j56155l25773l09021k32628
40442f68276k23335j65794M3972K60173L29369L47894M22884L79497K5309m23206
40432C28487n35065k61593n168l7225j52161m3241K14714K78654K7297k71904
40422d57205k92987j4967K91339L64473J75769j18186l57010m62551m06536k02351
40412a480212N7186K43625L08897K89289J90708m436j80371j16880J95025M26431
$$ plain form
40482 312120 646428 854627 798650 403788 -120059 -464328 -619148 -794780 -964452 -838383
40472 -838383 -357833 125508 295952 220159 119123 71432 101697 291646 581650 674667
40462 674667 385961 -51504 -260219 -199526 -165955 -374948 -721210 -920237 -758583 -256740
40452 -256740 303069 578761 504369 345486 329985 355301 199146 -126627 -435648 -668276
40442 -668276 -891611 -1057405 -1013433 -753260 -423891 -75997 346887 726384 751693 328487
40432 328487 -206578 -468171 -473339 -510564 -662725 -705966 -491252 -212598 -185301 -457205
40422 -457205 -750192 -765159 -473820 -109347 66422 -51764 -408774 -871325 -1277861 -1480212
40412 -1480212 -1423026 -1179401 -870504 -581215 -390507 -394943 -575314 -692194 -497169 -70738
40402g0738L04692K0281k6264J68046J87408j45051m35443k75595J32054K51448
40392A10838j2763k20034j04018L0544j58551m37920l04374K16196N09562K06350
40382a64170k93698l77264m0049J98251Q7242n8121P3845L02620K70589n83j71403
40371a72741q4988Q9937J79390J85827J28291k6249j89179j58884N9822J65709
40361A76935k4694k60967j96275R3369K17979N5509q5856M7018K75607K60053
40351E58678k4267k66374k07272R0486L33766K77998m5988l28505k70922O0771
40341A78371K64611P4495l00537m45889k57467R320J63031K91494M80108N56291
40331A013828L18245r8330l12344j63676Q5118P9494k03268m50024l87824q4796
$$ plain form
40402 -70738 233954 254235 227971 396017 583425 438374 2931 -272664 -140610 110838
40392 110838 98075 -121959 -225977 -195433 -353984 -791904 -1096278 -880082 -370520 -164170
40382 -164170 -457868 -835132 -875181 -676930 -589688 -647809 -573964 -271344 -755 -1338 -172741
40371 -172741 -257729 -167792 11598 197425 325716 299467 110288 -48596 11226 176935
40361 176935 152241 -108726 -305001 -211632 6347 61856 -24000 23018 298625 558678
40351 558678 534411 268037 60765 151251 485017 763015 717027 388522 117600 178371
40341 178371 442982 517477 216940 -228949 -486416 -477096 -314065 -22571 457537 1013828
40331 1013828 1332073 1233743 921399 757723 842841 922335 719067 269043 -118781 -203577
40321b03577J38587P0867j46298j72595J12970M11527L25845j26900m75218l52034
40311d16826M4880K28310P3376p2210L8439J81115O8787j31880n9196J86267J08169
40300B49231l74462o44384k17159M83539O23489P3407m54696l96254Q542K12457
40290d36290J11402j6054n1449j19929k12115j04541K48311N04590K99749k77390
40280e3716p22949o38659j44444K65774K64406K2925n1413J55112L53885K86377
40270b62702O0873o3048m4887j7544k359P1656J24404p717k37987k57200j223
40259f37734J81060J5253k62749k20830J44067L91779K45407n8640j30446N5601
40249b77232J82100O1515j05326k8950K19825K57619n6242l14670n1653N53304
$$ plain form
40321 -203577 -64990 5877 -140421 -313016 -200046 211481 537326 410426 -64792 -416826
40311 -416826 -371946 -143636 -70260 -142470 -104031 77084 145871 13991 -45205 141062 249231
40300 249231 -125231 -769615 -986774 -503235 120254 193661 -261035 -657289 -648747 -436290
40290 -436290 -324888 -340942 -392391 -512320 -724435 -828976 -580665 -76075 223674 -53716
40280 -53716 -776665 -1415324 -1559768 -1293994 -1029588 -1006663 -1058076 -902964 -549079 -262702
40270 -262702 -201829 -264877 -309764 -327308 -329667 -258011 -133607 -141324 -379311 -636511 -637734
40259 -637734 -456674 -441421 -704170 -925000 -780933 -389154 -143747 -202387 -332833 -277232
40249 -277232 -95132 -33617 -138943 -167893 51932 309551 253309 -61361 -113014 440290
40239D40290Q01572L79351k17985l82329j88377j29066k94856l17918p6840P4551
40229H8393r3479l18836l06312j74987j63210j95617o8566J61063K88005K76081
40219e07465J85209l770j94059p4284L85532O16524J70017m59553m14689K02999
40209i3539L99242j88835o95556l67757K76493K99401k22846m42220r2718K63417
40199h64918K62101J83874K48265J92404j44148l80968j44080L16028M44474J08675
40189B21707l08690m10429j43734K35568L80134J34750k61049l71336q2529K24235
40179c81373J68794j07397j34701K25577N44893L42658k69908o26346k68246M33499
40169g2550O46410Q9304o17968p78709m61124j86357q4073J15765M09881M67973
$$ plain form
40239 440290 1241862 1621213 1403228 1020899 832522 703456 408600 90682 13842 88393
40229 88393 -5086 -323922 -630234 -805221 -968431 -1164048 -1232614 -1071551 -783546 -507465
40219 -507465 -322256 -326026 -520085 -594369 -208837 407687 577704 118151 -296538 -93539
40209 -93539 305703 116868 -578688 -946445 -669952 -370551 -593397 -1035617 -1128335 -864918
40199 -864918 -602817 -418943 -170678 21726 -122422 -503390 -647470 -331442 113032 221707
40189 221707 -86983 -497412 -641146 -405578 -25444 109306 -151743 -523079 -605608 -381373
40179 -381373 -212579 -319976 -454677 -229100 315793 658451 388543 -237803 -506049 -72550
40169 -72550 573860 663164 45196 -733513 -1194637 -1380994 -1465067 -1349302 -939421 -471448
40159d71448K73958K04299L28728K37289j99044m90941l03710j8391p5067k45714
40149g60041r7719K22498K73269Q7110L0384J02371J0509j84890j46539O9505
40139c93543O5573j45590r2626L07259M75482K8867n91654p00892k29605L21725
40129i55004N35912L94066J14359p6977j03409r3606j84367k56745p3642K99411
40119d00002M87677L07057K080j32605j15928j24255j91357k17787j26283Q3866
40109d27537K97306K90318j6520l34063l10180m2830O2468m2046L4311M23069
40099f5704O89061M61760k8588l34108l62882k70923j04951J11331J98285N4901
40089C48182j40444k21448k67709l08752j44529K20355L50710J6506l12267j27647
$$ plain form
40159 -471448 -197490 6809 335537 572826 373782 -117159 -420869 -439260 -514327 -760041
40149 -760041 -857760 -635262 -361993 -274883 -244499 -142128 -131619 -316509 -463048 -393543
40139 -393543 -327970 -473560 -566186 -258927 216555 245422 -346232 -1047124 -1276729 -955004
40129 -955004 -419092 -25026 89333 12356 -91053 -184659 -369026 -625771 -699413 -400002
40119 -400002 87675 394732 396812 264207 148279 24024 -167333 -385120 -511403 -427537
40109 -427537 -130231 160087 143567 -190496 -500676 -543506 -481038 -523084 -488773 -65704
40099 -65704 623357 1085117 1056529 722421 359539 88616 -16335 94996 293281 348182
40089 348182 207738 -13710 -281419 -590171 -734700 -514345 -163635 -147129 -459396 -587043
40079e87043K87399L09107j4537j25627K6397m8076l76482l54398J84546N41116
40069a57598K26370k28786j28497K65412J92797l38704n40772o6939M71417M21398
40059A16098k3788k10417L4791K69498J43628j34050j46057J37916L17134P7171
40049E81924m08330o65348m42686L2566L14736K04219o5299j05001J70013M28058
40039D4852L44373M9533m7155J35359K16189n4707l82211l67707j10036J344p6682
40028b46848n0751J26904J67368n059q4504O9373J54952m4566k50124j43011Q9781
40017b16485P0643j49383k33413j54469j54111j82542O7244M95860N32730r163
40007F6911m96598l00062K92158M86053J17157j93895k8482K50044J35040k38125
$$ plain form
40079 -587043 -299644 9463 -5074 -130701 -104304 -152380 -528862 -883260 -698714 -157598
40069 -157598 68772 -160014 -288511 -23099 169698 -169006 -709778 -776717 -305300 116098
40059 116098 92310 -118107 -83316 186182 329810 195760 49703 187619 504753 581924
40049 581924 173594 -491754 -934440 -901874 -587138 -382919 -448218 -553219 -383206 44852
40039 44852 389225 438758 391603 526962 743151 688444 306233 -61474 -171510 -170166 -246848
40028 -246848 -297599 -170695 -3327 -8386 -92890 -23517 131435 86869 -163255 -306266 -216485
40017 -216485 -145842 -295225 -528638 -683107 -837218 -1019760 -952516 -456656 76074 66911
40007 66911 -429687 -729749 -437591 48462 165619 -28276 -56758 193286 328326 90201
39997I0201l26996K2805M05481M17645Q8060k54155l06057Q372M41020N31877
39987A118253O6744n52637o63835j49519L76356L26252j62543m88151l45120K8620
39977d45580K53821K00826J020j27611m4193J91915L45809K40915l8529k32477
39967C45916j56145J57735M74396M89266J02273l72057m64824j43393Q4687j45280
39957C72574n06472m31660M9777L29014N8679m03058m97577j33511L01822M19033
39947d41379J75784j54768k73012j36389N3970J60543K60015L82061L15099o3149
39937B78775m30556l69106j33J42951r8416k84365p6443K53669K70926J1018j50677
39926d52357o0009J01829J56602J05158J1331o7163m9509Q3741J77526L3457l05861
$$ plain form
39997 90201 -236795 -213990 191491 609136 697196 443041 136984 145356 586376 1118253
39987 1118253 1184997 632360 -31475 -180994 195362 521614 359071 -129080 -474200 -445580
39977 -445580 -191759 9067 10087 -117524 -161717 30198 376007 616922 578393 345916
39967 345916 189771 347506 821902 1311168 1413441 1041384 576560 433167 517854 372574
39957 372574 -133898 -565558 -515781 -186767 -128088 -531146 -1028723 -1162234 -860412 -441379
39947 -441379 -265595 -420363 -693375 -829764 -775794 -615251 -355236 26825 341924 278775
39937 278775 -151781 -520887 -521020 -378069 -476485 -760850 -837293 -583624 -312698 -301680 -452357
39926 -452357 -512366 -410537 -253935 -148777 -137446 -204609 -254118 -170377 7149 40606 -265255
39915b65255n12201k88901K76960P27539O66856J99818j61219j04373J05369L0816
39905F75409k86516l76434k8036L90760M10215J4255m18281n53321l60366o3938
39895e96253P4128J7997M362J93627L59783J97460j26656j35536J91567K87946
39885D68425j46546o08520m80322Q1426M04274K45693m125m911J10239Q1373o3693
39874H3313j17636j9881Q3467K7541k02257m46581m92929k58607J30213M38096
39864g75261M83643K53521o4555k15226j57754j33880k87715l58049n7322L57898
39854i54700L55176l3277j88469J28913L82978J48893j85762r6773J93377J38419
39844a11225j79826k30133L7021J58562o787j12165k6994l8129k21411k45808
$$ plain form
39915 -265255 -777456 -1066357 -789397 -61858 604998 804816 643597 539224 644593 675409
39905 675409 388893 12459 -15577 375183 785398 799653 381372 -171949 -532315 -596253
39895 -596253 -522125 -504128 -499766 -306139 53644 251104 124448 -11088 180479 468425
39885 468425 321879 -286641 -766963 -685537 -281263 -35570 -39695 -44606 65633 147006 83313
39874 83313 -34323 -54204 29263 56804 -145453 -592034 -1084963 -1343570 -1213357 -775261
39864 -775261 -291618 -38097 -102652 -317878 -475632 -609512 -897227 -1255276 -1312598 -954700
39854 -954700 -599524 -632801 -821270 -692357 -309379 -160486 -346248 -443021 -249644 -111225
39844 -111225 -291051 -521184 -484163 -325601 -332388 -444553 -471547 -509676 -731087 -976895
39834i76895j2770R8325r4603j97884R7392M45112L71531P332j84882j51466k05254
39823h04062l80355l51229k3965K42086J64648l6682J5646K83837L74481J36334
39813c79261r0532L2987L09801K55099j72495m51257k33168J48982J85864q5111
39803d79091k49587k06878k07168k75382j32607K25133L74296J06137j89058o7645
39793a101850L40114N54670L96355J23978L7579J61694K65908R3399l39449o49818
39783a17420m87350l8039J70560K9377J2048L89467P18543M85273r2142l85065
39773F85252k58195j23949j91576k15049m8235N4933j10576l37972l36147j35575
39763a017089P2038K56102M34257M29370Q0074l73874m57712p1318L44328L74748
$$ plain form
39834 -976895 -989665 -891340 -985943 -1183827 -1086435 -641323 -269792 -262460 -447342 -598808 -804062
39823 -804062 -1184417 -1535646 -1559611 -1317525 -1152877 -1189559 -1173913 -890076 -515595 -379261
39813 -379261 -469793 -436806 -127005 128094 -44401 -495658 -728826 -579844 -393980 -479091
39803 -479091 -728678 -935556 -1142724 -1418106 -1550713 -1325580 -951284 -845147 -1034205 -1101850
39793 -1101850 -761736 -207066 189289 313267 350846 512540 778448 871847 532398 -117420
39783 -117420 -604770 -642809 -472249 -442872 -430824 -41357 677186 1162459 1070317 685252
39773 685252 427057 303108 111532 -103517 -151752 -96819 -207395 -545367 -881514 -1017089
39763 -1017089 -945051 -688949 -254692 174678 254752 -119122 -576834 -648152 -303824 70924
39753G0924J32727l200L6518l170k06155l16549j58681O9774J18419O9115J42436
39742d7842K81807K40819J0672j58143j55507j25465j43083q7541O9895J51094
39732C6706Q9795Q5137K39746K99839K4161l71672m48007j32688K12672L00633
39722C36322K17609J62989J37820M5420n6134k1257Q5148j7449m01983o70279
39712a81794l86725K45458M89293J6000n87914n70894j1899L74348K67581L6863
39702c09683J5719O2231M561j586J59445K70071J69548O3863J17721R9175j87692
39691D63373m48171l20809Q063Q8031r9690k19162j95083k28874k86417j16366
39681a355105K04072K64038l1771k61844r4153K79834M78634L78845Q4867k48384
$$ plain form
39753 70924 203651 200451 236969 233799 27644 -288905 -447586 -377812 -259393 -190278 -47842
39742 -47842 233965 474784 485456 327313 171806 46341 -96742 -184283 -114388 36706
39732 36706 126501 211638 451384 751223 775384 403712 -44295 -176983 35689 336322
39722 336322 553931 716920 854740 900160 844026 822769 907917 890468 488485 -181794
39712 -181794 -568519 -323061 166232 182232 -405682 -976576 -988475 -614127 -346546 -309683
39702 -309683 -293964 -231733 -227172 -228758 -69313 200758 370306 434169 551890 651065 463373
39691 463373 15202 -305607 -297544 -209513 -309203 -528365 -723448 -952322 -1238739 -1355105
39681 -1355105 -1151033 -886995 -918766 -1180610 -1274763 -994929 -516295 -137450 -52583 -300967
39671c00967m09241k15499K33012N94156O67532N24505K38052j87087n42249m73832
39661A28382j5603K93011Q8638l12281l85419j05730J64261K73789L52818L86321
39651H68187J63442k91490n95537m69120r4699J43539J30152O7113J25045K12091
39641B58723J32721j16782l20483l16777j86221q6701j4668J09632K04456J11840
39631b24260r7955j82566j26728j70452l28850k48110K14772O10485M72938K1511
39621e9215j73320o0516r3570l70369l98380R2151O38886O90942L50986P3911
39611F91506m7132k16359l76177k52867R2597K62667J22937l7419l0133j7343
39601A92277r8315q9784N8453N7264k00578l12466K7131M29891L34436j17756
$$ plain form
39671 -300967 -710208 -925707 -692695 -98539 568993 1093498 1331550 1144463 602214 128382
39661 128382 112779 405790 494428 182147 -203272 -309002 -144741 129048 481866 868187
39651 868187 1031629 740139 144602 -324518 -419217 -275678 -145526 -78413 46632 258723
39641 258723 391444 274662 -45821 -362598 -548819 -635520 -650188 -540556 -336100 -224260
39631 -224260 -322215 -504781 -631509 -801961 -1130811 -1378921 -1164149 -553664 -80726 -59215
39621 -59215 -232535 -293051 -386621 -756990 -1155370 -1063219 -424333 266609 617595 691506
39611 691506 644374 428015 51838 -201029 -108432 154235 277172 239753 209620 192277
39601 192277 93962 4178 62631 119895 -80683 -393149 -366018 63873 398309 280553
39591B80553l09842j22144l2274k25648k77166O9307M03370K91958l8839r4918
39581e5643J34716K57214J02439j36339k68551k66204j43527K6682O1110j00451
39571c88554k09823l3051K50231K78318N8771m7340J22794L18363K61704k102
39561F09311k08835j58346J18735L38904J71142l64559p95099o94831j83750K93453
39551h73875N27270N81655M48683R5665k28842k21798o2588k17113o31947o79280
39541a262170j15601M46760L86207n5626k03627P4610L37848L31496K47224K46893
39531D34014K00668P998j72040j69868n0495L4998O9797J04222R9453n276j32279
39520D21192j26464J2365Q7086k9558j76018r5976J70623K85602P3872k17528
$$ plain form
39591 280553 -29289 -151433 -183707 -409355 -686521 -617214 -213844 78114 39275 -55643
39581 -55643 79073 336287 438726 302387 33836 -232368 -375895 -349213 -288103 -388554
39571 -388554 -598377 -631428 -381197 -102879 -44108 -91448 31346 349709 611413 609311
39561 609311 400476 242130 360865 699769 870911 506352 -288747 -983578 -1167328 -873875
39551 -873875 -346605 235050 683733 779398 550556 328758 266170 49057 -582890 -1262170
39541 -1262170 -1377771 -931011 -544804 -600430 -804057 -729447 -391599 -60103 187121 434014
39531 434014 634682 642680 470640 300772 250277 285275 355072 459294 558747 553471 421192
39520 421192 294728 307093 394179 364621 188603 92627 263250 548852 622724 405196
39510D05196k83295j89728j84257k24224n0227L04387M53988J95861k05078l84842
39500a62219k76200l4977J70006J89584j5849k08819p8011K80352M10481J68350
39490D42698l9781Q3010K40550P0944k22512k36494o8109r3798k31342m8961M06503
39479C02708N19470J5446n58541n53084n0594L37713K72693k7509j90473j10713
39469d2884M0085P8350K6807N5157J95025K26448j3375l15102l30497p5580Q7348
39458f8218r823j34481q1034J7932r802n7385K5037J11653L3002m3545J60904
39447e5760M96312M71975l6460n22150m80958n2134K24588J23647r0518j44026
39437f5484r7478j26376k00029j52756M7231K58217L29081J90041j26519m13306
$$ plain form
39510 405196 121901 -67827 -252084 -476308 -526535 -222148 231840 427701 222623 -162219
39500 -162219 -438419 -473396 -303390 -113806 -129655 -338474 -416485 -136133 274348 442698
39490 442698 402917 485927 726477 797421 574909 338415 270306 176508 -54834 -103795 302708
39479 302708 822178 837624 279083 -274001 -324595 13118 285811 258302 67829 -42884
39469 -42884 -2799 75551 102358 157515 352540 578988 565613 250511 -79986 -155566 -68218
39458 -68218 -78041 -212522 -293556 -275624 -285426 -342811 -317774 -206121 -173119 -216664 -55760
39447 -55760 440552 912527 876067 353917 -127041 -179175 45413 169060 78542 -65484
39437 -65484 -162962 -289338 -489367 -642123 -594892 -336675 -7594 182447 55928 -357378
39427c57378l47765J44242O29813N53974o3091n79077m97612l3763K65553K26317
39417e8787R6533N5814K8519l5390k1568J17204K30338J87912N7522m3952j22946
39406D91199k15051k48240j41256M1014J55017J44260L6949j44881l42363l94765
39396f18117k01536N7769O8820j81675l05369N19N00738O66396L18411j89974
39386A15982m34223l36965p8335J61776K37011M2139k91949l78603j3488M69513
39376e07142N52578J87782j79958k21173o2657J0452q2290k26980k69174j07192
39366i05754J67218K36093p0122m00723k59809K35228M39487J34099j49437j2258
39356e85978J82415R019k22318j5036L49109J89408l88227n27474P3176O72769
$$ plain form
39427 -357378 -705143 -560901 68912 622886 559795 -19282 -516894 -550657 -285104 -58787
39417 -58787 37746 93560 122079 86689 65121 182325 412663 600575 658097 614145 491199
39406 491199 276148 27908 -113348 -72334 82683 226943 263892 119011 -223352 -618117
39396 -618117 -819653 -761884 -693064 -874739 -1180108 -1179589 -678851 -12455 305956 115982
39386 115982 -318241 -655206 -733541 -571765 -334754 -292615 -584564 -963167 -976655 -507142
39376 -507142 45436 233218 53260 -167913 -230570 -220118 -302408 -529388 -798562 -905754
39366 -905754 -738536 -502443 -572565 -973288 -1233097 -997869 -558382 -424283 -573720 -585978
39356 -585978 -403563 -394544 -616862 -631898 -282789 -93381 -481608 -1009082 -935906 -263137
39346b63137N80680P4458j82275j13502j12973k95005l94831k66247l5647J77183
39336h31296L35361L31740R5882j60882j32236J20177K02949k7447k30151j01684
39326c97587J41580R3232j96593k82538l3601J21196j35869m21949j39166N81393
39316f69902R14036M32977k70685l83067L2994J94480k47417p15134n20825K04941
39306a027602P13113N88707J58643o7930o3331j76439n03283o70190l45147K58063
39296a135396O13215N17437K40287O8474j2562j21175k34728k81464k79917k58075
39286h83904j98329j44185j60807j31130J29267M65438M52844M9789k24078m3743
39276f88838K03968O5652k08279q8540L23867M56936J98634J0198J17252K19894
$$ plain form
39346 -263137 317543 392001 209726 96224 -16749 -311754 -706585 -972832 -1008479 -831296
39336 -831296 -495935 -164195 -68313 -229195 -361431 -241254 -38305 -65752 -295903 -397587
39326 -397587 -256007 -162775 -359368 -641906 -675507 -554311 -690180 -1112129 -1251295 -669902
39316 -669902 244134 677111 406426 23359 56353 250833 3416 -711718 -1232543 -1027602
39306 -1027602 -314489 274218 432861 364931 301600 125161 -378122 -1048312 -1393459 -1135396
39296 -1135396 -522181 -4744 235543 304017 291455 170280 -64448 -345912 -625829 -883904
39286 -883904 -1082233 -1226418 -1387225 -1518355 -1389088 -923650 -470806 -421017 -645095 -688838
39276 -688838 -484870 -419218 -627497 -716037 -392170 64766 263400 273598 390850 610744
39266F10744J08052j1835J9368K6583j04628j71602k4820J48699J15880j06530
39256F09911l71292n33426m08573N1928M90468M43744j6367l61198l73189l30734
39246g98728l48708j58853K34254L35081k7817k69945P4320N58615M75968r8696
39236b4509n10633m64991j83937J28653L95168M13919O9319l11386l12316l7658
39226h38371R5794L1476L7469J32712R7045k5792J1663J44929R9570k8651R9127
39215a43029L51452K10985l17060n78281k88229Q894j26236k86022N0449N73114
39205e43963O18700K59125J53334M19834M21973j71410p66627o55161n290M20777
39195A51292L16672J03299J64211K83513P0329l74739n77385l62492m7840O6224
$$ plain form
39266 610744 718796 706961 726329 752912 648284 476682 451862 600561 716441 609911
39256 609911 238619 -294807 -703380 -651452 -160984 282760 266393 -94805 -467994 -798728
39246 -798728 -1147436 -1306289 -1072035 -736954 -764771 -1034716 -960396 -401781 74187 -24509
39236 -24509 -535142 -1000133 -1184070 -1055417 -660249 -246330 -177011 -488397 -800713 -838371
39226 -838371 -742577 -711101 -673632 -540920 -443875 -469667 -458004 -313075 -213505 -242156 -143029
39215 -143029 208423 419408 102348 -475933 -764162 -755268 -881504 -1167526 -1117077 -543963
39205 -543963 74737 333862 487196 907030 1329003 1157593 390966 -264195 -269485 151292
39195 151292 467964 571263 735474 1018987 1089316 714577 137192 -225300 -273140 -206916
39185b06916O8050J50367K33451J18452j45773l05647k41802o1540Q9303J26116
39175a75939J816k27625l61586k57246l0305J06095J27102J36580J17597j3320
39165e76831j61824j39032K0159R0479K4315J3255J33722K08748J17578j8528
39155b87959r0450j93704l86222m66088k30949J65442L60268K42018N3937L6048
39145g97659J53557K37464K38960K28890K31075J92992J02420M917j07066k79924
39135B05626m24261l31791K201K49273J53822q3339j10311K1881n516j65300r2844
39124e80559K46643M29435K71230J08052J25241j0982m53783o91932l37772J10929
39114g83498J1869l26185j35948M79162O63483K11506j21397J19648M24311K53376
$$ plain form
39185 -206916 -138866 11501 244952 363404 217631 -88016 -329818 -391358 -302055 -175939
39175 -175939 -174123 -401748 -763334 -1020580 -1050885 -944790 -817688 -681108 -563511 -576831
39165 -576831 -738655 -877687 -857528 -767049 -742734 -729479 -595757 -387009 -269431 -287959
39155 -287959 -378409 -572113 -958335 -1424423 -1655372 -1489930 -1129662 -887644 -833707 -797659
39145 -797659 -644102 -406638 -167678 61212 292287 485279 587699 592616 485550 205626
39135 205626 -218635 -550426 -548225 -298952 -145130 -228469 -338780 -316899 -322415 -487715 -580559
39124 -580559 -333916 95519 366749 474801 600042 589060 135277 -556655 -894427 -783498
39114 -783498 -771629 -1097814 -1233762 -754600 -91117 120389 -1008 118640 542951 796327
39104G96327j50990l34794l40571l47785j84091K46867N18146K52779j97302k21898
39094C6688J44139L40678J44233j14624j38588k5004j9111k10115m82512n90893
39084i15109l65166K9766K22186J46352J34750L20581L45020k2340l80154k69289
39074g53403R4124J98379O8017J00125K67862J79372j33462j97340O2699J53492
39064C9865j30952l29759r4019K18496J29505k17004l39824j34865J24397K74335
39054d59825L41102K92319R4873p5475k6344J19696J06200j1780M4490K57804
39044F83060K66379o6817l83949l31233n7208N7639j7145P927J89962K17503n3547
39033E12571k70677p7626K88972K94777p6755k70590k0869K18046p96l81201l59382
$$ plain form
39104 796327 645337 310543 -30028 -377813 -561904 -315037 203109 455888 258586 36688
39094 36688 180827 521505 665738 551114 412526 387522 368411 158296 -324216 -915109
39084 -915109 -1280275 -1250509 -1028323 -881971 -747221 -426640 -81620 -103960 -484114 -753403
39074 -753403 -659279 -460900 -392883 -292758 -24896 154476 21014 -176326 -113627 39865
39064 39865 -91087 -420846 -514865 -296369 -166864 -383868 -723692 -858557 -734160 -459825
39054 -459825 -118723 173596 268469 192994 166650 286346 392546 380766 425256 683060
39044 683060 949439 882622 498673 167440 110232 167871 150726 158653 348615 566118 512571
39033 512571 241894 164268 453240 748017 671262 400672 379803 597849 597053 215852 -143530
39022a43530k8024L5893k34973k75750J18782L75819O5048l64844k94134Q5408
39012f60305J45077j23360j60753J58359L41361J75689P4737K74236L59303M388
39002E88732l83701k87109R9588K48201J51179J51430J74855j27271n67389n34557
38992d86042j322L30642J09239j60586l7672J17031j39492m45738j77529M68891
38982d22578O91623K64936j89762j62674J14228J65401o4645k77967k51225m398
38972a37061K63203L01651M6205k39348k41750j8171Q4113p7970k78760k73528
38962e71416p0415J77635L27311K67623M620k58318l14756k04352q1526O0442
38952f63152K70561L71828J68923j57971k62382j75484k03706l26540k13249J26830
$$ plain form
39022 -143530 -171554 -135661 -370634 -646384 -527602 -151783 -86735 -451579 -745713 -660305
39012 -660305 -515228 -638588 -799341 -640982 -299621 -123932 -49195 225041 584344 588732
39002 588732 205031 -82078 17510 265711 416890 568320 743175 615904 48515 -486042
38992 -486042 -487364 -156722 -47483 -208069 -245741 -128710 -268202 -713940 -891469 -422578
38982 -422578 269045 533981 344219 181545 295773 461174 396529 118562 -132663 -137061
38972 -137061 126142 427793 473998 234650 -7100 -25271 58842 -19128 -297888 -571416
38962 -571416 -641831 -464196 -136885 130738 135358 -122960 -437716 -642068 -723594 -663152
38952 -663152 -392591 -20763 148160 -9811 -272193 -447677 -651383 -977923 -1191172 -1064342
38942a064342K70194Q2104o0760N4792J31792l9551j68787K876K30286K11818
38932c49578R3521J26995K04923J48396J00924K10580K51866J927l15476l95423
38922G8655l44772l62895k79234O6324L18878J05044k31037p4363M42897N87553
38912C07050J41145l32457l88306k11700r4269J961J46809K02467J06921J1456
38902a08923k4611j17188k29937j48409J13153K66668K09283J29299P4511j26059
38892C7787l87296l21802J13158M08241K36988l7649N7661L92548M85986J88658
38882A174280k60376o24312p62978n52229p6103K64317J85127o6849n9129K04329
38872e73923L59730K75023J68052J53837O9237j66875l51272l05612j43548o0602
$$ plain form
38942 -1064342 -794148 -712044 -772804 -718012 -586220 -625771 -794558 -791682 -561396 -349578
38932 -349578 -256057 -129062 75861 224257 325181 535761 787627 789554 474078 78655
38922 78655 -266117 -629012 -908246 -841922 -523044 -418000 -649037 -723400 -280503 307050
38912 307050 448195 115738 -272568 -484268 -578537 -576576 -429767 -227300 -120379 -108923
38902 -108923 -133534 -250722 -480659 -629068 -515915 -249247 -39964 89335 163846 37787
38892 37787 -349509 -671311 -558153 -149912 87076 49427 107088 499636 985622 1174280
38882 1174280 913904 289592 -473386 -1025615 -1101718 -837401 -652274 -719123 -778252 -573923
38872 -573923 -214193 60830 228882 382719 451956 285081 -66191 -371803 -515351 -575953
38862e75953m0949L6581J20604L5759k02836l18864j11361K47941L93978K23528
38852a91572K1636P4884K92366L48976J31794j33369k04989j09946l9340q2994
38842A07446j69703k10957j98549j57113p7298N2053J73830K00878J43104J06357
38832b9952J05554j393k63068m48059l28966m8744R1325J25384L02433M96172
38822F86K71940l14146n66873j34973L93088L44845n1991j24048J83730L73228
38812C75486K72188J38810K8673k25252m47853k49874K38186M32255J76058r0859
38802F47818j31936j90597l22559j80837K65760M89305K25705q7667p6298j7279
38792F21415k18320l88372j65429K04039K72103Q9423l4656j16148k96560l74342
$$ plain form
38862 -575953 -616902 -580321 -459717 -423958 -626794 -945658 -1057019 -809078 -415100 -191572
38852 -191572 -169936 -95052 197314 546290 678084 544715 339726 229780 190440 107446
38842 107446 -62257 -273214 -471763 -628876 -706174 -654121 -480291 -279413 -136309 -29952
38832 -29952 75602 74209 -188859 -636918 -965884 -1014628 -923303 -797919 -495486 686
38822 686 272626 -41520 -608393 -743366 -350278 -5433 -57424 -181472 2258 375486
38812 375486 647674 786484 815157 589905 142052 -107822 130364 562619 738677 647818
38802 647818 515882 325285 2726 -178111 87649 576954 802659 714992 638694 621415
38792 621415 403095 14723 -150706 53333 325436 414859 380203 264055 -32505 -406847
38782d06847j03040K78656L49812J46439P976j4153j02398k16939j91405j18028
38772c69927j54500j28061J57688M10404K24594j69154j69455K29823M06009J07623
38762E45044j68858q186K91370K33925j45487m12656l31979m5531J87428K29814
38752C74884J42043J08615J98549K22035o352l23729l92651j88799k3764o9575
38742D1256j57892j02282N5639J85836K12953Q3315j64212k81293m6749L51676
38732A78247M72228K00241j37551k88934l47852m04383l05539K5038L39846L80918
38722A12259K05083n272k12233l90418l79669j36716P7868N2766j5088J65595
38712e25825M47240L96286n0258m34422l59846L8836L18721K39648m8178k08660
$$ plain form
38782 -406847 -509887 -231231 118581 265020 272996 258843 156445 -60494 -251899 -369927
38772 -369927 -524427 -652488 -494800 -84396 140198 -28956 -198411 31412 437421 545044
38762 545044 376186 368000 659370 893295 747808 335152 3173 -42358 145070 374884
38752 374884 516927 625542 824091 1046126 1039774 716045 323394 134595 110831 41256
38742 41256 -116636 -218918 -163279 22557 235510 318825 154613 -126680 -173429 178247
38732 178247 650475 850716 713165 424231 76379 -328004 -633543 -608505 -268659 112259
38722 112259 317342 312070 99837 -290581 -670250 -806966 -729098 -676332 -691420 -525825
38712 -525825 -78585 317701 267443 -166979 -526825 -487989 -169268 70380 22202 -186458
38702a86458n0462K59083L15969n5766m93401m60640N6186M76447L59089n4698
38692A65349k35413o7745J40533J91456J64430J02415p0271k60842k23931J991
38682i2028M3525k22309l95244j51367K18902K49977O350r6997J6808P3308J5072
38671c34003O3403K20459K09088k6249k08518j96314j34063o5663J41535L90363
38661F0038L62515P8826n1535P6861O4120k51787m21466j30274K14895J30328
38651A32521j56991j15166K36856M41307L28425J00223j23872l42529m10162k17122
38641a26510L899j609m3627J85062M77523L48945j78618n70521n44910l27988
38631g78354j20956J64393N17107O37998L51334j02883l63868l29689j49256j8448
$$ plain form
38702 -186458 -236920 22163 338132 282366 -211035 -671675 -615489 -139042 220047 165349
38692 165349 -70064 -137809 2724 194180 358610 461025 390754 129912 -94019 -92028
38682 -92028 -48503 -270812 -666056 -817423 -598521 -348544 -342194 -439191 -422383 -349075 -334003
38671 -334003 -270600 -50141 158947 132698 -75820 -272134 -406197 -471860 -330325 60038
38661 60038 422553 501379 449844 526705 590825 339038 -82428 -212702 2193 132521
38651 132521 -24470 -139636 97220 538527 866952 967175 843303 500774 90612 -126510
38641 -126510 -122611 -124220 -167847 17215 494738 843683 665065 94544 -450366 -778354
38631 -778354 -899310 -734917 -217810 420188 771522 668639 304771 -24918 -174174 -192622
38621a92622l7179j29165j13873L5893J21742L9455k6164P0695J54214N4005l3183
38610e6182J32788L65093L06084j0649k48237k65218j52455M2324K33444J64440
38600E11432j97534l78186k5557M18588K88282k57491m48517p5567K70219J49693
38590B55362k10920m41470m45753k08467K31997N35992L54703o9542j65929Q0802
38580h3225J45262j08614k29995k2553J58213J29624J60915K92611J33290l45061
38570B30467n44512j71778K47501K20631J6192O8373K47997K38436J11869K6169
38560F91345j59553m69309n00860o0119L54868K56245p0205p3780J78006K27125
38550C73763J4605j60492k20236k76907k36987K3724K73708K19302P088m5599
$$ plain form
38621 -192622 -229801 -358966 -472839 -436946 -315204 -275749 -301913 -231218 -77004 -22999 -56182
38610 -56182 76606 441699 747783 737134 488897 223679 71224 113548 346992 511432
38600 511432 313898 -64288 -89845 328743 617025 359534 -88983 -164550 105669 255362
38590 255362 44442 -397028 -842781 -1051248 -819251 -283259 71444 1902 -164027 -83225
38580 -83225 62037 -46577 -276572 -299125 -140912 -11288 149627 442238 575528 230467
38570 230467 -314045 -485823 -238322 -17691 -1499 66874 314871 553307 665176 691345
38560 691345 531792 62483 -438377 -498496 -143628 112617 42412 -31368 146638 373763
38550 373763 388368 227876 7640 -269267 -506254 -482530 -208822 10480 17568 -28031
38540b8031k2355j97181m24367k92500J83860N33676M83718K22243J8132m6441
38530D30754L0834K04166K91605J33469j56386l07719k24023k9715J14924R1645
38520E79554j31449l66087l01932P0252L39047J93793j42768k51325r6727P508
38510a00134j04283k50780j79850R9000K74733P0292l11263k77108L55012R02899
38500D78518O48012r6243m10802j37180L0294j54922j06428L82845N69862k0147
38490A183809o93368o38911j51039N832j45316m3166L28415M65590K17956p8609
38480D51193j74179o2442K04867M04579J75001l93774o22437j65680M12128M85093
38470G14349K24716M3745j68162n42304o20688j01647L90526K02339k30412j43086
$$ plain form
38540 -28031 -50386 -247567 -671934 -964434 -780574 -246898 236820 459063 477195 430754
38530 430754 461588 665754 957359 1090828 934442 626723 402700 372985 487909 579554
38520 579554 448105 82018 -219914 -149662 189385 383178 240410 -10915 -107642 -100134
38510 -100134 -204417 -455197 -635047 -536047 -261314 -191022 -502285 -779393 -424381 478518
38500 478518 1126530 1030287 619485 482305 512599 357677 251249 634094 1203956 1183809
38490 1183809 490441 -148470 -299509 -293677 -438993 -482159 -153744 311846 529802 451193
38480 451193 277014 214572 419439 824018 999019 605245 -17192 -182872 229256 714349
38470 714349 939065 982810 814648 272344 -348344 -449991 -59465 142874 -87538 -230624
38460b30624K23037J54361j50259K4729M74611L61464k37116m11046k2431J09968
38450B96694k53511l66166R7991M52570K23167j16780r5927K3575n9577j12098
38440H9938L4153N7648k22861m47836l36406j06190L4947K08533M06187L35439
38430E3552k621j79259j9650J67352K16928L26106M73410L14090j23587l19156
38420I07165p9574J70711J32457N501o9859k46243m42299l08335O4751J52935
38410B87210o3565J2260M89164O51312J43655l63765k44546J15949N9908k69495
38400H18087k86623N5178K93258J93941m8414j70159o1595J96482L45756K20714
38390A556625L9534J00115K50791J45106n1386J59117P09728R35937N38727o3883
$$ plain form
38460 -230624 -7587 146774 -3485 21244 495855 857319 620203 209157 186726 296694
38450 296694 43183 -322983 -224992 227578 450745 333965 238038 261613 202036 89938
38440 89938 124091 181739 -41122 -488958 -825364 -931554 -896607 -688074 -281887 53552
38430 53552 50931 -128328 -147978 19374 236302 562408 1035818 1349908 1226321 907165
38420 907165 827591 998302 1130759 1136260 1066401 820158 377859 69524 134275 287210
38410 287210 223645 235905 725069 1376381 1520036 1156271 911725 1027674 1087582 818087
38400 818087 531464 586642 879900 1073841 1025427 855268 793673 990155 1335911 1556625
38390 1556625 1596159 1696274 1947065 2092171 2040785 2199902 2909630 3845567 4384294 4320411
38380D320411m39527n58652m55361j48833M4687j87933n25745m00674L2826J31031
38370A812230j08818r9198J81792J37155k74435l97451o5672J41675J13p6535
38360A250856l57j30870k98802P0801P00146O43098o0024l29258P1646J36048
38350B053284m74651p29135o0663O48510O49222M04326L24526o5978q41559j035839
38340H72043k44786N13350M63784K15488L36895K67811l43794o86598k38441K39500
38330A395252J87299K47552P56207Q32531J05416l12178K02221N48325l5977m76324
38320C450324R9712O47474J72020l79960L3622N58684J67094l34779M5549N07826
38310D967566J02993l28701J36578O01657J81993j05108O08276J090676L39258
$$ plain form
38380 4320411 3880884 3322232 2866871 2718038 2762725 2574792 2049047 1648373 1681199 1812230
38370 1812230 1703412 1604214 1786006 1923161 1648726 1251275 1185603 1327278 1327391 1250856
38360 1250856 1250499 1119629 820827 891628 1591774 2234872 2174848 1845590 1917236 2053284
38350 2053284 1578633 849498 788835 1437345 2086567 2490893 2815419 2749441 1907882 872043
38340 872043 627257 1140607 1604391 1819879 2156774 2424585 2080791 1394193 1155752 1395252
38330 1395252 1582551 1830103 2586310 3418841 3524257 3212079 3414300 3962625 3926648 3450324
38320 3450324 3550036 4197510 4369530 3989570 4023192 4581876 4748970 4414191 4459740 4967566
38310 4967566 5070559 4741858 4878436 5480093 5662086 5556978 6165254 7255930 7595188
38301G595188k92356L23983P40936j99425p26250O18422J789888P31543o58399
38292I923530J18937J563273J149223J69460R75213K114672J283130L49856J925929
38283A9573223L823732L032353K057915M317569O572566M168300N08180J727507
38275D5781345N168718M520950L351381R556075J8775263K1194388K4550404M6561707
38267A79460231P6962348P3455137J5230468n8658044q9686321o7808352l3600208
38260I5355259j9564150j8635959j2902441m130087k474734n357492m275247q73815
38252B7141334j839839n432963n291739k187353j456542k840948k156709J09029
38244F044270J91374j413022j203471M83363N13709q42503q02464L16478o947
$$ plain form
38301 7595188 7302832 7626815 8367751 8168326 7442076 8060498 9850386 10581929 9923530
38292 9923530 10042467 11605740 12754963 12924423 13899636 16014308 17297438 17647294 19573223
38283 19573223 23396955 26429308 28487223 32804792 39377358 43545658 44053838 45781345
38275 45781345 50950063 55471013 58822394 68378469 87153732 108348120 132898524 179460231
38267 179460231 256422579 329877716 345108184 286450140 196763819 128955467 95355259
38260 95355259 75791109 57155150 44252709 40122622 37647888 32290396 28015149 27141334
38252 27141334 25301495 19868532 14576793 12389440 10932898 8091950 5935241 6044270
38244 6044270 6235644 4822622 3619151 4102514 4616223 3773720 2971256 3287734 3280787
38235C280787j286840r84578M51631M59197p16339o66771M87301N37067m35157
38226A126298m01359N34070M85965l70932k38505N90509K85802p77689o06609
38217F27550N41586O04189l73570m80043K50490J7785r69936p03654O59203Q29027
38207A002627m12959p91175K70179P11713k41528p76933j0524N31353O153k72161
38197A6745L99251P53151J36264k33124K62618M68074j39703l70528K51406M41646
38187A985800l25445o77710P4761N91186M56n45187j40300K69048q1927k93266
38177H57416K36460M57900k49091o71782L7089P17213L21491k32023M5340L32244
38167A852257k62616q44968m14811K41070J33147n5134M79422Q15056J949q61618
$$ plain form
38235 3280787 1993947 1009369 1461000 1920197 1203858 537087 1024388 1561455 1126298
38226 1126298 724939 1259009 1744974 1374042 1135537 1726046 2011848 1234159 627550
38217 627550 1169136 1773325 1399755 919712 1170202 1187987 218051 -485603 173600 1002627
38207 1002627 589668 -201507 68672 780385 538857 -238076 -248600 282753 288906 16745
38197 16745 415996 1169147 1305411 1072287 1334905 1802979 1663276 1292748 1544154 1985800
38187 1985800 1660355 982645 1057406 1648592 1649048 1103861 963561 1232609 1150682 857416
38177 857416 1093876 1551776 1302685 630903 667992 1385205 1706696 1474673 1520013 1852257
38167 1852257 1589641 744673 329862 570932 704079 648945 1128367 1943423 1945372 1083754
38157A083754l51954P71004R11686L34294L29643P21763M67458q9268J50802P70748
38147E099930M38135o42186j022881m90308j96639m66868m34236J44747N23707
38138B953401M84137N75933P75848M48202k84349n79934l45158k98863n58914
38129C170303n16017j35524n8685l52830m08991j17627M4027P2928L92643P89044
38119B879271O06568m486k19381Q3667K14563p5930l35906l70294m04329l74844
38109A998899q0697J26790j63379m92690j80791M15716M48959K7817j10243J3796
38099B004177j19264k85220M6037M27517R8017m54413j92462N68285O56576J20819
38089B870069J1503L62503K77709j71313q9385L53854J85671l64183k18047L41526
$$ plain form
38157 1083754 731800 1502804 2414490 2748784 3078427 3800190 4267648 4178380 4329182 5099930
38147 5099930 5538065 4895879 3872998 3382690 3186051 2719183 2284947 2429694 2953401
38138 2953401 3437538 4013471 4789319 5237521 4953172 4373238 4028080 3729217 3170303
38129 3170303 2654286 2518762 2460077 2107247 1698256 1580629 1624656 1697584 2090227 2879271
38119 2879271 3485839 3481353 3261972 3345639 3560202 3484272 3148366 2778072 2373743 1998899
38109 1998899 1918202 2044992 1881613 1388923 1208132 1623848 2072807 2100624 1990381 2004177
38099 2004177 1884913 1599693 1645730 2073247 2171264 1716851 1524389 2092674 2749250 2870069
38089 2870069 2881572 3244075 3521784 3350471 3261086 3614940 3800611 3436428 3218381 3559907
38079C559907Q3272o61952l75552P43232R07892j2109j93418P58143J050198M8904
38069E908517n44288J70617Q15977M95983K58973O47010N64802k06418k06715
38060G904458P66698R02500j71879l99662Q20975J267977J18569k16980J406143
38051A2398799K436594J223965R4491R50280J825963J065481P67733K449475L616930
38042B6829711K689466K674307N323170O717795M165578K035124M176431O480462
38034F1092044N068481N430512J3043384K1680670K4938003L2853532N6736499
38027B20843125P8622366O1143932k117019o7224066q7121417o3586060l4678514
38020A05882347k3147452j9857288j2446757m986415m282536o059140m263780
$$ plain form
38079 3559907 3643179 2981227 2605675 3348907 4256799 4244690 4051272 4809415 5859613 5908517
38069 5908517 5364229 5534846 6350823 6846806 7105779 7752789 8317591 8111173 7904458
38060 7904458 8671156 9573656 9401777 9002115 9823090 11091067 11209636 10992656 12398799
38051 12398799 14835393 16059358 16153849 17104129 18930092 19995573 20763306 23212781 26829711
38042 26829711 29519177 32193484 37516654 44234449 48400027 50435151 54611582 61092044
38034 61092044 66160525 71591037 84634421 106315091 131253094 164106626 220843125
38027 220843125 299465491 360609423 358492404 291268338 204146921 140560861 105882347
38020 105882347 82734895 62877607 50430850 45444435 41161899 35102759 30838979
38013C0838979j797955l226713n626423m467414j840390j835004l082073k207463
38005F755544l46268m20671j462247r12756L40235L785j051713o44888M67469
37996B728490K35491p16925n40329J76597k20052r93209m02126Q15778O76856
37987A760571m81631q00286k48781j95311n37142j45271N94518M26756k66481
37978A06942j89795L20859K2577o40873k61814P71820Q38563n658k43231K65465
37968I84855K12035n11351o08632R5909L26803k22703m04870J12552K42746l92134
37958a64790p28109k14833K99768K15415O7395K26718K51092L7751J46192N06466
37948F43065K87172m73227o24438J33650N68752o3402p51646m11047L99572N03449
$$ plain form
38013 30838979 29041024 25814311 20187888 15720474 13880084 12045080 8963007 6755544
38005 6755544 6409276 5988605 4526358 3613602 3953837 3957622 2905909 2261021 2728490
37996 2728490 2963981 2247056 1706727 1883324 1663272 670063 267937 1083715 1760571
37987 1760571 1278940 478654 229873 34562 -502580 -647851 -53333 373423 106942
37978 106942 -82853 238006 260583 -380290 -642104 129716 968279 962621 719390 984855
37968 984855 1196890 685539 76907 172816 499619 276916 -127954 -15402 227344 -164790
37958 -164790 -892899 -1107732 -807964 -592549 -525154 -298436 -47344 -9593 136599 643065
37948 643065 930237 457010 -167428 -33778 534974 471572 -280074 -691121 -291549 211900
37938B11900p4124l64568O2378P46911J085635Q26027J42438m14178m06582j20495
37928A695342j91288n70700n66934k9861L29974P9285k77102j59029K55859M93372
37918A058918N17338N75727P04163P02470L62057l58873j118843j295813p29083
37909D18061j22466j47529m47120k58058K92662M38040R3237j15727m2931j43417
37899c5248m02944k80899J72950K76723l9740r0450K50406K78582j81156l71423
37889d23199m19J76494k43181n04242k3458N38745L78200j79882l66312j64491
37879h11745K873J09555K67498K47090k4000q9382K35262L54873r6614m50062
37869b54652m8434N51269L96206l37747o60484k96965Q4282L4987j62942j51039
$$ plain form
37938 211900 137776 -226792 -164414 582497 1668132 2494159 2636597 2222419 1815837 1695342
37928 1695342 1504054 933354 366420 336559 666533 745818 468716 309687 565546 1058918
37918 1058918 1576256 2151983 2856146 3558616 3920673 3561800 2442957 1147144 418061
37909 418061 295595 148066 -299054 -557112 -264450 173590 266827 151100 108169 -35248
37899 -35248 -438192 -719091 -546141 -269418 -309158 -399608 -149202 129380 -51776 -423199
37889 -423199 -423618 -247124 -490305 -994547 -1018005 -479260 -101060 -280942 -647254 -811745
37879 -811745 -808872 -699317 -431819 -184729 -208729 -298111 -62849 292024 195410 -254652
37869 -254652 -303086 248183 644389 306642 -353842 -650807 -566525 -531538 -694480 -845519
37859h45519N1993K94156M56253L81631O1193j91196j08941J28521J88392N2595
37849D69078j25103l36111n30138m31010M5051M70310M21125O3974j47090r4077
37839a93991M0869J53884K03121Q1444j66331k63152j05427N4924M8371J9047
37829a27241J9481j32713l54865k33835K28498M29075J03655k06316p5433J18682
37819b31012k1905j65392M7193K37997M606k39214N943L32385J12184l20813k14122
37808d52150K51354K47218k77860n45527k56186P0183J01495R6074J77120O7887
37798e20392k53547l74892j34716J30293J80179J54797J52783O4398q0583r0130
37788g71810J0107L0498L2305K07411M03258L01117K0985j1054K19127K85850
$$ plain form
37859 -845519 -793526 -499370 -43117 338514 399707 208511 99570 228091 416483 469078
37849 469078 343975 7864 -522274 -953284 -908233 -437923 -16798 47176 -99914 -193991
37839 -193991 -153122 762 203883 285327 118996 -144156 -249583 -194659 -146288 -127241
37829 -127241 -107760 -240473 -595338 -829173 -600675 -171600 -67945 -274261 -349694 -231012
37819 -231012 -252917 -418309 -371116 -133119 -128513 -367727 -361784 -29399 82785 -238028 -452150
37808 -452150 -200796 46422 -231438 -776965 -1033151 -962968 -861473 -765399 -588279 -520392
37798 -520392 -773939 -1148831 -1283547 -1153254 -973075 -818278 -665495 -601097 -681680 -771810
37788 -771810 -761703 -731205 -698900 -491489 -88231 212886 233871 222817 441944 727794
37778G27794K2917k76419l71808l03250j30277Q3263R2955k27221n10685l38098
37768a230829Q0798K22205Q6892R2290K66686K53967M5391k1460L1173j41452
37758c14339m39484l45406J78229N34036L85633O1082q0643o9694J4649J98518
37748A22581L05302P6036l03785l70175j25468j6053j49146j96080r7742j38179
37738h92709k60650q8311K71956K61899j34854k69379Q6313L79358K76849J62259
37728b07269K81961K63067o8104k13509J15808L96381J50012k66985l26890j67488
37718d3016j55824j79209r150J12546j06205l90799k98359Q1894L36302L37651
37708c14169K15804L1854j38104j27715o738q9367l45359l09295J17206L73453
$$ plain form
37778 727794 750711 474292 102484 -200766 -331043 -247780 -154825 -382046 -892731 -1230829
37768 -1230829 -1150031 -927826 -840934 -748644 -481958 -227991 -182600 -204060 -172887 -314339
37758 -314339 -753823 -1099229 -921000 -386964 -1331 59751 -20892 -90586 -75937 122581
37748 122581 427883 503919 200134 -170041 -295509 -311562 -460708 -656788 -754530 -892709
37738 -892709 -1153359 -1241670 -969714 -707815 -842669 -1112048 -1025735 -646377 -369528 -207269
37728 -207269 74692 337759 269655 56146 171954 568335 718347 451362 124472 -43016
37718 -43016 -198840 -378049 -387199 -274653 -380858 -771657 -1070016 -988122 -651820 -314169
37708 -314169 -98365 -66511 -204615 -332330 -339068 -428435 -773794 -1083089 -965883 -592430
37698e92430J42178j02610N5564K39186M642l10874j91892J31121J37936l1734
37688e18913J02841M17148L71726m3454l03196j80686M7318J32694N4783j75345
37678i5084m26853l65087P8141M12993K48842q4354r8032N6304k2581j79702k3567
37667d98980K64359K31136J0608N1478J93672q2401n88884n66084O1791M82989
37657d40316K33977j93231k43778n1396L6892M6267J10341J30914M6174K5376
37647b98780J15556P7456j77330l51347k11024M8306J19283m264j31725j68380
37637i82249j36254o8665J5750J44283L63618N45673L86195j37597n07261k55951
37627f32458L26611N41411K39783o3016m511K08454K50477Q2011j72184l51940
$$ plain form
37698 -592430 -450252 -552862 -497298 -258112 -253470 -564344 -756236 -625115 -487179 -518913
37688 -518913 -416072 1076 372802 329348 26152 -154534 -107216 25478 80261 -95084
37678 -95084 -521937 -887024 -808883 -395890 -147048 -231402 -329434 -273130 -295711 -475413 -498980
37667 -498980 -234621 -3485 7123 58601 252273 169872 -419012 -985096 -923305 -440316
37657 -440316 -206339 -399570 -643348 -694744 -657852 -611585 -501244 -370330 -324156 -298780
37647 -298780 -183224 -105768 -283098 -634445 -845469 -797163 -677880 -682144 -813869 -982249
37637 -982249 -1118503 -1187168 -1171418 -1027135 -663517 -117844 268351 130754 -376507 -632458
37627 -632458 -305847 235564 475347 412331 407820 616274 866751 948762 776578 424638
37617D24638k45466J58471M34745J94208k61591l04503K9836Q0107l24355n30417
37607c44327j37866K95473J25023l48872l54795J55964M58133J49145k84104j93452
37597d79678L03968M76539j6531o20668o00846m3445K77335K3111k54043j8697
37587i52955M15839M33090Q5820q0459O5676J41876m4549k74721l68767l55935
37577i35085k30195J0501J55545M7570p4875N8361K56857K40043K01037L80487
37567A10246M19387p3358o14176m50717J45659K58551j27966j58488L00944M12336
37557B22418n8537k66472J52098L57689j80332o68627l33448K88570L48415M9123
37547h9103J6653J17446n4595k05533P8819L67208O0107m71329m80119j27300
$$ plain form
37617 424638 179172 337643 772388 966596 705005 400502 430338 510445 186090 -344327
37607 -344327 -482193 -186720 -61697 -410569 -765364 -609400 -151267 -2122 -286226 -479678
37597 -479678 -175710 300829 284298 -336370 -937216 -980661 -703326 -680215 -934258 -952955
37587 -952955 -537116 -104026 -18206 -98665 -32989 108887 64338 -210383 -579150 -935085
37577 -935085 -1165280 -1154779 -999234 -951664 -1026539 -968178 -711321 -471278 -270241 110246
37567 110246 529633 456275 -157901 -608618 -462959 -204408 -332374 -490862 -189918 222418
37557 222418 163881 -102591 49507 407196 226864 -441763 -775211 -486641 -138226 -89103
37547 -89103 -72450 44996 -9599 -215132 -136313 230895 291002 -180327 -660446 -787746
37537g87746r1407k82148p4978M33662N37751J60927p0943O4649J91481J97676
37527B78924L30793M43866J01802n08274o80915k94478L7342o312j02451l8254
37517d37957P457K0462J76668K52132j37070o41347m59439L43143P70914L93834
37507B88797p2810k2241J79677M6672k04949k33913k00039k68824j98056O9378
37497f16308J08704j83524k38597J74645L84153o3469n02624j98076M11416M70631
37487b53049J18905Q5431L11948J27331m18274n39102m4673L45767J71152j80264
37477b74828k56967j37030l06J85714L08548R6538k90735l02154J05142K70295
37467b95783j13114m10797k6036O06970O46273P0888l84692l12370o231J71542
$$ plain form
37537 -787746 -879153 -1161301 -1236279 -802617 -264866 -103939 -174882 -110233 81248 278924
37527 278924 609717 1053583 1155385 647111 -33804 -328282 -290940 -297252 -399703 -437957
37517 -437957 -430500 -410038 -233370 18762 -118308 -759655 -1219094 -875951 -105037 288797
37507 288797 215987 193746 373423 420095 215146 -18767 -218806 -487630 -685686 -616308
37497 -616308 -507604 -691128 -929725 -755080 -370927 -434396 -937020 -1135096 -723680 -253049
37487 -253049 -134144 -48713 263235 390566 -27708 -566810 -611483 -265716 -94564 -274828
37477 -274828 -531795 -668825 -669131 -483417 -174869 -78331 -369066 -671220 -566078 -295783
37467 -295783 -408897 -819694 -845730 -238760 407513 478401 93709 -218661 -224892 -53350
37457e3350K12455J90351N5200j57643k62346k00996j19495q4144m24J03191K4192
37446b93009k29351l07673r519L44617L26334R010j74793q1765J3326o9626j61465
37435f33914r9635J7544J02012K68749N15100N19742J07504l25162k74633J18999
37425C16306K52418m9617l24032k35113m9666j10609k58226j33225K15309M00705
37415B4250K41281p5049k80663k38783L3562L19455K95424p6400l69199j96179
37405c22301K14316L02933j9675k77867j83471k6150j12290k31360l9255L10434
37395c84686L60078N4353j83903r3055J12035J61991J03600O8933J326j32035
37385F8637j34465Q7183K18169k7927l39845j80004L35124N07075R9864k98898
$$ plain form
37457 -53350 159105 349456 404656 247013 -15333 -216329 -335824 -419968 -420392 -317201 -293009
37446 -293009 -522360 -830033 -839552 -494935 -168601 -159591 -334384 -416149 -402823 -472449 -633914
37435 -633914 -733549 -716005 -613993 -345244 169856 689598 797102 471940 197307 316306
37425 316306 568724 519107 195075 -40038 -89704 -200313 -458539 -591764 -376455 24250
37415 24250 265531 190482 -90181 -328964 -295402 24053 319477 243077 -126122 -322301
37405 -322301 -107985 194948 175273 -102594 -286065 -312215 -424505 -655865 -695120 -384686
37395 -384686 -24608 29745 -154158 -247213 -135178 26813 130413 199346 200672 68637
37385 68637 -65828 21355 239524 211597 -128248 -308252 26872 533947 633811 334913
37375C34913k18424k503j27159l56868k00362J80137K41776J7978K7425L03506
37365B00419L19073m2597k44987n2104N1105k36728m36190j20922K78989J66735
37355a17207k10836j89057J93893K89892p5231l68435k32675O5313J99336K13214
37345b31793J93272K2445k77707l69794o0114L59627M94614L37997J44855K4290
37335F37692q7830j84049j59284K993J70078J86121J6240j94715k28887o7181
37325I1178k558k86525o89851o98405k14170K48217K45130M957M8453L90169N13349
37314c50056J50198k91581k86157P3624K25929l2618k48367p773L88255L30138
37304d8408j67503m44676j83898J11004o8062l95760k15176L88285O42584J97100
$$ plain form
37375 334913 116489 113986 -13173 -370041 -570403 -390266 -148490 -130512 -103087 200419
37365 200419 519492 476895 231908 179804 230909 -5819 -442009 -562931 -283942 -117207
37355 -117207 -328043 -517100 -323207 -33315 -108546 -476981 -709656 -644343 -445007 -231793
37345 -231793 -38521 -16076 -293783 -663577 -723691 -364064 130550 468547 613402 637692
37335 637692 549862 365813 206529 209522 379600 565721 581961 387246 158359 91178
37325 91178 88620 -197905 -887756 -1586161 -1800331 -1552114 -1306984 -1302027 -1253574 -863405 -350056
37314 -350056 -199858 -491439 -777596 -703972 -478043 -510661 -759028 -766801 -378546 -48408
37304 -48408 -215911 -660587 -844485 -733481 -801543 -1197303 -1412479 -1024194 -381610 -184510
37294a84510m04878n10102j43401K22431L25288K54253J52099N0037p3677k09308
37284e21768k56844p9355K51473L66591L4368l94299l63859P7494L23415J40307
37274d22477n858K12004L94863J05617l28875k81813K02237N01283L29604j2496
37264F94089k36998l63547l92200j97805J33349K91078K01379J27611J87516J48558
37254E93030j17898l35564k29914L2017Q5978j13300k72457j71284R5014K52175
37244a82203J30381j46644k47321j6702K55783J62759k25817l86285n5844L86925
37234c24968M51651J70983o5940r7506p2656p6904l9230K127j20880l79692m73769
37223a026784k22097J56643L09731J77643M670j2196O7205P5504k0159r7912o6683
$$ plain form
37294 -184510 -589388 -1099490 -1242891 -1020460 -695172 -440919 -288820 -238783 -312460 -521768
37284 -521768 -778612 -857967 -606494 -239903 -205535 -599834 -963693 -886199 -562784 -422477
37274 -422477 -428335 -216331 178532 284149 -44726 -326539 -124302 376981 706585 694089
37264 694089 457091 93544 -298656 -496461 -363112 -72034 129345 256956 444472 593030
37254 593030 475132 139568 -90346 -58329 27649 -85651 -358108 -529392 -434378 -182203
37244 -182203 -51822 -198466 -445787 -462489 -206706 -43947 -269764 -656049 -711893 -324968
37234 -324968 126683 297666 231726 134220 61564 -15340 -54570 -52443 -173323 -553015 -1026784
37223 -1026784 -1248881 -1092238 -782507 -604864 -600194 -612390 -545185 -469681 -489840 -587752 -654435
37212f54435R626J3154m8027m3781Q5129K26266K46085J74654J47584J92429J84518
37201E33202M5877j04702q5337R6932K24362J29489r6032k24134j76465q6210
37191B56982q1528j27448j22765m2601P9001K01046K34374P4298k11303l57346
37181i7290k29233n9856j45303l82928l71909L0796N03510O56674M34518P2744
37171D11723j65248j72819q0657j45256l84771m15502N2328O33207O20422l0027
37161C23400n59684m23888N2388L14903L55099L95076K66254k53112p56999n93033
37151h79596J23467N43446K32450k87409l31703Q6840M40113L68371n9843n12207
37141b76071o29130l04620J52722L42712K86806L30404N16605M67098K1711m19925
$$ plain form
37212 -654435 -644809 -631655 -679682 -723463 -638334 -412068 -165983 8671 156255 348684 533202
37201 533202 579079 474377 389040 485972 710334 839823 743791 519657 343192 256982
37191 256982 175454 48006 -74759 -117360 -38359 162687 397061 471359 260056 -97290
37181 -97290 -326523 -386379 -531682 -914610 -1286519 -1255723 -752213 -95539 338979 411723
37171 411723 246475 73656 -7001 -152257 -537028 -952530 -900202 -266995 353427 323400
37161 323400 -236284 -660172 -607784 -292881 62218 457294 723548 470436 -286563 -879596
37151 -879596 -756129 -212683 19767 -267642 -599345 -512505 -72392 295979 236136 -276071
37141 -276071 -905201 -1209821 -1057099 -714387 -427581 -97177 419428 886526 908237 488312
37131D88312m39734j46773P9731R9150l139j64349l01868k63013q3140n0804k47383
37120a033010k96695R2017N86827O46471K96751O2931K04443M18013L10845j38779
37110A149814o14214p48524m32185L896O7142k49302l59790Q6035N95413N07890
37100F175r908k51490p2565J2060j85368k15042J47154M39638K65269q3582j58309
37089a05968k9584K540l8437P97R18j67202k57365j788L70001M28813J79953m7598
37077C35080j66344l07070l85041k14484L0878J1984j51874j1083M32912O58051
37067B33009M50060K04349J81461O7879l41965n75452j54858N22642O13555j5556
37057A185124o53574p42359m52673j79690R25J33712P9806k18622m39633k44352
$$ plain form
37131 488312 48578 -98195 -18464 80686 77547 -86802 -388670 -651683 -734823 -785627 -1033010
37120 -1033010 -1329705 -1237688 -650861 -4390 292361 355292 559735 977748 1288593 1149814
37110 1149814 535600 -212924 -645109 -641213 -574071 -823373 -1183163 -1097128 -501715 6175
37100 6175 -3733 -255223 -327788 -315728 -501096 -716138 -568984 -129346 135923 52341 -105968
37089 -105968 -135552 -133012 -171449 -170652 -169734 -336936 -594301 -596089 -226088 202725 382678 335080
37077 335080 168736 -138334 -523375 -737859 -706981 -694997 -846871 -857954 -425042 233009
37067 233009 683069 887418 1068879 1136758 794793 219341 64483 587125 1200680 1185124
37057 1185124 531550 -210809 -663482 -843172 -842247 -708535 -628729 -847351 -1286984 -1531336
37047a531336J88364L66715J88631O1023K46880M66785L66552P9913j8318N6233
37037D71442n5932l86930m73046m9637M60497M85884Q7585j97300j59493j06876
37027G6194k36838k92610m4184K64489K61594M486j46003p8673k2749j21372k31971
37016e67637k10111j34064j28510j47206p3491P0048J49392J17685Q2679J63343
37006f77872L25047L91350K43046q036j18262j3931J09632O8224n6119q8101o9822
36995A05156j62998k97360k19363N5223J48075j50015n00153m14524J09987O01760
36985g24212O76404L68322l5070k57169j55484J76532L93003J90500l03304n99508
36975b69986l95112P7475L40105K09614n4429r9738J05448K39140K1150l82824
$$ plain form
37047 -1531336 -1342972 -976257 -787626 -726603 -479723 -12938 353614 433527 415209 471442
37037 471442 415510 28580 -444466 -494103 -33606 452278 539863 342563 183070 76194
37027 76194 -160644 -453254 -497438 -232949 28645 33131 -112872 -191545 -214294 -335666 -567637
37016 -567637 -777748 -911812 -1040322 -1187528 -1261019 -1190971 -1041579 -923894 -841215 -677872
37006 -677872 -352825 38525 281571 273535 155273 141342 250974 319198 263079 174978 105156
36995 105156 -57842 -355202 -574565 -519342 -371267 -521282 -1021435 -1435959 -1325972 -724212
36985 -724212 -47808 320514 285444 28275 -127209 49323 442326 632826 329522 -269986
36975 -269986 -665098 -587623 -247518 -37904 -92333 -192071 -86623 152517 173667 -209157
36965b09157m81136o5350M47394M80628K2141l73854k98301O9941K96281K11655
36955A00242k4311j85780j68689m9727l5739k08526l05769j0846M86533N80382
36945A77770R0248l64571j83392L31472L98093r8396m52849j86481K86741K98617
36935B97252j39123m08533j45815L20559M43399J42682j61067j54650n1193k26685
36925h3174n76712n89630j18457L24032K92853O7578J66402M75973M22504q6390
36915B94979m90136m24722j87987j49059j82730j2451K56598L24566J86464Q9155
36905b95323J33224J94355J46986m2787l43964o05776n99979k89246O6992K22239
36895a413279K13947J82799J11396n3712j83057j03352J43792L70669M64588L80776
$$ plain form
36965 -209157 -690293 -755643 -308249 172379 194520 -179334 -477635 -407694 -111413 100242
36955 100242 75931 -109849 -278538 -328265 -364004 -572530 -878299 -889145 -402612 177770
36945 177770 268018 -96553 -279945 51527 449620 351224 -101625 -288106 -1365 297252
36935 297252 158129 -250404 -396219 -75660 367739 510421 349354 194704 143511 -83174
36925 -83174 -659886 -1249516 -1367973 -1043941 -751088 -683510 -517108 -41135 381369 294979
36915 294979 -195157 -619879 -807866 -956925 -1139655 -1152106 -895508 -570942 -384478 -295323
36905 -295323 -162099 32256 179242 136455 -207509 -813285 -1413264 -1702510 -1635518 -1413279
36895 -1413279 -1199332 -1016533 -905137 -958849 -1141906 -1245258 -1101466 -730797 -266209 114567
36885A14567P2364l62690o09804m60747j17043N3809j6989r4216j7326J43624
36875a294451K68165L21330L25917L33070L71122L40023R1842k79994m37395k50934
36865b11305k6874n5345j77049j00530Q4867R7191k0970j5678O1028p2995l57061
36854g94721l70459K8372M54550N14416K45017o3232j90223o4939J90654K58251
36844B07686l3793l63761k77931J02180J93584j53086l93497j27485L05733L85489
36834a54881J34247q8573j61125j64217o5613J34964J74319j27613m59024l81213
36824a158729K2196K84071K50101J91169K47201K21901J8911j27724l7552J06806
36814A8351M2442j83151k99941j79688L9903J44379O9386m2267k270J75879K58950
$$ plain form
36885 114567 186931 -175759 -785563 -1246310 -1363353 -1309544 -1326533 -1420749 -1438075 -1294451
36875 -1294451 -1026286 -704956 -379039 -45969 325153 665176 757018 477024 39629 -211305
36865 -211305 -238179 -293524 -470573 -571103 -486236 -389045 -410015 -425693 -364665 -437660 -794721
36854 -794721 -1165180 -1136808 -682258 -167842 77175 13943 -176280 -241219 -50565 207686
36844 207686 173893 -189868 -467799 -365619 -172035 -325121 -718618 -846103 -540370 -154881
36834 -154881 -20634 -109207 -270332 -434549 -500162 -365198 -190879 -318492 -777516 -1158729
36824 -1158729 -1136533 -852462 -602361 -411192 -163991 57910 76821 -50903 -88455 18351
36814 18351 60793 -122358 -422299 -601987 -562084 -417705 -348319 -390586 -392856 -216977 41973
36803D1973J12162o8921k5165J40494O2656l34017o41145m59050Q9131M93771
36793e88111M19521K321l56421l78163j09818J72114K39168J16903J5096O4077
36783d03313J67448J37021o3959k55619k33702j8814J33447L2975j70462j53096
36773h28074J14116K60243K9907k77949j77144K69701M55595P6043l84024k90774
36763g52360K51185N43806K53366j97702k86698n0370J44866J81979J92531J69245
36753D49848k14j70103m8952K56389K40319k70721p74409p58381l74421r2244
36743a542889K7616K48469N28926N26965K23085K0701J06127J60793q5948l95859
36733a82014l85914q9786J23707M5793j72503k31858J6755L92081M81684R2723
$$ plain form
36803 41973 154135 85214 60049 200543 263199 -70818 -711963 -1171013 -1081882 -588111
36793 -588111 -168590 -166269 -522690 -900853 -1010671 -838557 -599389 -482486 -467390 -403313
36783 -403313 -235865 -98844 -162803 -418422 -652124 -670938 -537491 -504516 -674978 -828074
36773 -828074 -713958 -453715 -423808 -701757 -878901 -609200 -153605 -77562 -461586 -752360
36763 -752360 -501175 42631 295997 98295 -188403 -238773 -93907 88072 280603 449848
36753 449848 449634 279531 230579 486968 727287 456566 -317843 -1076224 -1450645 -1542889
36743 -1542889 -1515273 -1266804 -737878 -210913 12172 32873 139000 299793 213845 -182014
36733 -182014 -567928 -657714 -534007 -488214 -660717 -892575 -875820 -483739 -2055 90668
36723I0668m11303m94948j77133o819k34874m49734k48623J57812L32114K36692
36713a206148J06972J6927l2942J05518M17682M80158M3311l88524j74196M28597
36703b02645N48767J936m45622k66722J12764J32351k7377R3716L85813L96603
36693G29584J18291p3737j31194l64070p39509p36920j20744N86925P32752L53493
36683C54871J5992q630n702k22581m03027j80489K66927L34052j89737p42088
36673g80412o62441n2900L61720J91486j68098j73324J17034K42941R6511L9162
36663g88321K50457L97022J72522j74621k15648k7279m0271k66704k11905K99777
36653f04971P17056N08890o6567l57934k01718N5672J95758K56244J58032k01785
$$ plain form
36723 90668 -320635 -815583 -992716 -999535 -1234409 -1684143 -1932766 -1774954 -1442840 -1206148
36713 -1206148 -1099176 -1082249 -1115191 -1009673 -591991 -111833 -68522 -457046 -631242 -202645
36703 -202645 346122 348058 -97564 -364286 -251522 -119171 -146548 -52832 332981 729584
36693 729584 847875 774138 642944 278874 -460635 -1197555 -1318299 -731374 1378 354871
36683 354871 370863 362233 356531 133950 -269077 -449566 -182639 151413 -38324 -780412
36673 -780412 -1442853 -1495753 -1134033 -942547 -1110645 -1283969 -1166935 -923994 -827483 -788321
36663 -788321 -537864 -140842 31680 -142941 -358589 -385868 -426139 -692843 -904748 -604971
36653 -604971 112085 620975 554408 196474 -5244 50428 246186 502430 660462 458677
36643D58677n03690k66743L50781O08800K16576k75948l52580j99254j61629j21635
36633b46645J13932K95576J41103j22123j55048r6080k06520k67606N2584M99764
36623H937N47659K17741m5231j35778k62287l19226k6328L67096K83917k30106
36613D06394m96452k51704K0656k5170j01487O3002K39975J88327M7411n9950
36603C1002k60000m68827k88689K83134O20504L55640m9851p6060N7724q5735
36593A18842l30131k24262J30918K52122O3519p9838k4714N6330Q1316J27364
36583A71466J52579N6625o1160o0936n4194j81828k64040o7702K28852K60311
36573A79973M1932j08163j04342j19827j69412j13256k3556j03413k62455k08426
$$ plain form
36643 458677 -45013 -311756 39025 647825 864401 588453 235873 36619 -125010 -246645
36633 -246645 -132713 162863 303966 181843 26795 -69285 -275805 -543411 -490827 8937
36623 8937 556596 774337 729106 593328 331041 11815 -14513 352583 636500 406394
36613 406394 -90058 -341762 -321106 -346276 -447763 -384761 -144786 43541 90952 31002
36603 31002 -228998 -697825 -986514 -703380 -82876 272764 222913 146853 204577 118842
36593 118842 -211289 -435551 -304633 -52511 11008 -68830 -93544 -37214 44102 171466
36583 171466 324045 380670 319510 258574 204380 22552 -241488 -309190 -80338 179973
36573 179973 221905 113742 9400 -110427 -279839 -393095 -416651 -520064 -782519 -990945
36563i90945L6757J45894M5499L7284K70965M81506L84337K9278l43411n35797
36553d38633m21087j8403L89601M68903K30885k97l1202L0459M3822k294j08079
36542A43675k60823k88675j0474M12831N59356K63321j87390m36259m13335k52968
36532d70741r2494l1961j02347k03869k06257j01111P0911L33606O11603O12858
36522D20198J93835k85405l65976j70228k18019n73114o94524k70257K88608M34418
36512a240464J84329m5947l4667R1740J27752J3305j14397l7109K44609L90994
36502d19855J52226j88890j87429M9322N0556j46342n482M84332N79540m3185
36492C24793o35588m95987p6029j81632n85786m19767L06169O38821J94794k67456
$$ plain form
36563 -990945 -954188 -808294 -762795 -725511 -454546 26960 411297 440575 97164 -438633
36553 -438633 -859720 -878123 -488522 -19619 211266 210969 179767 210226 254048 251754 143675
36542 143675 -117148 -405823 -416297 -3466 555890 819211 631821 195562 -217773 -470741
36532 -470741 -563235 -595196 -697543 -901412 -1107669 -1208780 -1137869 -804263 -192660 420198
36522 420198 614033 328628 -37348 -207576 -425595 -998709 -1693233 -1963490 -1674882 -1240464
36512 -1240464 -1056135 -1102082 -1136749 -1045009 -917257 -903952 -1018349 -1055458 -810849 -419855
36502 -419855 -267629 -456519 -643948 -594626 -544070 -690412 -695894 -211562 367978 324793
36492 324793 -310795 -806782 -882811 -1064443 -1650229 -2069996 -1763827 -1125006 -930212 -1197668
36482a197668j01878K72714J97695j36868j16303K19504K70491j12187m05684
36473a110184k57177M0817J11701N4785J25076J98674r958l49426l19099J85168
36463a329623O15716M74159k9274l13008k08980k9584M2730J62627L48445K82787
36453A5995j44151m77099k83824J55592K28411p3281j52172K13423M79821K05327
36443A68042k09167j40268K39783K13299l10927n85105j67926L65501K94171j64068
36433b96665k55317J13011L06233M5892j89461l7722J54508J938k08046P09M71726
36422A06806O40464L58721k6890k64149l61524k91780m7937Q2748j70255n14450
36412d88246m09233O9252K69958m3785l60893k59688K5197J48783J94342K96265
$$ plain form
36482 -1197668 -1299546 -1026832 -829137 -966005 -1082308 -862804 -592313 -704500 -1110184
36473 -1110184 -1367361 -1326544 -1214843 -1160058 -1034982 -836308 -846266 -1195692 -1514791 -1329623
36463 -1329623 -713907 -239748 -269022 -582030 -791010 -820594 -777864 -615237 -266792 15995
36453 15995 -128156 -605255 -889079 -733487 -505076 -578357 -730529 -517106 -37285 168042
36443 168042 -41125 -181393 58390 271689 -39238 -624343 -792269 -426768 -132597 -296665
36433 -296665 -551982 -438971 -132738 -86846 -276307 -314029 -159521 -157583 -365629 -364920 106806
36422 106806 747270 1105991 1079101 814952 453428 161648 113711 196459 26204 -488246
36412 -488246 -897479 -828227 -558269 -602054 -962947 -1222635 -1197438 -1048655 -854313 -558048
36402e58048K44345p6924k82012k5454L76925L80116J3189k51290k29110j17988
36392e26251r801J68522K98788J62524j11376j53066N3205J15496j35822l65065
36382e02846k26712J75970M84631M89814K17682j56149l60001k06358J52126L20052
36372C88209J24461j74128k36626n3832J25074J45608P6154L2387R399o8021j75031
36361A93654j55090N9410K43280P9742l80916o77914n06092j26124J7163q7717
36351a340604r5131J03452K34182J17973n5114n9778K5766m866j52715k39719
36341a466554j70240k0784Q0266P0839M16J1603K06955M78552N53929L01325o3708
36330a7401j84020K4122K56096J79955j42754l16020j17894J88115J86737j35520
$$ plain form
36402 -558048 -313703 -390627 -672639 -698093 -321168 58948 72137 -179153 -408263 -526251
36392 -526251 -536052 -367530 -68742 93782 -17594 -170660 -117455 -1959 -137781 -502846
36382 -502846 -729558 -553588 -68957 420857 638539 482390 122389 -83969 68157 388209
36372 388209 512670 338542 101916 48084 173158 318766 394920 427307 436706 368685 193654
36361 193654 38564 97974 341254 420996 40080 -637834 -1143926 -1270050 -1252887 -1340604
36351 -1340604 -1435735 -1332283 -1098101 -980128 -1035242 -1095020 -1069254 -1074120 -1226835 -1466554
36341 -1466554 -1636794 -1657578 -1577312 -1506473 -1506057 -1494454 -1287499 -808947 -255018 46307 -17401
36330 -17401 -201421 -177299 78797 258752 115998 -200022 -317916 -129801 56936 -78584
36320g8584l88110l26180j52409j55573k55758j23060L19816P01921N69324q3486
36310B7901o84816n95942J60625Q24005P46268J70165j69251p8748k6771k31361
36300A42075k87814L9116K92843O5366k70703j76482J21572L5104l20554k79453
36290f38930K16401M33609j3872n57679n22872k8404L36101L25171J40477p571
36280c17569q0995j00845j10638j61467j91632n5289K20967L79906K53086j6534
36270a81010j78813j56694l3729Q7385J24411M4787p3836j18226r1580o9182l2178
36259f78665P9961J79922J04837j24266l09684l27054j86945P6383L46423L65132
36249d73956M4282k57313j41156K11430K59993p1271k77877n4097L01767M04469
$$ plain form
36320 -78584 -466694 -792874 -945283 -1100856 -1356614 -1479674 -1159858 -457937 111387 27901
36310 27901 -656915 -1252857 -1092232 -268227 478041 648206 478955 400207 373436 142075
36300 142075 -145739 -106623 186220 251586 -19117 -195599 -74027 -38923 -359477 -638930
36290 -638930 -422529 11080 -2792 -560471 -1083343 -1111747 -775646 -450475 -309998 -317569
36280 -317569 -398564 -499409 -610047 -771514 -963146 -1018435 -797468 -417562 -164476 -181010
36270 -181010 -359823 -516517 -550246 -462861 -338450 -293663 -367499 -485725 -577305 -646487 -678665
36259 -678665 -598704 -418782 -313945 -438211 -747895 -1074949 -1261894 -1185511 -839088 -473956
36249 -473956 -429674 -686987 -828143 -616713 -356720 -427991 -705868 -759965 -458198 -53729
36239e3729K46347k3367l27989m74908k08686K89554M15433l1618m71449l59095
36229i99507M0894J41508o3022j07900J50295L79534L28963J07335p5255j23619
36219b20774m5712M1484j9336j66891j12809J97979L78680J51804j67574j39054
36209a02203R3602N6490k39525k99456M0456L40456K38233n3344j53856o9276
36199a48423n4427j42569j18484R4138K58958J21254k21923l74962j19631K59167
36189d46902K85093r8303m47898m02468r9647J12400J40275J24864J42883J58255
36179e31448J62553J78144J97536K29431K89446K77680N2010k99776m91960m27520
36169c63904k78182j09622J90490M82304L58249j71623m73102j53390L33289M03657
$$ plain form
36239 -53729 192618 169251 -158738 -633646 -842332 -552778 -137345 -168963 -640412 -999507
36229 -999507 -958613 -817105 -880127 -988027 -837732 -458198 -129235 -21900 -97155 -220774
36219 -220774 -266486 -225002 -244338 -411229 -524038 -326059 52621 204425 36851 -102203
36209 -102203 -8601 47889 -191636 -491092 -450636 -110180 128053 74709 -79147 -148423
36199 -148423 -202850 -345419 -463903 -369765 -110807 10447 -211476 -586438 -706069 -446902
36189 -446902 -161809 -260112 -708010 -1110478 -1210125 -1097725 -957450 -832586 -689703 -531448
36179 -531448 -368895 -190751 6785 236216 525662 803342 855352 555576 63616 -363904
36169 -363904 -642086 -751708 -561218 -78914 279335 107712 -365390 -518780 -185491 218166
36159B18166J91803J07142K5110l27829n60470j11260O18163O17779j84084o94250
36149i9730k36763N13279O05548Q8684l35233l68940k35103j03015L0960R3317
36139d6996K4027j1935J44232L31837K91824P3374o1090k8200K9772k774j27621
36128F16450k97805l85222k15255J58143L50233Q3842l52200l87509O5840M35391
36118G1908K33399k51136l14472J63960M86560J06914n25250n55877K4495L72135
36108a87364Q0654k60403j16848J22572p2015l57777j18768L63044L08863k09825
36098d47867l54075Q0283L81176J88052J7058J98344K61843j23377m51047k17929
36088d67539K47541M07645L31728K75477P0786l68949n11814K5448O29930M55349
$$ plain form
36159 218166 409969 517111 542221 214392 -346078 -457338 160825 778604 594520 -99730
36149 -99730 -336493 176786 782334 871018 535785 166845 -68258 -171273 -140313 -46996
36139 -46996 -22969 -34904 109328 441165 732989 806363 745273 717073 746845 744071 616450
36128 616450 318645 -66577 -281832 -123689 226544 310386 -41814 -429323 -363483 71908
36118 71908 305307 54171 -260301 -96341 390219 497133 -28117 -583994 -559499 -187364
36108 -187364 -106710 -367113 -483961 -361389 -433404 -791181 -909949 -546905 -238042 -447867
36098 -447867 -801942 -721659 -340483 -152431 -135373 62971 324814 201437 -249610 -467539
36088 -467539 -219998 187647 519375 794852 865638 496689 -15125 10323 640253 1095602
36078A095602k97737p01197m54555q1748O5079J43734K06646O8312j47093o7170
36068a70127K10513J52711l15143o15992m18365r2230j2047j824J81577L25145
36058g55782J41748j80947k19418J09672N13151O97555N71196K33966p7670j89621
36048H43850k06263l22398m18716j95625K22249K67815k51625p40011n75583L0205
36038a346102L60514J65770j53998k45402k00991j96023j41462Q8485L43945L68618
36028i56646J66219j8957m7604k1115n7246j07976q2500q301O0214J82748M05337
36017d85827N58584M04309q562l41568l62616j60262O5694K10187K11311M0352
36007A31602j65038j94571p9974n6475j34903n2035K24072L42728J42988m7738
$$ plain form
36078 1095602 797865 96668 -357887 -439635 -374556 -230822 -24176 44136 -102957 -170127
36068 -170127 40386 193097 -122046 -738038 -1156403 -1248633 -1260680 -1262504 -1080927 -755782
36058 -755782 -614034 -794981 -1014399 -904727 -391576 305979 877175 1111141 1033471 843850
36048 843850 637587 315189 -103527 -299152 -76903 190912 -60713 -800724 -1376307 -1346102
36038 -1346102 -985588 -819818 -973816 -1219218 -1420209 -1616232 -1757694 -1669209 -1325264 -956646
36028 -956646 -790427 -809384 -856988 -878103 -935349 -1043325 -1125825 -1134126 -1073912 -891164 -485827
36017 -485827 72757 477066 468504 126936 -235680 -395942 -330248 -120061 91250 131602
36007 131602 -33436 -228007 -307981 -364456 -499359 -551394 -327322 15406 158394 110656
35997A10656J0539L8701k12161m15743j98426J67596K06739N1310J23851K78057
35987A61119M9425l95981m31376o2877N1298k15893j95210L72654P72294M32129
35977E37582j74932l38264j66527j77826l45372k58934R2289L42183L37067J81424
35967B8690p8987l49425l27625O1087L48647J58246j42151o832L49191K80736
35957C21577j95781m14005j38192J32963N7021p2359L6212J86657J55984J06924
35947A77001K00196K46716J00274K890J65945L42091J99945j49843l79808m48110
35937D57297m83691l97164n9706K75302K14835j45534k98378p1987J40690K5817
35927c42519j91817j61746M9656J29544J9357o2809Q328J40446K15276J89784
$$ plain form
35997 110656 121195 159896 -52265 -468008 -666434 -498838 -292099 -240789 -116938 161119
35987 161119 210544 -185437 -616813 -679690 -628392 -844285 -1039495 -666841 105453 537582
35977 537582 362650 24386 -142141 -319967 -665339 -924273 -831984 -489801 -152734 28690
35967 28690 -50297 -399722 -727347 -666260 -317613 -159367 -301518 -308350 40841 321577
35957 321577 125796 -288209 -426401 -293438 -236417 -308776 -272564 -85907 70077 177001
35947 177001 377197 623913 724187 727077 893022 1235113 1435058 1285215 905407 457297
35937 457297 -26394 -423558 -483264 -207962 6873 -138661 -437039 -509026 -368336 -342519
35927 -342519 -534336 -696082 -646426 -516882 -497525 -560334 -552006 -411560 -196284 -6500
35917f500N1421j40630k28204j48611o5575r6292m5114K71291N48879L07981k99928
35906A48718n27244o8036M49930L58079j18721l02705q8361O8216q143k0614J63746
35895E4865K76941J53270k3850j14477k23777l61262l09765j6239K43705K62451
35885e8138J41076J4897j06041j19357J25840M25081L23539j71023m65980k41044
35875a31150P5191L1004j55620q5731R8341L1529j85558j87607L2688K37282M11698
35864A72067N74535M09607k66485r00833p90064j44007J75677o8035k45779M1220
35854a042097M04337M16573K15799O5444q0426k50473k33897j9445L2477k08212
35844f99920l35714o0341K84522K82141O6562p893M2321K4927K7540J87440K75979
$$ plain form
35917 -6500 44921 -95709 -323913 -472524 -538099 -634391 -679505 -408214 140665 448646 148718
35906 148718 -378526 -446562 3368 361447 242726 -59979 -148340 -80124 -88267 -108881 54865
35895 54865 331806 485076 461226 346749 122972 -238290 -548055 -564294 -320589 -58138
35885 -58138 82938 97835 -8206 -127563 -1723 423358 746897 575874 109894 -131150
35875 -131150 -55959 -24955 -180575 -266306 -167965 -136436 -321994 -509601 -476913 -239631 172067
35864 172067 746602 1156209 889724 -11109 -801173 -945180 -769503 -837538 -1083317 -1042097
35854 -1042097 -637760 -221187 -5388 60056 -20370 -270843 -504740 -524185 -491708 -699920
35844 -699920 -1035634 -1095975 -811453 -529312 -462750 -470643 -428322 -403395 -375855 -188415 87564
35833H7564L1513k86881k07117K01291L87388J07373l01321m55533l32642r1817
35823h60182J48376K70527J97199N3948N0157J54442J41422k997j5658K00997
35813C38231L43021J01566l73102o07619l54030J36092L91975K14135j40731k65749
35803b16211o2630J84623K00579M5576l2962N5667J94280K59799K16041O0898
35793I05660j60793l18669l05649j63179M588J74992L33789L45671R9093k49066
35783F66437l89044k51552r7624j48877k93289k67859j7667K59193L71066L08212
35773A38996J56363m2372k55609l52950j89727J47024L20132J19701k22911k88457
35763d69810o111K75467K63279L2293j94023l24092l38248j89559N0318J38939
$$ plain form
35833 87564 119077 -167804 -374921 -173630 213758 321131 19810 -435723 -768365 -860182
35823 -860182 -711806 -441279 -244080 -190132 -139975 14467 155889 152892 137234 338231
35813 338231 681252 782818 409716 -197903 -551933 -415841 -23866 190269 49538 -216211
35803 -216211 -278841 -94218 106361 151937 118975 174642 368922 628721 844762 905660
35793 905660 744867 426198 120549 -42630 -38042 136950 470739 816410 915503 666437
35783 666437 277393 25841 -71783 -220660 -513949 -781808 -799475 -540282 -169216 138996
35773 138996 295359 252987 -2622 -355572 -545299 -398275 -78143 41558 -181353 -469810
35763 -469810 -475921 -200454 62825 95118 -98905 -422997 -761245 -950804 -900486 -761547
35753g61547l3438k35282j93180L2447J83021J91264J95569K45384K37996J27567
35743a0199n071q6947j02254k9678J32823L08881M09774L98347K25777j37940
35733A103513n04416n26817j66903J24519j7496l20990k69452J08607K92045O3761
35723a13629k16524k07637j8757J12331J90592K77615K26500j09596n52847p25674
35713a137626m59399M2685M12766M44837K67739J80708K58050K32860p6005l92381
35703b25766l29661J6747K06468J23518N9891J15412K9870k43775l24141l5958
35693f07395K12034N6569k15386j41982J51699J85911p6360k06009k0903J80795
35683d81027J47097N044m1654k520M7316J28345K23770K00162J1770j64643j36037
$$ plain form
35753 -761547 -794985 -1030267 -1223447 -1191000 -1007979 -816715 -621146 -375762 -137766 -10199
35743 -10199 -15270 -102217 -204471 -234149 -101326 207555 617329 1015676 1241453 1103513
35733 1103513 599097 72280 -94623 29896 12400 -308590 -578042 -469435 -177390 -113629
35723 -113629 -330153 -537790 -556547 -444216 -253624 23991 250491 140895 -411952 -1137626
35713 -1137626 -1597025 -1554340 -1141574 -696737 -428998 -248290 9760 242620 166615 -225766
35703 -225766 -555427 -538680 -332212 -208694 -148803 -33391 -3521 -247296 -571437 -607395
35693 -607395 -395361 -338792 -554178 -696160 -544461 -358550 -434910 -640919 -661822 -481027
35683 -481027 -333930 -328886 -370540 -373060 -325744 -197399 26371 226533 238303 73660 -62377
35672f2377M9992J54703K7207k03709k29940P9715M20085L20454k21078n95859
35662b60807l20641K65397M01717o4356m75821k84805K26740L92277N0446l38350
35652d08203l54098q1122J27606J23547O3295J16746K14019J42334j45086m12421
35642f13383l90405r3667J90376K19123L2903j27385q2819J22360K95534L13136
35632a34227K38792J96563J81810J08034P678J397L8567r9909m23187n92420l67979
35621h44881P113J42003N7229P7677K61910L24356J40422n0773o0225l7726j71933
35610a54828l59103l73645j89354M8700K28098K93015K06898M2627j9526P2403
35600b04715J34499J1764j88079k75193k45723j95695j15190K3458J10054P3751
$$ plain form
35672 -62377 -12385 142318 169525 -34184 -264124 -184409 235676 556130 335052 -260807
35662 -260807 -581448 -316051 85666 21310 -454511 -739316 -512576 -120299 -69853 -408203
35652 -408203 -762301 -843423 -715817 -592270 -528975 -412229 -198210 -55876 -200962 -613383
35642 -613383 -1003788 -1097455 -907079 -687956 -655053 -782438 -865257 -742897 -447363 -134227
35632 -134227 104565 301128 482938 590972 598650 600047 638614 538705 115518 -476902 -844881
35621 -844881 -837768 -695765 -638536 -560859 -298949 25407 165829 115056 54831 17105 -154828
35610 -154828 -513931 -887576 -1076930 -1028230 -800132 -507117 -300219 -257592 -277118 -204715
35600 -204715 -70216 -58452 -246531 -521724 -767447 -963142 -1078332 -1054874 -944820 -871069
35590h71069R0141L14161N03540K85861k04837l83908l3373L51365K82407k6016
35580C08272o7324J36201J36372j32201k27362K2588J71506j23789m86857l62309
35570f24903J26647L75579K09139M5209J35947J92302m1976l02281k13578J19879
35560B1964K89040J59954m6763j41145j27928m9710O1596J00718j1666j56583
35550I9477j45370q688L1622j24305l37896m26373l31984j21023N2936L3393j48704
35539a426915k29882j1161L66800N90998N21374K20120k00120n33369m71614L1148
35529a142621N12455M88619J04610r6876K1370R9088j4855k5296J87939K54809
35519C89242p8496m61216m19310j2682L32396L95326K43871k7222l08489l97228
$$ plain form
35590 -871069 -780928 -466767 36773 322634 117797 -266111 -299484 51881 334288 308272
35580 308272 240948 377149 513521 381320 153958 176546 348052 224263 -262594 -624903
35570 -624903 -498256 -122677 86462 131671 267618 459920 417944 115663 -97915 21964
35560 21964 311004 470958 424195 283050 155122 105412 167008 267726 256060 99477
35550 99477 -45893 -54581 -22959 -147264 -485160 -911533 -1243517 -1364540 -1311604 -1278211 -1426915
35539 -1426915 -1656797 -1667958 -1301158 -710160 -188786 31334 -168786 -702155 -1173769 -1142621
35529 -1142621 -630166 -141547 -36937 -133813 -112443 -13355 -28210 -53506 134433 389242
35519 389242 310746 -150470 -569780 -582462 -250066 145260 389131 361909 53420 -343808
35509c43808k10843M7408J68119K18489L29794M08178L04681P3518j75829m47256
35499C72451o34354m47771Q5004L84274O0177l99351k72927K72247M13763k9705
35489a96192l31312n3945K64483M0949l76706k77953K61397M90787J23466k80280
35479c35306j77347K19231L36291N3958k26357k08869n5092m3409j40013j06372
35469f83285R8005K60031K36839J09844j0166j04453j15201N3260K89540K96290
35459D30704K2696j91903j16253K1949l8407j29153o833J21563n6776l04115j46248
35448c92776K49487K17746l07682n71967j40785M15347M14467O7374R031K38865
35438A99107K07777k24703n83523n39553l20284k32260k18944r6110R8569K20291
$$ plain form
35509 -343808 -554651 -507243 -339124 -120635 209159 617337 922018 995536 819707 372451
35499 372451 -261903 -709674 -624670 -240396 -180219 -579570 -852497 -580250 -166487 -196192
35489 -196192 -527504 -581449 -316966 -276017 -652723 -930676 -669279 -178492 -55026 -335306
35479 -335306 -512653 -293422 42869 96827 -129530 -338399 -393491 -436900 -576913 -683285
35469 -683285 -585280 -325249 -88410 21434 11268 -93185 -208386 -155126 134414 430704
35459 430704 453400 261497 145244 167193 128786 -367 -7200 114363 57587 -246528 -392776
35448 -392776 -143289 74457 -233225 -805192 -945977 -530630 -116163 -48789 -39758 199107
35438 199107 406884 182181 -401342 -940895 -1261179 -1493439 -1712383 -1808493 -1709924 -1489633
35428a489633K62280K70286J71051q4276k91923j60731K64354N54248L96686M587
35418a03071j64394j8864R9977q792q8211J24306M06186L49364j1336k61183k35001
35407H8981j71282k15135j95332k2875Q6852l05o7677Q0447K55398J78631o6756
35396d9053j63489K14K59957M25383L93046J31906k41807m79863m61327l24038
35386e09071k10160o3060J58357K82672J81809L6386P6569K13967K14975J02479
35376D84923P3125J17360N8387p8968q3196L9697L361l13951o13593n20637n1701
35365h85193L85558M18455Q5002k13131j57155J05343J40777j86875n03753m05647
35355a216619L1919L81741L58662L2856l08543l67593n8456L33821L92272R2589
$$ plain form
35428 -1489633 -1227353 -957067 -786016 -870292 -1162215 -1322946 -1058592 -504344 -107658 -103071
35418 -103071 -267465 -286329 -186352 -195144 -283355 -159049 247137 596501 585165 323982 88981
35407 88981 -82301 -297436 -492768 -515643 -428791 -429096 -496773 -416326 -160928 17703 -49053
35396 -49053 -212542 -212328 47629 473012 866058 997964 756157 276294 -185033 -509071
35386 -509071 -719231 -782291 -623934 -341262 -159453 -123067 -46498 167469 382444 484923
35376 484923 558048 675408 733795 654827 571631 611328 614689 300738 -312855 -833492 -885193
35365 -885193 -499635 -81180 3822 -209309 -366464 -261121 -120344 -307219 -810972 -1216619
35355 -1216619 -1184700 -802959 -444297 -411441 -719984 -1087577 -1146033 -812212 -419940 -327351
35345c27351j47226q3321K1770p3214j17089J67715M81460L49594q0504k34140
35335d2306m004J51765Q752j31904o9834n7906k94489n21788m15093m2416L05077
35324a114146M65305L97935J11064k01930k17014J10456M06282L46276P0669n8958
35314C15939N3720J86479J18182j45273l93849l96181j38178J25677J69948P4674
35304b8862K7112k6260k30550m24432k94391P8595K55815R2583p4312r738Q0115
35293e54325k4018j85989k04882j32663p6758L634J05467J02546L4935J25825
35283h06228L35116L10402p13j66117J611N2571l21361o17183k42108M70567O78953
35272c04490K60869j06427l8966J07718l329j49494m5746J22891L0413k46690
$$ plain form
35345 -327351 -474577 -557898 -536128 -609342 -726431 -558716 -77256 272338 191834 -42306
35335 -42306 -46310 105455 114207 -17697 -87531 -145437 -439926 -961714 -1376807 -1419223 -1114146
35324 -1114146 -648841 -250906 -139842 -341772 -558786 -448330 -42048 304228 374897 315939
35314 315939 369659 556138 674320 529047 135198 -260983 -399161 -273484 -103536 -28862
35304 -28862 -1750 -28010 -258560 -682992 -977383 -898788 -642973 -550390 -624702 -634440 -554325
35293 -554325 -578343 -764332 -969214 -1101877 -1178635 -1175001 -1069534 -966988 -932053 -806228
35283 -806228 -471112 -160710 -161423 -327540 -325929 -273358 -594719 -1211902 -1454010 -983443 -304490
35272 -304490 -43621 -150048 -189014 -81296 -84625 -234119 -279865 -156974 -126561 -373251
35262c73251l64129k12725K436R8382R7323R2822J09106J34505J85795K54326
35252B4590K29011J9l11132l70455l8723L50673L55626N125k64446k24171p2322
35241c16205k0976l5230o3273j45491j84462j142K60823K28519o4247j48638Q3410
35230d06912J58416j13793k32645R0943L25643L3448k72868K1664N01405L70507
35220D75808k02609m11355j69528o1920j38840P7176M34689K33012m03758m69688
35210f37013K70231P61606L10747l56388l63546j5998l3236k76066j69793K06397
35200c03059L63153K88527K61366J68274j84823m25643j07616M11070L94028j46053
35190G19224n18232m16306j65154o686J22297J55386m5096k28429n4094J96068
$$ plain form
35262 -373251 -737380 -950105 -947669 -849287 -751964 -659142 -550036 -415531 -229736 24590
35252 24590 253601 253620 -57512 -427967 -466690 -116017 239609 244734 -19712 -243883 -316205
35241 -316205 -337181 -372411 -435684 -581175 -765637 -766779 -505956 -277437 -341684 -490322 -406912
35230 -406912 -248496 -362289 -594934 -503991 -178348 -144900 -417768 -396104 105301 475808
35220 475808 273199 -138156 -307684 -369604 -508444 -431268 3421 236433 -167325 -637013
35210 -637013 -366782 394824 705571 349183 -14363 -30361 -63597 -339663 -509456 -303059
35200 -303059 60094 348621 609987 778261 593438 167795 60179 471249 865277 719224
35190 719224 200992 -215314 -380468 -387154 -264857 -109471 -154567 -382996 -437090 -241022
35180b41022l6234n34791m60671L01483Q21242M70367j96497l59501n4269J64401
35170a25492J30940M5285o5587k76828m14916k89715p6604k2002J6524K70600
35160h07795N04455K97584k05594l76989J7408M94138N29373J68970j98327l51361
35150G1862l19514j94184o7508k0582k3533M4192J82710K22802Q9765l7631K8187
35139b3434K07248K80138J96048Q0223o55r2204j91909k23863k02661k51006l83843
35128f05918m21234k26400O9980K12254J40246M6358J12405K83230L41489J71633
35118A24043q8045j78499j0579K24273K87407J78227P2581K7884n7491j83557
35108C96244j92534o7254l5115k05771l42580k21521J0857J23688K14296M48941
$$ plain form
35180 -241022 -277256 -812047 -1272718 -971235 -149993 320374 123877 -235624 -289893 -125492
35170 -125492 5448 50733 -14854 -291682 -706598 -996313 -1072917 -1094919 -1078395 -807795
35160 -807795 -303340 -5756 -211350 -588339 -570931 -76793 452580 621550 423223 71862
35150 71862 -247652 -441836 -509344 -529926 -553459 -509267 -326557 -103755 -13990 -51621 -23434
35139 -23434 183814 463952 660000 740223 739568 647364 455455 231592 28931 -222075 -605918
35128 -605918 -1027152 -1253552 -1183572 -971318 -831072 -784714 -672309 -389079 -47590 124043
35118 124043 35998 -142501 -153080 71193 358600 536827 609408 637292 579801 396244
35108 396244 203710 136456 101341 -104430 -447010 -668531 -657674 -533986 -319690 129251
35098A29251N86062K68015k84170m38311q2001J83488l2604l43354k48860J24035
35088a38449L48232L51250K88487J10474k31118m20976j83843J44958M6258l14519
35078G54l02410J22714K77846j38873n19726k97066J68756J86870j90031l17386
35068a008552J5061L45108L23190J51844Q2473j7041k74513l77938J5145O11328
35058a33895P20262J86872l61292l66060m1814P8505k6403L8349L11211L57715
35048G63450K295l40639l07565j25495j54478k31737M8439N68457P19217K36373
$$ plain form
35098 129251 715313 983328 699158 260847 178846 362334 329730 -13624 -262484 -138449
35088 -138449 209783 561033 849520 959994 728876 307900 124057 269015 315273 754
35078 754 -301656 -178942 98904 -39969 -559695 -856761 -688005 -501135 -691166 -1008552
35068 -1008552 -993491 -648383 -325193 -173349 -90876 -107917 -382430 -760368 -745223 -133895
35058 -133895 586367 773239 411947 45887 4073 82578 56175 94524 405735 763450
35048 763450 765745 425106 117541 -7954 -162432 -394169 -345730 222727 941944 1178317
$$ [...]
##END NTUPLES=NMR SPECTRUM
##END=
