##TITLE=31Pdec_BAU-j-FPO
 CDCl3, 24 sc
 20.8.2019
##JCAMPDX= 6.0         $$ Bruker NMR JCAMP-DX V2.0
##DATA TYPE= NMR SPECTRUM
##DATA CLASS= NTUPLES
##ORIGIN= UXNMR, Bruker Analytische Messtechnik GmbH
##OWNER= root
$$ XWIN-NMR		Version 3.5
$$ Tue Aug 20 15:21:50 2019 Russian Standard Time (UT+4h)  she@DPX200
##.OBSERVE FREQUENCY= 81.013821
##.OBSERVE NUCLEUS= ^31P
##.ACQUISITION MODE= SIMULTANEOUS
##.ACQUISITION SCHEME= undefined
##.AVERAGES= 24
##.DIGITISER RES= 17
##SPECTROMETER/DATA SYSTEM= spect
##.PULSE SEQUENCE= zgpg30
##.SOLVENT NAME= CDCl3
##.SHIFT REFERENCE= (INTERNAL, CDCl3, 0, 182.463)
##AUDIT TRAIL= $$ (NUMBER, WHEN, WHO, WHERE, WHAT)
$$ ##TITLE= Audit trail, XWIN-NMR		Version 3.5
$$ ##JCAMPDX= 5.01
$$ ##ORIGIN= Bruker BioSpin GmbH
$$ ##OWNER= she
$$ F:/spectra/data/she/nmr/P31/1/pdata/1/auditp.txt
$$ ##AUDIT TRAIL=  $$ (NUMBER, WHEN, WHO, WHERE, WHAT)
(   1,<2019-08-20 15:20:29.93 +0400>,<she>,<DPX200>,
      <created by zg, POWCHK disabled, PULCHK disabled
       configuration hash MD5:
       00 E9 B6 7A A2 85 ED C7 34 08 36 98 17 FE 4E 26
       data hash MD5: 32K
       0C E3 A3 A1 8C AE 5B 88 C5 1B 14 47 81 AC BE 9D>)
(   2,<2019-08-20 15:20:32.90 +0400>,<she>,<DPX200>,
      <Start of raw data processing
       efp BC_mod = 2 LB = 1 FT_mod = 6 PKNL = 1 PHC0 = -405.0508 PHC1 = 81.80041 SI = 64K 
       data hash MD5: 64K
       E2 66 EE 93 C6 1A D5 17 C4 C2 E2 33 D9 3B F1 46>)
(   3,<2019-08-20 15:20:52.14 +0400>,<she>,<DPX200>,
      <pk PHC0 = 22.83345 PHC1 = 0 
       data hash MD5: 64K
       B2 FB 3A A8 B8 0F 03 4A 0C 3F 68 A8 91 4D 38 40>)
(   4,<2019-08-20 15:21:11.07 +0400>,<she>,<DPX200>,
      <pk PHC0 = -94.77186 PHC1 = 221.9999 
       data hash MD5: 64K
       CD 39 94 2E 69 0F B5 C4 B6 D9 36 07 FF 09 F5 1B>)
(   5,<2019-08-20 15:21:16.75 +0400>,<she>,<DPX200>,
      <abs ABSG = 5 
       data hash MD5: 64K
       A8 3B 2E 1D E5 5C 78 AD E2 BC A7 27 41 AB 63 65>)
$$ ##END=
$$ 
$$ hash MD5
$$ AD C8 EF 2A 14 E7 39 94 45 62 1D E5 51 F1 73 64
##$RELAX= 
##$RELAX= 
##$RELAX= 
##$RELAX= 
##$RELAX= 
##$RELAX= 
##$RELAX= 
##$RELAX= 
$$ Bruker specific parameters
$$ --------------------------
##$DU= <F:/spectra>
##$EXPNO= 1
##$NAME= <P31>
##$PROCNO= 1
##$TYPE= <nmr>
##$USER= <she>
##$AMP= (0..31)
100 100 100 100 100 100 100 100 100 100 100 100 100 100 100 100 100 100 
100 100 100 100 100 100 100 100 100 100 100 100 100 100 
##$AQSEQ= 0
##$AQ_mod= 1
##$AUNM= <au_zg>
##$AUTOPOS= <>
##$BF1= 81.014009
##$BF2= 200.13
##$BF3= 200.13
##$BF4= 200.13
##$BF5= 200.13
##$BF6= 200.13
##$BF7= 200.13
##$BF8= 200.13
##$BYTORDA= 1
##$CFDGTYP= 0
##$CFRGTYP= 5
##$CHEMSTR= <none>
##$CNST= (0..31)
1 1 145 1 1 1 1 1 1 1 1 1 1 1 1 1 1 1 1 1 1 1 1 1 1 1 1 1 1 1 1 1 
##$CPDPRG= <waltz16>
##$CPDPRG1= <>
##$CPDPRG2= <waltz16>
##$CPDPRG3= <>
##$CPDPRG4= <mlev>
##$CPDPRG5= <mlev>
##$CPDPRG6= <mlev>
##$CPDPRG7= <mlev>
##$CPDPRG8= <mlev>
##$CPDPRGB= <>
##$CPDPRGT= <>
##$D= (0..31)
0 1 0 0 0 0 0 0 0 0 0 0.03 2e-05 3e-06 0 0 0 0 0 0 0 0 0 0 0 0 0 0 0 0 
$$ [...]
##$SUBNAM3= <"">
##$SUBNAM4= <"">
##$SUBNAM5= <"">
##$SUBNAM6= <"">
##$SUBNAM7= <"">
##$SUBNAM8= <"">
##$SUBNAM9= <"">
##$SW= 369.568048894756
##$SWIBOX= (0..15)
0 1 3 0 0 0 0 0 0 0 0 0 0 0 0 0 
##$SW_h= 29940.119760479
##$TD= 32768
##$TD0= 1
##$TE= 0
##$TE2= 300
##$TE3= 300
##$TEG= 300
##$TL= (0..7)
0 120 53 12 22 120 120 120 
##$TP= (0..7)
150 150 150 150 150 150 150 150 
##$TP07= 0
##$TPNAME0= <>
##$TPNAME1= <>
##$TPNAME2= <>
##$TPNAME3= <>
##$TPNAME4= <>
##$TPNAME5= <>
##$TPNAME6= <>
##$TPNAME7= <>
##$TPOAL= (0..7)
0.5 0.5 0.5 0.5 0.5 0.5 0.5 0.5 
##$TPOFFS= (0..7)
0 0 0 0 0 0 0 0 
##$TUNHIN= 0
##$TUNHOUT= 0
##$TUNXOUT= 0
##$USERA1= <user>
##$USERA2= <user>
##$USERA3= <user>
##$USERA4= <user>
##$USERA5= <user>
##$V9= 5
##$VALIST= <valist>
##$VCLIST= <CCCCCCCCCCCCCCC>
##$VD= 0
##$VDLIST= <DDDDDDDDDDDDDDD>
##$VPLIST= <PPPPPPPPPPPPPPP>
##$VTLIST= <TTTTTTTTTTTTTTT>
##$WBST= 1024
##$WBSW= 4
##$XGAIN= (0..3)
0 0 0 0 
##$XL= 0
##$YL= 0
##$YMAX_a= 24702
##$YMIN_a= -23984
##$ZGOPTNS= <>
##$ZL1= 120
##$ZL2= 120
##$ZL3= 120
##$ZL4= 120
##$ABSF1= 182.463
##$ABSF2= -187.1042
##$ABSG= 5
##$ABSL= 3
##$ALPHA= 0
##$AQORDER= 0
##$ASSFAC= 0
##$ASSFACI= 0
##$ASSFACX= 0
##$ASSWID= 0
##$AUNMP= <proc_1d>
##$AZFE= 0.1
##$AZFW= 0.5
##$BCFW= 0
##$BC_mod= 2
##$BYTORDP= 0
##$COROFFS= 0
##$CY= -3
##$DATMOD= 1
##$DC= 0
##$DFILT= <>
##$DTYPP= 0
##$F1P= 0
##$F2P= 0
##$FCOR= 1
##$FTSIZE= 65536
##$FT_mod= 6
##$GAMMA= 0
##$GB= 0
##$INTBC= 1
##$INTSCL= 5.30512e-09
##$ISEN= 30
##$LB= 1
##$LEV0= 0
##$LPBIN= 0
##$MAXI= 10000
##$MC2= 0
##$MEAN= 0
##$ME_mod= 0
##$MI= 50
##$NCOEF= 0
##$NC_proc= -4
##$NLEV= 6
##$NOISF1= 182.463
##$NOISF2= 159.3651
##$NSP= 0
##$NTH_PI= 0
##$NZP= 0
##$OFFSET= 182.463
##$PC= 4
##$PHC0= -476.9891
##$PHC1= 303.8003
##$PH_mod= 1
##$PKNL= yes
##$PPARMOD= 0
##$PSCAL= 0
##$PSIGN= 0
##$REVERSE= no
##$SF= 81.0140089999434
##$SI= 65536
##$SIGF1= 159.3651
##$SIGF2= -187.1042
##$SINO= 113.3802
##$SIOLD= 16384
##$SREGLST= <1H.CDCl3>
##$SSB= 0
##$STSI= 65536
##$STSR= 0
##$SW_p= 29940.119760479
##$SYMM= 0
##$S_DEV= 0
##$TDeff= 32768
##$TDoff= 0
##$TI= <>
##$TILT= no
##$TM1= 0
##$TM2= 0
##$TOPLEV= 0
##$USERP1= <user>
##$USERP2= <user>
##$USERP3= <user>
##$USERP4= <user>
##$USERP5= <user>
##$WDW= 1
##$XDIM= 65536
##$YMAX_p= 354230316
##$YMIN_p= -8993134
$$ End of Bruker specific parameters
$$ ---------------------------------
##NTUPLES= NMR SPECTRUM
##VAR_NAME=  FREQUENCY,     SPECTRUM/REAL,   SPECTRUM/IMAG
##SYMBOL=    X,             R,               I
##VAR_TYPE=  INDEPENDENT,   DEPENDENT,       DEPENDENT
##VAR_FORM=  AFFN,          ASDF,            ASDF
##VAR_DIM=   65536,         65536,           65536
##UNITS=     HZ,            ARBITRARY UNITS, ARBITRARY UNITS
##FACTOR=    0.456856943014862, 1,           1
##FIRST=     14782.0589164792, 0,            0
##LAST=      -15158.0608439998, 0,           0
##MIN=       -15158.0608439998, -8993134,    0
##MAX=       14782.0589164792, 354230316,    0
$$ Real data points
##PAGE= N=1
##DATA TABLE= (X++(R..R)), XYDATA
$$ [...]
41014D94499n37745q9592M69797L33486k03630k53576K17434L31129k51657p03210
41004a93065k83600M70504N09339j75484n81623k02038L24102K92818n5743j05967
40994g57P8331l6056m18860m26114J26274N38155K31585l47294l66333J72009
40984d49060M84754K02072j54410n7459K45695K27755o0315j47506M6883J19832
40974D58241j02348k70964r3542K00137K19616l9626k71898k85074j03021J89575
40964i8904M46291M31398P3531l17068l49654m8385J95038J54091%l4857J9030
40953D70511j4351j85750l72095l93622j39463K93337N61324L52618k16499o37032
40943b81022n42345q9352K78452L14105J05938j27170k12212p4186K00040L51320
$$ plain form
41014 494499 -43246 -132838 336959 670445 466815 213239 430673 761802 510145 -193065
41004 -193065 -476665 -6161 503178 327694 -253929 -455967 -131865 160953 105210 -757
40994 -757 77574 41518 -377342 -803456 -677182 -139027 92558 -254736 -621069 -449060
40984 -449060 35694 237766 83356 25897 271592 499347 439032 291526 338409 458241
40974 458241 355893 84929 -8613 191524 411140 371514 99616 -185458 -288479 -98904
40964 -98904 347387 778785 852316 535248 185594 137209 332247 486338 486338 451481 470511
40953 470511 456160 270410 -101685 -495307 -634770 -341433 219891 572509 356010 -281022
40943 -281022 -823367 -912719 -634267 -320162 -214224 -341394 -553606 -627792 -427752 -76432
40933g6432J63207k51731m89787k80885J70881L93816K10878n3908m0594J37486
40923a17069J11931j00392q7676K32828L57989j8557m05391k14465K63152K70578
40913B92928j83194l21909Q9099K99942j95552p73676o31517k5598K00591m6724
40903a295610q3838L56592P06397M72843n7135k83857n6833K72359L04471n2970
40893B82419n04018n91185j87496K77934L21710M0802q2591P5155J67031J8959
40883a81280r0125O6865K97544L37018K28764J43055R0471J6373n4394j28356
40873G25935k65382l68275k32957N4243R7759k27080m99719l26658R3943K82186
40863f66005J19332j32922k66196k54845q9444K02279M39609M49012K86524J24206
$$ plain form
40933 -76432 86775 -164956 -654743 -935628 -764747 -370931 -160053 -213961 -254555 -117069
40923 -117069 -5138 -105530 -193206 39622 397611 379054 -26337 -240802 22350 292928
40913 292928 109734 -212175 -123076 176866 -18686 -792362 -1423879 -1449477 -1248886 -1295610
40903 -1295610 -1379448 -1022856 -316459 156384 99249 -184608 -241441 30918 335389 282419
40893 282419 -221599 -812784 -1000280 -722346 -400636 -359834 -442425 -367270 -200239 -181280
40883 -181280 -271405 -204540 93004 430022 658786 801841 892312 908685 854291 725935
40873 725935 460553 92278 -140679 -86436 11323 -215757 -715476 -1042134 -948191 -666005
40863 -666005 -546673 -679595 -945791 -1200636 -1290080 -1087801 -648192 -199180 87344 211550
40853B11550K5306q847N9127J66527J24173n6193o1125K13462L37675n6186n92654
40842C62815n89696n2188L37872K17378n3932j06111j06965l14500n33487m04527
40832a243341K9703L95469M70508L25497J07950p9634j70080j78335j85442j74251
40822g01956k3770K25791L05838R2373j49683j19691R0186J78909J05678P1566
40812G5241J24348J17608M1114M9934J23591L9237k06805k89436o1696J33928
40802A47064n0514m02850m28507p1921K25587J74996l2836j29118j38961j74243
40792h81303j53632K2491K27191K86880K38243J68025p709k96756l55422J06359
40782f45633P25324P86972J91062l66237l40382k283J16592J719l2511K8931k7287
$$ plain form
40853 211550 236856 228009 287136 453663 577836 521643 460518 673980 1011655 955469 362815
40842 362815 -226881 -279069 58803 276181 222249 116138 9173 -305327 -838814 -1243341
40832 -1243341 -1213638 -818169 -347661 -22164 85786 6152 -163928 -342263 -527705 -701956
40822 -701956 -725726 -499935 -194097 -101724 -251407 -371098 -280912 -102003 3675 75241
40812 75241 199589 317197 358311 408245 531836 571073 364268 74832 13136 147064
40802 147064 96550 -306300 -734807 -806728 -581141 -406145 -438981 -568099 -707060 -881303
40792 -881303 -1034935 -1012444 -785253 -498373 -260130 -92105 -99814 -396570 -751992 -645633
40782 -645633 79691 866663 1057725 691488 351106 348823 465415 467134 434623 463554 436267
40771D36267j24001K3363L37645L86700M2697k83586k25096N5086J50814n7622
40761G42267l49676m65658l02393N4893L66388M17190K52332J07949N3838r8832
40751G78298m16525n89129k94274K94319O27398M25709L788j31421J26972M15979
40741A241114L73880L8229k82572m20793m65867m82997l42115K7206L74222L60036
40731D20343P083l11232l43155k08787j22457p1669R0943L55022N04008L53309
40721F73408k1428l07874k43994Q1619K88138J46243j31703j90037j7441Q9780
40711C66711k133j15567j12037r7446j63871j86595n2230J10252J20488K5535
40701a06893K294Q8925J85687K36484K42442J59813n0262k97157m22909l84406
$$ plain form
40771 436267 312266 335629 673274 1059974 1102671 819085 593989 649075 799889 742267
40761 742267 392591 -73067 -375460 -320567 45821 463011 715343 823292 877130 778298
40751 778298 361773 -227356 -521630 -227311 400087 825796 829584 698163 825135 1241114
40741 1241114 1614994 1653223 1370651 949858 483991 994 -341121 -313915 60307 420343
40731 420343 427426 116194 -226961 -435748 -558205 -629874 -538931 -183909 320099 673408
40721 673408 651980 344106 100112 181731 469869 616112 484409 294372 276931 366711
40711 366711 364578 249011 136974 39528 -124343 -310938 -363168 -252916 -132428 -106893
40701 -106893 -104599 -15674 170013 406497 648939 808752 758490 461333 38424 -345982
40691c45982k77069j85432q8015Q6140L42611N56663N38266K30235j60516l24649
40681C72252j65736J23253K91345K34558o262k96246m40671l27825p8057P7927
40671b15462P6086L5235K8617L1121N9476J28899J05662j08677k83522j21053
40661b63618J94573J76393j66944k66027P9617L14978L9471k92282j23528K62078
40651d5289K39573r3751j37207J53737K55115N7161K8186L02684L89124J5816
40641A165149m18064n25721m52758l92368j68332K91653N78193L68829j6508r1088
40631C38985Q3512J03856j15035l19038l55222k47885j5917K40245K65613N035
40621a5851j75679K7981L69747M15547J80630J342k6676m3230l3157R1520J59455
$$ plain form
40691 -345982 -623051 -808483 -896498 -810358 -467747 88916 627182 857417 696901 372252
40681 372252 206516 329769 621114 855672 849410 553164 112493 -215332 -293389 -215462
40671 -215462 -139376 -104141 -75524 -44403 15073 143972 249634 140957 -142565 -263618
40661 -263618 -69045 107348 -59596 -325623 -246006 68972 108443 -183839 -307367 -45289
40651 -45289 194284 100533 -36674 117063 372178 429339 457525 760209 1149333 1165149
40641 1165149 747085 221364 -231394 -623762 -792094 -500441 77752 446581 430073 338985
40631 338985 422497 526353 411318 92280 -262942 -510827 -526744 -286499 -20886 -15851
40621 -15851 -191530 -163549 206198 621745 802375 803717 777041 733811 700654 792174 951629
40610I51629l1540k71229k10508L6150Q3899m2746k2974M9270k25033o95621o91332
40599a070035r8655L48017J85835r4291N0149L04506J17923l01060l42351p857
40589i07819J66459K0078q4542M1899J77585J53993N3482o2042j80452j39322
40579g60681J60192M08688K37566j56119k56925m2567M4601p9320k2927K80490
40569a87002L66372N5931j98612r2836N4734k4244m7451J83449K79179l3375k88842
40558F7303m3662K65890J9801m64958m17980P9462K67731M3989N7462M16741M05851
40547F97630k00039n71309j23288M88096L72074k59123n36947k57857M2074O3455
40537b85234K6663P0367L7916j01427j47383n1282J4359J1256Q4277K16285J90179
$$ plain form
40610 951629 920089 648860 438352 474502 558401 515655 492681 541951 316918 -378703 -1070035
40599 -1070035 -1168690 -820673 -634838 -729129 -678980 -374474 -256551 -557611 -899962 -907819
40589 -907819 -741360 -721282 -805824 -763925 -586340 -432347 -378865 -440907 -621359 -760681
40579 -760681 -600489 -191801 45765 -110354 -367279 -409846 -365245 -444565 -467492 -187002
40569 -187002 179370 235301 36689 -56147 -1413 -25657 -73108 110341 389520 356145 67303
40558 67303 23641 289531 309332 -155626 -573606 -494144 -226413 -182424 -124962 291779 697630
40547 697630 497591 -73718 -197006 291090 663164 404041 -132906 -390763 -348689 -285234
40537 -285234 -258571 -188204 -150288 -251715 -399098 -450380 -436021 -424765 -340488 -124203 65976
40526F5976l4346k08277j38397Q7183K62525K53167K2352l24516n30754m23812
40516i68899j42412M6663R2987J27771J85220K04550K18962K69012K12008p7072
40506A68790l82583l62869n2022K02287K82255L89284N56073M97283R8575l09362
40496A087711l79180j83742k7697l8827j33698k22964k80561l04242k95247k06379
40486i84826N4956M22391N66846K67621j80736k74373J1817K26484J36590k0638
40476B26132l8173r295K0711J59979K57203m6754n91322o42196K1530N80583L10620
40465B49018l11617l71233O3304J75342j93201l55768j1466K87886J33183j08501
40455d43053l1816J27613K2792j38528K3672L94256N66236M39053J90580j03736
$$ plain form
40526 65976 31630 -176647 -315044 -227861 34664 287831 310183 -14333 -545087 -968899
40516 -968899 -1111311 -1064648 -971661 -843890 -658670 -454120 -235158 33854 245862 168790
40506 168790 -213793 -576662 -628684 -426397 -144142 245142 801215 1298498 1397073 1087711
40496 1087711 708531 524789 497092 458265 324567 101603 -178958 -483200 -778447 -984826
40486 -984826 -929870 -507479 59367 326988 146252 -128121 -116304 110180 246770 226132
40476 226132 187959 178664 199375 359354 616557 569803 -21519 -663715 -642185 -61602 249018
40465 249018 -62599 -433832 -370528 -195186 -388387 -744155 -755621 -467735 -334552 -443053
40455 -443053 -474869 -347256 -324464 -462992 -439320 -45064 521172 960225 1150805 1047069
40445A047069m10556n08261k42601J26031K21290Q7956N8852J76881J43387j70004
40435E30044n10658n89895l76697l1560K28218K26081J9210o8021J41245L32519
40425i9514J14692l11535l63367K2405K24653j31261n72158m56104J25903N57568
40415h88718N52705L39847J31611j08084l58858m25626k40129J2958J76491K86495
40405e21308L67074L00134M0767k12093k14252L4739K83997K61918q2646m81767
40395b23437n39476j63777K54144K82722M17j48959J2556K39966L20076K89287
40385C23519J50696j75632m78896l15850K96073O98131M50595m5034j94488p0275
40375F38839j05057k85115k78144j19609r7144j05737J70612N10385L58241j76281
$$ plain form
40445 1047069 636513 128252 -114349 11682 232972 320928 379780 556661 700048 530044
40435 530044 19386 -570509 -947206 -978766 -750548 -524467 -505257 -573278 -432033 -99514
40425 -99514 15178 -296357 -659724 -637319 -412666 -543927 -1116085 -1572189 -1446286 -888718
40415 -888718 -336013 3834 135445 27361 -331497 -757123 -997252 -984294 -807803 -521308
40405 -521308 -154234 145900 186667 -25426 -239678 -204939 79058 340976 258330 -223437
40395 -223437 -762913 -926690 -672546 -389824 -389407 -538366 -525810 -285844 34232 323519
40385 323519 474215 298583 -180313 -496163 -200090 498041 948636 903602 709114 638839
40375 638839 533782 248667 -29477 -149086 -246230 -351967 -181355 329030 687271 510990
40365E10990l22023J58326N56942L40964m9283q892K51589J52391k68145m59029
40355H63830k06476J73604L42795K04518j77763n40757m87387K4890M59755L53980
40345A010989k2149q3949K01225L66866K30357J00549K35059N43532Q18820Q67217
40335D268516M71638l36041j017156j024258n59781l45236n96805p72298m75548
40326c86969n1893K3115j12396q555L22630M03212R610m73004n25527j24780K64726
40315f59831K82639P8753K1077J55091K29534J97433K75274M13404K07645l82072
40305H18947p29578m10537Q6659J09103j18251L6253M09088K64202l60721n55928
40295d50763K3552N83373M33549m3515j80693m7206o4988j92966j63727r8116
$$ plain form
40365 510990 188967 347293 904235 1245199 1195916 1187024 1438613 1591004 1322859 863830
40355 863830 657354 830958 1173753 1378271 1200508 659751 172364 197254 657009 1010989
40345 1010989 988840 904891 1106116 1472982 1703339 1803888 2038947 2582479 3401299 4268516
40335 4268516 4740154 4404113 3386957 2362699 1802918 1457682 860877 88579 -386969
40326 -386969 -438862 -415747 -528143 -536698 -214068 189144 198754 -274250 -799777 -924557 -659831
40315 -659831 -377192 -298439 -277362 -122271 107263 304696 579970 993374 1201019 818947
40305 818947 89369 -321168 -234509 -125406 -243657 -207404 201684 465886 105165 -450763
40295 -450763 -427211 156162 589711 546196 365503 318297 253309 60343 -103384 -201500
40285b01500k27499l32324q6200K93937L44886J10283J2512J10235O3617k09609
40275a21662l83462k71280q2579m9798j28050j39922P828K67869M56341L89267
40265e5448J49827M7933J57389J57873j30286l72152k19036J19001K21686J15833
40255A92620J05489J63863L1121k19668k64428j09368o3317j63747j51284q011
40245d86730P983j08195q1577P5056K0617k54438k81352J42663N55093M74902
40235F4022N8617k02923j41406L4060J19980J00162P5214J47120K53279J26252
40225F34377l39423p35746n46812Q2439M49173K54122n3131n9364M6890j990k4826
40214b94291J59767K34935r8585m66475l11350J88399L52452N8911j02839J87216
$$ plain form
40285 -201500 -428999 -761323 -847523 -553586 -208700 -98417 -85905 24330 87947 -121662
40275 -121662 -505124 -776404 -858983 -908781 -1036831 -1176753 -1168925 -901056 -444715 -55448
40265 -55448 94379 142312 299701 457574 327288 -44864 -263900 -144899 76787 192620
40255 192620 298109 461972 493093 273425 8997 -100371 -163688 -327435 -478719 -486730
40245 -486730 -478747 -586942 -668519 -593463 -572846 -827284 -1108636 -965973 -410880 64022
40235 64022 122639 -80284 -221690 -187630 -67650 32512 107726 254846 508125 634377
40225 634377 294954 -440792 -987604 -905165 -455992 -201870 -255001 -314365 -267475 -269465 -294291
40214 -294291 -134524 100411 1826 -464649 -775999 -587600 -235148 -176237 -279076 -91860
40204i1860M72289K43602k99076n55734l17114P6131K27718P7650j57471k49450
40194e73315j37090P7499K66350L79545L97335K64943j3837k64597k72398m5562
40184G8873J61283J27183j02141k90757k75863j27857m9181j11466j43607L0131
40174g03402K85671L13645O2401j57680j15380L2020M8355K868P5945J76041J03653
40163A24137k0923R4870L62147L48187l4287l06032j03532K92136M07435K44747
40153A408885J19192O0950j50476m44154m46550r2080J84285N2600k48590k91596
40143A52466m9196J54553J04885j37149l88021m39728j56252K88025M32042Q1684
40133D3309l20497k41029J63277K66913p3732l30528j54754J34669J55657N7421
$$ plain form
40204 -91860 380429 624031 324955 -230779 -547893 -471762 -244044 -166394 -323865 -573315
40194 -573315 -710405 -632906 -366556 12989 410324 675267 661430 396833 124435 78873
40184 78873 240156 367339 265198 -25559 -301422 -429279 -478460 -589926 -733533 -703402
40174 -703402 -417731 -104086 -41685 -199365 -314745 -282725 -234370 -231502 -155557 20484 124137
40163 124137 103214 198084 560231 908418 874131 568099 464567 756703 1164138 1408885
40153 1408885 1528077 1589027 1438551 994397 547847 455767 640052 692652 444062 152466
40143 152466 103270 257823 362708 225559 -162462 -602190 -758442 -470417 -38375 43309
40133 43309 -277188 -518217 -354940 -88027 -161759 -492287 -647041 -512372 -356715 -299294
40123b99294J47838L15068K36598r7886m39059o23030n53105j29148M51982O53942
40113c36094K91216o8658R6120M06903J87502l66725m50713L3008L25650O7652
40103A85861k02635p7589M8820k10197m86815k89951J76818M08636L66979L04948
40093B24875K20715L3132n0928J04295J60720j78841n63972m95915j39184J2387
40083f72716J0110K43921N44765L43386k76527n40799j74338J68509k5845l52250
40073g31784k30637J67551K96656J24255M9891J77003K28761J01501J1772O8113
40063B63082R0044n0874j99326j55729L5347J56697P6335j47841l49241l71439
40053f52945j62043J65952L73726K87192Q01j75395o2230J53346J70677J0823
$$ plain form
40123 -299294 -151456 163612 400210 302324 -136735 -759765 -1312870 -1442018 -990036 -336094
40113 -336094 -44878 -113536 -17416 389487 576989 210264 -240449 -207441 118209 185861
40103 185861 -16774 -94363 -45543 -255740 -742555 -1032506 -855688 -447052 -80073 224875
40093 224875 445590 478722 427794 532089 692809 513968 -50004 -545919 -685103 -672716
40083 -672716 -662606 -418685 126080 469466 192939 -347860 -522198 -353689 -379534 -731784
40073 -731784 -962421 -794870 -498214 -373959 -324068 -147065 81696 183197 194969 263082
40063 263082 353126 302252 102926 -52803 -17456 139241 215576 67735 -281506 -652945
40053 -652945 -814988 -649036 -275310 11882 12683 -162712 -224942 -71596 99081 109904
40043A09904l3986J02202J30248q6399k32528l0391K56942J97650j30275k79062
40033D305j45211o3459j93195k95609k14974j26976j36765m2230K60208M76922
40023d76984L15830n5316k26730o6408J96733K85946J12741j78413k97516r1727
40013d81844K01893K04426n8869j75537q293O2889k06106m39591j98580K93423
40003h06189M51910J69454j26428j57870p0944l9631l2576k6021o7246n9794J52915
39992f12420M15259L51772l7952k58357n250L63200L30080o0442l13816j63032
39982I042J78329L69784K82499J3993k14610j94253N4466K32673J06514j63847
39972F74590k48836j33439r5100k16256k61725j30473p7718k73537m34796k08725
$$ plain form
40043 109904 75918 178120 308368 221969 -10559 -40950 215992 413642 283367 4305
40033 4305 -140906 -204365 -397560 -693169 -908143 -1035119 -1171884 -1214114 -953906 -476984
40023 -476984 -161154 -216470 -443200 -509608 -312875 -26929 85812 -92601 -390117 -481844
40013 -481844 -279951 -75525 -134394 -309931 -318224 -255335 -461441 -901032 -1099612 -806189
40003 -806189 -354279 -184825 -311253 -469123 -540067 -579698 -612274 -638295 -705541 -765335 -612420
39992 -612420 -197161 154611 116659 -141698 -146948 216252 546332 485890 172074 9042
39982 9042 187371 557155 839654 853647 639037 444784 499250 731923 838437 674590
39972 674590 425754 292315 197215 -19041 -280766 -411239 -488957 -762494 -1197290 -1406015
39962a406015K65429N24198M15349K14542J23470J2937k34427m30549l22573M7376
39952g90263L91769M88178L32494P4741j09744j51964j32813j34991r5795N3735
39942g4653J72204O5559j70009k54700j78354j96118l19910k37531J12167L39873
39932g41472K35654J38643L22028M64171K14113j23789p1425J76633Q1186k74263
39922D21479l03536O2983K52334N528k78614l01448k54727k47901n5090K82044
39912d16948K97035q9030k72212P6550M19847K55089l5076R8195L67909J66930
39902H68289l38561m94570k61497j53533k35974p7242L25615M53492J93405L2024
39892C11448J48722J20546k09710l64345j02575Q6839j49936l57757n9542L76545
$$ plain form
39962 -1406015 -1140586 -616388 -201039 13503 136973 149910 -84517 -515066 -837639 -790263
39952 -790263 -398494 89684 422178 496919 387175 235211 102398 -32593 -128388 -74653
39942 -74653 97551 163110 -6899 -261599 -439953 -636071 -955981 -1193512 -1081345 -741472
39932 -741472 -505818 -367175 -45147 419024 633137 509348 437923 614556 695742 421479
39922 421479 117943 180926 433260 438788 160174 -141274 -396001 -643902 -698992 -416948
39912 -416948 -119913 -208943 -481155 -404605 15242 270331 235255 333450 701359 868289
39902 868289 529728 35158 -226339 -379872 -615846 -693088 -367473 86019 279424 311448
39892 311448 460170 580716 371006 6661 -95914 -9075 -159011 -516768 -576310 -199765
39882a99765L57736P2770Q3837K65298M6493m45607m49069J32517M24016p0412
39872B17814o16692l37207M44958O94953J89143k50827m2416L69616K85182k21128
39862G33396m90875k45289J07974J15238j44045k57556m8702K41613K81973K2639
39852C16366k76769l27718r0959K07934L15571J86073j4604j00956l9799L8290
39842B13429l3728k84499n14533m36976M007M89960O18822L39437k3808j90628
39832A81483k06602k30617k24995o2367J44407R0570k69469n39390l34407J93996
39822a257391N08767L44981j5757j90733j62582j16689m2646J68754L45295J79445
39812b38556j97252k35452K25849N88252K90328l45561n39655j45320K23518J30863
$$ plain form
39882 -199765 157971 230741 314578 579876 626369 180762 -268307 -135790 288226 217814
39872 217814 -398878 -736085 -291127 403826 592969 342142 299726 669342 954524 733396
39862 733396 242521 -2768 105206 220444 76399 -181157 -229859 11754 293727 316366
39852 316366 39597 -288121 -379080 -171146 144425 330498 315894 214938 175139 213429
39842 213429 179701 -104798 -619331 -1056307 -1052300 -562340 56482 395919 372111 181483
39832 181483 -25119 -255736 -480731 -543098 -398691 -308121 -577590 -1116980 -1451387 -1257391
39822 -1257391 -748624 -403643 -419400 -610133 -772715 -889404 -932050 -763296 -418001 -238556
39812 -238556 -435808 -671260 -445411 142841 433169 87608 -452047 -597367 -373849 -242986
39802b42986j50525j84976L520J12657N7593P30M8444J43843J91213J58997R7266
39791B35776P8429P1776m0023k06997j56451J63828L11008o4281n32465l73983
39781e13383K96835N97345J89043k32783q5200K19976R0166k04041n3788L66929
39771F71099L69660o0294k13900J68680M65145J52623m04120n23289j53378J70085
39761F42311J16544q8809j22852o8883k32144n42111n00865O3907N35087K80197
39751H2382l20569l27196K87961N02837j32645o83844k77598M78856M53857k43830
39741a79789n54437j81720J34188j5654j69707L2816L01195L61658L58010L25145
39731D11705J5869m68609n86989k10837P9708j24091m83421n34550l17103n4979
$$ plain form
39802 -242986 -393511 -578487 -574967 -462310 -404717 -403987 -355543 -211700 -20487 138510 235776
39791 235776 314205 385981 345958 138961 -17490 146338 457346 393065 -139400 -513383
39781 -513383 -216548 380797 569840 337057 251857 471833 561999 357958 304170 671099
39771 671099 1040759 980465 766565 935245 1400390 1553013 1148893 625604 472226 642311
39761 642311 758855 670046 547194 478311 246167 -295944 -796809 -732902 -197815 82382
39751 82382 -238187 -565383 -277422 225415 92770 -591074 -868672 -389816 64041 -179789
39741 -179789 -734226 -915946 -781758 -797412 -967119 -934303 -633108 -271450 86560 411705
39731 411705 427574 -41035 -628024 -838861 -759153 -883244 -1366665 -1901215 -2218318 -2273297
39721b273297K52355N83061P11632N70996L75084J98761q1200l16012j72582J67343
39711A6141J11219l34326m50773K779L50354J61322n6224J14431J95680k07389
39701i6786m81987O575O94957O11876j23505o09802n61905l84598j84747K26649
39691i03273N50498K77579l13534m15758N1999L67264J99399k6102l0286n1625
39681b93839j66479q3516J80615J95204j00278k28678M444K25292K18184K22473
39671A73422K99158J41686k24845k94430O1122K96823R1478j65516j39701p3895
39661A65302j32594J5965M40666N19166p6005o36958m26651J53012K47964p0833
39651A99034p7726K65795K81878j63811l77000L737M24420L37320J515q2321Q824
$$ plain form
39721 -2273297 -2020942 -1437881 -726249 -155253 219831 418592 337392 21380 -151202 16141
39711 16141 127360 -206966 -657739 -654960 -304606 -143284 -199508 -85077 110603 -96786
39701 -96786 -578773 -572198 122759 734635 611130 1328 -560577 -945175 -1129922 -903273
39691 -903273 -352775 -75196 -388730 -804488 -752489 -385225 -185826 -211928 -242214 -293839
39681 -293839 -460318 -543834 -363219 -168015 -268293 -496971 -492527 -267235 -49051 173422
39671 173422 472580 614266 389421 94991 156113 452936 544414 378898 239197 165302
39661 165302 32708 48673 489339 1008505 932500 295542 -131109 21903 269867 199034
39651 199034 121308 387103 668981 505170 128170 131907 556327 893647 895162 812841 821665
39640H21665j01440l41835k93724Q4812L44142K10164l4402j8232J58057J21334
39630I50541j58968l17805j79193j7470n5440o4346J90674M04902J41578l71377
39620E23096m55207m472L27242J27541k04919j95691k2394n4405j43684N5271
39610d7622L81621L86830P4139j55492j96283l06987m97220m09931N5378M78150
39600b37417M87420K37737Q3032N5178o1326k95304m02880k12087J11825K24049
39590i773L45k92805l12471q5928L7502q0590j38802J23384M54351M05242j3496
39579H6959l34449k72049l6927M9846j8405k8471J10772K69625K80001J37240
39569B44142J6640O1640J54945L2172l07584n01548l13299k5708n3069l04674
$$ plain form
39640 821665 720225 378390 84666 169478 513620 723784 689382 671150 829207 950541
39630 950541 791573 473768 294575 277105 221665 157319 347993 752895 894473 523096
39620 523096 67889 63417 390659 518200 313281 117590 95196 40791 -102893 -47622
39610 -47622 333999 720829 794968 639476 443193 136206 -361014 -770945 -715567 -237417
39600 -237417 250003 487740 570772 625950 564624 269320 -133560 -345647 -233822 -9773
39590 -9773 -9428 -302233 -614704 -700632 -663130 -743720 -882522 -759138 -304787 100455 86959
39579 86959 -247490 -519539 -556466 -506620 -525025 -553496 -442724 -173099 106902 244142
39569 244142 260782 322422 477367 509539 201955 -299593 -612892 -638600 -691669 -996343
39559i96343l22250j1313K10683J01578r828K18171N33421M35090n1824l72356
39549b64971k05960J39363K14811J8403j14959k3884J38896K11314K10784J76329
39539E00126L6861k34628m61591m09696o3167L25657M43687J68257k88412m73206
39529d56112j12097M84712O58045J93017l67395m38193j54250m6243j85963j78144
39519f02623Q4187K44318J26522j0527j5290p3425j72074O3008O21439P80497
39509A046032P8820q24367r16212j83706M54359M11193k3190l51159m40959l43729
39499a092918q5766J86864K62594J90185K04379K78959J58131j03660r7727K80689
39489A81730N65011L50432j56442m71793m19595j40116K00366M34624L74103O3176
$$ plain form
39559 -996343 -1318593 -1329906 -1119223 -1017645 -1027473 -809302 -275881 159209 107385 -264971
39549 -264971 -470931 -331568 -116757 -98354 -213313 -237197 -98301 113013 323797 500126
39539 500126 536987 302359 -159232 -568928 -632095 -306438 137249 305506 17094 -456112
39529 -456112 -568209 -83497 574548 767565 400170 -38023 -192273 -238516 -424479 -602623
39519 -602623 -518436 -274118 -147596 -158123 -173413 -246838 -418912 -355904 265535 1046032
39509 1046032 1124852 300485 -615727 -799433 -345074 66119 42929 -308230 -749189 -1092918
39499 -1092918 -1178684 -991820 -729226 -539041 -334662 -55703 102428 -1232 -98959 181730
39489 181730 746741 1097173 940731 468938 49343 -90773 109593 544217 918320 981496
39479I81496j27300M8196L08204J96546k52920n22920k99764J21975K41019j3275
39469F81257k26855p0031K47698K44805j60601m96805l74839k7752N9608j23967
39459b47482j56979J00242K77586Q7982k40040l19805j02370J86929L62504L39237
39449B87804J11440j37410j30017J02638J48886k26207o78901p12310l11320J37589
39439a407808L95949N19377N59538M53300K01237q1410k78120k82686k1552L34632
39429C92457L60171j24572o82890p38565l11960R8355K56736L34908L60048J06366
39419E1054l29697m28665j5966L70354K59633n0115m5805J35221Q384l28643k76966
39408f51211K68933O76886M83754j7727l31325l93760l48654j34509K76463N44158
$$ plain form
39479 981496 854196 902392 1210596 1407142 1154222 631302 331538 453513 694532 681257
39469 681257 454402 384371 632069 876874 716273 219468 -155371 -183123 -123515 -247482
39459 -247482 -404461 -304219 -26633 61349 -178691 -498496 -600866 -413937 -51433 287804
39449 287804 399244 261834 131817 234455 383341 157134 -521767 -1234077 -1545397 -1407808
39439 -1407808 -1011859 -492482 67056 520356 721593 640183 362063 79377 57825 392457
39429 392457 752628 628056 -54834 -793399 -1105359 -1007004 -750268 -415360 -55312 51054
39419 51054 -278643 -707308 -723274 -352920 -93287 -143402 -189207 -53986 -45602 -374245 -651211
39408 -651211 -382278 294608 778362 760635 429310 35550 -313104 -447613 -171150 373008
39398C73008L35593j31473l43919j99147o2282j57033k79074j65072J53596M45390
39388c0413N19283L33401K9469j52659j41398j30681k45128k87413r7646M6439
39378a56746j77776m89779l10674K93941N96700K81737q2415N6829M21182M16506
39368H49505K0739l35507m53280m30718k80347J9586K39617J32211j31870j66009
39358e36073O3695K43247K10534Q6849k9646j49111k10075j31144O022R7145K22422
39347a26135M22379M51836J41333j73928n5436L28008L98488J5790l94527n34712
39337D73096n10464l92163q1118K77499L12123L2114j01165R3537K29946L7559
39327C70964j83900j12265N9861J6094j36517j12381N1971J20371N7087k0224
$$ plain form
39398 373008 708601 577128 233209 34062 -28220 -185253 -464327 -629399 -475803 -30413
39388 -30413 488870 822271 851740 699081 557683 427002 181874 -105539 -203185 -156746
39378 -156746 -334522 -824301 -1134975 -841034 -244334 37403 -45012 11817 432999 849505
39368 849505 870244 534737 81457 -349261 -629608 -610022 -370405 -238194 -370064 -536073
39358 -536073 -472378 -229131 -18597 68252 38606 -110505 -320580 -451724 -445702 -348557 -126135
39347 -126135 296244 748080 889413 715485 660049 988057 1386545 1402335 1007808 473096
39337 473096 -37368 -429531 -510649 -233150 78973 111087 9922 103459 333405 370964
39327 370964 187064 74799 134660 150754 14237 -98144 -46173 74198 131285 111061
39317A11061q9515j47551q1852J29173K83190K37227J13085L7595o0777k06090
39307C25546k31220j02863o2671j87412j63889J76117M51889K69353j36604k42100
39297I6146Q991K38981K53722J76017P9588p6398k06095j70339n1519l3762p4431
39286B40901j391J45688J78841Q4893m572o7064j34409j21899j1479l3008l09804
39275c3303n05135k51342K11507L16164J7520j60462N0982L15564K95633J37798
39265C94926J30594K32139K01372j7344k59049l68673l34357k62397k62734l05465
39255h50988k46310p2695K4429k4640K3102L36002O30333N23918J15792j69639
39245B89304j97919j65143j15009J03755L99550M38750J67918q1232r8807k1774
$$ plain form
39317 111061 21546 -126005 -207857 -78684 204506 441733 554818 592413 531636 325546
39307 325546 94326 -8537 -71208 -258620 -422509 -246392 205497 474850 338246 96146
39297 96146 105137 344118 597840 773857 853445 777047 570952 400613 349094 315332 240901
39286 240901 239510 385198 564039 648932 644360 577296 442887 320988 309509 276501 -33303
39275 -33303 -538438 -789780 -578273 -262109 -244589 -405051 -354069 -38505 257128 394926
39265 394926 525520 757659 959031 941687 682638 313965 -20392 -282789 -545523 -850988
39255 -850988 -1097298 -1169993 -1145564 -1170204 -1147102 -811100 -180767 343151 458943 289304
39245 289304 91385 -73758 -188767 -85012 314538 753288 921206 839974 741167 719393
39235G19393K1344Q4536J28998p932k38167k31716L6264J56586r0248l74738l38571
39224a34251j22350p5083k18429l10370k40231q0784J06873K87668L78348L23932
39214h4677J59769o7505k88931l12413M445M24154M86209J15396k39119k25509
39204b8181k5337L6168o752O6703K32844K82053J71536N6786M5443R4565Q3407
39193A009235r9744m24651o33347m74523n9668K43803K95018K65772K36446R9728
39183D58069o5061Q107K36542J57505l09283n84361k79716J70570K01478j7794
39173b3944Q120K02734J15464k11258k97175p4437J1807j97778l17122j02646
39163h86235J63701J99997J52786K28779K91061J38971q1961o1906K26673M96321
$$ plain form
39235 719393 740737 825273 954271 946339 708172 476456 512720 669306 579058 204320 -134251
39224 -134251 -256601 -331684 -550113 -860483 -1100714 -1181498 -1074625 -786957 -408609 -84677
39214 -84677 75092 7587 -281344 -593757 -589312 -165158 321051 436447 197328 -28181
39204 -28181 -53518 -17350 -24102 42601 275445 557498 729034 785820 831263 925828 1009235
39193 1009235 909491 484840 -148507 -623030 -682698 -438895 -143877 121895 358341 458069
39183 458069 393008 401115 637657 795162 485879 -98482 -378198 -207628 -6150 -23944
39173 -23944 -15824 186910 302374 91116 -206059 -280496 -268689 -466467 -783589 -886235
39163 -886235 -722534 -522537 -369751 -140972 150089 289060 207099 145193 371866 868187
39153H68187M75151J35209l11151n45876l90600j4012K01703P9080j56345j62973
39143A78373J04513L42150K41831j39523l96874k30989J57993L04964J08939n0405
39133F20972O7170J68375p6912m49787m94293k11219J8695Q6133K21200M24363
39123C74697L62045m1566l82034l61210k00946k07608k63222q3234K53830L99001
39113a50247K54024P3679M2576J2535k27759n55373n51484N8P24394R43220M33561
39102I99184k70378n09190k74214p9435j75032k79183j27679J06662J29521l0357
39092e10101j27134o5735N5344J58235K55542L53760M06801L51409J68139m2291
39082A003969r7578K0064M2019k30820n20470l62618J77137M82600K22915j93312
$$ plain form
39153 868187 1343338 1478547 1167396 621520 230920 216908 418611 497691 341346 178373
39143 178373 282886 625036 866867 727344 330470 99481 257474 562438 671377 620972
39133 620972 688142 856517 779605 329818 -164475 -375694 -356999 -270866 -49666 374697
39123 374697 736742 695176 313142 -48068 -249014 -456622 -719844 -803078 -549248 -150247
39113 -150247 103777 177456 220032 232567 4808 -550565 -1102049 -1101991 -377597 565623 999184
39102 999184 728806 219616 -54598 -134033 -309065 -588248 -715927 -609265 -479744 -510101
39092 -510101 -637235 -702970 -647626 -489391 -233849 119911 526712 878121 1046260 1003969
39082 1003969 906391 926455 968474 737654 217184 -145434 31703 514303 737218 543906
39072E43906k51844n4371m0927k60679l61463j89104K4169P2812L7045O4366J43572
39061b72518J77368J21302R789n1881M8191K60760L48282J68231j05441k02544
39051E01539q8459J03212L15001M82354L61989j76622p40248p16739p0654N36616
39041E07989N53628J32326k40739l65944l44264k57655j42609j03157j65861j48294
39031e74580P6736L04206K38224q3324l50882l88287k56517m2282J86374K75410
39021f14922J23711r3042j03429P6806K09344K31159K59780K33699m0047m22945
39011a39886m77444j24088J67262Q6103m2670J62421M65116L81395l1685k67949
39001A78575j34558N8591M3411j02493k20834k68732k07717k0572J32472P4454
$$ plain form
39072 543906 292062 237691 196764 -63915 -425378 -614482 -590313 -517501 -480456 -416090 -272518
39061 -272518 -95150 26152 35941 -15940 32251 293011 641293 809524 704083 501539
39051 501539 413080 516292 831293 1313647 1675636 1499014 758766 42027 -28627 507989
39041 507989 1061617 1193943 953204 587260 242996 -14659 -157268 -260425 -426286 -574580
39031 -574580 -497844 -193638 44586 -38738 -389620 -777907 -1034424 -1076706 -890332 -614922
39021 -614922 -491211 -584253 -687682 -610876 -401532 -170373 89407 323106 283059 -139886
39011 -139886 -617330 -741418 -574156 -488053 -530723 -368302 96814 478209 446524 178575
39001 178575 44017 102608 146019 43526 -177308 -446040 -653757 -674329 -541857 -467403
38991d67403p5615o5083N1476R803j43907p9355K14283L31390J07473q9923M3083
38980a63778K80843K81075R9606j3851k0814P504J03782K17048J11374k22546
38970F80243l62666m5357L29149K32313j89701l64522j91029j18997l48640n09162
38960h88369k73112J59169M00352L71527K31588N4212j70614l24265j84714K77713
38950c46513P16423O52007R845o52417o78522r8869L93787L40070L4879m7478
38940C23212M5311p403j65687j36588N9607J26968J6609m9623k8916p4191j23622
38929a4323N1547L53697L82959N0771k63409k92028k01879j81728j12935J21030
38919a06298L29885K83134N1254j38284k03757j89789j06479M4600J84689K10155
$$ plain form
38991 -467403 -543018 -608101 -556625 -546822 -690729 -770084 -555801 -224411 -116938 -206861 -163778
38980 -163778 117065 398140 497746 483895 463081 470585 574367 791415 902789 680243
38970 680243 317577 272220 601369 833682 643981 279459 88430 -30567 -379207 -888369
38960 -888369 -1161481 -1002312 -601960 -230433 1155 55367 -115247 -439512 -624226 -346513
38950 -346513 369910 1021917 1031762 379345 -299177 -398046 -4259 335811 370690 323212
38940 323212 368523 361120 195433 58845 118452 245420 262029 212406 183490 109299 -14323
38929 -14323 37224 390921 773880 824651 561242 269214 67335 -114393 -227328 -106298
38919 -106298 223587 506721 557975 419691 215934 26145 -80334 -35734 148955 359110
38909C59110Q2766j31607k48966r8982J90199K17785j34406l85251p3782M81405
38899B58271N47065K9913l95668k66898J14968K62678J25954p8205k20268k15877
38889A61933r468J99573Q0186l08017m97609k80997J8670J14788J35151K11637
38879a74153J74985m4075j61061k1280P9784q9206k63488j43620Q8876J20639
38869d32599L2294O8558J86408K19641K03774J81951Q552l01839m00187j62605
38859c96052o696j96977k93547J24495O16818M87239p8525k78522O6337L49222
38849C93792K25131L2007N3806P7620q7675k35112j68357l1439J0604M2509J39081
38838D51967J65348L7615q3168l6107R7988J19861o1709l54369n09471k99246
$$ plain form
38909 359110 441876 310269 61303 -37679 152520 370305 235899 -149352 -223134 258271
38899 258271 805336 835249 439581 172683 287651 550329 676283 598078 377810 161933
38889 161933 152465 352038 432224 124207 -373402 -654399 -635729 -520941 -385790 -174153
38879 -174153 832 -43243 -204304 -225584 -145800 -235006 -498494 -642114 -553238 -432599
38869 -432599 -400305 -331747 -145339 74302 278076 460027 468579 166740 -233447 -396052
38859 -396052 -402748 -599725 -893272 -768777 -151959 335280 256755 -21767 44570 393792
38849 393792 618923 650930 704736 782356 694681 459569 291212 259773 270377 312886 451967
38838 451967 617315 654930 571762 535655 633643 753504 691795 337426 -172045 -471291
38828d71291J70961M68443L54978R6314j0033j22035m60086p18681m42013J79527
38818i53916N02734L51740J36728Q5390M722j40757p6679K01093L00083Q2013
38808D93151j11703p4896k3544o8554J1982K17273J44381k90513n31211k12409
38798d46043K17015K04315m3844K034K63133K27522j36667l09042n1736K48123
38788A74810J91533r5966k20394m6112K10977K89827J58455J436k8190J003p3316
38777E64063k36974l08638k05772k2810J47407K65618K44359N5165q0191P2372
38767D94599L21620K33924j87292m39414k74566n7081j35984l02680k01041R1693
38757d56222K61545K45656J71172N4009j11635j91258j36538j29738k23329j45534
$$ plain form
38828 -471291 -300330 168113 523091 619405 609372 487337 27251 -691430 -1133443 -953916
38818 -953916 -451182 -99442 37286 122676 127398 -13359 -90038 111055 411138 493151
38808 493151 381448 306552 283008 214454 226436 443709 588090 297577 -233634 -446043
38798 -446043 -229028 -24713 -68557 -66523 196610 424132 287465 -21577 -73313 174810
38788 174810 366343 270377 49983 3871 214848 504675 663130 664566 636376 637379 564063
38777 564063 327089 18451 -187321 -210131 -62724 202894 447253 502418 422227 494599
38767 494599 816219 1050143 862851 423437 148871 91790 -44194 -346874 -547915 -456222
38757 -456222 -194677 50979 222151 276160 164525 -26733 -163271 -293009 -516338 -661872
38747f61872J96415L64653l220n22256n22801n94M27557M02036J32484r5948j99818
38736d83364r6090K50241N26089L15949k52105n66785l59065j3527R0842P0689
38726e17126J33876J52928K276n1906K56575O47490N99514R6548l56820m43297
38716E20058l52579l30731k92810p1316K27703L59370K68585P0724j61387l63888
38706a26271l53223j9555L90623M84963K36450j4138r8866j97334l60410l00142
38696c57903P1406L14700R6253j97338j7291M23844M24949j11178n34679m38597
38686c25834j30411L5719J54979L35453L52171R8272j02980j7632Q9583n6067
38676D33253k44051j77817N675M6439L8322J32260J02077k60071n91347l90944
$$ plain form
38747 -661872 -465457 -100804 -104024 -626280 -1149081 -1149675 -722118 -320082 -187598 -283546 -483364
38736 -483364 -579454 -329213 196876 512825 260720 -306065 -665130 -678657 -587815 -517126
38726 -517126 -383250 -230322 -228046 -279952 -23377 624113 1223627 1320175 963355 520058
38716 520058 167479 -163252 -456062 -527378 -299675 59695 328280 399004 237617 -126271
38706 -126271 -479494 -499049 -108426 376537 612987 598849 499983 302649 -57761 -357903
38696 -357903 -286497 28203 124456 -72882 -90173 333671 758620 647442 112763 -325834
38686 -325834 -456245 -420526 -265547 69906 422077 520349 417369 399737 489320 433253
38676 433253 189202 11385 17060 63499 101821 234081 336158 76087 -515260 -906204
38666i06204J67314M42506K56335M4307R9143K21945J98487J17246O7406n4725
38656F53760k49202k62880M2493L97471M08650L5542l41781l09619J36130N27678
38646A038242L97119j63417n82785n06537j64422O1700J10875Q0477n4906k49691
38636c3345k33568P8037L09863J59391r5632p0106O7799l9359k10336l7775K78599
38625A73568J86626k05134k04367K85637N11295P1046m15082k95008J11063R2269
38615C11913l23483m83482j37246K62834K79695L6510p8211M9210J89395J28516
38605B35651n1905r3597Q9075K88761K76973P1637j51550k63957j89065Q7598
38595B99621L43001K15752k56046m88852j18817L77911L25449j40462l20712n6162
$$ plain form
38666 -906204 -738890 -296384 -40049 4258 103401 325346 523833 641079 708485 653760
38656 653760 404558 141678 184171 581642 990292 1025834 684053 374434 510564 1038242
38646 1038242 1435361 1271944 689159 182622 18200 79900 190775 271252 216346 -33345
38636 -33345 -266913 -188876 120987 280378 184746 114640 182439 143080 -67256 -105031 173568
38625 173568 360194 155060 -49307 236330 747625 818671 403589 108581 219644 311913
38615 311913 -11570 -495052 -632298 -369464 -89769 -53259 -131470 -82260 107135 235651
38605 235651 183746 90149 179224 467985 744958 816595 665045 401088 212023 299621
38595 299621 642622 858374 602328 113476 -5341 372570 698019 557557 236845 180683
38585A80683J38941L5951J5734K66240L79723O7220l27185l90766k19556p6863
38575G0122N9975K37734K41990j9353k14637q0267J10826q268k70306k36145J07899
38564d30L46408K34785m8086k04745j25469O9926J38787n8034l52006m32895k58652
38553f90411p1394K3616J66252L54838L50064J23040p659R9198J48680p0565l10766
38542A14893l06780k01525j96878j62894L0111J53945J1441j48261l7468J56167
38532e87249J19419j5240O1398K54067K65897J57864J73011K04079O043k26792
38522D12497j17587J56671M9454m25864o20398k37730K21323K38968k7796j40702
38512d91164k9614R8117J72566K38071K33860R7693o5882j50498k18197k99159
$$ plain form
38585 180683 319624 355575 371309 637549 1017272 1084492 757307 366541 146985 70122
38575 70122 130097 367831 609821 590468 375831 295564 406390 398122 127816 -108329 -430
38564 -430 345978 580763 532677 327932 202463 272389 411176 353142 1136 -431759 -690411
38553 -690411 -761805 -738189 -571937 -217099 132965 256005 248346 347544 496224 425659 114893
38542 114893 -191887 -393412 -590290 -753184 -723073 -569128 -557687 -705948 -743416 -587249
38532 -587249 -467830 -483070 -421672 -167605 98292 256156 429167 633246 639289 412497
38522 412497 294910 451581 501035 75171 -545227 -782957 -561634 -322666 -350462 -491164
38512 -491164 -520778 -422661 -250095 -12024 221836 319529 253647 103149 -115048 -414207
38502d14207k26177N9302K24039o2135n27008n16127J12517P20647P31640L76241
38492D78732K33307L18388J83872j78965k25848J85275M11416J6893m56674l39330
38482F27066M4097o4974m86233l07561N43274R91743L96330m91152o64546k10434
38472C77610J13925O1791m9227p4824j44525k29519j80439o7545m2437j6157J36665
38461a14682K42398Q4790j85031k62109j34683J0967J23263K00502J15324j32726
38451e1987k36016m747K71579K41990J9192o7803K0019J28870K31138K88056J09495
38440I49786k68572m10328r4911K60953K35956N3471Q9305J62215o0278l25798
38430E91799j73250K26155L07025o613l08266m09414m06710k63578L6471J51404
$$ plain form
38502 -414207 -640384 -581082 -357043 -419178 -946186 -1462313 -1349796 -629149 102491 478732
38492 478732 712039 1030427 1214299 1035334 809486 994761 1406177 1423070 966396 627066
38482 627066 671163 606189 119956 -187605 355669 1347412 1743742 1252590 588044 377610
38472 377610 491535 553326 504099 429275 284750 55231 -125208 -192753 -235190 -251347 -114682
38461 -114682 127716 212506 27475 -234634 -369317 -358350 -235087 -34585 80739 -51987
38451 -51987 -288003 -292750 -21171 220819 240011 172208 192227 321097 552235 840291 949786
38440 949786 681214 270886 175975 436928 672884 726355 815660 977875 917597 591799
38430 591799 418549 644704 951729 945116 636850 227436 -179274 -442852 -406381 -254977
38420b54977j37933l64223j7944N05768M27682j48315l83790k5713L29109K86436
38410B16100Q5780q2776l28942n02217k10535M04445O60988L25590o0570l8747
38400D69116K07812L28361K59114N3170k19636l22438r6879J62708J00779o6986
38390H75121O8628K98312J24775k68338k58909J03878J74902j34804k58897n3094
38380F71574K9136q7255L7428L99492M70521K00877P6581P7791k87471p80991
38370H07683n36812L62992P46196K21580j36828M16176J082736Q70084O0266m74198
38360C419875n01450k55820J10148K79229j52208q16989p60003K7698L73175k13288
38350A510367o91560k59574L22588J38188l61860l51027p9625j58568l17748o6925
$$ plain form
38420 -254977 -392910 -757133 -775077 -269309 158373 10058 -373732 -399445 -70336 216100
38410 216100 301880 219104 -109838 -612055 -822590 -418145 242843 568433 507863 469116
38400 469116 676928 1005289 1264403 1317573 1097937 775499 678620 841328 942107 875121
38390 875121 943749 1242061 1366836 1098498 839589 943467 1118369 983565 724668 671574
38380 671574 700710 613455 650883 1050375 1520896 1721773 1798354 1876145 1588674 807683
38370 807683 270871 633863 1380059 1601639 1464811 1880987 2963723 3833807 3894073 3419875
38360 3419875 2918425 2662605 2772753 3051982 2899774 2082785 1322782 1350480 1723655 1510367
38350 1510367 818807 559233 881821 1020009 658149 307122 227497 68929 -248819 -315744
38340c15744K13275l224l01290o6980L69845L84807J76366K26832L24600R9753
38330A108240j45692o5055M78k14564k31655K00403M08024P780k17516K93215
38320A143658P09428K12793n16101n01132r2133k8616K6486N42033P84160M1911
38310B322487p96112n70488J54838J43149l49635k56653K46448K13395k15298
38301H92131k14269P9084J1135j46839J60925M33908L5868l91862o8781L61957
38291A153257R2475j88908K93446O49860k1161o51021n9192P23133L54871k32938
38281B113822K52148P64340K2327o08704M09696J446768M91553p97459M3065J478718
38271E616274P03278q92424k06272J557732J140738l09549O11952K670835K283877
$$ plain form
38340 -315744 -102469 -105693 -406983 -473963 -104118 280689 457055 683887 1008487 1108240
38330 1108240 962548 897493 897971 683407 451752 652155 1060179 1067959 850443 1143658
38320 1143658 1853086 2065879 1549778 1048646 956513 927897 954383 1496416 2280576 2322487
38310 2322487 1526375 955887 1110725 1253874 904239 647586 894034 1107429 892131
38301 892131 677862 756946 768081 621242 782167 1216075 1251943 860081 791300 1153257
38291 1153257 1245732 1056824 1350270 2000130 1978969 1327948 1268756 1991889 2346760 2113822
38281 2113822 2365970 3130310 3152637 2543933 2953629 4400397 4891950 4094491 4137556 5616274
38271 5616274 6319552 5427128 5220856 6778588 7919326 7609777 8221729 10892564 13176441
38262A3176441J044890K999205N889405M237408O8275K03076L559166L183406
38254C4361272Q19669M984668J3475821J5921922J7828534L8838586P4242109
38247B00472581Q2052150L2967366m1820000q1303918o6619638l4289755j9822004
38240G1636782j9182787j3724063m121798j564537m360176l258073M95805o52699
38232B5268454n116883n353437j768552q37278k795632k479680J18376L97695
38224G433063j549629j467707N35519M64861j536378j502639O86061J263322k42444
38215D084029n95866O96157R37080r675L35520J554488P26293j702647k226580
38206C798799n49287P6836j035102j129163L52870P44022n27229q41250M78074
$$ plain form
38262 13176441 14221331 17220536 23109941 27347349 27415624 27618700 31177866 34361272
38254 34361272 35180941 40165609 53641430 69563352 87391886 126230472 200472581
38247 200472581 282524731 315492097 273672097 192368179 125748541 91458786 71636782
38240 71636782 52453995 38729932 34608134 33043597 28683421 25425348 25921153 25268454
38232 25268454 20151571 14798134 13029582 12192304 9396672 6916992 7035368 7433063
38224 7433063 5883434 4415727 4951246 5416107 3879729 2377090 3063151 4326473 4084029
38215 4084029 3488163 4184320 5121400 5111725 5447245 7001733 7728026 6025379 3798799
38206 3798799 3249512 3326348 2291246 1162083 1514953 2258975 1731746 890496 1368570
38197A368570R23343k89855q59103r506J76471q09175p10154R43306J531675O9849
38187B335421r99809k90241L40627k85402n25743N19552J066095J22570o07782
38178A675288r1007J81904n65168p07012M38059R45517j54939r43230j64477N19505
38168A134440j50611o61411J66377P89474n4275q70511k69897M63673O665m76762
38158G7162J90521P81381J26047m98036J38411P44604j2642q94791m37517L43819
38148E58959Q2466l14348L23130R67911M92219N9237Q17731J379241L26714r02120
38138C791140n22541K92662l09626j250337m92780J072654J163062J41989O3163
38129C949386P69202M00362r42835j353386n04595J03024l7087n8148J66207k0184
$$ plain form
38197 1368570 2291913 2002058 1142955 1133449 1309920 500745 -209409 733897 2265572 2335421
38187 2335421 1335612 1045371 1385998 1100596 574853 1094405 2160500 2283070 1675288
38178 1675288 1584281 1766185 1201017 494005 932064 1877581 1722642 779412 614935 1134440
38168 1134440 983829 322418 488795 1278269 1223994 353483 83586 547259 553924 77162
38158 77162 267683 1049064 1175111 677075 815486 1560090 1547448 652657 215140 558959
38148 558959 641425 327077 650207 1618118 2110337 2169574 2987305 4366546 4693260 3791140
38138 3791140 3268599 3561261 3251635 2001298 1508518 2581172 3744234 3886223 3949386
38129 3949386 4718588 5118950 4176115 2822729 2318134 2421158 2384071 2325923 2492130 2471946
38119B471946l70970k20129o7399n97946r70593k25284O49371L29603l41169Q6365
38109G43795Q50228L93842o03850m65916L22112J54461n19941j48834P16186L48419
38099A790502p87564q07096J15281K39477l74902k27753M53105J76393o66345
38090h8902m07292N88580N21072l78058l22579N21240M24568m27855l34222M76475
38080E73027L45870l43440J07618J051952M74008q93598n98762Q43554P17388
38071B277617p93408r49150L12871M20907o04555j65124J502936J366214n34165
38062B834143q61999P50527J055833l99803l66530J539238J784097j85189o64500
38053E485817J070206J259274p26062p19446K059097L090279J403289J750765
$$ plain form
38119 2471946 2100976 1880847 1813448 1215502 244909 19625 668996 998599 657430 743795
38109 743795 1594023 1987865 1384015 918099 1240211 1394672 874731 725897 1442083 1790502
38099 1790502 1002938 195842 311123 550600 175698 -52055 401050 577443 -88902
38090 -88902 -496194 92386 613458 235400 -87179 434061 858629 430774 96552 573027
38080 573027 918897 575457 683075 1735027 2209035 1315437 716675 1560229 2277617
38071 2277617 1484209 535059 847930 1268837 664282 499158 2002094 3368308 2834143
38062 2834143 1972144 2722671 3778504 3378701 3012171 4551409 6335506 6150317 5485817
38053 5485817 6556023 7815297 7089235 6369789 8428886 11519165 12922454 14673219
38045A4673219M909348N266000J819812J123102M647670N102159J312253L014138
38037D1867701J2611610J8506059J9202389L4850765P2436442R5233624N9521726
38030C54230316k1498509q3079628q4388144n0014055k5722167k1426620j7999541
38023E0101652q120562k428704m550403n486177j875837o56523m187271n919599
38015A6876576l032695q43468k144559k809551o61915N64868j066579k092623
38007D790054n57455N27194o61405j446578j42025Q21774j55095q89706Q6540
37998B373298P42835l03365j109912k48733N59512q4378p23115j31793L84990
37989A459339j66327m79013K33482M63823n78918j118646m781J021560L71306
$$ plain form
38045 14673219 19582567 24848567 26668379 27791481 32439151 37541310 38853563 41867701
38037 41867701 54479311 72985370 92187759 127038524 199474966 294708590 354230316
38030 354230316 332731807 249652179 165264035 115249980 89527813 68101193 50101652
38023 50101652 41981090 39552386 35001983 29515806 27639969 26983446 22796175 16876576
38015 16876576 13843881 13000413 10855854 8046303 7384388 7949256 6882677 4790054
38007 4790054 4232599 4759793 4098388 2651810 2509785 3331559 3176464 2286758 2373298
37998 2373298 3116133 2812768 1702856 1454123 2013635 1929257 1206142 1074349 1459339
37989 1459339 1293012 813999 1047481 1511304 932386 -186260 -191041 830519 1201825
37980A201825o54822l61595M37254K49027l98485k95037J46355r666l25715p9356
37970i0215J60192k24894m56466J72705P28216J98119o24091m86240K21494L52578
37960d8602j522K498L12479L06534P1264M7838N8274j72531k29686J96202M91314
37949A034062J33935k74452m2796L60910J91376k22220j49296K02141J61004j64271
37939A230393j99706K6204J06323Q0877J57981J05844k41384m12010o4477K47628
37929A037673m8019m74919k65587L16427M29268P9500Q3524P32558J348400J197428
37919D436253K88067p25998j113219o99936j27206j50572o12139o71460j29969
37910D93821K84529J58430m0028p06j44618o11374p16132j32861L57254J10576
$$ plain form
37980 1201825 547003 185408 622662 871689 473204 178167 324522 314856 -10859 -90215
37970 -90215 69977 -154917 -611383 -438678 289538 487657 -136434 -622674 -401180 -48602
37960 -48602 -50124 -47626 264853 571387 642651 690489 748763 576232 346546 542748 1034062
37949 1034062 1167997 893545 850749 1211659 1403035 1180815 1031519 1233660 1394664 1230393
37939 1230393 1030687 1056891 1163214 1244091 1402072 1507916 1266532 854522 790045 1037673
37929 1037673 989654 514735 249148 565575 994843 1074343 1157867 1890425 3238825 4436253
37919 4436253 4724320 3998322 2885103 2185167 2057961 1907389 1295250 623790 493821
37910 493821 778350 936780 896752 896046 751428 140054 -576078 -708939 -351685 -241109
37900b41109l09469j87844J14216k5681k72849j8006M17971L70710L5219p988
37890a24830O6984k30295n99070m00893J49452L26883J17008O2355J84012P7900
37880c70494j67791j42675K6850o9636k63158j21074J58472J20359M585K98805
37870e25757O50049L57930k74380k97725K71292M38242j14823n70417l69438M4659
37860c90368J62581J04072O1280p4656k28886q0382K61154K79682l8879j12082
37850e6484K12104L52343n848l95040l74723j32536L7846J67048K19966k2657
37840B019l78525k76325K84152N04312l5652o50682n39098Q1615M17502K29820
37830c60862o8682j41624j6659J65404K67086J60637p9914j57177M4704K40373
$$ plain form
37900 -241109 -550578 -738422 -624206 -649887 -922736 -940742 -522771 -152061 -116842 -124830
37890 -124830 -57846 -288141 -887211 -1288104 -1138652 -811769 -694761 -632406 -448394 -370494
37880 -370494 -538285 -680960 -654110 -723746 -986904 -1107978 -949506 -829147 -824562 -525757
37870 -525757 124292 482222 207842 -89883 181409 619651 504828 -65589 -435027 -390368
37860 -390368 -227787 -123715 -62435 -137091 -365977 -446359 -185205 94477 55598 -56484
37850 -56484 155620 507963 502115 107075 -267648 -400184 -362338 -195290 24676 2019
37840 2019 -376506 -652831 -368679 135633 99981 -550701 -1089799 -1008184 -590682 -360862
37830 -360862 -429544 -571168 -587827 -422423 -155337 5300 -74614 -231791 -187087 53286
37820E3286J51753q7917j78821j05475q4799j79222j88475P0125M63277N81999
37810D95731J91515l57294m45685m3245J63448j96434n14862j38854M90534M50058
37800I4912j98573n15729j84649J12600m6207j98082L4136K60301R4775j61217
37790g07733j38924l8421j02642o3073L01908N82365L30721j80209l86766k59087
37780f61861j22756L878K78423M91067K82202k07809m50064k52477O2368J78121
37770c98908J11157J8116k8498m8652r9925j80495j42225J23993L92187L08599
37760E5349k1852p0098L16005O02548L50768j39353l43225k57619j86732j44596
37750A61195J9940J74566R6544q2874j03581n6638j61083k51317j9806L57170
$$ plain form
37820 53286 205039 117122 -61699 -167174 -251973 -431195 -619670 -549545 -86268 495731
37810 495731 687246 329952 -115733 -158978 4470 -191964 -706826 -845680 -355146 94912
37800 94912 -103661 -619390 -804039 -691439 -737646 -935728 -901592 -641291 -546516 -707733
37790 -707733 -846657 -885078 -987720 -1050793 -748885 -166520 164201 -16008 -402774 -661861
37780 -661861 -784617 -780739 -502316 -11249 270953 63144 -386920 -639397 -577029 -398908
37770 -398908 -287751 -269635 -298133 -346785 -446710 -627205 -769430 -645437 -253250 55349
37760 55349 33497 -36601 279404 881952 1232720 1093367 750142 492523 305791 161195
37750 161195 181135 355701 452245 369371 265790 209152 48069 -203248 -223054 134116
37740A34116L95873O5378j69031q6363K5574o0133j59444p4326N8760L8756p6930
37729I2230j31820j30261j43780j27337j4261J12485J06054l2683j47662j27638
37719e44673l4340M420j2907L2589J56048J86502L5874r0795J3236J64504K0182
37708f9360l38401m50712j55600J95393L20212L57534M46134M14387J72361k0101
37698H71847j6193r3500m12274n87586k90009J09775P0623k55135l18517r3875
37688a014844p566r0102N1299M11141M78922J04036j97915n0077K45557K71361
37678B01812J08423M5152O5895m655j28557j60374j28045j33347j26350l314J88231
37667g5129K98062K21343o1694m19606n20799j27097M82870O93453L00945k10998
$$ plain form
37740 134116 529989 595367 426336 339973 365547 305414 145970 71644 130404 169160 92230
37729 92230 -39590 -169851 -313631 -440968 -455229 -342744 -236690 -269373 -417035 -544673
37719 -544673 -579013 -574593 -587500 -554911 -398863 -212361 -176487 -267282 -254046 -89542 -69360
37708 -69360 -407761 -858473 -1014073 -818680 -498468 -140934 305200 719587 891948 871847
37698 871847 855654 762154 349880 -237706 -527715 -417940 -347317 -602452 -920969 -1014844
37688 -1014844 -1022410 -1112512 -1061213 -650072 -171150 -67114 -265029 -315106 -69549 201812
37678 201812 310235 355387 421282 416627 288070 127696 -349 -133696 -260046 -263360 -75129
37667 -75129 222933 444276 382582 -37024 -557823 -684920 -202050 491403 792348 581350
37657E81350l17299p9249Q5629j8601k74294m99393n26339k42679J89247L63857
37647g37771J48729o1132Q9163L47187K58588p8800j83393k833L0883j97067k34073
37636f20519J62976N33291L67994j26023l43178j05780K39338L68280K19645j65909
37626E30115o09191o85748j35571O08600P76151K36175l30237l78331j46591j04103
37616b38731k12038j39201J17502K82809K71961J91389K7449k54011m22409k21004
37606e96284J80689L70006K59512P9526r7860l53979n02449k27410L00741M97572
37596h9936J91339j41256j37656j1120r398L4716K51492L37434P2704j79245j6922
37585C02152K73454J23755l68624n05963J767O14768O75445J75826l48766m63510
$$ plain form
37657 581350 264051 184802 270431 251830 -22464 -521857 -1048196 -1290875 -1101628 -737771
37647 -737771 -589042 -650174 -561011 -213824 44764 -34036 -217429 -220262 -189379 -386446 -620519
37636 -620519 -457543 75748 443742 317719 -25459 -131239 108099 476379 696024 530115
37626 530115 -79076 -764824 -900395 -291795 484356 720531 390294 11963 -134628 -238731
37616 -238731 -450769 -589970 -472468 -189659 82302 273691 301140 47129 -375280 -596284
37606 -596284 -415595 -45589 213923 293449 195589 -158390 -660839 -888249 -587508 -89936
37596 -89936 101403 -39853 -177509 -188629 -198027 -163311 88181 425615 498319 319074 302152
37585 302152 575606 699361 330737 -175226 -173459 441309 1116754 1292580 943814 480304
37575D80304k12667N4784J24871J16832J96163K27348k3716l95917m36965p9828
37565E1209K12075J45027p018M8050J43891P6915M1430J94002K05638k10620o72406
37554B28193o16028j39150K33373L67015M63258M25223J5318m76859m90734j06364
37544i6755M4317j81081k53415L4523J86729r1733l38284j08141K90993L35143
37534a77704J00096K7172J88014K74350J43317l8180j11448r2863o5982q4815
37524A61957j37430j39072n4985l234n4374j5016K84683N71917M27198j8904j96120
37513H26620K6333J37301j48518m01305j95641J83526J97017j53186m30797m04815
37503c63465j81260R3485L02337L07917J36172L3485J01414J17721l6092r2418
$$ plain form
37575 480304 267637 322421 447292 564124 760287 987635 963919 568002 131037 51209
37565 51209 263284 408311 401293 449343 593234 670149 711579 905581 1111219 900599 228193
37554 228193 -387835 -526985 -293612 73403 536661 961884 977202 500343 9609 -96755
37544 -96755 -52438 -233519 -486934 -452411 -265682 -357415 -695699 -803840 -512847 -177704
37534 -177704 -77608 -50436 137578 411928 555245 517065 405617 312754 246772 161957
37524 161957 24527 -114545 -169530 -172764 -227138 -242154 42529 614446 1041644 1022740 826620
37513 826620 852953 990254 841736 440431 244790 428316 625333 472147 41350 -363465
37503 -363465 -544725 -451240 -148903 159014 295186 328671 430085 547806 511714 419296
37493D19296J25807K80199J1721m03095m05052p272K34765O8194j51957p7242
37483I5364J52219K07465L6155j67542k61584k46111j55057l338J60203K21193
37473C8967R3042j22196j55774J06238L88148L21093n7097l58944l91660l11298
37463d49481j99347R1994N08686O33907K50626k64026m19843k17347K6102J74765
37453A36036K57392J95249o9372l23165k97602l4445K06980K63960J01673k34283
37443B02423m83497k97626K17794M32778K3107m84810m44849j9539J73330M7223
37433f33666K1919J89521K18893O7453R4146L55079M10234L8745l66990l72428
37423B2906p5740J19119J2776k75979m75349l52459M3123L27047K17459m7120
$$ plain form
37493 419296 545103 825302 837023 433928 28876 21604 256369 324563 172606 95364
37483 95364 247583 455048 491203 323661 62077 -184034 -339091 -342429 -182226 38967
37473 38967 132009 9813 -145961 -39723 348425 669518 612421 253477 -138183 -449481
37463 -449481 -648828 -556834 -48148 585759 836385 572359 152516 -64831 -38729 136036
37453 136036 393428 588677 519305 196140 -101462 -135907 71073 335033 436706 202423
37443 202423 -281074 -578700 -360906 71872 94979 -389831 -834680 -854219 -680889 -633666
37433 -633666 -611747 -422226 -203333 -135880 -41734 313345 723579 762324 395334 22906
37423 22906 -52834 66285 79061 -196918 -672267 -1024726 -981603 -654556 -437097 -484217
37413d84217m3565J96002L01698K24969K48251L46566J35902m15278p84762o19987
37403h94421j83335J33198K73655K85881J07442j48917j54447R5416J45622j91227
37393e31133m28863j31287L70513M59390J06929k16165k46845o6717K44939N85739
37383A46500O16776J13578n17509n81363j160N47363M99693K5917l41918l79543
37373A28334k56598j55185m6999J57385L70487L50720K3705l03191k44231J42275
37363A66702L88664K49223m048o9681n6049j54955k06162k703K00734k0004n52218
37352f0497q21213n75800j44843J42830L26583M53547L09698j81181o08519n02515
37342a661910K5885M00254L05977L4086L8501L45008N51498L61164m8670k74445
$$ plain form
37413 -484217 -527782 -331780 -30082 194887 443138 789704 925606 510328 -274434 -894421
37403 -894421 -1077756 -944558 -670903 -385022 -277580 -426497 -580944 -485528 -339906 -531133
37393 -531133 -959996 -1091283 -720770 -261380 -154451 -370616 -617461 -684178 -439239 146500
37383 146500 763276 876854 359345 -222018 -223178 324185 823878 849795 507877 128334
37373 128334 -128264 -283449 -330448 -173063 197424 548144 571849 268658 24427 166702
37363 166702 555366 804589 800541 730860 674811 519856 313694 310991 511725 491721 -60497
37352 -60497 -881710 -1457510 -1602353 -1459523 -1132940 -679393 -369695 -550876 -1159395 -1661910
37342 -1661910 -1636025 -1235771 -929794 -895708 -857207 -512199 39299 400463 351793 77348
37332G7348j91576k2184P2185J84943L42465K91816j16943n55873n78285k24981
37322g21085R3276K16160L05298L44226R6663l28220m03473N5777N09032M14698
37312E82352l0969k72825k00911j18498j36534j02126j3641k1551o0575O4625
37302c10653K44942J72317j13727k58221k04775k57775m35930l44145R4925L77601
37292a035441K31402J10296L97855O57502L25876k71457l75895n331J40976j08765
37282F7018j80679J54250L54398P4164k29919j01081J74259J43365n4157p6134
37272C25484n0388k33522l82067j33466K62916K76217l0045j29374P0447J39807
37262A16009q3145k63426j84416j1778J16475K14558J42225k22108m72797m7369
$$ plain form
37332 77348 -114228 -136412 -64227 120716 463181 754997 638054 82181 -496104 -721085
37322 -721085 -627809 -411649 -106351 237875 334538 6318 -397155 -341378 167654 582352
37312 582352 551383 278558 77647 -40851 -177385 -279511 -293152 -314703 -375278 -310653
37302 -310653 -65711 106606 -7121 -265342 -470117 -727892 -1163822 -1507967 -1413042 -1035441
37292 -1035441 -804039 -693743 -295888 361614 687490 416033 40138 34807 175783 67018
37282 67018 -113661 40589 394987 469151 239232 138151 312410 455775 401618 325484
37272 325484 275096 41574 -340493 -473959 -211043 65174 35129 -94245 -23798 116009
37262 116009 32864 -230562 -414978 -426756 -310281 -95723 46502 -175606 -648403 -695772
37252f95772P68867R79750K84775m35215m39962j42819k12649m11378j58044K97028
37242a65419K39202k48379l67394J06860N22735M29838J33338k2935j53584l07107
37232A67155j61366L20592N39911J03425m62852m38630Q160J20284k72003n62525
37222f37849l41401Q8634L12829L67499M32487L94504Q1690l27812m86979l37878
37212d54276j10842K6229O3935j947j42361j70672O7046L81211L92461L2940l56827
37201b73103m79601l76099k06890k2371J31724J53464Q7096J30968K83725K77429
37191b93658O8758M1791L86407O24715K52969l91426n13563j8036L69799K01061
37181G28817j34270j68339p3811k31277n42190o38232m66380k22029N8209L88583
$$ plain form
37252 -695772 73095 1052845 1337620 902405 462443 319624 106975 -304403 -462447 -165419
37242 -165419 73783 -174596 -541990 -435130 87605 517443 650781 627846 474262 167155
37232 167155 5789 326381 866292 969717 506865 68235 76395 196679 -75324 -637849
37222 -637849 -979250 -890616 -577787 -210288 222199 616703 698393 370581 -116398 -454276
37212 -454276 -565118 -538889 -474954 -476901 -619262 -789934 -722888 -341677 50784 83724 -273103
37201 -273103 -752704 -1128803 -1335693 -1358064 -1226340 -1072876 -985780 -854812 -571087 -293658
37191 -293658 -224900 -183109 203298 828013 1080982 689556 175993 157957 527756 728817
37181 728817 594547 426208 352397 121120 -421070 -1059302 -1525682 -1747711 -1689502 -1300919
37171a300919N15424K05746k29137k02933L10913O69712M24309j03461l31607
37162d1953j88695n1008q8181n4478K36571N42981M91704R0660k85450l80566
37152B71585k92303j82692j9548K27003L61226K12796k9238n0333R8208Q6210
37142F82914j40673k72250j50438J1184M2720P2622J83368J74623p5895l22780
37132B05395l11121j68069j41203j74227o5051J30778J85104P3956k2754k0031
37122c07223J5520L2320K1395l0612o8732N096J16355O3046q5690K1980M00496
37111A83951N08264L9375m64121l38227J72850K77725j39931l94495j05378K87166
37101B7179K94566M8780q4505o7048m5768l1087j4298r5269k35323j75057J54311
$$ plain form
37171 -1300919 -785495 -579749 -808886 -1011819 -700906 -31194 393115 289654 -41953
37162 -41953 -230648 -281656 -369837 -424315 -187744 355237 846941 937601 652151 271585
37152 271585 -20718 -203410 -222958 4045 365271 578067 548829 498496 596704 682914
37142 682914 542241 269991 119553 130737 173457 246079 429447 604070 528175 205395
37132 205395 -105726 -273795 -414998 -589225 -654276 -523498 -338394 -264438 -287192 -307223
37122 -307223 -291703 -259383 -237988 -268600 -337332 -332236 -215881 -152835 -238525 -216545 183951
37111 183951 692215 731590 267469 -70758 102092 379817 239886 -154609 -259987 27179
37101 27179 321745 370525 286020 218972 173204 142117 127819 32550 -202773 -377830 -223519
37090b23519M22893L65062J74089J37166J29174j49381n66884o07353p3022N64230
37080A72455O78700K20456k55373k91689p1276p0017k88317k21470K91855O55273
37070H20597L33833k82709m09372l5029J34565j48500l32644o8143K08701O7439
37060B88738j93436j23997J04172R5225q544J75018M69485L39230k02988n47704
37050C95199l91951j02176l9986n7237R3820K79736K43272N3965l9186l5076j24293
37039B76087k72418k02241J22370K84551o0388n86076n84657O7373O12781L93676
37029E1058j74083j44370N47248R11945L49463m33165m58728R7473K65336k05043
37019H07134n32955j70404L97456M34547l2672m10192l73992q2548K16625L85354
$$ plain form
37090 -223519 199374 564436 738525 875691 1004865 855484 288600 -318753 -391775 172455
37080 172455 851155 1071611 816238 524549 453273 383256 94939 -126531 165324 820597
37070 820597 1154430 871721 462349 427320 561885 413385 80741 12598 221299 288738
37060 288738 95302 -28695 75477 170702 162158 337176 806661 1145891 942903 395199
37050 395199 3248 -98928 -138914 -196151 -102331 177405 420677 474642 435456 400380 276087
37039 276087 3669 -198572 -76202 208349 147961 -438115 -1022772 -955399 -342618 51058
37029 51058 -123025 -267395 279853 1191798 1541261 1108096 649368 746841 1012177 807134
37019 807134 274179 103775 501231 935778 903106 492914 118922 36374 252999 638353
37009F38353L15712K323l37506m59119l62059j91744l50J69086J27266j98914
36999b96952m57929k35455K87661M79345J47364j67175M490L94398M75062K29444
36989H60253o152j91228n12485p85584n42383J88104P21860N76012Q0441j33588
36979B55250N8982K73769K05972n8070k17193p6920K22751K74432j11670n20590
36969C06713l78708J96167M72645J62172j79985r7913N0914j72992m31466j97858
36959b70311K25807J36162l56355m44146P1888M72034K66256j35255j77905P1933
36949a39892K48581K37846Q9063j65263l28777j23641K91024L38039j59437o20536
36939c32993m79437Q7515N16034N48345K66942j69855m79702l10278K80244O95190
$$ plain form
37009 638353 954065 956388 618882 159763 -202296 -394040 -394390 -225304 -98038 -296952
36999 -296952 -754881 -990336 -702675 -223330 -75966 -243141 -238651 155747 630809 860253
36989 860253 854101 662873 150388 -635196 -1177579 -989475 -267615 308397 388838 255250
36979 255250 314232 588001 793973 735903 518710 441790 664541 938973 827303 306713
36969 306713 -71995 124172 596817 758989 579004 481091 532005 359013 -72453 -270311
36959 -270311 -44504 91658 -264697 -708843 -636955 -164921 101335 -33920 -211825 -139892
36949 -139892 108689 346535 435598 270335 -58442 -182083 108941 446980 287543 -332993
36939 -332993 -812430 -724915 -208881 339464 606406 436551 -43151 -353429 -73185 622005
36929F22005M94799n7140m33182m98248m03309j78478J63704L96752L49297J86845
36919F43045J01064j6995k65668m04213k25145K8336L0803j01278q1469Q193p5172
36908c58499k05504p8438K07025K65825O3430l5478J42321L39562K63096p5233
36898E28107m25553n00150j75784L15085N24830L04508j0994j05765q2392j17210
36888B54682p1583J83716L74085J97108j43945k24053k0457J58110J69275O4888
36878I41826j64364m64500n62509l43954j35456j89168j93977J94211O43688N72997
36868B98794O4960k59848j35041J50054K93289J94669j87023o65231p43317k47160
36858a235854K47976K11042l170J74686M39154J23130n19577o16146j03171K49964
$$ plain form
36929 622005 1116804 1059664 626482 128234 -275075 -453553 -289849 106903 456200 643045
36919 643045 744109 727114 461446 57233 -167912 -139576 -108773 -210051 -291520 -283327 -358499
36908 -358499 -564003 -642441 -435416 -169591 -106161 -141639 682 340244 603340 528107
36898 528107 102554 -397596 -573380 -258295 266535 571043 560049 454284 371892 254682
36888 254682 183099 366815 740900 938008 794063 570010 549553 707663 876938 941826
36878 941826 777462 312962 -249547 -593501 -728957 -918125 -1112102 -917891 -274203 298794
36868 298794 363754 103906 -31135 118919 412208 606877 419854 -245377 -988694 -1235854
36858 -1235854 -987878 -776836 -780006 -605320 -166166 -43036 -562613 -1178759 -1281930 -1031966
36848a031966J96330K47329M89737L48873k34645n14183j59160K57642L26995
36839g3048L34746L83866P3066m99789n17308J98970O70587K67207k97368k31250
36829C09679P2159p0246l76878k51724O0838J8230j35222J29517N36345M42143
36819G34841k8531k55561j87162k04583k48123r663K76102J50566j85481j88970
36809a46565M9503L3696j55072l9444K52122J41392l03335l93741J5855L04283
36799b41306J30043j42421k05591k08535k25416o3750K06113K12134m2584j08863
36789f90176J27319K31767j1374k37666j43231P0360J32389Q6845K7381q7314
36779d93700j71438j6954K80178L44135J06126r0078r3427j59304l85839m35061
$$ plain form
36848 -1031966 -835636 -588307 -98570 250303 15658 -498525 -657685 -400043 -73048
36839 -73048 261698 645564 718630 218841 -298467 -99497 571090 838297 540929 309679
36829 309679 381838 311592 -65286 -317010 -256172 -237942 -373164 -243647 292698 734841
36819 734841 706310 450749 263587 59004 -189119 -198782 77320 227886 42405 -146565
36809 -146565 -97062 -63366 -218438 -257882 -5760 135632 -167703 -561444 -545589 -241306
36799 -241306 -111263 -253684 -459275 -667810 -893226 -956976 -750863 -538729 -581313 -690176
36789 -690176 -562857 -331090 -342464 -580130 -723361 -653001 -520612 -433767 -406386 -493700
36779 -493700 -665138 -682092 -401914 -57779 48347 -41731 -135158 -294462 -680301 -1115362
36769a115362p3930M07024N75895L65673J8696k11935j90709K1601J62835P1666
36759C1454n3679L2770J97849J80714Q5562J41598J49647k32812p60081q13225
36749a040203l29225J42046L19764M39271N60914L74284j26112m48839l25957
36740d34057m9967Q2367R4450j0651k80194m02351J5928O25733N84950j55263
36730G0945o53700l76185P9573P6483j14740k1600J75898J60875J62792M19293
36720b0366N39618J25205m51092n62728k18237J55810L85080M44034J69164l38116
36710B28372n20371j69175J22433o9516k24536J62726N36248J81727m16299k98912
36700d67303K95992K90988l77988o22859j9769N27901K96582k13147k58644L4891
$$ plain form
36769 -1115362 -1189292 -782268 -206373 159300 177996 -33939 -224648 -203047 -40212 31454
36759 31454 -22225 10545 208394 389108 474670 616268 765915 533103 -226978 -1040203
36749 -1040203 -1369428 -1227382 -907618 -468347 92567 466851 340739 -108100 -434057
36740 -434057 -484024 -401657 -307207 -317858 -598052 -1000403 -984475 -358742 226208 70945
36730 70945 -582755 -958940 -879367 -802884 -917624 -939224 -763326 -602451 -439659 -20366
36720 -20366 519252 644457 193365 -369363 -587600 -431790 -46710 397324 566488 228372
36710 228372 -291999 -461174 -338741 -408257 -632793 -470067 66181 247908 -168391 -467303
36700 -467303 -171311 119677 -258311 -881170 -900939 -373038 -76456 -289603 -548247 -513356
36690e13356J44787L1860m0164n6297j11672j08078J7253J02559Q7352J52615
36680b93141K97174K10169j60652l66485j18209K27496K20950l952k0711K01149
36670A93788L20094J62693j21663l30783l46926j16622K48125M41179K64721j00239
36660F14367k96713j96207L5629J91984K07714J48010J16657J40708J16353o1401
36650A017101l19987m68520m24966k61828n9753J27825K06066J27568K3539M5311
36640A2356J07085J2272j94139k63616j39655m0624r6493j53699k5120K56063
36630e25570M91963M87067J75461k56521m38621k10127J39138K45217J53057J28615
36620C89679J49074o863k53371k54057J6619K17882J77311N0928o0726j92248
$$ plain form
36690 -513356 -368569 -336709 -376873 -433170 -544842 -652920 -635667 -533108 -445756 -293141
36680 -293141 4033 214202 53550 -312935 -431144 -203648 17302 13350 -7361 193788
36670 193788 513882 676575 554912 224129 -122797 -239419 8706 449885 714606 614367
36660 614367 317654 121447 157076 349060 556774 704784 821441 962149 1078502 1017101
36650 1017101 697114 228594 -196372 -458200 -517953 -390128 -184062 -56494 -32955 12356
36640 12356 119441 131713 -62426 -326042 -465697 -506321 -602814 -756513 -781633 -525570
36630 -525570 -33607 453460 628921 372400 -66221 -276348 -137210 108007 261064 389679
36620 389679 538753 531890 278519 24462 41081 258963 436274 487202 426476 234228
36610B34228k06221O1385L17194Q2327m51799n20634M9772M94035K68522j49135
36600A79674j09651K13122K92096J59624J50685J65576p3993l53393k84494m4216
36590B95030n8950j76555M2857L64236J14479n91257p89664q3234P12757P32099
36580E61798J77496j97541j63709k9321J6873K4720j2701j02043o5316J90676
36570D00932L72651J45832l30098n55738l12469J54649M87453M88683J61832k43292
36560G70435l38678m2085K10763K0940l46399l07366J45534L92877Q7609l92980
36550B00650n61667m23022k05956O8063L79926M35919O9343l00878j16747M97254
36540D2885Q30454N08351j09900n07784n65050m14131j45538J20373J71727l1693
$$ plain form
36610 234228 28007 89392 406586 488913 37114 -483520 -433748 60287 328809 179674
36600 179674 70023 283145 575241 734865 885550 1051126 977133 623740 339246 295030
36590 295030 236080 59525 102382 466618 581097 -10160 -799824 -883058 -170301 561798
36580 561798 739294 541753 378044 348723 365596 390316 377615 275572 210256 400932
36570 400932 773583 919415 589317 33579 -278890 -124241 363212 851895 1013727 770435
36560 770435 431757 389672 600435 621375 274976 -32390 113144 506021 593630 200650
36550 200650 -361017 -784039 -989995 -921932 -542006 -106087 -36744 -337622 -454369 42885
36540 42885 873339 1381690 1271790 764006 198956 -215175 -360713 -240340 -68613 -100306
36530a00306k33208k11572m9183R2282K27966L69413L27150j0735l65099l54986
36520c08278k7183K02497J19407n4585m0525J12415J35569q0608l30506l25705
36510e97502n2134J84042J42490k3975j8080J20640J00889q1480j11646N7180
36500b79576P6105j35006j33573K71943N33855J96951k50032p1788M88819N26399
36490A224097j02533n50589k85980J82528J80802j94696m12776k98378q7362j219
36480c46106o9331j54734n584M54417Q20516N64092k05959p49547o00476n8974
36470c51686L48057M45708K86254o4060l65813k79105J32266L61318J53666j64205
36460E02400k56704k13056j76976n1081J41530J15082j39951k01152O6414K08735
$$ plain form
36530 -100306 -333514 -545086 -594269 -501987 -274021 95392 422542 411807 46708 -308278
36520 -308278 -335461 -132964 -13557 -68142 -108667 3748 139317 58709 -271797 -597502
36510 -597502 -649636 -465594 -323104 -347079 -365159 -244519 -143630 -225110 -336756 -279576
36500 -279576 -203471 -338477 -472050 -200107 333748 530699 280667 208879 697698 1224097
36490 1224097 1121564 570975 284995 467523 648325 453629 40853 -257525 -344887 -346106
36480 -346106 -415437 -570171 -575755 -121338 699178 1263270 1057311 307764 -292712 -351686
36470 -351686 -3629 442079 728333 664273 298460 19355 151621 512939 666605 502400
36460 502400 245696 32640 -144336 -195417 -53887 61195 -78756 -279908 -213494 -4759
36450d759j0298j30590J79520M63178K58978o2146L0717K67913J07665k46910
36440H53268k48532l6123j17069l23290r9747L51877K81986k90551n23880j19653
36430b71714K54798J22139j56302j83453j32823j97348j74877L1320J48320Q1382
36420d78558R6785K01808L3783l53812l55205J64093M83127J50866k56445j08167
36410d21725K44984J46838k19178k03665J57170K18849j94768n46599m10323N5647
36400a172770M82772O61413N16932J29585j88199j57812J09603K65272J74707
36391H21503j2842j54599k32609k55635k42369k30331j81537k3278J32692N4018
36381c24987k15002l22010j24453J03903J65034K31815M01121L90924L2328l44752
$$ plain form
36450 -4759 -15057 -145647 33873 497051 756029 693883 724600 992513 1100178 853268
36440 853268 604736 568613 451544 128254 28507 380384 662370 371819 -152061 -271714
36430 -271714 -16916 105223 -51079 -234532 -367355 -564703 -739580 -708260 -559940 -478558
36420 -478558 -381773 -179965 -146182 -499994 -855199 -691106 -207979 -57113 -313558 -421725
36410 -421725 -176741 -29903 -249081 -452746 -295576 -76727 -271495 -818094 -1228417 -1172770
36400 -1172770 -689998 -28585 488347 617932 429733 271921 381524 646796 821503
36391 821503 808661 654062 421453 165818 -76551 -306882 -488419 -511697 -379005 -324987
36381 -324987 -539989 -861999 -986452 -882549 -717515 -485700 -84579 306345 338673 -6079
36371f079m08561l08860k46141o556N30184Q38351L86909m42369p83653m64041
36361i10816o2244Q3711J92363L73406L75865J31852o2700o8654p1319r8570Q4699
36350c2407M30363M89172Q2439l68395m47486k79163j87572j85999j16726k5774
36340f41548p9325k53964l44691k04431J34033M76509N75291L63820Q7097L1342
36330A44133J57548K02919P8704q5790k22723l52119l90707k52457p8967l9520
36320h38979K349K35450M35050K43408j59356k41597K1362J10347j20475j74844
36310d87285J96268N00438K88417j23735j86407N3368J37470p9918l27591l48054
36300c77029j20815J75561K44939l6427l14258j24920L34027L43809k29009o15947
$$ plain form
36371 -6079 -414640 -723500 -969641 -976197 -446013 392338 779247 336878 -446775 -910816
36361 -910816 -973060 -889349 -696986 -323580 52285 184137 121437 52783 -18536 -117106 -32407
36350 -32407 397956 887128 969567 601172 153686 -125477 -313049 -499048 -615774 -641548
36340 -641548 -720873 -974837 -1319528 -1523959 -1389926 -913417 -338126 25694 112791 144133
36330 144133 301681 504600 583304 497514 274791 -77328 -468035 -720492 -799459 -838979
36320 -838979 -836630 -601180 -166130 77278 -82078 -323675 -302313 -191966 -312441 -487285
36310 -487285 -291017 209421 497838 374103 187696 241064 378534 298616 -28975 -377029
36300 -377029 -497844 -322283 -77344 -113771 -428029 -552949 -218922 124887 -104122 -720069
36290g20069k92735K36621L19040J53614K29632L51978P3973l28386k42343J83098
36280c5577K54418q8191k29132J9919J78190J8769j31881j37738k47000l75709
36270g73932p3706N36899O81989J67353j99147P6719L19114j54957p99792o69459
36260h88919Q6665N40344M31070K84163K71582O127m75485n26217K7436M60576
36250B17342K29210k20034k24508P8498J08327j89020l73151k87530j73995r5446
36240i30307J39709M26850L34009j68111m62554j22367M11478M42158L1215j47167
36230d5087J42147L94187K17824q8584j24398p1765l11893o57367n45775P6722
36220a013989O07931O02878K75847M1197l3006p9848q8190p356L7792n9110j38744
$$ plain form
36290 -720069 -1012804 -776183 -457143 -303529 -73897 278081 352054 23668 -218675 -35577
36280 -35577 218841 130650 -98482 -78563 99627 118396 -13485 -151223 -398223 -773932
36270 -773932 -847638 -310739 371250 538603 339456 416175 735289 580332 -219460 -888919
36260 -888919 -802254 -261910 169160 453323 724905 731032 255547 -270670 -243234 217342
36250 217342 446552 226518 2010 80508 188835 -185 -373336 -660866 -834861 -930307
36240 -930307 -790598 -363748 -29739 -197850 -660404 -782771 -371293 70865 102080 -45087
36230 -45087 97060 491247 709071 620487 496089 424324 112431 -544936 -1090711 -1013989
36220 -1013989 -406058 196820 472667 513864 480858 401010 312820 305464 343256 284146 145402
36209A45402q499K03575K13434J4174j41179j42520j17562j23114l8693J50219
36199A55237K24478M6058j77536j38779J39766L08278J34481j97187l13519j07183
36189G4094J57738K00811N2188o1338l5434O7462K00811L27709K75798r0811n06056
36178F62972m68657N1719M32163K16251k08920j83021K24203L41626m5822l88446
36168F34068k54127N4641P3930r4491o1527J52752J91924m615j11736L8133K19566
36157H38518K05428P2971q200l8628q3914j00040l2469M0696J9245o0244j13089
36146G40274j63965k62107l12778j85524K5957O3385j15187k13305l090K95246
36136a31094K69208r9801l65592j98413J95793L90029K81119R4146k8788j47063
$$ plain form
36209 145402 136903 340478 553912 568086 426907 284387 166825 43711 5018 155237
36199 155237 379715 425773 248237 109458 249224 557502 691983 494796 181277 74094
36189 74094 231832 432643 484831 423493 388059 455521 656332 984041 1259839 1169028 662972
36178 662972 194315 246034 678197 894448 685528 502507 726710 1068336 1022514 634068
36168 634068 379941 434582 508512 414021 352494 505246 697170 692555 580819 618952 838518
36157 838518 1043946 1116917 1108717 1070089 986175 886135 853666 894362 913607 853363 740274
36146 740274 576309 314202 1424 -184100 -158143 -94758 -209945 -423250 -426340 -131094
36136 -131094 138114 38313 -327279 -525692 -329899 60130 341249 435395 406607 259544
36126B59544k51637j93811K0986J37695R774j63733j46874j7776K0421Q780J15015
36115b01616K54711J80214o4273j37028O9177K29801Q9338j40346j21709J03660
36105B61929K36051J73997M1815j21209l57259n24334l99133q1702O1573l4594
36095g42866J3018M12051P64958N96061O7968k38896j50107n8974k40419m33748
36085a0954k89129R6490L46539L05915J20919n6112j94716k70784k37634j24221
36075c13687k8542o324l3675l4163R4745L50477M61498R8059n64363p77171j00764
36064h53910Q25802R16673L8014p76968o76271j5683L00112M3535k72516k76522
36054g47734j11034N369P5248J15228N2186o5954o3944O9677J62974J92831L27526
$$ plain form
36126 259544 7907 -185904 -164918 -27223 -17449 -181182 -328056 -345832 -325411 -316631 -201616
36115 -201616 53095 233309 169036 32008 101185 330986 420324 279978 158269 261929
36105 261929 497980 671977 713792 592583 235324 -289010 -688143 -769845 -708272 -742866
36095 -742866 -729848 -317797 447161 1043222 1111190 872294 722187 663213 422794 -10954
36085 -10954 -300083 -203593 142946 448861 569780 513668 318952 48168 -189466 -313687
36075 -313687 -342229 -348553 -382228 -416391 -321646 28831 490329 588388 24025 -753146 -853910
36064 -853910 -28108 888565 926579 149611 -526660 -542343 -242231 -198696 -471212 -747734
36054 -747734 -858768 -853399 -778151 -662923 -610737 -676691 -740635 -670958 -507984 -315153 12373
36043A2373N37357M85724m69n92857p96651m68800J24927N91814O44235K69829
36033H07482j86615l13272j28754n5380k78299m65270l46773j93288l20255m37682
36023a918106m7763O59135R22257M70273j08574k41442j02928j52406l52947l06650
36013a179151M2952L10787K44726J4961j40151k34066l36762l09314J873M13858
36003a170287N47728L53990K14727L67496M91199J75443l67939n04070q3598L28317
35993C53006K82072K1030o1580p4421k77722m62558k74799P7601Q9368j84413
35983e12416k04786J35635L63933K67319J72437K16943P8119k82913l51443L3882
35973h3290K21837k18314o54445l27388L86540N18145j3641l78315j63646J63817
$$ plain form
36043 12373 549730 1035454 1034985 442128 -354523 -823323 -698396 -106582 537653 807482
36033 807482 620867 307595 178841 123461 -154838 -620108 -966881 -1160169 -1480424 -1918106
36023 -1918106 -1965869 -1306734 -384477 85796 -22778 -264220 -367148 -519554 -872501 -1179151
36013 -1179151 -1136199 -825412 -580686 -565725 -705876 -939942 -1276704 -1586018 -1584145 -1170287
36003 -1170287 -622559 -268569 -53842 313654 804853 980296 612357 108287 24689 353006
35993 353006 635078 656108 594528 520107 242385 -220173 -494972 -417371 -328003 -512416
35983 -512416 -717202 -581567 -217634 49685 222122 439065 517184 234271 -117172 -83290
35973 -83290 138547 -79767 -734212 -1061600 -675060 -156915 -170556 -548871 -712517 -548700
35963e48700J79443P3013J10597J91123J81503J67982J72136P3547n1365J3813
35953E63092J28677j07501o13870p55292k53892L62589N20101L12439J30123M7875
35943C34341k8516o530J83750L28400K40307N6149p3635k59959n24535n48738
35933b98966j69445K13331J69467j00857r6768K21500M50232L44808L582l71939
35923C64945n42669k91967K07245L72253k0470l84706j64297K43849J01678m20708
35913e34847m66413J21980N45924L18934o0039k0520K25096J97643l5773q2017
35903B09968J01992K32733K01378J63586K10067K08525k3785m58299p46133m95712
35893c95680J76937N92292L24631j70758k20374M2255k403l02676k03525L02498
$$ plain form
35963 -548700 -369257 -296244 -185647 5476 186979 354961 527097 600644 549279 563092
35953 563092 691769 584268 -29602 -784894 -1038786 -676197 -156096 156343 286466 334341
35943 334341 305825 299295 483045 811445 1051752 1107901 1034266 774307 249772 -298966
35933 -298966 -468411 -255080 -85613 -186470 -283238 -61738 388494 733302 736884 364945
35923 364945 -177724 -469691 -262446 109807 89337 -295369 -459666 -215817 -114139 -534847
35913 -534847 -1001260 -879280 -333356 -14422 -74461 -94981 130115 327758 291985 209968
35903 209968 311960 544693 746071 909657 1119724 1328249 1304464 846165 100032 -395680
35893 -395680 -218743 373549 698180 527422 307048 349303 346900 44224 -159301 143197
35883A43197M03705j69196o01912k96245K21762L17063K69549M80002M85602k03524
35873A050003r26774p06338J36617M02750j40747n37688k53810J76700K94638
35864e04649L71386N52484L82669k59488o14717j07273O79200P72716J10760n53868
35854H29220p02948m34709m9428K19747K16636K0429m1663J51008K64278L2581
35844E05151k49474j67923J23330J42463j42351k90132j13310O1023n4455k89298
35834d74976l10872o2674K44663L89928K76280k9381k89875k60518M2773L26176
35824a48476L41041J48418k247J5465J04644J22745N4297k6882q3561j16719r3406
35813C15319l117L2718j12584l05694k44532Q2426K90657J45853n7356M3048K88939
$$ plain form
35883 143197 546902 377706 -224206 -520451 -298689 18374 287923 767925 1253527 1050003
35873 1050003 123229 -583109 -446492 -43742 -184489 -722177 -975987 -799287 -504649
35864 -504649 -133263 419221 801890 542402 -72315 -179588 499612 1272328 1383088 829220
35854 829220 126272 -308437 -357865 -138118 78518 98947 57284 208292 472570 505151
35844 505151 255677 87754 211084 353547 211196 -78936 -192246 -131223 -185678 -474976
35834 -474976 -785848 -848522 -603859 -213931 62349 32968 -256907 -517425 -474652 -148476
35824 -148476 192565 340983 338736 354201 458845 581590 635887 609005 525444 408725 315319
35813 315319 312202 344920 232336 -73358 -317890 -235464 55193 201046 143690 186738 475677
35802D75677K74479J6908j16661m5417l1307j39868j72305j48049k98655n11380
35792f96578l65571J35565M65652L99940L18317M29415L63706p3775m01354k21212
35782C54105J04244J09077Q188J76433L53566J21722k42157k07220M8930j6142
35772H10746k58965q6456L83799L95510j66331n38071l16523k6597j32736l16115
35762b51739j74538O4181L2973j25879r3491Q6127K27283L59787M77287L33919
35752I35910j07059m04129k34642Q1722P8460j50332j80068N6908K53431K26478
35742E56679N3705j54661l07778k93413j39837n9250j24817j22916P7077K85772
35732b29439L41524L60153L81455J62116l23282n74777k29422K97463L55213j6120
$$ plain form
35802 475677 750156 767064 650403 604986 573679 433811 261506 113457 -185198 -696578
35792 -696578 -1062149 -926584 -460932 -60992 257325 686740 1050446 976671 575317 354105
35782 354105 458349 567426 575614 752047 1105613 1227335 985178 777958 826888 810746
35772 810746 551781 465325 849124 1244634 1078303 540232 223709 197112 64376 -251739
35762 -251739 -426277 -362096 -329123 -455002 -548493 -462366 -235083 124704 601991 935910
35752 935910 828851 424722 190080 271802 350262 199930 19862 76770 330201 556679
35742 556679 610384 455723 147945 -145468 -285305 -344555 -469372 -592288 -515211 -229439
35732 -229439 112085 472238 853693 1015809 692527 117750 -111672 185791 541004 524884
35722E24884k47800j27294N2066R2811O4378n9453l54621n42389k12312M59618
35712c50112P51205L23389l39894o16728m77636k89434k03556m5287L07780O59788
35702b80485O49177J65776m08908n46734k23674M6630j5847m8796K49647M57964
35692D4750P4622n05870m52113J93327N28580J94261j26339J04478M34748K71134
35682G61578j30776j82937K9492j8997l46082m46741j24377K54733L33799J24918
35672B54610k01323m67378m33446j1024M24399L44120k01065n38240k40392L00252
35662g69487M29564R7775j89751j56260n6539j19324j02321K73487O94897N42857
35652F44898j87141p29736n19745Q6698L85702K72869J62771K09439J75734O698
$$ plain form
35722 524884 277084 149790 201856 294667 359045 299592 -55029 -597418 -809730 -350112
35712 -350112 401093 724482 384588 -232140 -709776 -999210 -1202766 -1248053 -940273 -280485
35702 -280485 368692 534468 125560 -421174 -644848 -598218 -614065 -662861 -413214 44750
35692 44750 119372 -386498 -838611 -645284 -116704 77557 -48782 55696 490444 761578
35682 761578 630802 447865 477357 458360 112278 -334463 -458840 -204107 129692 254610
35672 254610 53287 -414091 -847537 -858561 -434162 -90042 -291107 -829347 -1069739 -769487
35662 -769487 -339923 -242148 -431899 -588159 -644698 -764022 -866343 -592856 102041 644898
35652 644898 457757 -271979 -791724 -705026 -319324 -46455 116316 325755 501489 508187
35642E08187m3485O9311M7106k12942l96530k70191j2003J30944J49228P8372
35632D7997j14074k79540j31904K61359M35812J83376j71796l47854m56258n24558
35622a097440k53594L45495O46965K82281j87438q8530L24299L47243k6321k28242
35612F4718j28698r6121j72616j8848L27768M20841J88565K4570L0846r7561l38896
35601B04568k66802J22475K76824K5429j17024J10331K51571J1576j84383k8967
35591D05598K7067l61851o20498j26700O27833O73345K7495m07962k48480m655
35581h808o5779j77702r0772K1747L0217J05393K57774J83075j59868l31356p4470
35570c10549K65532L07521J87482J78806J57385j06782m17272l91459o6957J69099
$$ plain form
35642 508187 464702 534013 581119 368177 -28353 -298544 -310547 -179603 -30375 47997
35632 47997 -66077 -345617 -477521 -216162 219650 403026 231230 -116624 -572882 -1097440
35622 -1097440 -1351034 -1005539 -358574 -76293 -263731 -352261 -27962 319281 292960 64718
35612 64718 -63980 -160101 -332717 -351565 -23797 397044 585609 610179 641025 543464 204568
35601 204568 -62234 60241 337065 362494 245470 355801 607372 618948 434565 405598
35591 405598 432665 70814 -549684 -676384 -48551 624794 652289 244327 -4153 -8808
35581 -8808 -74587 -252289 -343061 -321314 -291097 -185704 72070 255145 95277 -236079 -310549
35570 -310549 -45017 262504 449986 628792 786177 679395 262123 -129336 -196293 -27194
35560b7194J53069M3904p3247k58963l95040k11336K49675N41740L59421q3214
35550B98815l82653m20294l13896j14690J68553L61937K52726o7742k42520j02793
35540e62557J20364J43261J3428j2955J36167K66408J95173m8128l04770m34835
35530d88444l63356j09338J77729L10361K58321J87327K51411L98582M26595J98435
35520A247623k09090n29179n01021j36495K15061J91226j71398m75147m41980
35511h10400k02573l8415q125K7241J28219J99960J51218R932j00338m9713J60494
35500e32500L21565K21186k8647q3251J07054J50684j61346l85481k349P21931
35490C28846R83696N32882l3583j87902j27994k41425m15859l29943q2456j6582
$$ plain form
35560 -27194 125875 169779 96532 -162431 -557471 -768807 -519132 22608 382029 298815
35550 298815 -83838 -504132 -818028 -932718 -764165 -402228 -149502 -217244 -459764 -562557
35540 -562557 -442193 -298932 -285504 -298459 -162292 104116 299289 251161 -53609 -488444
35530 -488444 -851800 -961138 -783409 -473048 -214727 -27400 224011 622593 1049188 1247623
35520 1247623 1038533 509354 8333 -128162 86899 278125 106727 -368420 -810400
35511 -810400 -1012973 -1051388 -1059513 -1032272 -904053 -704093 -552875 -542943 -643281 -692994 -532500
35500 -532500 -210935 10251 -18396 -101647 5407 156091 -5255 -390736 -393085 328846
35490 328846 1312542 1845424 1811841 1623939 1495945 1254520 838661 508718 426262 409680
35480D09680j14673q0663P1707K8319k24746l10052p2222J70576J58539N8734
35470I5199P2708O3451j15762k51001j10628Q7928j2870k86890k70950J09946
35460f18869M17880L54598J20124l146l8625r6618j08590l5898o4449k85859l95025
35449g54477o1808M97190O80118K60002l05844m31119p6949K61047J62941k39051
35439g950m40395j96810J49899J24915j97119k73938R1448M06393K00515k56595
35429c99637l43821K0900L39619K95942Q6152l5180r4840j60926j34449L8134
35419c88106K08931K35528J40217j3314j79765k37374j06544J5050j32262l87903
35409h45542l13052R4484K99023L4831k67020j58721J69131K94633K21145J76739
$$ plain form
35480 409680 295007 214344 286051 314370 89624 -220428 -292650 -122074 36465 95199
35470 95199 167907 231358 115596 -135405 -246033 -158105 -170975 -457865 -728815 -618869
35460 -618869 -200989 153609 273733 270587 231962 135344 26754 -9144 -73593 -359452 -754477
35449 -754477 -816285 -319095 361023 621025 315181 -115938 -192887 68160 231101 -7950
35439 -7950 -448345 -645155 -495256 -370341 -567460 -841398 -749950 -343557 -143042 -399637
35429 -399637 -743458 -722558 -382939 -86997 -845 -36025 -130865 -291791 -426240 -388106
35419 -388106 -179175 56353 196570 183256 3491 -233883 -340427 -325377 -457639 -845542
35409 -845542 -1158594 -1064110 -765087 -730256 -997276 -1155997 -986866 -692233 -471088 -294349
35399b94349J06453j25186k96145j30224J57501J55524n5815n8708J72583K72663
35389i5703J63003J33579K22044J09208k46650m25344j85073J84930L42454K91084
35379D93532J28793j51345m01477l11108P8028K64606j3083l58684l16054j3927
35369f00719J52965J49409J78600J94690N261k74226l05257l8758J99206J51614
35359a87215q0503k07401o0748K37601L47270O8339l30381l69290j5599K39276
35349c58651J07252q2197L7516K74442K55958N8531j6329j8110j60190k63505
35339a65283P306M44826M61726j6287m08977l47371j30150j24377k17115j48470
35329f44172J1203M0337n1537r5161j2742J91632M70565O07224L31448k30072
$$ plain form
35399 -294349 -187896 -313082 -609227 -739451 -581950 -426426 -482241 -540949 -368366 -95703
35389 -95703 67300 200879 422923 532131 285481 -139863 -324936 -140006 202448 493532
35379 493532 622325 470980 69503 -241605 -163577 101029 87946 -270738 -586792 -600719
35369 -600719 -447754 -298345 -119745 74945 80206 -194020 -499277 -538035 -338829 -187215
35359 -187215 -267718 -475119 -535867 -298266 49004 117343 -213038 -582328 -597927 -358651
35349 -358651 -251399 -333596 -296080 -21638 234320 292851 276522 258412 98222 -165283
35339 -165283 -157977 286849 748575 732288 323311 -24060 -154210 -278587 -495702 -644172
35329 -644172 -632969 -592632 -644169 -739330 -752072 -560440 -89875 517349 848797 618725
35319F18725n07145j77516L23010L22602j86611n28917k25094M06386O43866K04223
35309H93529m49342o39421k36713K16493J79228k45546n07307l20278Q6998L75155
35299f47204M24020K44168q8781l15886j58282K43661L85804R2924j81567j8683
35289a9826L28536L35319J115k01534o4634J14979N2859j46180k34525j62224
35279C885l4026Q0909J56615J37667j6430k31482l26127j72908J09723K01951
35269i0223l4157k77298j14187L15557M14164n174l73459j86060K42176K96633
35259A87972J1009q6075J22389K43724J42767J36771L17420L13639m3203l83745
35249I62668m17744l61853m08298k85526J89290N70642L73047j22343k72592p5866
$$ plain form
35319 618725 111580 -65936 257074 579676 393065 -135852 -360946 45440 689306 893529
35309 893529 444187 -195234 -431947 -215454 -36226 -281772 -789079 -1109357 -1022359 -647204
35299 -647204 -223184 20984 -67797 -383683 -541965 -298304 87500 180424 -1143 -19826
35289 -19826 308710 644029 645144 443610 378976 493955 546814 400634 166109 3885
35279 3885 -30141 50768 207383 345050 328620 97138 -228989 -401897 -292174 -90223
35269 -90223 -124380 -401678 -515865 -200308 213856 208682 -164777 -350837 -108661 187972
35259 187972 198981 112906 235295 479019 621786 758557 1075977 1389616 1346413 962668
35249 962668 544924 183071 -225227 -510753 -321463 249179 622226 499883 227291 151425
35239A51425r4748m37977n22672j3738N91162O29094J32581k98374k46497J57840
35229D8096M66861L34500j68927n72098m87224r8854P7974o2756j04265J50425
35219d16268K94392l886l58982k07882K72793L77981p2605m79243l56474L3966
35209i16208J71745J775j27467L738K92329M98566M24407M3604l87315m99575
35199d94401k39292M2790O3201m8934n2832J4006J3138L8463K24451L93272K88488
35188B42350N1161L2016J78400Q8740k72955m23984j10731K50984J86448j49011
35178G3418k56837j9035K43148K81148J40893l8919j50999j11271J5337k2175
35168A54708l01672m58363j26033M33573N68459J33658k87243k07431J22862J75779
$$ plain form
35239 151425 56677 -381300 -903972 -917710 -326548 302546 435127 136753 -109744 48096
35229 48096 514957 849457 680530 108432 -378792 -477646 -399672 -462428 -566693 -416268
35219 -416268 -121876 -125762 -484744 -692626 -419833 -41852 -114457 -593700 -950174 -916208
35209 -916208 -744463 -742688 -870155 -866417 -574088 -75522 348885 392489 5174 -494401
35199 -494401 -733693 -690903 -627702 -676636 -729468 -715462 -702324 -663861 -439410 -46138 242350
35188 242350 293511 325527 503927 592667 319712 -104272 -215003 35981 222429 73418
35178 73418 -183419 -202454 40694 321842 462735 423816 272817 161546 176883 154708
35168 154708 -146964 -605327 -731360 -297787 270672 404330 117087 -90344 32518 208297
35158B08297p0205j86083J3372K23385J35123j25910k01725k312J75889M8036
35148B17867k66629l85298j85664N411j09851l07718j27776L97467O75316L46770
35138B59895j87337k96745N6307L53941K55774n5721k48435k31249r0907R5596
35128h8881K45310K46530R2171q1866j89115k92482m08334l65737l7853L83990
35118d96267N50265L58435K0558k53605m31097m81790k76771J75174N52613N09607
35108B27122R4978l01639m07074k90306j33652K501J06668J07691p797r8748m6088
35097g46344P1403J22729J32062J56099P5439k17202m75754k92896K91047O99144
35087a84273N18765K3872k41923j77438j00706j57557j41711Q1803L20234L41366
$$ plain form
35158 208297 138092 -47991 -34619 188766 323889 197979 -3746 -6058 169831 217867
35148 217867 -48762 -434060 -619724 -614313 -724164 -1031882 -1159658 -762191 -86875 259895
35138 259895 72558 -224187 -167880 186061 441835 386114 137679 -93570 -184477 -88881
35128 -88881 156429 402959 495130 413264 224149 -68333 -476667 -842404 -880257 -496267
35118 -496267 53998 412433 432991 179386 -251711 -733501 -1010272 -835098 -282485 227122
35108 227122 322100 20461 -386613 -676919 -810571 -808070 -701402 -593711 -601508 -700256 -746344
35097 -746344 -674941 -552212 -420150 -264051 -188612 -405814 -881568 -1174464 -883417 -184273
35087 -184273 334492 358364 116441 -60997 -161703 -319260 -460971 -379168 -58934 282432
35077B82432J71130k9430j82812k50933j56758P5097K33904J55142n9371k01531
35067C6870k19859j59399R343K57538L24214J0368m00708m04919q462K23087Q197
35056c23730k03609M3603M37591L57181j35071l70906j01159J85509J03964o1814
35046f8441N5783K53902J38551j80769k73246p2804R7911Q8658M1460j5790k19984
35035a54769m53150l29927K11717O70883N74998N9046l61033l85738j03774K34370
$$ plain form
35077 282432 453562 424132 241320 -9613 -166371 -91274 142630 297772 238401 36870
35067 36870 -182989 -342388 -333045 -75507 248707 259075 -141633 -546552 -555014 -331927 -323730
35056 -323730 -527339 -483736 -46145 311036 175965 -194941 -296100 -110591 -6627 -68441
35046 -68441 -12658 241244 379795 199026 -74220 -147024 -49113 39545 81005 65215 -154769
35035 -154769 -607919 -937846 -726129 -55246 519752 578798 217765 -167973 -271747 -37377
$$ [...]
##END NTUPLES=NMR SPECTRUM
##END=
