##TITLE=31Pdec_BAU-j-FPBU
 CDCl3, 24 sc
 5.3.2019
##JCAMPDX= 6.0         $$ Bruker NMR JCAMP-DX V2.0
##DATA TYPE= NMR SPECTRUM
##DATA CLASS= NTUPLES
##ORIGIN= UXNMR, Bruker Analytische Messtechnik GmbH
##OWNER= root
$$ XWIN-NMR		Version 3.5
$$ Tue Mar  5 14:53:18 2019 Russian Standard Time (UT+4h)  she@DPX200
##.OBSERVE FREQUENCY= 81.013821
##.OBSERVE NUCLEUS= ^31P
##.ACQUISITION MODE= SIMULTANEOUS
##.ACQUISITION SCHEME= undefined
##.AVERAGES= 24
##.DIGITISER RES= 17
##SPECTROMETER/DATA SYSTEM= spect
##.PULSE SEQUENCE= zgpg30
##.SOLVENT NAME= CDCl3
##.SHIFT REFERENCE= (INTERNAL, CDCl3, 0, 182.463)
##AUDIT TRAIL= $$ (NUMBER, WHEN, WHO, WHERE, WHAT)
$$ ##TITLE= Audit trail, XWIN-NMR		Version 3.5
$$ ##JCAMPDX= 5.01
$$ ##ORIGIN= Bruker BioSpin GmbH
$$ ##OWNER= she
$$ F:/spectra/data/she/nmr/P31/1/pdata/1/auditp.txt
$$ ##AUDIT TRAIL=  $$ (NUMBER, WHEN, WHO, WHERE, WHAT)
(   1,<2019-03-05 14:52:04.84 +0400>,<she>,<DPX200>,
      <created by zg, POWCHK disabled, PULCHK disabled
       configuration hash MD5:
       00 E9 B6 7A A2 85 ED C7 34 08 36 98 17 FE 4E 26
       data hash MD5: 32K
       C5 04 68 0C C4 4F 58 01 80 85 61 1E A9 ED 6D 72>)
(   2,<2019-03-05 14:52:12.98 +0400>,<she>,<DPX200>,
      <Start of raw data processing
       efp BC_mod = 2 LB = 1 FT_mod = 6 PKNL = 1 PHC0 = -1402.41 PHC1 = -31.40108 SI = 64K 
       data hash MD5: 64K
       39 13 CF 0C 76 AB 2F 68 12 6D C5 18 CA F4 0D 6F>)
(   3,<2019-03-05 14:52:27.84 +0400>,<she>,<DPX200>,
      <pk PHC0 = -17.28831 PHC1 = 0 
       data hash MD5: 64K
       27 75 F8 F5 E7 CB 9A B9 60 30 60 12 A8 64 14 C4>)
(   4,<2019-03-05 14:52:31.18 +0400>,<she>,<DPX200>,
      <abs ABSG = 5 
       data hash MD5: 64K
       4C 20 C2 92 B4 AE 80 A7 40 28 39 80 4E F3 68 6F>)
$$ ##END=
$$ 
$$ hash MD5
$$ AD 0E 95 9A 25 5C 1B 65 D2 47 DF 3A DF BA 55 97
##$RELAX= 
##$RELAX= 
##$RELAX= 
##$RELAX= 
##$RELAX= 
##$RELAX= 
##$RELAX= 
##$RELAX= 
$$ Bruker specific parameters
$$ --------------------------
##$DU= <F:/spectra>
##$EXPNO= 1
##$NAME= <P31>
##$PROCNO= 1
##$TYPE= <nmr>
##$USER= <she>
##$AMP= (0..31)
100 100 100 100 100 100 100 100 100 100 100 100 100 100 100 100 100 100 
100 100 100 100 100 100 100 100 100 100 100 100 100 100 
##$AQSEQ= 0
##$AQ_mod= 1
##$AUNM= <au_zg>
##$AUTOPOS= <>
##$BF1= 81.014009
##$BF2= 200.13
##$BF3= 200.13
##$BF4= 200.13
##$BF5= 200.13
##$BF6= 200.13
##$BF7= 200.13
##$BF8= 200.13
##$BYTORDA= 1
##$CFDGTYP= 0
##$CFRGTYP= 5
##$CHEMSTR= <none>
##$CNST= (0..31)
1 1 145 1 1 1 1 1 1 1 1 1 1 1 1 1 1 1 1 1 1 1 1 1 1 1 1 1 1 1 1 1 
##$CPDPRG= <waltz16>
##$CPDPRG1= <>
##$CPDPRG2= <waltz16>
##$CPDPRG3= <>
##$CPDPRG4= <mlev>
##$CPDPRG5= <mlev>
##$CPDPRG6= <mlev>
##$CPDPRG7= <mlev>
##$CPDPRG8= <mlev>
##$CPDPRGB= <>
##$CPDPRGT= <>
##$D= (0..31)
0 1 0 0 0 0 0 0 0 0 0 0.03 2e-05 3e-06 0 0 0 0 0 0 0 0 0 0 0 0 0 0 0 0 
0 0 
##$DATE= 1551783124
##$DBL= (0..7)
120 120 120 11 120 120 24 19 
##$DBP= (0..7)
150 150 150 150 150 150 150 150 
##$DBP07= 0
##$DBPNAM0= <>
##$DBPNAM1= <>
##$DBPNAM2= <>
$$ [...]
##$SUBNAM3= <"">
##$SUBNAM4= <"">
##$SUBNAM5= <"">
##$SUBNAM6= <"">
##$SUBNAM7= <"">
##$SUBNAM8= <"">
##$SUBNAM9= <"">
##$SW= 369.568048894756
##$SWIBOX= (0..15)
0 1 3 0 0 0 0 0 0 0 0 0 0 0 0 0 
##$SW_h= 29940.119760479
##$TD= 32768
##$TD0= 1
##$TE= 0
##$TE2= 300
##$TE3= 300
##$TEG= 300
##$TL= (0..7)
0 120 53 12 22 120 120 120 
##$TP= (0..7)
150 150 150 150 150 150 150 150 
##$TP07= 0
##$TPNAME0= <>
##$TPNAME1= <>
##$TPNAME2= <>
##$TPNAME3= <>
##$TPNAME4= <>
##$TPNAME5= <>
##$TPNAME6= <>
##$TPNAME7= <>
##$TPOAL= (0..7)
0.5 0.5 0.5 0.5 0.5 0.5 0.5 0.5 
##$TPOFFS= (0..7)
0 0 0 0 0 0 0 0 
##$TUNHIN= 0
##$TUNHOUT= 0
##$TUNXOUT= 0
##$USERA1= <user>
##$USERA2= <user>
##$USERA3= <user>
##$USERA4= <user>
##$USERA5= <user>
##$V9= 5
##$VALIST= <valist>
##$VCLIST= <CCCCCCCCCCCCCCC>
##$VD= 0
##$VDLIST= <DDDDDDDDDDDDDDD>
##$VPLIST= <PPPPPPPPPPPPPPP>
##$VTLIST= <TTTTTTTTTTTTTTT>
##$WBST= 1024
##$WBSW= 4
##$XGAIN= (0..3)
0 0 0 0 
##$XL= 0
##$YL= 0
##$YMAX_a= 31860
##$YMIN_a= -35376
##$ZGOPTNS= <>
##$ZL1= 120
##$ZL2= 120
##$ZL3= 120
##$ZL4= 120
##$ABSF1= 182.463
##$ABSF2= -187.1042
##$ABSG= 5
##$ABSL= 3
##$ALPHA= 0
##$AQORDER= 0
##$ASSFAC= 0
##$ASSFACI= 0
##$ASSFACX= 0
##$ASSWID= 0
##$AUNMP= <proc_1d>
##$AZFE= 0.1
##$AZFW= 0.5
##$BCFW= 0
##$BC_mod= 2
##$BYTORDP= 0
##$COROFFS= 0
##$CY= -3
##$DATMOD= 1
##$DC= 0
##$DFILT= <>
##$DTYPP= 0
##$F1P= 0
##$F2P= 0
##$FCOR= 1
##$FTSIZE= 65536
##$FT_mod= 6
##$GAMMA= 0
##$GB= 0
##$INTBC= 1
##$INTSCL= 5.30512e-09
##$ISEN= 30
##$LB= 1
##$LEV0= 0
##$LPBIN= 0
##$MAXI= 10000
##$MC2= 0
##$MEAN= 0
##$ME_mod= 0
##$MI= 50
##$NCOEF= 0
##$NC_proc= -5
##$NLEV= 6
##$NOISF1= 182.463
##$NOISF2= 159.3651
##$NSP= 0
##$NTH_PI= 0
##$NZP= 0
##$OFFSET= 182.463
##$PC= 4
##$PHC0= -1419.698
##$PHC1= -31.40108
##$PH_mod= 1
##$PKNL= yes
##$PPARMOD= 0
##$PSCAL= 0
##$PSIGN= 0
##$REVERSE= no
##$SF= 81.0140089999434
##$SI= 65536
##$SIGF1= 159.3651
##$SIGF2= -187.1042
##$SINO= 113.3802
##$SIOLD= 16384
##$SREGLST= <1H.CDCl3>
##$SSB= 0
##$STSI= 65536
##$STSR= 0
##$SW_p= 29940.119760479
##$SYMM= 0
##$S_DEV= 0
##$TDeff= 32768
##$TDoff= 0
##$TI= <>
##$TILT= no
##$TM1= 0
##$TM2= 0
##$TOPLEV= 0
##$USERP1= <user>
##$USERP2= <user>
##$USERP3= <user>
##$USERP4= <user>
##$USERP5= <user>
##$WDW= 1
##$XDIM= 65536
##$YMAX_p= 532095215
##$YMIN_p= -9780001
$$ End of Bruker specific parameters
$$ ---------------------------------
##NTUPLES= NMR SPECTRUM
##VAR_NAME=  FREQUENCY,     SPECTRUM/REAL,   SPECTRUM/IMAG
##SYMBOL=    X,             R,               I
##VAR_TYPE=  INDEPENDENT,   DEPENDENT,       DEPENDENT
##VAR_FORM=  AFFN,          ASDF,            ASDF
##VAR_DIM=   65536,         65536,           65536
##UNITS=     HZ,            ARBITRARY UNITS, ARBITRARY UNITS
##FACTOR=    0.456856943014862, 1,           1
##FIRST=     14782.0589164792, 0,            0
##LAST=      -15158.0608439998, 0,           0
##MIN=       -15158.0608439998, -9780001,    0
##MAX=       14782.0589164792, 532095215,    0
$$ Real data points
##PAGE= N=1
##DATA TABLE= (X++(R..R)), XYDATA
$$ [...]
46057f71058j97181J98938N78097O95077N82378L88615J55209j03079l04252m45107
46047H77637o32887q22310p64886l96909j4115J57280K94772O20941R62020R77447
46037A258990O38285J76284k64442o15009o91352l70566J18904L75222K48098
46028H74414j02854m48487n98738m45786j12857J21647K27395M73307Q61321R01974
46018A751336L31963l24616m21382j12582l2252k87385m21170k52049p9023o6633
46008H6207n0734O026n6047j65774q5380O2960p5942l83437l19177J93069N49374
45997b38855L20969k27919o33539o95145l40543L41377Q13446N45087q1743j20259
45987c17124M55884N53905l20828j150157r20349j49480N2403k67274k23351K80453
$$ y = [-671058, -868239, -669301, -91204, 603873, 1186251, 1574866, 1730075, 1626996, 1322744, 877637, 244750, -577560, -1342446, -1739355, -1753470, -1596190, -1301418, -680477, 281543, 1258990, 1897275, 2073559, 1809117, 1194108, 502756, 132190, 251094, 626316, 874414, 771560, 323073, -275665, -721451, -834308, -712661, -485266, -11959, 849362, 1751336, 2083299, 1758683, 1337301, 1224719, 1192467, 905082, 483912, 231863, 152840, 86207, 35473, 41499, -14548, -180322, -265702, -202742, -278684, -662121, -981298, -788229, -238855, 82114, -145805, -779344, -1474489, -1815032, -1473655, -660209, -115122, -196865, -317124, 138760, 692665, 371837, -778320, -1698669, -1848149, -1795746, -2063020, -2286371, -2005918]
45977b005918M48378J3461l24606l5042N13745P01112M28633M4658q2171J69670
45967a28080N02044L65446l46475r53517p71509j7627N48252O11026L58576j16506
45957E1630p16509q90672j96505P56007Q49722L3246n50482j93089N10516P36882
45947C90746N30996L50915K17464r2046m61955n88392m43166k24228o7561k5162
45937d12389p5687m1870J94610L70927J53848k31806k30122J50644L06865K5549
45927B10569j83524L7496L59492L90197K01943m5979l71170n77292l01801K18166
45917f1903J83151n41983r98606m54011N52975J037887P71413J19836n87696r42944
45907i21881m86069M64005P87982J26852l75493K24927J120998J028597J85871
$$ y = [-2005918, -1557540, -1544079, -1868685, -1903727, -1389982, -688870, -260237, -215579, -297750, -128080, 373964, 739410, 392935, -560582, -1332091, -1349718, -801466, -190440, 168136, 51630, -664879, -1555551, -1752056, -996049, -146327, -113081, -663563, -856652, -346136, 390746, 921742, 1272657, 1490121, 1398075, 936120, 347728, -95438, -319666, -387227, -412389, -488076, -529946, -335336, 35591, 189439, -42367, -272489, -121845, 185020, 210569, 27045, 64541, 424033, 814230, 1016173, 970194, 599024, 21732, -280069, -61903, 121248, -420735, -1419341, -1873352, -1320377, -282490, 488923, 608759, 21063, -921881, -1407950, -943945, -155963, -29111, -404604, -179677, 941321, 1969918, 2155789]
45898B155789k66849k28292m25431p33645l88326L11142K22015o31003r19684
45889i04284j76469M96163L55499J30584N09042Q92918N56448p9917k60866o6749
45879A452369Q0321K36721M42630K45690m14033o65617j5738N87619J14012p95948
45869A268026p33864K38308O62853n6704q25993n98899J72139M01625q1690n31080
45859h5279m28490j4921K35807K10770R6562j1594j60012k27612P4361O67585
45849C57177R08115L70609m13986n96376k06529K0140j14627j54667j27684o07104
45839e64932j321636j036867M44105J433759O21232q71942j054870J11477R87881
45830a251793Q28449M12523K82355L7082m07612l84125K23738N12146k8662o84478
$$ y = [2155789, 1888940, 1660648, 1235217, 501572, 113246, 424388, 646403, 15400, -904284, -1080753, -584590, -229091, -98507, 410535, 1303453, 1859901, 1779984, 1519118, 1452369, 1532690, 1769411, 2212041, 2457731, 2043698, 1378081, 1362343, 1949962, 2063974, 1268026, 534162, 772470, 1435323, 1378619, 552626, -46273, 125866, 527491, 445801, -85279, -513769, -528690, -292883, -82113, 14449, 2855, -157157, -384769, -310408, 357177, 1265292, 1635901, 1221915, 625539, 419010, 439150, 324523, 169856, 42172, -564932, -1886568, -2923435, -2479330, -1045571, -424339, -1296281, -2351151, -2239674, -1251793, -423344, -10821, 271534, 308616, -98996, -483121, -259383, 252763, 224101, -460377]
45820d60377o76846k15593J78397N08000Q23324P38489J51037k54758Q895L33764
45810A134332q2205q77733r50974m6743Q68185Q51002M2048o43257n62990J7870
45800b50465K70317j91155p68946o58453p145L16207J01139R4142O33917R18739
45790D58297K83112n85524o13095J8250K28829k21470m37022J02078O93677M52275
45780C79407m41147r82954n52948M40306J044587P89771K00550J23028N44053
45771A544653N51609k73495j042802p66401J28891L94641j88099o05879k73921
45762e30803K00695K23991J38660L51805M13344k16821j063202j159975l64561
45753b006867N98228J145397J171152O40540k94562q85639m38681N07147N79937
$$ y = [-460377, -1137223, -1352816, -1174419, -666419, 156905, 895394, 1046431, 791673, 800568, 1134332, 1052127, 174394, -776580, -823323, 44862, 895864, 937912, 294655, -268335, -250465, 19852, -171303, -940249, -1598702, -1605847, -1289640, -1188501, -1094359, -460442, 458297, 741409, 155885, -457210, -438960, -210131, -431601, -868623, -766545, -72868, 379407, -61740, -1044694, -1597642, -1157336, -112749, 677022, 877572, 1000600, 1544653, 2096262, 1822767, 779965, 13564, 142455, 537096, 348997, -256882, -530803, -330108, -106117, 32543, 384348, 797692, 580871, -482331, -1642306, -2006867, -1408639, -263242, 907910, 1548450, 1253888, 368249, -70432, 436715, 1016652]
45744A016652n27507j454847j016086J59427O30239J84271j45144J73853N25359
45735d53783L59652M0289N0002J29139j93102p14393q29022m03404J46273M75031
45725a393318N68923N27759M64390M85865M80206J50934m27276o35491j42630
45716G9362M55749M27906m415j26086n377l31773j020818j078478j40652Q60688
45706h83894J050552P32288N51896L83650j44348o84525o75262l77799m54835
45697e02277p73027n76842K22323Q28759P20436K58031k1838o2409l3980K0116
45687G9292O7344M4772O8552K87023M81665K82597j78419l68910j93366j29480
45677D41070l49011l42818K25767Q43645P93460J06143n64645p37344l95872K29239
$$ y = [1016652, 489145, -965702, -1981788, -1822361, -1192122, -1007851, -1152995, -979142, -453783, -94131, -53842, -3840, 125299, -67803, -782196, -1611218, -2014622, -1868349, -1393318, -824395, -296636, 167754, 653619, 1133825, 1284759, 857483, 221992, 79362, 535111, 963017, 958602, 832516, 827139, 495366, -525452, -1603930, -1744582, -883894, 166658, 898946, 1450842, 1834492, 1690144, 1005619, 330357, -47442, -502277, -1275304, -1852146, -1629823, -801064, -80628, 177403, 155565, 93156, 59176, 79292, 146636, 191408, 259960, 546983, 1028648, 1311245, 1132826, 763916, 570550, 441070, 92059, -250759, -24992, 818653, 1612113, 1718256, 1153611, 416267, 20395, 249634]
45667B49634P64265P89776K37058m39292p82955q36106q04611n09933K90667J151178
45657A09681J147738N7472j131792j262045l40773N35878N42780J7082j85074
45648e09053R9938K24491k14467p37089o83736j29425L78514O82790R75196J060999
45638A148158M84258m89080q50868k18415M99655L88436j37604o1558N99379Q23449
45628B185810J43545p25278r65339o12075j69297R2319J08929j66772n19275m59159
45618a086592J05898N33883K46995m09022o20460k38883J14494M4895j02336J10114
45608a301014N30276O85043M26324N644l02382l70985j56093K50267N57211N17110
45598H41401K26114n106n0937m3274q0526j09226j11697j52158j66920K5778L72882
$$ y = [249634, 1013899, 1803675, 2040733, 1601441, 818486, -17620, -822231, -1332164, -1041497, 109681, 1257419, 1314891, 183099, -1078946, -1419719, -883841, -341061, -323979, -509053, -409115, -184624, -399091, -1136180, -1819916, -1949341, -1570827, -888037, 87159, 1148158, 1632416, 1143336, 292468, 74053, 573708, 962144, 824540, 762982, 1362361, 2185810, 2329355, 1604077, 638738, 26663, -142634, -50315, 58614, -108158, -627433, -1086592, -980694, -446811, -199816, -608838, -1229298, -1468181, -1353687, -1308792, -1411128, -1301014, -770738, -85695, 340629, 346273, 43891, -327094, -483187, -232920, 324291, 841401, 1067515, 1062409, 1011472, 968198, 887672, 778446, 666749, 514591, 347671, 373449, 746331]
45587G46331M99171J85466k71182m44474l74018m29474o20551m50657L44053J182674
45577C67339J128868J7739j177673j315219l24631P69121J067323O96396K90613
45568A519876j1563m99827j011161r00688j03699M84640J73260n14903o01523
45559a465588k9491M16315L22743K8805j25271j69711p4187L01438O42282L03919
45549A51254o48458j179231n51657O33954J202321Q33503J80816j66796k28111
45540B27595k17632j65790q4947j35280m08178o92082o13729m0951O66567R07649
45530e56778M85426q5696j77847J20084J79607j43254k28475K94151P99093M66441
45520A152752m87311r92510m87291M19926P62837L36019k08356k33669J40380
$$ y = [746331, 1245502, 1430968, 1159786, 715312, 341294, -88180, -708731, -1159388, -815335, 367339, 1496207, 1513946, 336273, -978946, -1303577, -534456, 532867, 1229263, 1519876, 1508313, 1008486, -2675, -903363, -1007062, -522422, -349162, -864065, -1465588, -1495079, -1078764, -756021, -727216, -852487, -1022198, -1096385, -794947, -152665, 151254, -497204, -1676435, -2228092, -1594138, -391817, 441686, 622502, 455706, 227595, 9963, -155827, -240774, -376054, -784232, -1476314, -2090043, -2130994, -1464427, -556778, -71352, -157048, -334895, -214811, -35204, -178458, -406933, -112782, 686311, 1152752, 665441, -327069, -814360, -394434, 368403, 704422, 496066, 262397, 402777]
45511D02777K94133K6032j41528J68965M05483j83386j200138j361430k86619
45502a875711Q59938R33311J84813n01839r06773j158824q65675K76907J394052
45493a659801J194985j83710j177341p94216L06749R65704Q99049N68391L49349
45484D69159K64381J56883j28649m89131n00693L2880O24650O88534L57352R6434
45474A571800j94074q18832j277292p40728M77050J123379Q26832M65455M61651
45465A895241J24661p53454j101030k90025O06233M05222l90564o11262l07500
45456d22478k79184m73517k87687Q3998M1348j16540K77211P84580M56990l38164
45446b73443l25227M94573P66198N6159n15644l07159r6237l54954k67742N92377
$$ y = [402777, 696910, 722942, 581414, 750379, 1155862, 972476, -227662, -1589092, -1875711, -1015773, -82462, 102351, -399488, -1306261, -2465085, -3330760, -3053853, -1659801, -464816, -648526, -1825867, -2620083, -2313334, -1347630, -448581, 119810, 469159, 733540, 890423, 761774, 272643, -228050, -195170, 429480, 1118014, 1475366, 1571800, 1377726, 558894, -718398, -1459126, -982076, 141303, 968135, 1433590, 1895241, 2019902, 1266448, 165418, -124607, 481626, 886848, 496284, -114978, -422478, -701662, -1175179, -1462866, -1378868, -1337520, -1454060, -1176849, -392269, 64721, -273443, -598670, -104097, 662101, 718260, 202616, -104543, -200780, -555734, -823476, -231099]
45436b31099J146228N51681k62135j57249K54675k34083j192782j197676k19297
45427a541737L72771N2159k71341n2175N3394l73540n75772J16004J042715J097944
45417g9578K72385m43379l82586J78137N62168M06968j06687m73437l57353L1358
45407c92004J83142n1254k73829r2810L58659N78359K45808m26961q30557n48992
45397a250439Q2541K62551k08133n09051R2606J061240J211899L44672n36382
45388E51504o60083l16138m6408J65039M58307N23020M0081o86107j019085o90439
45378a680309M7139O67438O29529j51719r24860p65208J47111N94738J8566o42112
45368b059687l77904L99404O14141J60095j83265o7648J55206K43910K58873J24036
$$ y = [-231099, 915129, 1466810, 1204675, 1047426, 1302101, 1068018, -124764, -1322440, -1541737, -1168966, -1116807, -1388148, -1440323, -1386929, -1760469, -2336241, -2220237, -1177522, -79578, 192807, -250572, -633158, -455021, 107147, 514115, 407428, -66009, -423362, -392004, -208862, -260116, -533945, -626755, -268096, 310263, 556071, 129110, -701447, -1250439, -1167898, -905347, -1113480, -1622531, -1529925, -468685, 743214, 1087886, 551504, -108579, -424717, -471125, -306086, 152221, 675241, 715322, 29215, -989870, -1680309, -1633170, -965732, -336203, -487922, -1412782, -2177990, -2030879, -1436141, -1417575, -2059687, -2437591, -2038187, -1424046, -1263951, -1447216, -1514864, -1359658, -1115748, -856875, -732839]
45358g32839j88849k61406J65285M92487J06492m46430k84053J54288k50467j130973
45348b376465q96794N37818J216260J69932q54138p5841J445987J462027K8795
45339F57581p32658L0162Q84765O06915j52978l29748j12871k45198o41778o71010
45329g06818k46018J84187L98479M90473M19154P9106k68787j71664L47234P09882
45319A235228N47503K35826L51293P40260O12410k71173j007619o73548L01949
45310B072129O61488J07795l74833j35019K62933K24068J36646M59339P52466
45301D167012N70173M79769J121595K057389K755608L804126N497789O009632
45293B6463093L200199j872422n516698n844933m523715l548805k636028j042759
$$ y = [-732839, -921688, -1183094, -1017809, -525322, -418830, -865260, -1149313, -995025, -1245492, -2376465, -3273259, -2735441, -1519181, -1349249, -2203387, -2279228, -833241, 628786, 657581, -75077, -44915, 839850, 1446765, 1293787, 964039, 851168, 605970, -35808, -706818, -952836, -768649, -370170, 120303, 539457, 618563, 349776, 178112, 525346, 1235228, 1782731, 2018557, 2369850, 3110110, 3722520, 3451347, 2443728, 1770180, 2072129, 2733617, 2841412, 2466579, 2331560, 2594493, 2818561, 2955207, 3414546, 4167012, 4737185, 5216954, 6338549, 8395938, 11151546, 14955672, 20453461, 26463093, 29663292, 27790870, 22274172, 16429239, 11905524, 8356719, 5720691, 4677932]
45285D677932K14117r4047j109526j163328l81137q2509l12953L661Q18568Q73378
45275C444156q9408q16246n44426J5164J07909p409N1440K4327k56531l30870
45265A598106P4178M69315L89542P2306j36150l85965q17924j056306p75936l05323
45255h74157j19171j01930J68113O82034J020286R22469M58818j92317p81573
45246A182572r41320m80209K60446O14920K71804l55836n47890p2971N44905O63350
45236A139771K82189j03603k77830m37272n53692k74848L03303M82306J5029l79454
45226A95899j28510K57209Q4845l49645l76572j39839j63174k64777j8252J97320
45216g05496j42347m50183J25614R45562O31624n57127r24638n2385N96242K11507
$$ y = [4677932, 4892049, 4798002, 3688476, 2525148, 2144011, 2061502, 1748549, 1752210, 2570778, 3444156, 3354748, 2538502, 1994076, 2009240, 2117149, 2109740, 2161180, 2185507, 1928976, 1598106, 1672284, 2141599, 2531141, 2603447, 2467297, 2081332, 1263408, 207102, -568834, -874157, -993328, -1095258, -927145, -245111, 775175, 1697644, 2156462, 1964145, 1182572, 241252, -238957, 21489, 636409, 908213, 552377, 4487, -68484, 476421, 1139771, 1421960, 1318357, 1040527, 603255, 49563, -225285, 78018, 560324, 575353, 195899, 67389, 324598, 409443, 59798, -316774, -456613, -619787, -884564, -902816, -705496, -847843, -1298026, -1172412, -226850, 404774, -152353, -1076991, -1129376, -533134, -321627]
45206c21627j77127J92369M33892j53319o07482m5661O03092J64869p02308o51356
45196a264658J08326L89256Q7774j1571R0973j91149n62215k18612N30015N74011
45186d67850j44141n35872j22918M43443O44050O27503M65048N8245k20980L6437
45176G82965K89875k61195j120411j038447r1022L40608j67100m67551R3216O20302
45166a018760L61272k6856J99026N36133K45979l01020l14630J33016M21045L67815
45156F03020J55068j62478m44592l47031O8644K54969J15108J95139N35969L95376
45146A369192l01977m63185L49011Q50016J1933j035641o43630O80812J036729
45137A853260R7814n68843j15143M66293K02578m35649o12179m00301k37079m0810
$$ y = [-321627, -498754, -306385, 127507, -25812, -633294, -678955, -75863, 89006, -613302, -1264658, -1156332, -767076, -679302, -690873, -599900, -791049, -1353264, -1571876, -1041861, -467850, -611991, -1147863, -1270781, -827338, -183288, 444215, 909263, 967508, 746528, 782965, 1072840, 811645, -308766, -1347213, -1438235, -1097627, -1264727, -1732278, -1639062, -1018760, -657488, -684344, -485318, 50815, 296794, -4226, -318856, -185840, 235205, 603020, 758088, 595610, 151018, -196013, -127369, 127600, 242708, 437847, 973816, 1369192, 1067215, 604030, 953041, 1803057, 1814990, 779349, 135719, 816531, 1853260, 1951074, 1382231, 1267088, 1733381, 1935959, 1500310, 888131, 487830, 250751, 209941]
45127B09941L57263N76932K24936l54843m77035j3410N34291O77389L67122o7434
45117B035152k39456r7431j6047k99376o94130p26312m04112j41881o0531J11805
45107e32319M30365N64027L37565k1109k71563l76693k94357k2137J29392j52637
45097b09466n40899l39383M50169R46513N41315l00249o97960l65255L18621Q16298
45087F19704P50755J39947m40134l57249K04340L90723o3419l72817P5141O87838
45077A634829N16031l36952q99029o54027J1415N15906N86312J63646n54783j006535
45067b3187p76835k20809m2306k86765l47858J6519L55717L63613L64240O47005
45057D9334R03482P43993L11181o0728l90595p67048q85764m69128P7781Q3316
$$ y = [209941, 567204, 1144136, 1369072, 1014229, 537194, 523784, 1058075, 1735464, 2102586, 2035152, 1795696, 1698265, 1682218, 1382842, 688712, -37600, -441712, -583593, -644124, -532319, -101954, 462073, 799638, 778529, 506966, 130273, -164084, -186221, -56829, -209466, -750365, -1089748, -639579, 306934, 848249, 548000, -149960, -515215, -196594, 619704, 1370459, 1510406, 1070272, 713023, 917363, 1308086, 1244667, 871850, 946991, 1634829, 2150860, 1813908, 914879, 260852, 272267, 788173, 1374485, 1538131, 983348, -23187, -800022, -1020831, -1063137, -1349902, -1697760, -1681241, -1325524, -961911, -597671, 49334, 952816, 1696809, 2007990, 1947262, 1556667, 789619, -96145, -565273, -487492, -404176]
45047d04176l76293n09677O8295Q37260J172964J090123Q82303N31692m7792n26611
45037B718088m84397r0952M4888k96486o95391p15362l90826p465K50031L02308
45027F34436J40690n8763n4623Q9510L0145l13373n44378l22110J76568N68360
45017C46462P55413Q14568O61956K07513l17279n54081m51278k12876M3948K62030
45007A556376K43800j17697n04593m81698q9792K41581K87394J25703k18412o78293
44997C64369p80887q8863Q80944R44124j89671j306656j164264n6265P25827O28102
44987d3240K95482M01408P18111N56839k67147j152910j294710n14726M44636
44978h56257O28687j0583m91676o1730P62039Q91068J78835m15624k05984L26417
$$ y = [-404176, -780469, -1290146, -1221851, -384591, 788373, 1878496, 2760799, 3292491, 3244699, 2718088, 2233691, 2142739, 2187627, 1891141, 1195750, 480388, 89562, 82097, 332128, 634436, 775126, 716363, 661740, 751250, 781395, 468022, -76356, -398466, -221898, 346462, 1101875, 1916443, 2578399, 2785912, 2468633, 1914552, 1463274, 1250398, 1294346, 1556376, 1800176, 1682479, 1177886, 696188, 606396, 847977, 1135371, 1261074, 1042662, 364369, -416518, -505381, 375563, 1319687, 1130016, -176640, -1340904, -1397169, -671342, -43240, 252242, 653650, 1371761, 1928600, 1661453, 508543, -786167, -1300893, -856257, -227570, -238153, -729829, -791559, -29520, 861548, 1040383, 624759, 418775, 745192]
44968G45192L05525l36143q48585o50338M8893N85527N69627K22285N0683K12951
44958I05617L04247o8549n91124m78619M52664J291016R78848l53820j416643
44949A023637j240831l06311J24611l65382q71834m75177M54703P90266K66275
44940f00043j73660J85194P80130O79438j5449m28169k67293o9452j33684j03798
44930a46786J84082K78810m1195k31050J28636N01099J76187n47548p75153l60249
44920h33167J5790L2587J08661M45839N49768R6150m05403l42280Q1693K16902
44910c3460n3579k60853j15340J79309L43084L44379K72450J76438Q6409L0974
44900I69811L3907J50235L56690L51280k10071j069682j351939n96453M99187
$$ y = [745192, 1050717, 714574, -134011, -784349, -735456, -149929, 419698, 641983, 692666, 905617, 1209864, 1141315, 550191, 71572, 524236, 1815252, 2794100, 2440280, 1023637, -217194, -523505, -398894, -764276, -1636110, -2111287, -1656584, -866318, -600043, -773703, -588509, 191621, 871059, 855610, 427441, 160148, 90696, -42988, -146786, 37296, 316106, 274911, 43861, 172497, 673596, 849783, 302235, -472918, -833167, -817377, -784790, -676129, -230290, 319478, 415628, 10225, -332055, -250362, -33460, -87039, -347892, -463232, -283923, 59161, 403540, 675990, 852428, 938837, 969811, 1003718, 1153953, 1510643, 1861923, 1651852, 582170, -769769, -1366222, -867035]
44891h67035Q69659L91765j45683k04698J0912J61997J88206N3557k76869n04658
44881c22847k88028M0623j94894p87962o63611M58963J362562J007608P9600j02627
44871E89387M12446M69279k68067q93837p77984l71408k45538k83801k00340p9256
44861a649119Q234K64815O52975P21678L43596M8917J85947L03998r5367o63831
44851A21843o88326j69435K01096J3826m31362o45997m86896j30630J95850L79644
44841a640387M36524L98434K40434L6276N1623L84046O41420M30732N7956J16370
44831A153428M26146K29918m19396n02952K69583O83037k25746j536913j673455
44822a596350o06858L76282O61402P36618Q47607O06311M2137k16877p1821j29860
$$ y = [-867035, 2624, 394389, 248706, 44008, 54920, 216917, 405123, 458680, 181811, -322847, -610875, -570252, -765146, -1553108, -2216719, -1757756, -395194, 612414, 692014, 589387, 1001833, 1471112, 1203045, 309208, -468776, -840184, -1085722, -1369523, -1569863, -1649119, -1640885, -1376070, -723095, -1417, 342179, 391096, 577043, 881041, 785674, 121843, -566483, -735918, -534822, -520996, -952358, -1598355, -2085251, -2215881, -2020031, -1640387, -1203863, -805429, -564995, -528719, -477096, -93050, 548370, 979102, 1037058, 1153428, 1579574, 1809492, 1390096, 887144, 1156727, 1839764, 1614018, 77105, -1596350, -2203208, -1826926, -1165524, -428906, 418701, 1025012, 1067149, 850272, 778451, 648591]
44812F48591m67138l71139K66993M81527k13871q86375o07817J33561L90345K99939
44802c25384N52890R18074N46467n01857j189372r49912k43012L77202Q34061
44793A9157J031637O58830j82948q16495q07553m75437l23426l82297l56769o3139
44783a698440M65831R92714J097936N63365j95909n07020l07169j36535j97536
44774G7237p9784L47643N11421Q2830l21637q3002L13681M948p30974p20281K99842
44763b98076J131312P51958l11339q34925n38693j50116j50156k45454j02177
44754g47666P0678n8365l57974m10417j03599K18307J81555j59893l27133Q0761
44744a613746Q46029J233953Q15088M8145k65778k6116J05293k70627p23519o98069
$$ y = [648591, 181453, -189686, 77307, 558834, 344963, -541412, -1149229, -1015668, -625323, -325384, 227506, 1145580, 1692047, 1190190, 818, -949094, -1192106, -814904, 19157, 1050794, 1709624, 1526676, 710181, -97372, -572809, -896235, -1278532, -1635301, -1698440, -1232609, -239895, 858041, 1421406, 1225497, 718477, 411308, 274773, 77237, -2547, 345096, 856517, 939347, 617710, 534708, 848389, 853337, 122363, -597918, -298076, 833236, 1585194, 1273855, 438930, -99763, -249879, -400035, -645489, -747666, -676988, -735353, -1093327, -1503744, -1607343, -1389036, -1207481, -1367374, -1694507, -1613746, -767717, 466236, 1281324, 1329469, 1063691, 1037575, 1142868, 872241, 148722, -549347]
44734e49347k96497N3211K99740N92208P08368L40801j71919j43912L51313M02039
44724A586005m38210j398901j462972o14340L35736P89310P47198M49842J52519
44715A46187R9963K72358K66930j86664p41756q50425m73695O1039O62613J314288
44705E70838J489297N88823q87901j469329m86549R12736J143834J49486p14697
44696A296538n44293J17657K46119l19093q36405o68691K9935N99643O39153L75623
44686I36186K64353L33159J63716l98567q32745n72905J33400M68394J52126k08486
44676D38631q7265J53919j00170o24695n95630J04206N70092J80462m27593k90741
44666f78784M04743O00322l529n08233k37330K67915K17147j65305j34899K68066
$$ y = [-549347, -845844, -792633, -492893, 99315, 807683, 1148484, 976565, 832653, 1183966, 1586005, 1147795, -251106, -1714078, -2328418, -1992682, -1203372, -456174, -6332, 146187, 246150, 518508, 785438, 598774, -142982, -993407, -1467102, -1406063, -743450, 570838, 2060135, 2648958, 1761057, 291728, -194821, 717915, 1861749, 2011235, 1296538, 752245, 869902, 1116021, 796928, -39477, -708168, -678233, -78590, 560563, 936186, 1200539, 1533698, 1697414, 1298847, 466102, -106803, 26597, 494991, 647117, 438631, 351366, 505285, 405115, -219580, -815210, -711004, -140912, 39550, -388043, -678784, -274041, 326281, 322752, -185481, -422811, -154896, 62251, -103054, -237953, 30113]
44656C0113L32254q8789l97902l37420l15128m45967k08572N22035R74612O25065
44646F90301P6052N3597K19139r3433n30659k48809N33205P47362J79626k80388
44636A345993k04262j42302k59049J42795J047228J059908n32378k150581j846175
44627a538823r8831R36152N55530P6825K86450K59487o48951j357941p45558M63387
44617a812273Q08024K44049j56639p3693r3530k85039n6666N09906N13486k51246
44607f53621p75405l25975N03924Q09180O07221M07732K72073N0067k8358J94975
44597A061813K23845l64860r66483o76686K11935M78498k07182p82908m39140
44588a461168K09160K14617k15087j84684L80092O49114K33793k64605k58833
$$ y = [30113, 362367, 273578, -124324, -461744, -776872, -1222839, -1431411, -909376, 65236, 690301, 766353, 819950, 1039089, 945656, 414997, 166188, 699393, 1446755, 1626381, 1345993, 1141731, 999429, 740380, 883175, 1930403, 2990311, 2457933, 307352, -1538823, -1637654, -701502, -145972, -69147, 217303, 476790, -172161, -1530102, -2275660, -1812273, -1004249, -760200, -916839, -990532, -1084062, -1369101, -1425767, -915861, -402375, -653621, -1429026, -1755001, -1251077, -441897, 165324, 573056, 845129, 895196, 866838, 1061813, 1285658, 920798, -45685, -722371, -510436, -31938, -239120, -1022028, -1461168, -1252008, -1037391, -1252478, -1437162, -1057070, -407956, -174163, -438768, -697601]
44579f97601J94J6839q2346J35024N35682N60389K01081J25811N75670P93826
44569B164569J21836p93066p10415L98313J158137O34456m74733r96290q77039
44560F25768q13009q27534l06416O74765J166149P34111J07006R792J56922k8474
44550A499080l85737m34419l10432m63655p25746n26792O8481L56270P6031k43311
44540a090230j76872L2694N4199n26M3674N0837k4000J63396P51910J161836P62842
44529A729760j48129o31917l37636R2577m2017o11243r32391o48248n1847L44286
44519a236805L26824O2555j77496k55615j48385J52359N57673P62739M67513j96162
44509C15200o80493o20053k40523j0488o8666j98948j98307j8930L08324O12892
$$ y = [-697601, -697407, -680568, -762914, -627890, -92208, 468181, 669262, 795073, 1370743, 2164569, 2286405, 1493339, 782924, 1181237, 2339374, 2973830, 2499097, 1502807, 625768, -187241, -1014775, -1321191, -646426, 519723, 1253834, 1360840, 1370632, 1527554, 1499080, 1113343, 678924, 368492, -95163, -820909, -1347701, -1279220, -922950, -846919, -1090230, -1267102, -1234408, -1180209, -1180735, -1137061, -1086224, -1110224, -946828, -194918, 966918, 1729760, 1581631, 949714, 612078, 704655, 662638, 51395, -880996, -1529244, -1581091, -1236805, -909981, -847426, -1024922, -1280537, -1428922, -1276563, -718890, 43849, 511362, 315200, -365293, -985346, -1225869, -1236357, -1305023, -1503971, -1702278, -1721208, -1412884, -799992]
44499g99992N75038R5956m12844m52190q7323J90471K06243K46485M07059L20296
44489B89199k04438o93671n66505N1067M61890K63394k43867n09636l44791j0126
44479a507484J61513J16992L2028l0822k15218m90199m34576K10320R20101Q90614
44469c46731K16272q9340M56758R85272M72262p13840j217931m79108O23020R61667
44459H68301M02726l43025o67966n85518m83079n47399m83064O9078Q39048J055358
44449A24460M90433j23753j74602r9035m85762p82690o4069J128812J148233k75515
44439H86512j333571o68156O26488O54431n26227j177541m81598N44078P59978
44430g15606L11829k9916k8939K5750n8106k05244k51035o7061K86885N05034
$$ y = [-799992, -224954, -128998, -541842, -994032, -1081355, -890884, -684641, -438156, -31097, 289199, 84761, -608910, -1175415, -1124348, -662458, -399064, -642931, -1152567, -1497358, -1507484, -1345971, -1228979, -1196951, -1227773, -1442991, -1933190, -2367766, -2157446, -1237345, -346731, -130459, -219799, 236959, 1222231, 1694493, 980653, -237278, -716386, -93366, 868301, 1271027, 928002, 260036, -325482, -808561, -1355960, -1839024, -1769946, -930898, 124460, 614893, 491140, 316538, 217503, -268259, -1050949, -1115018, 13794, 1162027, 886512, -447059, -1115215, -488727, 165704, -360523, -1538064, -2019662, -1475584, -715606, -403777, -433693, -462632, -436882, -494988, -700232, -951267, -1018328, -731443, -226409]
44420b26409L90003J89721K28207L24547N4888m87467p38501m62561K4599M11699
44410b91274O01226M07205k62476q88068p68911q9647K58659P3662Q3014M91904
44400c84706M56505l33858p27030J63193J261971R53985m34557j127917n78158
44391g50572Q01j50061k58572L17425Q44072N09918j74205k92979O235R928k48707
44380a86717k51132j03651k91782o02299l70174L02547O06899L37555J59257M08246
44370H749N69691K52524j63770k65092k45895l47967l14837M9817L30425J04395
44360b1960l17131l39002M2385L54492L71767K11387m8031l35396l89240q4415
44350e55144K36526K16805L4440K1178L4471j97360l90566r0391M43919N19651
$$ y = [-226409, 163594, 353315, 581522, 906069, 960957, 473490, -265011, -727572, -702973, -291274, 309952, 717157, 454681, -433387, -1202298, -1291945, -1033286, -959624, -876610, -384706, 71799, -262059, -989089, -825896, 436075, 1390060, 955503, -172414, -750572, -749771, -899832, -1158404, -840979, 3093, 513011, 338806, 45827, 52062, 61990, -186717, -437849, -541500, -833282, -1435581, -1805755, -1503208, -896309, -558754, -399497, 8749, 578440, 830964, 667194, 402102, 156207, -191760, -506597, -456780, -126355, -21960, -339091, -678093, -635708, -281216, 90551, 301938, 253907, -81489, -470729, -555144, -318618, -101813, -67373, -46195, -11724, -209084, -599650, -690041, -246122, 273529]
44340B73529R4225k12732j59980j03522j47498J8921L01452J64451l33980m35299
44330e40433L9024L02753k6128k33301J51419M07240o5613n07818n8250O13634
44320H2527L50566m50048m44881L36516N15488k52242o56066O5503Q82090O96224
44310A125677p204j95581O0193L0960l13234m52262l44564l36602l45902M073
44300g74446O08203R64447R08959O62648K99418k40147p21896p75129m48791j67032
44290C16234j61046k73696k34530J13955O56274Q79271L11414o38474q59679m2930
44280F6793O39938J14898r26728r81171K7112P08679L68125j06366J62741P45855
44270H19876Q33545N23679L87683M09894J99608j47036k00465l066p746k94098
$$ y = [273529, 367754, 155022, -4958, -108480, -255978, -237057, 64395, 228846, -105134, -540433, -501409, -198656, -224784, -458085, -306666, 100574, 34961, -472857, -531107, 82527, 433093, -16955, -461836, -125320, 390168, 137926, -518140, -452637, 429453, 1125677, 1118473, 922892, 983085, 1014045, 700811, 248549, -96015, -432617, -778519, -774446, -166243, 798204, 1707163, 2369811, 2669229, 2429082, 1707186, 932057, 483266, 316234, 155188, -118508, -353038, -239083, 417191, 1296462, 1607876, 969402, 109723, 66793, 706731, 821629, -105099, -1086270, -1059158, -350479, 17646, -88720, 74021, 819876, 1653421, 2177100, 2564783, 2974677, 3174285, 3027249, 2826784, 2823718, 2815972, 2521874]
44260B521874m81265m39591n06071q39168j043260p28768j50497P0502k03838
44251a800082l79036J11555R63833J235221N04441n02751p39310j04472N17201
44242a93400M38052o9016l18439j22035J19154N351m29196p81297o62231j04743
44232b117800M20146N54007N16455P07831R74325Q01099K38386n9065O3195j15865
44222A982714r60845j596389j067397J13763N78768O1676l13046K00008R33695
44213f7053R45573L34608j83207l76860m55591l39704K21581R27432J046091L72642
44203B425512m43298o82401l06135J88971L40326K7757m91103p31348m25469Q5800
44193a1388J78699k52626o47473n55122j68660J38343L69667O12922N98359J38247
$$ y = [2521874, 2040609, 1601018, 1094947, 255779, -787481, -1516249, -1666746, -1596244, -1800082, -2179118, -2067563, -1103730, 131491, 635932, 133181, -606129, -710601, -193400, 244652, 175636, -142803, -264838, -145684, -140333, -569529, -1350826, -2013057, -2117800, -1697654, -1143647, -627192, 80639, 1054964, 1856063, 2094449, 2035384, 2098579, 1982714, 1021869, -574520, -1641917, -1528154, -949386, -887710, -1200756, -1000748, -67053, 878520, 1213128, 1029921, 653061, 197470, -142234, 79347, 1006779, 2052870, 2425512, 1982214, 1299813, 993678, 1182649, 1522975, 1550732, 1059629, 328281, -97188, -11388, 167311, -85315, -732788, -1287910, -1456570, -1318227, -948560, -335638, 262721, 400968]
44183D00968k54680Q4409Q46651R47429N3271q14811o34742K44051O73948K64847
44173A811341l17143m44253k30496n9411J7272J38585K39250J09603k53109n41664
44163D69975m04799J85160Q05951R15120M03608k68353n84493m91480k95413k30025
44153E05251k99502l58636j70120L74653Q96647P55232m1726n87427k42709L90658
44143A222321L82037m9470K7481N54185M80861l70074p80287n5794P55544M88097
44133B654901l13646l75401K32615L79805j29942k70940M69067J331057J522204
44124E499720J154786O32537P9315k15429K90067J481713K367986K334184J924058
44115A5548937J815147J772809J345811Q75956Q61272Q45204K4002j326635k129033
$$ y = [400968, 146288, 230697, 1077348, 2024777, 2078048, 1263237, 628495, 872546, 1546494, 1811341, 1494198, 1049945, 819449, 760038, 777310, 915895, 1155145, 1264748, 1011639, 469975, 65176, 250336, 1056287, 1971407, 2375015, 2106662, 1522169, 1030689, 735276, 505251, 205749, -152887, -323007, 51646, 948293, 1703525, 1661799, 1074372, 831663, 1222321, 1604358, 1554888, 1582369, 2136554, 2617415, 2247341, 1467054, 1411260, 2166804, 2654901, 2341255, 1965854, 2198469, 2578274, 2448332, 2177392, 2646459, 3977516, 5499720, 6654506, 7287043, 7366358, 7150929, 7440996, 8922709, 11290695, 13624879, 15548937, 17364084, 19136893, 20482704, 21358660, 22219932, 23065136, 23089138, 21762503, 19633470]
44106A9633470k107670k032480k308247k421866k048624j645918j495356j131437
44098D441872l38375J68382j61051o77170n09598J3554l0045n41234n62031P2022
44088A876326M35623M5163l96216j91312L11513M10014Q1279k54112m66149o41926
44078A210203o72065m23932l5699L41677P54215J072425Q77890J53401m00813
44069B877302k84565J6824k07080p51989q56862m04015L9554K13192L76690N67882
44059A586933M39654n2807m68735n22349l54509j00731K52044N26840M43544J09041
44049A858925r7958j11167r4185R1877O13845R87205N83620j99373l18992K50013
44039C563810M13604j63748l68398N32503J588897J616774R14826M51642K03336
$$ y = [19633470, 17525800, 15493320, 13185073, 10763207, 8714583, 7068665, 5573309, 4441872, 4103497, 4271879, 4110828, 3433658, 2924060, 2937614, 2907569, 2366335, 1804304, 1876326, 2311949, 2357112, 1960896, 1769584, 2081097, 2491111, 2572390, 2318278, 1852129, 1210203, 538138, 114206, 78507, 420184, 1174399, 2246824, 3124714, 3278115, 2877302, 2592737, 2609561, 2402481, 1650492, 793630, 389615, 429169, 642361, 1019051, 1586933, 2026587, 1973780, 1505045, 982696, 628187, 527456, 779500, 1306340, 1749884, 1858925, 1760967, 1649800, 1555615, 1647492, 2261337, 3248542, 3832162, 3632789, 3313797, 3563810, 3977414, 3813666, 3445268, 3977771, 5566668, 7183442, 8098268, 8549910, 8753246]
44030H753246m63288j365640j732258j475652j087785o09702J31935N77421J6671
44021B744948j008775j191461l85703K26614O0000q9022M27066J002381Q18679
44012B604727K7203p33033j176640j160226m65061N44545Q33009N0519o94493
44003a69450k95159O86081Q26119l7157o28584j81000N28035M62398j81315m11838
43993E98130P6320N85498N25642J97579J76034L60444K05439k51385l14118K00403
43983B359986M38675k56914j154123j036826j6714N71813J05643n24742l58347
43974A28451L07963N73856K21143k64939m65971k69308K56286P31056O03246j04660
43964A717123n84056k65267L52607M44149L5405j99381j0269K49648L32143L13968
$$ y = [8753246, 8289958, 6924318, 5192060, 3716408, 2628623, 2018921, 2150856, 2728277, 2744948, 1736173, 544712, 159009, 385623, 445623, 356601, 783667, 1786048, 2604727, 2631930, 1898897, 722257, -437969, -903030, -358485, 474524, 525043, -169450, -464609, 221472, 1047591, 1010434, 381850, 200850, 728885, 1191283, 1009968, 598130, 674450, 1259948, 1785590, 1983169, 2159203, 2519647, 2725086, 2473701, 2159583, 2359986, 2798661, 2541747, 1387624, 350798, 334084, 905897, 1011540, 486798, 128451, 436414, 1010270, 1231413, 966474, 500503, 231195, 487481, 1218537, 1821783, 1717123, 1133067, 867800, 1220407, 1664556, 1699961, 1500580, 1490311, 1739959, 2072102, 2386070]
43954B386070K09875k4042j73964k8999J34383o1821l12130N1953R00553J222317
43944D304195M79199n86356r03705l81109J75833J56368k78615n85776m50395
43935A929639K724M04153M86121K81148m880k49314m57394o25227o97605o22535
43925D46830l56805O4988L64901J69195m31556p31326k19956O40838R47992N57721
43915A452822J72107K19277L22565J06412j23121N1579M01078M15682J24949j7731
43905C125619R9203J57517L5638k6457M1207m0191l42749m39305J504O13513P00484
43894C925983R1041o68906r25432n00818K46621P12822M84083k41295p20346m48745
43884A955008J76501L42544o3580l31988l9234L16724J57760k32382j95523K15451
$$ y = [2386070, 2595945, 2571903, 2397939, 2368940, 2503323, 2441502, 2129372, 2181325, 3081878, 4304195, 4783394, 4197038, 3293333, 2912224, 3088057, 3244425, 2965810, 2380034, 1929639, 1932363, 2336516, 2822637, 3103785, 3098905, 2849591, 2392197, 1766970, 1069365, 446830, 90025, 155013, 519914, 689109, 257553, -473773, -693729, -52891, 895101, 1452822, 1624929, 1844206, 2166771, 2273183, 2150062, 2201641, 2602719, 3018401, 3143350, 3125619, 3224822, 3382339, 3417977, 3391520, 3432727, 3392536, 3049787, 2610482, 2611986, 3225499, 3925983, 4017024, 3348118, 2422686, 1921868, 2168489, 2881311, 3365394, 3124099, 2403753, 1955008, 2131509, 2474053, 2410473, 2078485, 2039251, 2355975, 2513735, 2281353, 2085830, 2301281]
43874B301281L21069j47040p32692r55734p44764j75995O06261J137590R23886
43865B533862J59526l74132k68221J82025O56808J117957J305299Q12288L2796
43856F158208J04902J297316K346344K246349J848838K487765L628984L403590
43848B3522296J364748q21323j761498j999904k570167l075187k394744o96020
43840A1568201N35536M46832k20575l89239o0276P2908r5309M1094P13100J305598
43830A3917870J277025R87595J079996J435306J490933J421964K077001L558699
43822B7246389M789077M992170M856468N544100P124599Q755478R948795J0753397
43814H4010473J0900614R669555O676654K247002k882270p667721j0837354j1699235
$$ y = [2301281, 2622350, 2475310, 1742618, 786884, 42120, -133875, 472386, 1609976, 2533862, 2693388, 2319256, 2051035, 2233060, 2889868, 4007825, 5313124, 6125412, 6158208, 6263110, 7560426, 9906770, 12153119, 14001957, 16489722, 20118706, 23522296, 24887044, 24065721, 22304223, 20304319, 17734152, 14658965, 12264221, 11568201, 12103737, 12550569, 12329994, 11940755, 11880479, 11953387, 11858078, 11899172, 12612272, 13917870, 15194895, 16182490, 17262486, 18697792, 20188725, 21610689, 23687690, 27246389, 32035466, 37027636, 41884104, 47428204, 54552803, 63308281, 73257076, 84010473, 94911087, 104580642, 111257296, 113504298, 110622028, 102954307, 92116953, 80417718]
43806H0417718j0907513r791438q942538q019068o740382n304968l922726k720844
43798B4068241k035620j988068j903383j118578k72954o25235j994383k678005
43790A1452015j795550m55336j0807l49417o81002r15155j258438j320224p12000
43781C954086O3197K98875J47051J00943j7194n52746r93789n68324M03759Q30437
43771C666295M07587j14278j90943j06548k58187n76177p77555o52921j24568
43762A272705N12260O18669K9708m71549j55447N45661P14892L37692N3550r7185
43752C360956m93857p56317j52520Q05554P07963m68168r68639J26735J329598
43743C491305Q71979p03033j420453o70033K54679J84178n63476r48612m75350
$$ y = [80417718, 69510205, 59718767, 50776229, 42757161, 36016779, 30711811, 26789085, 24068241, 22032621, 20044553, 18141170, 17022592, 16749638, 16124403, 14130020, 11452015, 9656465, 9201129, 9190322, 8840905, 8159903, 7244748, 5986310, 4666086, 3954086, 4017283, 4316158, 4463209, 4564152, 4546958, 3994212, 3000423, 2432099, 2835858, 3666295, 4073882, 3959604, 3768661, 3662113, 3403926, 2827749, 2050194, 1397273, 1272705, 1784965, 2403634, 2433342, 1961793, 1806346, 2352007, 3066899, 3404591, 3458141, 3360956, 2867099, 2110782, 1958262, 2763816, 3471779, 3003611, 2034972, 2161707, 3491305, 4363284, 3660251, 2239798, 1569765, 1824444, 2008622, 1445146, 496534, 21184]
43734B1184N03603J202545J029801J73598m94844m19468l3944l6561l14242k01402
43724A430270L87630P95216N98764J17637j84412k68753k93666k36857l027L21690
43714B664492M97556L16809k21640p82923q70851l77522J81783K85513R2013J15091
43704A900321L73142L91287J6577l40987l78659k82136k75879k87166k51208k65227
43694F00065k28384J36174O16640M73243m72646j269003r83639J4061O40627O03245
43684A30383M51851L57997r9514q29932r71352j77003O86804P09487J37077k18901
43674A76897j87650j25589n9371K22131M80541K69136k29210l73165o5425J40529
43664B48824j6843j79838j18583j03617l01167m23265k55384K0033K76608O51948
$$ y = [21184, 524787, 1727332, 2757133, 2930731, 2435887, 2016419, 1982475, 1945914, 1631672, 1430270, 1817900, 2613116, 3211880, 3329517, 3145105, 2876352, 2582686, 2345829, 2342802, 2664492, 3162048, 3478857, 3257217, 2474294, 1603443, 1225921, 1407704, 1693217, 1785230, 1900321, 2273463, 2664750, 2681327, 2340340, 1961681, 1679545, 1403666, 1116500, 865292, 600065, 371681, 507855, 1124495, 1597738, 1125092, -143911, -1127550, -1113489, -472862, 130383, 582234, 940231, 840717, 10785, -960567, -1137570, -450766, 258721, 395798, 176897, -10753, -136342, -195713, 26418, 506959, 776095, 546885, 173720, 108295, 248824, 231981, 52143, -66440, -170057, -471224, -894489, -1149873, -1129840, -853232, -201284]
43654b01284J025893Q87134R9817p11748r30443o46405k83897n3902q4340m61188
43644a360363p50794k04829J032956J702400J100274J71205L3378K49217j98795
43635A774649r02192o06715M97103Q41100R242n47948Q0658P64078K42003p75395
43625A376583p54957K57439Q05523K21180o37420q17857l84670Q0787K98326L28565
43615G73499K92191K65593J94619q2241m82550n46483m4782M96332M13184q3290
43605A196072j46240M29046Q26321L59273n26865q08311j51500P48509R90324
43596B916629L62935n36796r03449m49360L59482P80921N22429n2352m09388l81741
43586B209310j60166P6801L04170M47646K95879k10217p28855q07488m30830n4615
$$ y = [-201284, 824609, 1711743, 1811560, 1099812, 169369, -477036, -760933, -814835, -899175, -1360363, -2111157, -2315986, -1283030, 419370, 1519644, 1690849, 1724227, 1973444, 1774649, 872457, 265742, 762845, 1603945, 1613187, 1065239, 1145897, 1909975, 2151978, 1376583, 621626, 879065, 1684588, 1905768, 1268348, 450491, 65821, 146608, 444934, 773499, 1065690, 1331283, 1525902, 1443661, 961111, 414628, 369846, 866178, 1279362, 1196072, 1049832, 1478878, 2305199, 2664472, 2137607, 1329296, 1177796, 1926305, 2916629, 3279564, 2742768, 1839319, 1389959, 1749441, 2530362, 3052791, 3000439, 2591051, 2209310, 2049144, 2125945, 2430115, 2877761, 3173640, 2963423, 2234568, 1427080, 996250, 941635]
43576I41635l9338k90277n43828o95755o54468k29455M80828R02677O56522J70824
43566F99365R2213L06469K19550j41739j63031J90269K01146l15273n30849L6502
43556E94622N80757K43140m29068k92071N62398R20019K86916m67104n03745j33301
43546A362563j21147n40220q23439n96124m1168L82534L38463j11408m76495k63011
43536h89452M38273R51597P16504j36758r69363j248967r25151l26910K02045
43527b188182N50626P31800O60728K89452p8143k7835K85437K17913l00936l96380
43517b55520M59527J332489R29552m56667j199313n88199K86092K72594k69870
43508E10685l57277L431P4194k08318j71640L23648N53716J11354l93130k63520
$$ y = [941635, 902297, 612020, 68192, -627563, -1282031, -1511486, -1030658, -127981, 528541, 699365, 791578, 1098047, 1317597, 1175858, 1012827, 1203096, 1404242, 1088969, 558120, 594622, 1175379, 1418519, 989451, 697380, 1259778, 2179797, 2466713, 1999609, 1495864, 1362563, 1241416, 701196, -122243, -718367, -759535, -377001, -38538, -149946, -626441, -889452, -451179, 500418, 1216922, 1080164, 110801, -1138166, -2063317, -2390227, -2188182, -1637556, -905756, -245028, 44424, -33719, -61554, 223883, 441796, 140860, -255520, 204007, 1536496, 2466048, 2009381, 810068, 221869, 507961, 780555, 510685, 153408, 156839, 231033, 22715, -148925, 174723, 728439, 839793, 446663, 183143]
43498A83143K38049L69308P8214J2195M23852P40061M47935j23244l30583j80564
43488A858366k16927n84767p98057n16178k0774K79640L50405K75194l0602m66752
43478A29548n22498Q9186Q51603J026056O22682K64014K25642J85256j10370m83137
43468B277982o89888o92050n01024j61855Q8434N5775k9510J88416N40148N04211
43458A580639N2041k53187r9574K05033L43747L72012K99273p0218n79332o33550
43448A216884r0476L43133J10338l15139j61365M24988N95659L8905o65846q98779
43438E98302o46404k47778M1902J15198j9829j92452j83846L7440L18272N46488
43428C67293P29011Q49087P75486L71496k89812q14107p42620j15526L67685J08731
$$ y = [183143, 421192, 790500, 868714, 880909, 1304761, 2044822, 2492757, 2369513, 2038930, 1858366, 1641439, 1056672, 258615, -257563, -278337, 1303, 351708, 626902, 596300, 129548, -392950, -303764, 547839, 1573895, 2196577, 2460591, 2686233, 2871489, 2761119, 2277982, 1588094, 896044, 395020, 233165, 321599, 377374, 347864, 536280, 1076428, 1580639, 1632680, 1379493, 1279919, 1484952, 1828699, 2200711, 2499984, 2429766, 1850434, 1216884, 1126408, 1469541, 1579879, 1264740, 1103375, 1528363, 2124022, 2162927, 1497081, 598302, -48102, -295880, -253978, -138780, -158609, -351061, -534907, -497467, -179195, 367293, 1096304, 1945391, 2720877, 3092373, 2802561, 1988454, 1245834, 1130308, 1497993, 1606724]
43418A606724n28978n86525J88837R09771O58321l67803j116204q35174K35804
43409A64773J123222R91960M459p53788n53620J2183k7040m27384j78350N47153
43399I03568L99714p68460j188556J43548J585135J166946l92917q68323O0973
43390A041628O73471J88595k67384J14799O13935N37175K86737J95520j60271
43381C224205p39757o12946L64739Q67152J10533p82083o02349L2571j2237l23009
43371A526819J33458Q65519N30649o63653j107717l04992M80032L15457j98396
43362A577176k44487L4894K30532M24389O65465N92498J20679k62868l21670m30323
43352B386285p39485p94379l98461k7081P3591L37454R03715J095567N41994n0770
$$ y = [1606724, 1077746, 491221, 680058, 1589829, 2248150, 1880347, 764143, -71031, 164773, 1287995, 2279955, 2284414, 1530626, 977006, 989189, 962149, 534765, 356415, 903568, 1303282, 534822, -653734, -510186, 1074949, 2241895, 1848978, 980655, 1041628, 1715099, 1903694, 1636310, 1751109, 2365044, 2902219, 3188956, 3384476, 3224205, 2484448, 1871502, 2236241, 3103393, 3213926, 2431843, 1829494, 1862065, 1849828, 1526819, 1660277, 2525796, 3056445, 2392792, 1285075, 980083, 1460115, 1775572, 1577176, 1332689, 1367583, 1598115, 2022504, 2687969, 3280467, 3401146, 3138278, 2816608, 2386285, 1646800, 852421, 453960, 426879, 500470, 837924, 1741639, 2837206, 3379200, 3328430]
43342C328430l8475Q7558l07424p34494m38386J37395O0831l58969j5304R86271
43332B707433J297970M84710k75506j22447K32636m3010l97483Q1568R78537J112590
43322F056998L62348k34244q2307K95933K84711L389j45590q6086R8107M32197
43312F985456Q05466Q33192L31505l01236n15214k96269j20981k63198m35072
43303G023649k33917K37198M37251J01451l46338l13536J57927M53039K70505
43294G787229L8239K24138O01278O00787J84410j06102O3284M09872M97478K66649
43284A0567262m0614k28071k41103p6162K23093N03787N29758J43382n01325q93938
43274I986069o05648J05126M15559o7683p08239o23294J41600P14028N73709R3408
$$ y = [3328430, 3289955, 3377513, 3070089, 2335595, 1897209, 2034604, 2095435, 1736466, 1721162, 2707433, 4005403, 4490113, 4214607, 4092160, 4324796, 4281786, 3884303, 3965871, 4944408, 6056998, 6419346, 6185102, 6102795, 6398728, 6683439, 6686828, 6541238, 6455152, 6553259, 6985456, 7790922, 8624114, 8955619, 8654383, 8139169, 7842900, 7721919, 7458721, 7023649, 6789732, 7026930, 7464181, 7565632, 7219294, 6905758, 7063685, 7516724, 7787229, 7825468, 8049606, 8650884, 9251671, 9436081, 9329979, 9393263, 9803135, 10300613, 10567262, 10526648, 10298577, 10057474, 9981312, 10204405, 10708192, 11237950, 11381332, 10880007, 9986069, 9380421, 9485547, 9901106, 9833423, 9125184, 8501890, 8643490, 9357518, 9931227, 10024635]
43264A0024635j18678J05598N78240J023876J109037O56085J4815j87384J67063
43255A3373287N58971O22351N60990N95553N81991M98887P26520J384433J905883
43246B0808866J799539J388597J231109J235395J008896P30842R29175J587808
43238C0720227K193282K560111K953842L496184M096027M865099N919908O869497
43230F3674177P256685P473299Q424554J0233370J2122484J3706936J5494746
43223A38386251J7859651K0501032K3398051K7336415L2693367L8345458M2580149
43216C41100374M4612872M4409657M1380147L4156282K1759086M676797j4836350
43209E17258865l3052044m5997350n1595294n0884307m6689780m1185343l5177997
$$ y = [10024635, 9905957, 10011555, 10589795, 11613671, 12722708, 13378793, 13393608, 13206224, 13373287, 13932258, 14554609, 15115599, 15711152, 16293143, 16792030, 17518550, 18902983, 20808866, 22608405, 23997002, 25228111, 26463506, 27472402, 28203244, 29132419, 30720227, 32913509, 35473620, 38427462, 41923646, 46019673, 50884772, 56804680, 63674177, 70930862, 78404161, 86828715, 97062085, 109184569, 122891505, 138386251, 156245902, 176746934, 200144985, 227481400, 260174767, 298520225, 341100374, 385713246, 430122903, 471503050, 505659332, 527418418, 532095215, 517258865, 484206821, 438209471, 386614177, 335729870, 289040090, 247854747, 212676750]
43202B12676750k9234357k4223969k0449757j7231019j3980218j1126386r401608
43195H7029436q656492q033675p097988o161642n511327m911880m095534l300613
43187C9260285k927642k868158k627014k101933j756402j814854j777997j217234
43179B2169051o68061r79622j894436k177665j363940m72751m96868j007271j012457
43170A2095980n33911l55232o14495p00758m01198j41791q0030Q0755K71418J4352
43160I635090n71525o72157o7185L62048p4075q46252j069998p24624l48908r6761
43150E525653J70150K86555M2506k35580n4371M70698P92545P11636M53412J75899
43140H339103p1630j18514N7888O8139l18281o13800k91394K36754J25393n54686
$$ y = [212676750, 183442393, 159218424, 138768667, 121537648, 107557430, 96431044, 87029436, 78372944, 70339269, 63241281, 57079639, 51568312, 46656432, 42560898, 39260285, 36332643, 33464485, 30837471, 28735538, 26979136, 25164282, 23386285, 22169051, 21500990, 20521368, 18626932, 16449267, 15085327, 14612576, 14115708, 13108437, 12095980, 11562069, 11206837, 10592342, 9891584, 9490386, 9348595, 9268565, 9349320, 9620738, 9635090, 9063565, 8391408, 8324223, 8686271, 8612196, 7765944, 6695946, 5971322, 5622414, 5525653, 5695803, 5982358, 6024864, 5789284, 5734913, 6205611, 6998156, 7709792, 8163204, 8339103, 8267473, 8148959, 8206847, 8274986, 7956705, 7342905, 7051511, 7288265, 7413658, 6858972]
43130F858972q57861l92077J59627J26092l34678p61112j002490j003275o52841
43121B140357j93080j40372m50214m06722K59408Q25962O67563K34718K97881
43112C235501P71055J017376Q67035N42974m0980j007282j763475j488131l90645
43103A743428L72329J85090l67375n04310j90280J96295M60682M81874P5071n90067
43093A862737q69504l99050L37755N87602K16265l18246o15698o00913l66941
43084a65993j06212l1448p9025J04939O07174R49013P06602J64898r2085k4830
43074B033033n4933k90829m30183l99611m60554n80015l39460K67646N50889Q2607
43064C78590n17569l34751N51398J127537P55870j08262o12750m85937r5363J61971
$$ y = [6858972, 6001111, 5609034, 5768661, 5894753, 5560075, 4798963, 3796473, 2793198, 2140357, 1947277, 1806905, 1356691, 949969, 1209377, 2035339, 2702902, 2937620, 3235501, 4006556, 5023932, 5890967, 6433941, 6392961, 5385679, 3622204, 2134073, 1743428, 2115757, 2300847, 1933472, 1429162, 1238882, 1435177, 1895859, 2377733, 2452804, 1862737, 993233, 594183, 931938, 1519540, 1735805, 1417559, 801861, 200948, -165993, -272205, -303653, -382678, -277739, 329435, 1278448, 1985050, 2149948, 2057863, 2033033, 1978100, 1687271, 1257088, 857477, 396923, -183092, -522552, -254906, 295983, 378590, -138979, -473730, 77668, 1205205, 1961075, 1852813, 1240063, 754126, 658763, 820734]
43054H20734K11112J35514o1461m23603q38760r88359o20941R5425O34310O57005
43044c79024L94129K98313M09279L58078J8954k02454N0333M74050M20670k43277
43034A599051r13282r47723l55929L21497O23521M94594J42024j91427l15329
43025D56997j64223J08917K18320L8917k32943l09555j71617q4923k44369n05375
43015h89854n33287j79676L30173N79733L59560p6556k32808L7007K72589o377
43005c39496n33623n44820J11238O43110M45759K6848J73905O11954M14777l71268
42995F38384o09154J57880Q81912N68733k47274m50282n9414N8972k51460l28195
42985C60102J6892K20026L1965j75324l10237p36957j282853j106064j4359R95270
$$ y = [820734, 1031846, 1167360, 1105899, 682296, -156464, -1144823, -1765764, -1670339, -1036029, -379024, 15105, 313418, 722697, 1080775, 1099729, 897275, 947608, 1421658, 1842328, 1599051, 685769, -261954, -617883, -296386, 327135, 821729, 963753, 772326, 456997, 292774, 401691, 620011, 658928, 425985, 116430, -55187, -140110, -384479, -889854, -1423141, -1602817, -1272644, -692911, -333351, -409907, -642715, -605708, -333119, -339496, -873119, -1417939, -1306701, -663591, -217832, -190984, -17079, 594875, 1009652, 638384, 29230, 187110, 1069022, 1637755, 1390481, 940199, 880785, 939757, 688297, 360102, 376994, 597020, 628985, 453661, 143424, -593533, -1876386, -2982450, -2996809, -2001539]
42975b001539J052244M68312k5249k44781j80240M18274J288942J359664J82527
42966B318154j043230r41573J45297Q35373P09918L85081N8767n53497j049002
42957H65288o36574L35992O19086L9673k06440L84583P38175K7786r37244j021009
42947B09316l91286P6129J58972J65905J72969J97201M85968R15278P81669j07231
42937B664890q67961p87154l40513j96358r6813L20642M99252p6117p06490n58419
42927a45041j73192m56106q40360j56179J128173J421440O14784K05210O49731
42918B248460O10965n78631j591971j206281j47466L01963K35925M17770O80371
42909I71105L65036l36926p01560o43499n25097k60919L63311Q68692O02009j72485
$$ y = [-2001539, -949295, -480983, -506232, -751013, -931253, -512979, 775963, 2135627, 2318154, 1274924, 333351, 478648, 1314021, 2023939, 2409020, 2467787, 1914290, 865288, 228714, 564706, 1183792, 1223465, 1017025, 1401608, 2139783, 2167569, 1230325, 209316, -181970, -105841, 53131, 219036, 392005, 589206, 1075174, 1990452, 2772121, 2664890, 1796929, 1009775, 669262, 472904, 376091, 696733, 1195985, 1119868, 413378, -145041, -318233, -774339, -1614699, -1770878, -642705, 778735, 1393519, 1598729, 2248460, 2859425, 2280794, 688823, -517458, -664924, -362961, -127036, 290734, 971105, 1336141, 999215, 297655, -345844, -870941, -1131860, -768549, 100143, 702152, 529667]
42899E29667o01887m36448p1732L01165O89356P11043J7138q24990q76026k29900
42889g92614J42942Q956J82384R04649J096937o677j371003j349656O8587J254802
42879A39307J113799K82112j10182j4695j49846o16003o99236n4449O74243P28026
42869A293076J99469k81032m23367l70149k15462M0383K40922K63289K75789L53081
42859A375999J44674m74794q06836k37297N61087M30178m06014n79084K04041
42850B11954O42750Q486o66159m04153R9228j52868o52589l77256L20296L87538
42840e82773Q080J91384P77801N87398m43963r45628k45897O36237O34244K6759
42830F43642l94942m76666l72594K0357O12838Q36481M51167L0866O6659J66779
$$ y = [529667, -72220, -508668, -580400, -279235, 410121, 1121164, 1138302, 313312, -562714, -792614, -649672, -640716, -458332, 446317, 1543254, 1536577, 165574, -1184082, -1115495, 139307, 1253106, 1535218, 1425036, 1410341, 1260495, 644492, -54744, -109193, 565050, 1293076, 1492545, 1211513, 788146, 417997, 202535, 242918, 483840, 747129, 1022918, 1375999, 1520673, 1045879, 239043, 1746, 562833, 993011, 586997, 7913, 211954, 854704, 863190, 197031, -207122, -107894, -260762, -913351, -1290607, -970311, -582773, -574693, -383309, 394492, 981890, 537927, -407701, -653598, -17361, 616883, 643642, 248700, -227966, -600560, -580203, 32635, 869116, 1320283, 1351149, 1417808, 1584587]
42820A584587k37357q81822j026757n19723P7876K78482J50477P1473K51865M85512
42810B34613L63473j43613m88364k45476K39420M07702M14541P44678J102098
42801B629072O78207m30509j132022r06666m24313k52359n8531L60180L91600
42792H54659k38984o39584p6031P00541N58105k41641n56793j71135J43063O6610
42782C98810n46J0671k64446o39945m48767K32134N15770J32583j37972J40213
42772f1495K84911k67745q72144o54741P3075L08375j23110m49389k00436K69206
42762a693493N43467O79065P67343N86746N4204m09437l81277m2383J17022J8257
42752B39514k2052M8632r9313n01208o15614j01220M79836K90246n57291r91888
$$ y = [1584587, 1347230, 465408, -561349, -1081072, -1003196, -724714, -574237, -502764, -250899, 234613, 598086, 454473, -33891, -279367, -39947, 367755, 782296, 1526974, 2629072, 3307279, 2876770, 1744748, 838082, 413769, 161410, 102879, 463059, 854659, 615675, -23909, -99940, 600601, 1158706, 917065, 360272, 189137, 332200, 398810, 398264, 408935, 144489, -495456, -944223, -712089, -196319, -63736, -201708, -61495, 223416, -44329, -916473, -1571214, -1498139, -1189764, -1312874, -1762263, -1962699, -1693493, -1150026, -470961, 296382, 883128, 937332, 527895, 146618, 104235, 221257, 239514, 217462, 266094, 166781, -334427, -950041, -1051261, -571425, -281179, -838470, -1830358]
42742a830358l51437P23136J083362M66557k88989l20406L10881Q12937O00075
42733A205758j14190o37577n91746k50763q7253j91402l00872k28535M010L44253
42723h48317O97666P85203L73165k96904o32638l72609R7866K44062K0337j18474
42713e0643K12588P89440Q83581J15631q35580q71741n723M30455l68522j358603
42703a059117j094913Q3557N96074O2775l02097J50830N35256J51109k89759k7083
42693a193368L99657K23552j50574R648L40852N5628n63834n96645O422N26940
42683i41722P54574R77727R64432J99701r22361j318108p12155R3178N02879O84237
42673B82382P48949M18776k29733n81509l58616M0802K81767M47381M92910J31811
$$ y = [-1830358, -2181795, -1458659, -375297, 91260, -197729, -518135, -207254, 605683, 1205758, 1091568, 453991, -137755, -388518, -475771, -667173, -968045, -1196580, -1192570, -848317, -150651, 634552, 1007717, 710813, 78175, -294434, -196568, 47494, 67831, -50643, 161945, 951385, 1834966, 1950597, 1115017, 243276, 237553, 668008, 299486, -1059117, -2154030, -2070473, -1474399, -1411624, -1713721, -1562891, -1027635, -876526, -1166285, -1193368, -793711, -570159, -720733, -711085, -370233, -314605, -878439, -1475084, -1468662, -941722, -187148, 790579, 1755011, 1954712, 1032351, -285757, -997912, -904734, -401855, 282382, 1031331, 1450107, 1220374, 638865, 280249, 321051, 602818, 1050199, 1543109, 1674920]
42663A674920m82736p04306l29001O6304J8116j95658j29609J59172L24243K10002
42653F11447q3997k93906j27887L13471L90693k71561j019062q89748M2274Q09399
42643e18877R11484O86262M33191J30865j8027K08220L18576k87117r92488n87907
42633B84182O36107R57077j79344j212056q50657J18677L92907Q8342q0713k62610
42623a08088p09349o69855M07299J456736J195972K20730L8324O14722O84343
42614C130834R3521j06268K01440n6907j022401j403430o16648K67117L83667
42605H70925K86764M75463K70697o98370j241074k76337J208492J408333L12473
42596B617366m71158k19056J21595k32626o75035l48709M79310Q74272M96659
$$ y = [1674920, 1192184, 487878, 158877, 225181, 243297, 47639, -81970, 77202, 401445, 611447, 527450, 233544, 105657, 419128, 809821, 538260, -480802, -1370550, -1328276, -518877, 392607, 1078869, 1512060, 1642925, 1624898, 1833118, 2151694, 1864577, 872089, 284182, 920289, 1877366, 1698022, 485966, -364691, -246014, 146893, 235235, 154522, -108088, -817437, -1487292, -1079993, 376743, 1572715, 1793445, 1831769, 2446491, 3130834, 3224355, 3118087, 3319527, 3262620, 2240219, 836789, 220141, 487258, 870925, 1157689, 1633152, 1903849, 1205479, -35595, -311932, 896560, 2304893, 2617366, 2146208, 1927152, 2048747, 1816121, 1141086, 792377, 1271687, 2145959, 2642618]
42587B642618j99782p20574r75610j081021j063315q00848j87850N93796J041994
42578g50592Q15658K28494o1923J00137K29273M0203n8723L16648P32106M57946
42568B049227l95524r29957o88722j98094p4214j98049j70453o9319j89584l68215
42558a232904k03009K08178L49344O5233k85829m40668m42752k37772L24799R64271
42548i31109J060295N08650o4607k04192j79072l10212l44206j87L54929J99568
42538H9857k98003n47727m31479l06950k43250R1250P17536J097990Q24730J84710
42528A178664j98017p4428K43850K78252j50369p59700j035416o88288M2673N54731
42518f08048M27783j12688l34838K00031R74786R98965J00493p31023o53279r2256
$$ y = [2642618, 2442836, 1722262, 746652, -334369, -1397684, -2198532, -2386382, -1792586, -750592, 65066, 293560, 231637, 331774, 561047, 601250, 542527, 859175, 1591281, 2049227, 1653703, 723746, 35024, -163070, -237284, -435333, -605786, -675105, -864689, -1232904, -1435913, -1227735, -878391, -813158, -1098987, -1539655, -1982407, -2220179, -1895380, -931109, 129186, 637836, 573229, 369037, 189965, -120247, -464453, -464640, -109711, 89857, -208146, -755873, -1187352, -1494302, -1737552, -1646302, -928766, 169224, 993954, 1178664, 980647, 906219, 1150069, 1428321, 1277952, 518252, -517164, -1205452, -1162779, -608048, -180265, -292953, -627791, -427760, 547026, 1545991, 1646484, 915461, 262182, 169926]
42508A69926P5745o4880J50796N35097K70801m65439n23647K69454O46640J5081
42498A079574m34228K68691J116394P45305k80007m49791J71889K21554n21742
42489A917639q18113j58753M44235K66668k0058L04881P61888N56236j35706n22115
42479B596802l00740J55499L37590q308o55648r10608l13102O03500Q16975J44335
42469B466295n64518o31991k62207N7542J36814q3466n49259p95724l71858L19538
42459b78834M30191K5706N1758P17202J037491M55396k17541j73794J35577J5260
42449B198412j48391L09178R08504O64496k29863n88244l687O77841P74514O82627
42439E245387J037835J697028K041241J913328J818931K266153L139796L835127
$$ y = [169926, 245671, 180791, 331587, 866684, 1137485, 672046, 148399, 417853, 1064493, 1079574, 645346, 914037, 2030431, 2775736, 2495729, 2045938, 2217827, 2439381, 1917639, 1099526, 940773, 1385008, 1651676, 1631618, 1936499, 2698387, 3254623, 3118917, 2596802, 2296062, 2451561, 2789151, 2780843, 2125195, 1214587, 901485, 1504985, 2321960, 2466295, 1901777, 1269786, 1007579, 1065121, 1201935, 1118469, 569210, -226514, -598372, -278834, 151357, 177063, 228821, 946023, 1983514, 2438910, 2221369, 2047575, 2183152, 2198412, 2050021, 2359199, 3267703, 3932199, 3702336, 3114092, 3110405, 3788246, 4562760, 5245387, 6283222, 7980250, 10021491, 11934819, 13753750, 16019903, 19159699, 22994826]
42431B2994826M026731M137119M751962N655852N966896N354348M497099L916560
42423F1301393K903474L13210l742936p618262r599858r303842p641478n798390
42415B0813311m380212l320732k365671j503074r01961o21528n95008p80815j079355
42406E264955j231000j088072q29611n98364k05507L73921O06646J64887l07520
42397B150335p9511L54713k6703r71251j204027n02292j4269k33860k69846K95261
42387e01450M80157k37631p05739K9222R90112Q19855r9811n80631o23767q37144
42377a266827p93558J64740J152944P58818n24291q38673J81809J005984P29329
42368E70275J32272p1505k52502o18100n57847J07624N84887M32408J88639J51482
$$ y = [22994826, 27021557, 31158676, 35910638, 41566490, 47533386, 52887734, 57384833, 61301393, 64204867, 64518077, 60775141, 53156879, 43557021, 34253179, 26611701, 20813311, 16433099, 13112367, 10746696, 9243622, 8341661, 7720133, 7125125, 6344310, 5264955, 4033955, 2945883, 2116272, 1517908, 1312401, 1686322, 2292968, 2457855, 2150335, 2070824, 2425537, 2398834, 1427583, 223556, -278736, -293005, -526865, -796711, -501450, -21293, -258924, -964663, -935441, 54671, 874526, 774715, 194084, -429683, -1266827, -2060385, -1895645, -742701, 16117, -508174, -1346847, -1165038, -159054, 570275, 702547, 631042, 378540, -239560, -797407, -689783, -104896, 327512, 516151, 667633]
42358F67633j73461q18840q88737j00028M72153Q1876m02803P2476R98741J093981
42348A002991J56936q88219j293033r73008j61756O45500Q04353K37888l25686
42339g94034l13212j7839O5604j7273o7461j58645j78741K69089R53255Q99969
42329F40712j01673q23883l17868O11598P12417K03149J16726M39985L55293j14019
42319A722437j89210J44750J36459k66994l20603Q4287K05449j46352k56183J38038
42309A252078L25157j35113p19641r29513r60493r29335m42582M91317J053266
42300i94859P69169K56422J69458K02499j35396n13245l87933k854R1552J8793
42290e26394K24094N63895N91545L83588K54080K8665n01816p94562k83786L85343
$$ y = [667633, 494172, -324668, -1213405, -1313433, -841280, -759404, -1162207, -1089731, -90990, 1002991, 1159927, 271708, -1021325, -1994333, -2156089, -1510589, -706236, -468348, -794034, -1107246, -1125085, -1059481, -1076754, -1144215, -1302860, -1481601, -1212512, -259257, 640712, 539039, -284844, -602712, 8886, 721303, 924452, 1041178, 1481163, 1836456, 1722437, 1533227, 1677977, 1814436, 1547442, 1226839, 1311126, 1516575, 1370223, 1114040, 1252078, 1577235, 1442122, 722481, -207032, -1167525, -2096860, -2539442, -2048125, -994859, -225690, 30732, 200190, 402689, 267293, -245952, -633885, -636739, -545187, -526394, -302300, 261595, 853140, 1236728, 1490808, 1519473, 1017657, 223095, -60691, 324652]
42280C24652P7633r42571j167123j13083Q77443O31575k42646n05282o5552L15798
42270h09156L69687L69479L29483R3457j16070p3494j34112o05186r09968l57024
42260a842904N51964P01547J17038p3200M87489Q02341J78957o72127p70239j82977
42250g02111L75707N06544J95574l16909l46306O36525J795597J489516k92939
42241C341198j390907m23328J054150Q51949n59954j028553k20256J58645n25031
42232A257913q62097K519R16253P24462j4922l39018m16242o63556o26573K9781
42222H520M89988L6741n44975j36079Q29665R97404J51920o48019p23856l71526
42212H9783M9415N08470P95203N79288N2968k34565j78827j15521j48609j43078
$$ y = [324652, 402285, -540286, -1707409, -1820492, -943049, -311474, -554120, -1059402, -1124954, -809156, -439469, -69990, 259493, 352950, 236880, 163386, 29274, -575912, -1485880, -1842904, -1290940, -589393, -472355, -545555, -58066, 744275, 923232, 251105, -519134, -702111, -326404, 180140, 375714, 58805, -287501, 349024, 2144621, 3634137, 3341198, 1950291, 1526963, 2581113, 3433062, 2873108, 1844555, 1624299, 1782944, 1257913, 395816, 398335, 1314588, 2039050, 2024128, 1685110, 1268868, 605312, -21261, 8520, 498508, 535249, -9726, -145805, 683860, 1681264, 1833184, 1185165, 461309, 89783, 139198, 647668, 1442871, 2022159, 2075127, 1840562, 1661735, 1546214, 1397605, 1254527]
42202A254527j99719m45657n69844k88224j0510k48448o35096m31034K26459N51344
42192g96202L87580K08808J6574n39757r81764l26138J158653J878520J074128
42183B080402j94132p82594r00464j043144p96440J46814Q35735L26132o07610
42174i35301m94075N13426Q56278K5130p20115l90922L16387L06168k34052l03646
42164a060722L48130R79976R56361M21775j02593l37526l79432m57658o39107
42155b70796p31776n26297j04293K57700M58814N96149O42751M64018J91430J29428
42145A107128J66679j68950p92548q39234Q6035J002976P20109m44815j056485
42136b19105n29458L20718P24625Q21416P85181K79391n97764r16290l17609J63927
$$ y = [1254527, 1054808, 609151, 39307, -248917, -259427, -507875, -1142971, -1574005, -1347546, -796202, -408622, -199814, -183240, -722997, -1704761, -2030899, -872246, 1006274, 2080402, 1886270, 1103676, 203212, -839932, -1636372, -1489558, -653823, -327691, -935301, -1429376, -915950, -59672, -34542, -754657, -1145579, -829192, -523024, -757076, -1060722, -712592, 267384, 1223745, 1645520, 1542927, 1205401, 825969, 368311, -270796, -1002572, -1528869, -1633162, -1375462, -916648, -320499, 322252, 786270, 977700, 1107128, 1273807, 1104857, 312309, -526925, -440890, 562086, 1282195, 837380, -219105, -748563, -427845, 296780, 1118196, 1903377, 2182768, 1585004, 668714, 351105, 515032]
42126E15032k90518q04327k53959O43189L92155o50314p06657M26447R47619N6459
42116B75126p24163j71586O36959L29004m19759k80333K82294n6664r45964q50462
42106a925548L00706R78322N46187J7820Q5995J28349l45687p77910p03001n10131
42096b204898m56209j31202M57839M80909k57652n99584K60688J312203J079404
42087e8502k53546j185364r21892m1657N81065O23570K56661l0637K77031J008777
42077B55506J194562L10734p41938p16731K16811P25941K13593n21894o32984
42068C03600k89065o1315k2500M4908Q9958k8736j42706k2073J77608J15032k08290
42057d3579m48196l75733o4442L09477N75906N24541P6745m37455m95320l6212
$$ y = [515032, 224514, -579813, -833772, -190583, 201572, -448742, -1155399, -728952, 218667, 275126, -449037, -620623, 16336, 345340, -74419, -354752, -72458, -129122, -1075086, -1925548, -1624842, -646520, -100333, -82513, 3482, 131831, -213856, -991766, -1694767, -2204898, -2661107, -2792309, -2334470, -1853561, -2111213, -2710797, -2450109, -1137906, -58502, -312048, -1497412, -2419304, -2460961, -1879896, -1256326, -999665, -1030302, -753271, 255506, 1450068, 1760802, 1018864, 302133, 518944, 1244885, 1458478, 936584, 303600, 14535, -46780, -69280, -24372, 65586, 36850, -105856, -127929, 49679, 164711, -43579, -491775, -867508, -931950, -622473, -46567, 477974, 554719, 117264, -378056, -414268]
42047d14268L88910L63919K02498L89457O77420L85179m19921q02745l10456K81203
42037G41196J05667n18407o69380k29483J39039J55354J51926K40021J43961q9981
42027A69913p1219J54317J42949k3699K13715P32745O62345j44561o58081k98066
42017H80358N0692m78302j176832q35548K72235P55287J66340n10463m23396J43912
42007a155717M97757M19507R6275j88380j10770M13302Q98328P41325N9268m39093
41997A231802m43577l29475l83077l70361r2216J88046J74642l2556k20779l89913
41987f67464n11556l40909J63572N28450L16406j59743j44587N05085J012044
41978G01298O68052j80133n61316k03748J13355k64981q71297q03605n8806N20856
$$ y = [-414268, -25358, 338561, 541059, 930516, 1607936, 1993115, 1573194, 770449, 459993, 741196, 846863, 328456, -340924, -570407, -431368, -276014, -124088, 115933, 259894, 169913, 98694, 253011, 395960, 372261, 585976, 1318721, 1981066, 1836505, 1178424, 880358, 931050, 452748, -724084, -1559632, -1287397, -532110, -365770, -876233, -1299629, -1155717, -657960, -238453, -142178, -330558, -441328, -28026, 870302, 1611627, 1670895, 1231802, 788225, 458750, 75673, -294688, -386904, -198858, -24216, -56772, -277551, -667464, -1179020, -1519929, -1356357, -827907, -511501, -671244, -815831, -310746, 701298, 1369350, 1189217, 627901, 424153, 537508, 272527, -598770, -1402375, -1461181, -940325]
41968i40325N01504K74878J57335r3064n50134o76768j18975O21910Q21478L95984
41958C93823k60654p88025q19947p9243R65592J216816L77196m17850j82446M19782
41948H25044J86385o37705p91253q4636L61914q076m15534j54737L61222M26157
41938F8781M0842l56505m88111k57189K17220M19362l8766o22504l97431N44649
41928h69652J093873P54267K71886K94168M33605J89996j61464k54117l36226
41919A416336n93283n81584j04938J38886l22764p13050j62046P05999N76682
41910C60238m73538r87680k49538P74382R14745K63785l22043m79868m94623n59200
41900a253340m62969k3517M94291N75169P9080m64521m12850J52788M81731J56100
$$ y = [-940325, -438821, -163943, -6608, -99672, -649806, -1326574, -1445549, -823639, -2161, 393823, 133169, -654856, -1474803, -1554046, -588454, 628362, 1005558, 587708, 405262, 825044, 1011429, 373724, -417529, -502165, -140251, -148327, -563861, -718598, -357376, 68781, 109623, -246882, -734993, -992182, -774962, -355600, -394366, -1016870, -1414301, -869652, 224221, 978488, 1250374, 1544542, 1978147, 2168143, 2006679, 1752562, 1416336, 823053, 241469, 136531, 275417, -47347, -760397, -922443, -216444, 360238, -113300, -1100980, -1350518, -576136, 338609, 602394, 280351, -199517, -694140, -1253340, -1716309, -1739826, -1245535, -670366, -591286, -1055807, -1468657, -1315869, -834138, -678038]
41890f78038l55319l87034O1286M90283N89839L74761o3304n04454n53589r7287
41880a122856L90354M17399J36599J8504J21467J85896K04840L05565K51579k57443
41870F51904q62666q41166j90398K76275J00762k13396q0738K67227K37959j58996
41860h13233l40200M379N25631O82810L26931k08012m30361j07929N01764Q24748
41850I66528M89592k68362p76665n77799Q6604N32309M13173R8722J19074M01591
41840A484767L97743p5446n52158n92351l23584r2222L1557R9663O180k49055
41830A35094l22702K295L48914K25952k01896l33180k0443K74982K12205k3966
41820B97255j11723J3265K27091L50096J76670l03744p05006o02469j10288K33214
$$ y = [-678038, -1033357, -1420391, -1359105, -868822, -278983, 95778, 32474, -471980, -1025569, -1122856, -732502, -315103, -178504, -160000, -38533, 147363, 352203, 657768, 909347, 651904, -210762, -1051928, -1242326, -966051, -865289, -1078685, -1159423, -892196, -654237, -813233, -1153433, -1149054, -623423, 59387, 386318, 178306, -252055, -359984, 141780, 966528, 1456120, 1187758, 411093, -166706, -80102, 452207, 865380, 964102, 1083176, 1484767, 1882510, 1807064, 1254906, 662555, 338971, 246749, 278306, 377969, 384149, 135094, -187608, -185313, 163601, 389553, 187657, -145523, -165966, 109016, 321221, 297255, 185532, 198797, 425888, 775984, 952654, 648910, -56096, -658565, -768853, -535639]
41810e35639J67377m6683q8561Q4108L86311P12045Q35632N79444J48706n7090
41800B185650j3536o9867l39498n31597m70018l04229q3801L39005P66583O02239
41790B080931k62684j009213q68279j82819R5167k41172m35177Q4573Q81257J051413
41780A193997L03751p12960j092825o18286P825j0528n44032o82792j5971P12218
41770a459603O32422J0195j98895J68756L08840j45986m43540Q9666Q84362Q98962
41760G45179J30470m63785l77345m9468Q4456J93133M23152M32214K9257l23710
41750H23553k29612p7372l71511p58038n35753J26435M11190K08409K38653O82296
41740E18250P44989L0884o20486l73131K92430L54933j95340m92600j77243K42932
$$ y = [-535639, -368262, -414945, -503506, -419398, -33087, 678958, 1514590, 2094034, 2242740, 2185650, 2172114, 2102247, 1762749, 1231152, 761134, 456905, 373104, 712109, 1478692, 2080931, 1818247, 809034, -59245, -242064, -146897, -388069, -823246, -738673, 142584, 1193997, 1497748, 784788, -308037, -926323, -918498, -929026, -1473058, -2155850, -2171821, -1459603, -827181, -816986, -1015881, -847125, -538285, -684271, -1127811, -1038145, -153783, 745179, 875649, 411864, 34519, -14949, 69507, 262640, 685792, 1118006, 1147263, 823553, 593941, 516569, 145058, -612980, -1148733, -1022298, -611108, -402699, -164046, 518250, 1263239, 1294123, 673637, 300506, 592936, 947869, 752529, 259929, 82686, 325618]
41730C25618L04468R8105j22360k24110j10944J36904J63350j30629k29659J96485
41720D07228N05584k0962p97434o11892L70916O30277l70748j223542o68168N30770
41710a247971Q38039J99824j95394Q3279K38263k75989q95478q33602j00691O53982
41700a535738Q73398M92113o8719k26321J92822P27504Q30328M79766R85m33085
41690A333053p35003o55806j49222K59708R6895k43149m917O99173R76057N35156
41680B111945J25768L02550N54751J74207o24486j058567q45647l41047R7192
41671D96666L13834J28319n12347j177801j231246n45676L50190Q55962P90575
41662e31524L59589p0413j62006J64808O36949Q96869Q29926N16302K7442n03118
$$ y = [325618, 630086, 728191, 605831, 381721, 270777, 407681, 571031, 440402, 210743, 407228, 912812, 891850, 94416, -517476, -146560, 483717, 112969, -1110573, -1778741, -1247971, -409932, -210108, -405502, -322223, -83960, -359949, -1255427, -2089029, -2189720, -1535738, -662340, -170227, -238946, -465267, -272445, 455059, 1285387, 1765153, 1766138, 1333053, 598050, -57756, -206978, 52730, 149625, -93524, -98441, 600732, 1576789, 2111945, 2237713, 2540263, 3095014, 3269221, 2644735, 1586168, 740521, 399474, 496666, 810500, 938819, 426472, -751329, -1982575, -2528251, -2178061, -1322099, -531524, -171935, -242348, -404354, -239546, 397403, 1294272, 2124198, 2640500, 2667942, 2164824]
41652B164824p82360o59969m17940m03952m68893k01686L00595M19223p8566o02912
41642g31636n13794L6299M09090L86988L41535N56523P77102N79705K6m26056
41632A415782l21102m6783l30380j177901j551431o25325Q74551J342704L68251
41623e1634o86417n22726M78494J074412Q81220M31795K9179m31185p18793l93632
41613I0713K90056N26923J41578k06086j38997k1987q4868j775K74146J47244
41603A016947n91771j139194p43249J97515P40701O02596J66559k09878l01143
41594b60917P7592O52975O74670n8439o75716m20162K11913L19462P717l4682
41584D94413J14394j60226p03098p02840n1450N08966N97438N06017L11180k18299
$$ y = [2164824, 1382464, 722495, 304555, -99397, -568290, -769976, -469381, -50158, -128724, -731636, -1245430, -1209131, -800041, -413053, -71518, 485005, 1262107, 1841812, 1841838, 1415782, 1094680, 1047897, 717517, -460384, -2011815, -2637140, -1762589, -419885, -51634, -738051, -1260777, -782283, 292129, 1173349, 1605144, 1634323, 1203138, 484345, 90713, 380769, 907692, 1049270, 843184, 704187, 682200, 597332, 595557, 869703, 1016947, 425176, -714018, -1457267, -1259752, -519051, 83545, 250104, 40226, -260917, -183325, 469650, 1144320, 1085881, 410165, -9997, 201916, 521378, 529095, 494413, 608807, 448581, -254517, -957357, -1008807, -499841, 97597, 603614, 914794, 696495]
41574F96495p63542o56746r5840J243m42581m89037J29886N11484K77760L42744
41564d88134J163219J584201N90161q95729j306030p00502l25158m82108l46342
41555a206422L28601P67158N24127Q1732j19800k44183l88931k36409K72900O16048
41545C94821M06199o9673l20939k64999j60467k45413n50145p96689n15578L81401
41535a741482J208442J133073K20326n55975m05376M85787J249251J156680K39008
41526B989734o56680o30335J59736N03055k96141j309884j172272q653P91412
41517C69972N81002J16998P3581O0624l62580o98029l31111L45661N06928J72411
41507H35457L7835K39284J76155l54918o43857p0221Q79038J119790L37730o35667
$$ y = [696495, -67047, -723793, -819633, -818390, -1260971, -1750008, -1620122, -1108638, -830878, -488134, 675085, 2259286, 2849447, 1953718, 647688, -52814, -377972, -860080, -1206422, -877821, -110663, 413464, 495196, 375396, 131213, -257718, -494127, -221227, 394821, 801020, 731347, 410408, 145409, -15058, -260471, -810616, -1607305, -2122883, -1741482, -533040, 600033, 820359, 264384, -140992, 344795, 1594046, 2750726, 2989734, 2333054, 1702719, 1862455, 2365510, 2069369, 759485, -412787, -421440, 369972, 950974, 1067972, 1141553, 1202177, 839597, 141568, -189543, 156118, 663046, 835457, 873292, 1112576, 1288731, 933813, 289956, 219735, 1098773, 2218563, 2556293, 1920626]
41497A920626q93306m89471j06211J6391K54310P12689Q31554K34013n48872p29164
41487A202559k79522K60402O46798Q96614O85131k81566j331554j288005j17819
41478C93038Q21702N97648j37658l79316k69667m85289q25538n51212J98015M95280
41468a42997J18198j49327R5012K41074j23993l48124J87238Q46158O09900k47299
41458A085840m71302K33264P07104J12840q01968q97936l28951r1197l35381k44013
41448a031700M31383Q08812K45946n85246o35511M9400M99200K01834l47897m60282
41438h24061r1292K63353K16295j25015l40185k13845n22k3412j05811K25869
41428a018626R30485J311120R01676P5413n09437o79550o58975o16002o50486
$$ y = [1920626, 1027320, 537849, 431638, 448029, 702339, 1415028, 2246582, 2480595, 1931723, 1202559, 923037, 1183439, 1830237, 2726851, 3411982, 3130416, 1798862, 510857, 393038, 1214740, 1812388, 1674730, 1295414, 1025747, 540458, -285080, -836292, -638277, -142997, -24799, -174126, -79114, 161960, 37967, -310157, -122919, 723239, 1333139, 1085840, 614538, 847802, 1554906, 1667746, 865778, -32158, -361109, -452306, -787687, -1031700, -600317, 208495, 454441, -130805, -766316, -716916, -217716, -15882, -363779, -824061, -915353, -652000, -435705, -560720, -900905, -1114750, -1115272, -1138684, -1244495, -1018626, -88141, 1222979, 2124655, 2200068, 1690631, 1011081, 352106, -263896, -914382]
41419i14382q39821r26107l92419P01665J412936J005086l3406o55462n84280
41410a226190l32581k27046j58088j02016j57700j50302J71759O28929Q28150
41401g25085P11281L98847j66204q18958q71272j3021Q92185Q26794P0343l50149
41391d5239k54079j92105j28022L51966P43786J49342r01495q80909K37049P28789
41381a90917q5014o78951R7033J046535O01490o43775r51568k6947R26877J071589
41371A166352N34681k77884q09264m09731O30169Q46171l98788j533059q74912
41362a126265O92964R83084j01351n75478K74082Q16549n2409j037548o06135
41353g32507N60293P62894p3199n30541k5718M83378J90183l78076l44506J69615
$$ y = [-914382, -1754203, -2680310, -3072729, -2371064, -958128, 46958, 13552, -641910, -1226190, -1558771, -1785817, -1943905, -2045921, -2203621, -2353923, -2182164, -1553235, -725085, -13804, 385043, 218839, -600119, -1471391, -1484412, -592227, 234567, 304910, -45239, -299318, -491423, -619445, -267479, 476307, 625649, -275846, -1156755, -919706, -190917, -275931, -954882, -857849, 188686, 790176, 146401, -805167, -832114, 94763, 1166352, 1701033, 1423149, 613885, 204154, 834323, 1680494, 1281706, -251353, -1126265, -433301, 549783, 448432, -127046, 147036, 963585, 911176, -126372, -732507, -172214, 590680, 517481, -13060, -38778, 444600, 634783, 256707, -87799, 81816]
41343H1816L76034R5813p3831J43673K17799k06933n21539p9266N57905L22041
41333I13512n96879r08447k72571J53383l00981o81179j28307N71620L95622p3678
41323i27905K55611Q96878N57028n09003p94348n5661L42232j97756n80897j1633
41313a025454O95592O05366J55439K21191O69513P78213L94256j28097n86894
41304A779125q62124o88973r6445L57026K73604o4861k36998k62737k86504j98110
41294b86997L9861J81277J90354M33139R64407J137122M35621o78375j252623
41285A163786r43307k42265K07090K08930L1647j410M1773k22523q15295j103491
41275a675065o00793K60160P31201P93485Q63324P99005J88997n59684n55592
$$ y = [81816, 457850, 553663, 479832, 623505, 841304, 634371, 112832, 33566, 591471, 913512, 316633, -591814, -864385, -711002, -1011983, -1693162, -1821469, -1249849, -854227, -927905, -672294, 224584, 781612, 272609, -521739, -577400, -235168, -432924, -1013821, -1025454, -329862, 275504, 430943, 652134, 1321647, 2099860, 2494116, 2366019, 1779125, 917001, 228028, 131583, 488609, 762213, 697352, 460354, 197617, -88887, -286997, -247136, -65859, 124495, 557634, 1522041, 2659163, 3094784, 2416409, 1163786, 220479, -21786, 185304, 394234, 425881, 424471, 466244, 243721, -571574, -1675065, -2275858, -2015698, -1284497, -491012, 372312, 1171317, 1360314, 800630, 245038]
41266B45038J33823M87565Q7578m35286o25489o77957n22384K42293J185613J207563
41256A328357L19449j59943K49986L85659m40196j111448o08884K40757K59515
41247D63252j34896L4262M46072K64809j59250j7593L26738J03803k04105K58093
41237A381185Q15827J86278j106894j287020j79102N17246l8535p59490o64867
41228a135372j79181J21226M00642O05086J80639n83577m63439O74361J271893
41219H92278M65822l95164J33144J215890J010184n18392j629618j281072j72365
41210b79293N90626P05787M35682M9610k60602m13702m75039l92410P7453Q32041
41200H70153J186251O89010j51395n29286m21197l69539m77531l93349j54043
$$ y = [245038, 378861, 866426, 954004, 518718, -106771, -784728, -1307112, -1064819, 120794, 1328357, 1647806, 1487863, 1737849, 2123508, 1683312, 571864, -37020, 203737, 463252, 328356, 362618, 808690, 1073499, 914249, 896656, 1223394, 1327197, 1123092, 1381185, 2197012, 2383290, 1276396, -10624, -189726, 327520, 288985, -470505, -1135372, -1314553, -1193327, -792685, -187599, -6960, -590537, -1053976, -379615, 892278, 1358100, 962936, 1096080, 2311970, 3322154, 2803762, 1174144, -106928, -279293, 311333, 1017120, 1452802, 1502412, 1241810, 828108, 353069, -39341, 38112, 870153, 2056404, 2745414, 2594019, 2064733, 1643536, 1273997, 796466, 403117, 249074]
41191B49074j94593m42669k34489N69748J108172O57869k63918n77465j53479
41182G18250P0134m53993r86054n15980O87933J210517K63241j206659j569116
41173a781727m23777R84333J240265K65055p87699q63251J7838J019448J434600
41164A105085J199244N99055j59175q66480j105056o14500J74884M85930J77404
41155I96391j14770J0303J34349k07162p07383p65517m05362j63222k89608n39954
41145b051935n82571k44537M13849R51470Q15059R7007m06043k71645l2062j82527
41135a493935k88943J71657P22930N98308M0783j51102K0636k6600j92161J23524
41125d74903P25671P69853J85242k61842l57627o41049j102382r88025j83650
$$ y = [249074, 54481, -388188, -622677, -52929, 1055243, 1713112, 1449194, 871729, 718250, 788384, 334391, -651663, -1167643, -479710, 730807, 994048, -212611, -1781727, -2205504, -1221171, 19094, 284149, -503550, -1366801, -1348963, -329515, 1105085, 2304329, 2903384, 2744209, 1877729, 772673, 158173, 333057, 818987, 996391, 881621, 891924, 1026273, 819111, 111728, -653789, -1059151, -1222373, -1511981, -2051935, -2634506, -2879043, -2465194, -1513724, -698665, -601658, -1007701, -1279346, -1311408, -1493935, -1782878, -1611221, -888291, -289983, -249200, -400302, -379666, -406266, -598427, -474903, 250768, 1020621, 1205863, 944021, 586394, -54655, -1157037, -2145062, -2328712]
41116b328712M40045M07685K04836J52645o0734l58373p0208P60738J131097O79925
41106I58944K59225L18060J09871p12267j131387m25962M89101N35285J30905
41097E31775J53807L19715n4991n82517m84408m039J63861J45298L36651L62650
41087H87802r3824k58260M57786R89117J47334j112533r24289M72144J071936
41078A637213K89252l97219j43575J03121l15915n66319m7426M20351J43682j78122
41068I45043J99755P01657M97517j04502l78718m04566n70677o47159l26338q557
41058i6545j35257l58643k27164o3048k76427m30576L5766O74376O34672J9272
41048b23574l70573l52532m15448o29900n18943q716M09480N43418O84123Q08418
$$ y = [-2328712, -1888667, -1480982, -1276146, -1123501, -1184235, -1542608, -1612816, -852078, 279019, 958944, 1218169, 1536229, 1646100, 933833, -197554, -623516, -134415, 400870, 531775, 685582, 1005297, 950306, 367789, -116619, -120658, 43203, 188501, 525152, 887802, 793978, 535718, 993504, 1982621, 2129955, 1017422, 93133, 565277, 1637213, 1926465, 1529246, 1385671, 1488792, 1172877, 606558, 559132, 979483, 1123165, 945043, 1144798, 1846455, 2343972, 2239470, 1860752, 1456186, 885509, 238350, -87988, -96545, -231802, -590445, -817609, -880657, -1157084, -1587660, -1551894, -877518, -242846, -223574, -594147, -946679, -1362127, -1992027, -2510970, -2519686, -2110206, -1566788, -882665, -74247]
41038g4247M54606l27122o88767j12420P66199R85680M84469n0308k49942l37497
41028H50651m24452k15933L55132P28719M00203k78425m89721n7205L60843K56749
41018A486561o2910l9472L39651O34620N31348L2438o16363r29183n22508K18824
41008A073006L29427m22983j002436n51090K48361K25001l62577k37664P32427
40999C1472J198124L95707p47629j092718p50987m05741j52386J70786K74486
40990a078886o4424l25436N8541P12003Q12573K94243j70210j85222M0461K44823
40980C38466L61949K70170j49914o51932p29769j85176O16199J055175P46898
40971A672066j11141p88310o82399m5435K78711m3889m43858l64518m7339j2792
$$ y = [-74247, 380359, 53237, -635530, -747950, 18249, 1003929, 1488398, 1438090, 1188148, 850651, 426199, 210266, 565398, 1294117, 1694320, 1415895, 926174, 868969, 1229812, 1486561, 1423651, 1384179, 1723830, 2358450, 2889798, 2922236, 2305873, 1376690, 854182, 1073006, 1402433, 979450, -22986, -574076, -325715, -100714, -463291, -700955, 31472, 1229596, 1625303, 877674, -215044, -966031, -1371772, -1524158, -1353372, -1078886, -1143310, -1468746, -1410205, -698202, 114371, 408614, 238404, 53182, 93643, 338466, 700415, 970585, 820671, 168739, -561030, -746206, -130007, 925168, 1672066, 1560925, 772615, 90216, 44781, 323492, 279603, -164255, -528773, -576112, -588904]
40961e88904k08466j91382J19499L77552L62696K01126Q8588O3516K1137j61520
40951H3842m27723m95063k21868Q2501O4558r6941p253K23354K23707J48854L78516
40940d3516N75270J29092m94966k05791P27022P22349n34640j287896m65100M91037
40930c87139J8136q98240m13207R84597J259915J70784n74129l48462m10353j315630
40920a913728j742589p28792P15228J238331R72862P16182N04996Q0274k00355
40911c57591l082J51995k99411q88157p62864J1802O38202P34759N53745L08595
40901H7993j4419k96765l14166r4893J25304K44925L28516L93498L64547J71242
40891I95782j62618m22377l11562J05529L02722M6492n8938N49137J233068Q24590
$$ y = [-588904, -797370, -988752, -869253, -491701, -129005, 72121, 160709, 224225, 245362, 83842, -343881, -838944, -1060812, -978311, -913753, -1010694, -1017947, -794593, -570886, -422032, -43516, 531754, 660846, 165880, -39911, 687111, 1409460, 874820, -413076, -878176, -387139, -369003, -1267243, -1680450, -695853, 564062, 734846, 160717, -187745, -598098, -1913728, -3656317, -4385109, -3669881, -2431550, -1458688, -742506, -237510, -157236, -357591, -360673, -208678, -508089, -1396246, -2159110, -2147308, -1509106, -774347, -220602, 87993, 73574, -223191, -537357, -632250, -506946, -262021, 66495, 459993, 824540, 995782, 833164, 410787, 99225, 204754, 507476, 553968, 495030, 1044167, 2277235, 3101825]
40881C101825n69905j488893j083924j61469J63963p5807j83447M2916L05420
40872E0679M18631L45898M9185k81434k95623o9760o5177k63809q8459M83397
40862B83528N95477j67286r66970q86165j85767K94344K99588K7074m60149r05320
40852b071646o38736M34909J250111R09638L2351k06707J57273J84197l00919
40843b49529n50747k56577O3501P2653N1377K08954L29418K18213o7044m11131
40833e90912o11822l80160J67238M20835K04486J75832O08616N91412m96388j518597
40823a429460j044605L13202P32232K7093k46019M37870P31529j29026r22446
40814a529630m34213O81286J116289P78273L66092P8515k02707k57338r942M5308
$$ y = [3101825, 2531920, 1043027, -40897, -202366, -38403, -114210, -297657, -254741, 50679, 469310, 815208, 864393, 582959, 287336, 217576, 152399, -111410, -199869, 283528, 879005, 711719, -255251, -1141416, -1327183, -1032839, -733251, -706177, -1166326, -2071646, -2710382, -2275473, -1025362, -115724, -83373, -290080, -132807, 51390, -249529, -800276, -1056853, -993352, -920699, -869322, -660368, -330950, -112737, -179781, -590912, -1202734, -1582894, -1415656, -994821, -790335, -614503, -5887, 585525, 89137, -1429460, -2474065, -2160863, -1428631, -1401538, -1647557, -1209687, -478158, -607184, -1529630, -1963843, -1282557, -166268, 612005, 978097, 1056612, 853905, 596567, 586625, 631933]
40804F31933k89069l96883L7304K98986r2586l60712J99798P84783K84923p94932
40794C03545j058812l67057K01398K11670K00654K67602j44804r13208j068941
40785b367953l06784N30468Q25895R16284J046825P48453j29449p66613n12177
40776a5051Q5300J38892k99949n58546m30124k05473P301K87775M80356L90254
40766a19265K05799J81146J23045k31569n41906k47275M48716O88137J62998m41998
40756B27828m67734j59855j00661k12140N0326O69528R03783L22833n19898q15821
40746a01811n41840k89612k75924j49435K05761L58458J03057n9946L05653P87719
40736C42080O99968J00459m04056o02914p06208o20569o0989O30294O88745J15975
$$ y = [631933, 342864, -54019, -16715, 282271, 189685, -171027, 28771, 813554, 1098477, 303545, -755267, -1122324, -920926, -709256, -508602, -241000, -385804, -1299012, -2367953, -2674737, -2144269, -1318374, -402090, 644735, 1393188, 1263739, 497126, -15051, 70249, 209141, -90808, -649354, -1079478, -1284951, -1277650, -989875, -509519, -119265, 86534, 267680, 390725, 159156, -382750, -630025, -181309, 506828, 669826, 227828, -239906, -399761, -500422, -712562, -662236, 7292, 911075, 1233908, 714010, -101811, -643651, -933263, -1209187, -1358622, -1152861, -794403, -691346, -751292, -445639, 342080, 1042048, 1142507, 738451, 135537, -570671, -1191240, -1252229, -621935, 66810, 182785]
40726A82785k30324n603J05783l16104o08365k07477K65660N6105l63043j46802
40716a267385L02994j7523p59312n11179Q24978J557941O91565n37732n45518
40707b61171L24254O04919k173m79095k49904J97272L79517L81824K46846j99562
40697I42727p01265o52208j09249J24893k09473l21010L10018R19390N76206k80687
40687E99342m10526L77527R36692M32501n63313r52070m76782K11605M82941K86305
40677I24222o1624k77172k69876r7947J36778L33995L45957K0210n38599q39273
40667c23329m31956M61462J004045O14913l56505j007242q54745k50929J67297
40658i76989K31029K73868M91475N70831J78283l83729m48123N0468L83702O9836
$$ y = [182785, -47539, -53142, 52641, -263463, -871828, -1079305, -813645, -757540, -1120583, -1267385, -964391, -981914, -1741226, -2252405, -1427427, 130514, 822079, 284347, -261171, 63083, 668002, 665829, 186734, -63170, 134102, 513619, 895443, 1142289, 942727, 241462, -410746, -519995, -395102, -604575, -925585, -615567, 303823, 880029, 599342, 188816, 566343, 1503035, 1935536, 1372223, 420153, -56629, 154976, 637917, 924222, 862598, 585426, 315550, 217603, 354381, 688376, 1034333, 1054543, 515944, -323329, -755285, -293823, 710222, 1325135, 968630, -38612, -893357, -1144286, -976989, -745960, -472092, 19383, 590214, 768497, 384768, -63355, -12887, 370815, 440651]
40648D40651l92747l38973n5375k88411q19268n50706P31215J673164J105676
40639A505226k51999p61007j17267M35561Q8246m64334l25311J83750J72519l31657
40629A33727m93970r7504R6020l60765p52165k16305Q74280J289371N91798k90778
40619G73709l33789L01054O39297K01078n38427q61767n46502J07600O21236O43252
40609A006741K23167j40159P463M63517N54883M1364n19718n27713j22868J12895
40599A099572k0880k39319l48352m48628n43346l95403L5122L37930J16674m42293
40589h48923p15418l43173L59061P24232M23317j97756n11713l30433p2682j11165
40579a624653k04192Q4551N74393O25265J51078j63933M8670K05466j95285n08585
$$ y = [440651, 47904, -291069, -346444, -634855, -1454123, -2004829, -1273614, 399550, 1505226, 1253227, 492220, 374953, 810514, 898760, 434426, 109115, 292865, 465384, 133727, -360243, -457747, -361727, -722492, -1474657, -1690962, -816682, 472689, 1064487, 773709, 439920, 740974, 1380271, 1581349, 1042922, 181155, -365347, -257747, 363489, 1006741, 1229908, 1089749, 1097212, 1560729, 2115612, 2156976, 1637258, 1109545, 986677, 1099572, 1078692, 839373, 491021, 42393, -500953, -896356, -861234, -523304, -406630, -848923, -1564341, -1907514, -1548453, -824221, -400904, -598660, -1110373, -1440806, -1513488, -1624653, -1828845, -1744294, -1169901, -544636, -393558, -557491, -508821, -303355, -498640, -1007225]
40569a007225J39048J196737J183631n2989q86927k99014N42188J62901p70100
40560B08250m62185J032920J675304M68693j080095j235383l31102K44244K11872
40551G32518K31540L36639J4333m82339l22956L92647N74311k00411j054589j138713
40541i17020o09733O7341Q18281J436623J264348J52446q85396p80489J92204
40532G38605Q19732N08145k14459o25616o23561n25616m70536k61553K44677P14731
40522C04549N56587k21210o74338k859J192570J494210N47038n03980o77263l16275
40512A699029j43433j18405L0533j9574n36568q95743m31612L21623L14983l79534
40502a58701p04306k46523L45697N81075P02129Q72426P50395J92293l90730o84054
$$ y = [-1007225, -868177, 328560, 1512191, 1459202, 572275, 273261, 815449, 978350, 208250, -253935, 778985, 2454289, 2922982, 1842887, 607504, 276402, 520646, 732518, 964058, 1300697, 1315030, 832691, 509735, 902382, 1476693, 1276282, 221693, -917020, -1526753, -1459412, -641131, 795492, 2059840, 2212286, 1326890, 546401, 738605, 1558337, 2066482, 1852023, 1226407, 602846, 77230, -393306, -654859, -410182, 304549, 861136, 639926, -34412, -37271, 1155299, 2649509, 3196547, 2692567, 2015304, 1699029, 1555596, 1437191, 1467724, 1448150, 911582, 15839, -415773, -94150, 220833, -158701, -863007, -1109530, -763833, -182758, 519371, 1391797, 2142192, 2334485, 1943755, 1259701]
40492A259701q25827q81088o18049o2990L34634L42583J98006N3368k12165m63004
40482h74831k86650K49098N17595L05526J44986L29650L80150j9327l32155r2665
40472C21377J69625k15915p81453m80182O72113J462159J066077R469o69560o19427
40462I34283k36485L4565O7636q3237l12899m10063j25872M90522R17879O47686
40452A924015p4904l97275k5954K23651l83647j192303r65051J56218O61097j14028
40442a88181r69311o78913K08797L84625j91187m73276j22962J54335J0820l00
40432a865553M43460P58743M19176j34931j61650K65137M27503L6901m41920n40880
40422g94014l83345l42389m32311l66067q5440J50481K46563M29033P18005O83260
$$ y = [1259701, 433874, -447214, -1065263, -1128253, -793619, -451036, -253030, -199662, -411827, -874831, -1161481, -912383, -394788, -89262, 55724, 385374, 765524, 746197, 414042, 321377, 491002, 275087, -506366, -986548, -314435, 1147724, 2213801, 2223270, 1553710, 934283, 697798, 732363, 799999, 716762, 403863, -6200, -132072, 358450, 1276329, 1924015, 1849111, 1451836, 1425882, 1649533, 1265886, 73583, -891468, -735250, -74153, -188181, -1157492, -1836405, -1627608, -1242983, -1434170, -1907446, -2030408, -1876073, -1865253, -1865553, -1422093, -663350, -244174, -379105, -540755, -275618, 151885, 188786, -253134, -794014, -1177359, -1519748, -1952059, -2318126, -2403566, -2253085, -2006522, -1577489, -859484, -176224]
40412a76224J43342k95677m1901M32128J94195n77710o46578M21846J436263J142059
40402B031743j89048j327730j555814r44230J53669J129504J206505L14032n49817
40393B68814n63164k04840l32766o79728l22195O81026J259184Q75783R7676m00533
40383F79257m91534k34594K40504M27177j02866q46754q32834l4230N66349M55438
40373a74087J85612K53954L46420J07883j83144j92788q4676o0190O262R2276
40363B97522j36757o23058p41927k66802J85657J47223J4741K17912L99511J34235
40353c71743j77027L1962M23065K47604l83419o21501j78608L10817K93236j5201
$$ y = [-176224, -32882, -328559, -370460, 61668, 255863, -321847, -968425, -546579, 889684, 2031743, 1842695, 514965, -1040849, -1985079, -1831410, -701906, 504599, 818631, 268814, -294350, -499190, -831956, -1511684, -1833879, -1152853, 106331, 982114, 1079790, 679257, 187723, -46871, 193633, 620810, 517944, -328810, -1161644, -1195874, -629525, -174087, 11525, 265479, 611899, 719782, 536638, 343850, 259174, 198984, 205246, 297522, 160765, -462293, -1204220, -1471022, -1285365, -1138142, -1123401, -905489, -505978, -371743, -548770, -516808, -93743, 153861, -229558, -851059, -1029667, -718850, -425614, -440815]
$$ [...]
##END NTUPLES=NMR SPECTRUM
##END=
