##TITLE=31Pdec_BAU-j-FG
 CCl4, 24 sc
 4.6.2019
##JCAMPDX= 6.0         $$ Bruker NMR JCAMP-DX V2.0
##DATA TYPE= NMR SPECTRUM
##DATA CLASS= NTUPLES
##ORIGIN= UXNMR, Bruker Analytische Messtechnik GmbH
##OWNER= root
$$ XWIN-NMR		Version 3.5
$$ Tue Jun  4 13:51:12 2019 Russian Standard Time (UT+4h)  she@DPX200
##.OBSERVE FREQUENCY= 81.013821
##.OBSERVE NUCLEUS= ^31P
##.ACQUISITION MODE= SIMULTANEOUS
##.ACQUISITION SCHEME= undefined
##.AVERAGES= 24
##.DIGITISER RES= 17
##SPECTROMETER/DATA SYSTEM= spect
##.PULSE SEQUENCE= zgpg30
##.SOLVENT NAME= CDCl3
##.SHIFT REFERENCE= (INTERNAL, CDCl3, 0, 182.463)
##AUDIT TRAIL= $$ (NUMBER, WHEN, WHO, WHERE, WHAT)
$$ ##TITLE= Audit trail, XWIN-NMR		Version 3.5
$$ ##JCAMPDX= 5.01
$$ ##ORIGIN= Bruker BioSpin GmbH
$$ ##OWNER= she
$$ F:/spectra/data/she/nmr/P31/1/pdata/1/auditp.txt
$$ ##AUDIT TRAIL=  $$ (NUMBER, WHEN, WHO, WHERE, WHAT)
(   1,<2019-06-04 13:49:55.40 +0400>,<she>,<DPX200>,
      <created by zg, POWCHK disabled, PULCHK disabled
       configuration hash MD5:
       00 E9 B6 7A A2 85 ED C7 34 08 36 98 17 FE 4E 26
       data hash MD5: 32K
       8F 25 8A 8E 33 30 FD D6 5A ED 06 9C D3 DC 2F F0>)
(   2,<2019-06-04 13:49:58.76 +0400>,<she>,<DPX200>,
      <Start of raw data processing
       efp BC_mod = 2 LB = 1 FT_mod = 6 PKNL = 1 PHC0 = -2206.271 PHC1 = 91.59911 SI = 64K 
       data hash MD5: 64K
       46 02 EC F1 88 96 CE 9E 7B D8 2C E5 D1 FF 44 AF>)
(   3,<2019-06-04 13:50:16.29 +0400>,<she>,<DPX200>,
      <pk PHC0 = 27.32001 PHC1 = 0 
       data hash MD5: 64K
       35 21 62 24 C5 8F 0E 3D 02 6F 3A B8 FD B3 63 9C>)
(   4,<2019-06-04 13:50:29.20 +0400>,<she>,<DPX200>,
      <abs ABSG = 5 
       data hash MD5: 64K
       1B 83 83 17 F4 48 F7 F4 E3 2A A4 06 AC 8B 57 AD>)
$$ ##END=
$$ 
$$ hash MD5
$$ 7B 24 8A FB 13 02 C8 8F AF 58 38 FC D1 6F AA 2D
##$RELAX= 
##$RELAX= 
##$RELAX= 
##$RELAX= 
##$RELAX= 
##$RELAX= 
##$RELAX= 
##$RELAX= 
$$ Bruker specific parameters
$$ --------------------------
##$DU= <F:/spectra>
##$EXPNO= 1
##$NAME= <P31>
##$PROCNO= 1
##$TYPE= <nmr>
##$USER= <she>
##$AMP= (0..31)
100 100 100 100 100 100 100 100 100 100 100 100 100 100 100 100 100 100 
100 100 100 100 100 100 100 100 100 100 100 100 100 100 
##$AQSEQ= 0
##$AQ_mod= 1
##$AUNM= <au_zg>
##$AUTOPOS= <>
##$BF1= 81.014009
##$BF2= 200.13
##$BF3= 200.13
##$BF4= 200.13
##$BF5= 200.13
##$BF6= 200.13
##$BF7= 200.13
##$BF8= 200.13
##$BYTORDA= 1
##$CFDGTYP= 0
##$CFRGTYP= 5
##$CHEMSTR= <none>
##$CNST= (0..31)
1 1 145 1 1 1 1 1 1 1 1 1 1 1 1 1 1 1 1 1 1 1 1 1 1 1 1 1 1 1 1 1 
##$CPDPRG= <waltz16>
##$CPDPRG1= <>
##$CPDPRG2= <waltz16>
##$CPDPRG3= <>
##$CPDPRG4= <mlev>
##$CPDPRG5= <mlev>
##$CPDPRG6= <mlev>
##$CPDPRG7= <mlev>
##$CPDPRG8= <mlev>
##$CPDPRGB= <>
##$CPDPRGT= <>
##$D= (0..31)
0 1 0 0 0 0 0 0 0 0 0 0.03 2e-05 3e-06 0 0 0 0 0 0 0 0 0 0 0 0 0 0 0 0 
0 0 
##$DATE= 1559641794
##$DBL= (0..7)
120 120 120 11 120 120 24 19 
##$DBP= (0..7)
150 150 150 150 150 150 150 150 
##$DBP07= 0
##$DBPNAM0= <>
##$DBPNAM1= <>
##$DBPNAM2= <>
$$ [...]
##$SUBNAM3= <"">
##$SUBNAM4= <"">
##$SUBNAM5= <"">
##$SUBNAM6= <"">
##$SUBNAM7= <"">
##$SUBNAM8= <"">
##$SUBNAM9= <"">
##$SW= 369.568048894756
##$SWIBOX= (0..15)
0 1 3 0 0 0 0 0 0 0 0 0 0 0 0 0 
##$SW_h= 29940.119760479
##$TD= 32768
##$TD0= 1
##$TE= 0
##$TE2= 300
##$TE3= 300
##$TEG= 300
##$TL= (0..7)
0 120 53 12 22 120 120 120 
##$TP= (0..7)
150 150 150 150 150 150 150 150 
##$TP07= 0
##$TPNAME0= <>
##$TPNAME1= <>
##$TPNAME2= <>
##$TPNAME3= <>
##$TPNAME4= <>
##$TPNAME5= <>
##$TPNAME6= <>
##$TPNAME7= <>
##$TPOAL= (0..7)
0.5 0.5 0.5 0.5 0.5 0.5 0.5 0.5 
##$TPOFFS= (0..7)
0 0 0 0 0 0 0 0 
##$TUNHIN= 0
##$TUNHOUT= 0
##$TUNXOUT= 0
##$USERA1= <user>
##$USERA2= <user>
##$USERA3= <user>
##$USERA4= <user>
##$USERA5= <user>
##$V9= 5
##$VALIST= <valist>
##$VCLIST= <CCCCCCCCCCCCCCC>
##$VD= 0
##$VDLIST= <DDDDDDDDDDDDDDD>
##$VPLIST= <PPPPPPPPPPPPPPP>
##$VTLIST= <TTTTTTTTTTTTTTT>
##$WBST= 1024
##$WBSW= 4
##$XGAIN= (0..3)
0 0 0 0 
##$XL= 0
##$YL= 0
##$YMAX_a= 13832
##$YMIN_a= -6074
##$ZGOPTNS= <>
##$ZL1= 120
##$ZL2= 120
##$ZL3= 120
##$ZL4= 120
##$ABSF1= 182.463
##$ABSF2= -187.1042
##$ABSG= 5
##$ABSL= 3
##$ALPHA= 0
##$AQORDER= 0
##$ASSFAC= 0
##$ASSFACI= 0
##$ASSFACX= 0
##$ASSWID= 0
##$AUNMP= <proc_1d>
##$AZFE= 0.1
##$AZFW= 0.5
##$BCFW= 0
##$BC_mod= 2
##$BYTORDP= 0
##$COROFFS= 0
##$CY= -3
##$DATMOD= 1
##$DC= 0
##$DFILT= <>
##$DTYPP= 0
##$F1P= 0
##$F2P= 0
##$FCOR= 1
##$FTSIZE= 65536
##$FT_mod= 6
##$GAMMA= 0
##$GB= 0
##$INTBC= 1
##$INTSCL= 5.30512e-09
##$ISEN= 30
##$LB= 1
##$LEV0= 0
##$LPBIN= 0
##$MAXI= 10000
##$MC2= 0
##$MEAN= 0
##$ME_mod= 0
##$MI= 50
##$NCOEF= 0
##$NC_proc= -6
##$NLEV= 6
##$NOISF1= 182.463
##$NOISF2= 159.3651
##$NSP= 0
##$NTH_PI= 0
##$NZP= 0
##$OFFSET= 182.463
##$PC= 4
##$PHC0= -2178.951
##$PHC1= 91.59911
##$PH_mod= 1
##$PKNL= yes
##$PPARMOD= 0
##$PSCAL= 0
##$PSIGN= 0
##$REVERSE= no
##$SF= 81.0140089999434
##$SI= 65536
##$SIGF1= 159.3651
##$SIGF2= -187.1042
##$SINO= 113.3802
##$SIOLD= 16384
##$SREGLST= <1H.CDCl3>
##$SSB= 0
##$STSI= 65536
##$STSR= 0
##$SW_p= 29940.119760479
##$SYMM= 0
##$S_DEV= 0
##$TDeff= 32768
##$TDoff= 0
##$TI= <>
##$TILT= no
##$TM1= 0
##$TM2= 0
##$TOPLEV= 0
##$USERP1= <user>
##$USERP2= <user>
##$USERP3= <user>
##$USERP4= <user>
##$USERP5= <user>
##$WDW= 1
##$XDIM= 65536
##$YMAX_p= 348380615
##$YMIN_p= -9020829
$$ End of Bruker specific parameters
$$ ---------------------------------
##NTUPLES= NMR SPECTRUM
##VAR_NAME=  FREQUENCY,     SPECTRUM/REAL,   SPECTRUM/IMAG
##SYMBOL=    X,             R,               I
##VAR_TYPE=  INDEPENDENT,   DEPENDENT,       DEPENDENT
##VAR_FORM=  AFFN,          ASDF,            ASDF
##VAR_DIM=   65536,         65536,           65536
##UNITS=     HZ,            ARBITRARY UNITS, ARBITRARY UNITS
##FACTOR=    0.456856943014862, 1,           1
##FIRST=     14782.0589164792, 0,            0
##LAST=      -15158.0608439998, 0,           0
##MIN=       -15158.0608439998, -9020829,    0
##MAX=       14782.0589164792, 348380615,    0
$$ Real data points
##PAGE= N=1
##DATA TABLE= (X++(R..R)), XYDATA
$$ [...]
40793 -1668697 -3009377 -3534026 -3739330 -4017498 -3959724 -3188116 -2237735 -1891249 -1929452 -1404407
40783 -1404407 -249955 252122 -816030 -2400964 -2452736 -442803 1880733 2515398 1388312
40774 1388312 113690 45982 1176037 2694105 3837909 4007104 2778846 454921 -1699932
40765 -1699932 -2489651 -2136826 -1985620 -2610149 -2894927 -1633385 483623 1528686 932742
40756 932742 250656 907587 2272917 2843941 2498557 2370034 2945007 3614335 4008897
40747 4008897 4438517 4792696 4297642 2885534 1689791 1480150 1555102 1004986 227993
40738 227993 156532 554348 249432 -1075181 -2285857 -2137104 -660998 849269 980576
40729 980576 -500063 -2295853 -2899934 -2369157 -2063477 -2446763 -2383371 -1323638 -701067
40720 -701067 -1640044 -2482333 -782707 2762994 4797359 3821784 1844773 882873 209492
40711 209492 -1537434 -3482838 -3699018 -2133289 -535744 -124061 -833148 -2258554 -3793425
40702 -3793425 -4285503 -3111983 -1343316 -451475 -227436 473316 1340803 1025812 -10629
40693 -10629 569027 3306321 5318323 3921589 409013 -1650647 -1023971 191305 -123289
40684 -123289 -1651901 -2804946 -2869207 -2309363 -1816747 -1737188 -1981915 -2066565 -1546954 -615747
40674 -615747 107225 486550 1059932 2098237 2995936 2962766 1960817 620817 -472557
40665 -472557 -1117735 -1422265 -1704662 -2216645 -2700004 -2513378 -1482324 -305473 200396
40656 200396 -62821 -667573 -1185160 -1072510 307459 2676766 4292091 3547025 1077135
40647 1077135 -813850 -903599 -84620 518807 1028986 1749432 2059530 1596964 1445204
40638 1445204 2594633 3947174 3624609 1958058 1286540 2621518 4362565 4878755 4561516
40629 4561516 4306637 3605201 1699733 -491883 -1392072 -1114611 -1071743 -1511003 -1222751
40620 -1222751 178805 1437663 1690645 1777303 2572348 3249613 2485062 643517 -590989
40611 -590989 -503478 -62004 -301750 -1012929 -1297834 -638849 914777 2905581 4321446
40602 4321446 3913044 1482601 -1295757 -2166876 -719550 1006389 839979 -912307 -1911910
40593 -1911910 -857237 837448 1059075 -111292 -780290 -260221 -73209 -1386947 -3013482
40584 -3013482 -3300672 -2899471 -3734189 -5611859 -6003011 -3636867 -394775 1361469 1729657
40575 1729657 2168924 2819918 2775183 2235142 2332830 2987610 2912515 1971693 1595274 2248229
40565 2248229 2373122 926122 -721512 -941322 -564206 -1511087 -3511261 -4327679 -3094365
40556 -3094365 -1375659 -586527 -280696 248363 434021 -219067 -601684 523664 2219734
40547 2219734 2280211 330408 -1532243 -1506988 -168335 857989 1182785 1578940 2266029
40538 2266029 2542402 2171223 2085048 3189485 5015106 6105120 5507984 3501202 1081956
40529 1081956 -795129 -1629757 -1587633 -1377122 -1521439 -1732135 -1406623 -677928 -343461
40520 -343461 -669341 -1015764 -936119 -836775 -1022720 -922284 -117225 528228 -103513 -1575874
40510 -1575874 -2305587 -1686345 -654640 -90566 124249 158251 -430250 -1739673 -2841999
40501 -2841999 -2833529 -1947025 -957485 -43849 1084563 2374007 3389088 3810626 3543957
40492 3543957 2699909 1808346 1521291 1685926 1305644 -82442 -1642559 -2458821 -2826454
40483 -2826454 -3522852 -4395617 -4641899 -4079750 -3165907 -2059092 -674232 521517 805375
40474 805375 305576 -65246 177269 704275 1164171 1559263 1827551 1809851 1638515 1450927
40464 1450927 826315 -657361 -2385610 -3149803 -2641121 -1617139 -645432 258944 756190
40455 756190 256587 -794677 -973155 185519 1371179 1303444 411361 -30927 352493
40446 352493 905495 879791 -141559 -2068949 -3898147 -4184786 -2650924 -697666 316353
40437 316353 555897 766114 787006 113667 -774922 -958839 -580670 -545190 -889006 -686556
40427 -686556 352508 1310363 1364609 803036 404841 441151 593637 441573 -156050 -878865
40417 -878865 -1136484 -694444 22378 492124 670654 712239 551600 190059 -58026 -56444
40407 -56444 -39426 131588 1064589 2455071 2611203 602628 -1883545 -2342151 -646642
40398 -646642 1084039 1447456 868231 -106815 -1711333 -3801715 -5418505 -5986743 -5665892
40389 -5665892 -4375656 -2045593 49960 168987 -1225339 -1729630 -641600 -97512 -1473299
40380 -1473299 -3010815 -2733322 -1549316 -1233835 -1156086 316516 2437388 2946332 1610862
40371 1610862 218812 -496833 -1248870 -1800463 -1014662 573396 1006260 151094 4077
40362 4077 1143472 1681883 750383 184436 1214129 2147761 1364309 226371 554077
40353 554077 1205257 79229 -1887375 -1917285 82921 1344579 571616 -490720 -348242
40344 -348242 52780 -516346 -1401346 -1440638 -933006 -838672 -1113063 -1077549 -647438 -137306
40334 -137306 492811 1286105 1810320 1891919 2219488 3284421 4211716 3664419 1703232
40325 1703232 -133933 -537710 495870 2187130 3768453 4598797 4174449 2549445 624478
40316 624478 -328331 330462 1971506 3169740 3010744 1874412 773996 191811 -26812
40307 -26812 50158 521068 1114346 1433175 1761437 2639492 3497312 2965915 1089941 -66692
40297 -66692 995703 3102552 4065982 3483149 2407058 1086311 -973269 -2977947 -3088085
40288 -3088085 -1166901 615777 779643 481452 1322759 2669182 2734290 1370619 24829
40279 24829 -615372 -1142248 -1624789 -1079118 664537 2011211 1556600 121042 -292429
40270 -292429 840948 2018137 1772179 324711 -1117419 -1944754 -2389951 -2578070 -2162103
40261 -2162103 -1111338 -286670 -666527 -2098087 -3312633 -3336334 -2525507 -1938016 -1986322
40252 -1986322 -2179908 -2094439 -1981867 -2148739 -2215996 -1565083 -348484 584066 849397 938951
40242 938951 1095991 508013 -1473880 -3642068 -3707406 -1135677 1829900 2754569 1875170
40233 1875170 1367305 2226502 3181313 2801150 1440178 434661 158800 -251565 -1447605
40224 -1447605 -2787842 -2890235 -1175788 1177737 2099321 816814 -1070778 -1363986 73064
40215 73064 1332415 1094896 -26935 -1106872 -2316349 -3678554 -3795764 -1553331 1617583
40206 1617583 3061533 2333303 1550009 2171252 3204841 3174089 2217568 1270091 500736
40197 500736 -241999 -467844 125297 552666 -341956 -2035045 -2885181 -2383999 -1589857
40188 -1589857 -1281268 -947368 -15213 968163 1062436 233004 -691743 -1014018 -650626 102905
40178 102905 828320 1098931 721113 -21301 -486810 -178900 753202 1526533 1443260 676442
40168 676442 85086 134356 359974 104193 -678849 -1670568 -2671235 -3336946 -3090565 -2067185
40158 -2067185 -1489412 -2016491 -2329492 -894999 1178753 1038106 -1792042 -4198883 -3438378
40149 -3438378 -578063 1479720 1977347 2380224 3383297 4039365 3727146 3024728 2354075
40140 2354075 1440423 585289 915004 2571446 3893894 3364720 1546211 243767 393752
40131 393752 1508234 2578628 2739216 1559928 -442075 -1836560 -1557262 -30910 1455980
40122 1455980 2252113 2654922 3001504 3150418 2892117 2367116 1956250 1988675 2507135 3124923
40112 3124923 3269612 2797426 2199168 1995846 2146464 2248954 2055975 1577941 978071
40103 978071 583092 662606 1010652 1175646 1262697 1843462 2745548 2797763 1489221 88316
40093 88316 77549 1052020 1424552 897954 767961 1640127 2331028 1729806 626078 640455
40083 640455 1880128 2699179 1810330 -56508 -924143 196648 2117037 2693751 1182674
40074 1182674 -975028 -1823046 -843259 1061341 2826991 3704721 3067044 949927 -1295029
40065 -1295029 -2042534 -1292781 -605423 -1010899 -2002483 -2772483 -3208280 -3160275 -1976362
40056 -1976362 308281 2229888 2388829 1137958 -68566 -475846 -325980 119845 851949
40047 851949 1652241 2233762 2706207 3225910 3424961 2898821 2015236 1475437 1251489 727523
40037 727523 -219298 -1038513 -1371729 -1416189 -1441899 -1559386 -1903895 -2414850 -2483872 -1481606
40027 -1481606 331560 1955134 2648052 2277884 941708 -967446 -2436756 -2503545 -1412193
40018 -1412193 -376918 -92517 -227518 -448872 -970136 -1724925 -1932353 -1152186 -143044
40009 -143044 42095 -564805 -1024474 -833509 -480808 -648439 -1287180 -1662011 -1191774 -131812
39999 -131812 643546 545068 -186748 -892098 -1179904 -1066326 -817968 -932595 -1780676 -2816539
39989 -2816539 -2743489 -1193066 348486 327947 -617369 -526333 935699 1933908 1112157
39980 1112157 -720715 -2111216 -2783127 -3149354 -3248255 -3165933 -3497122 -4315213 -4552165
39971 -4552165 -3517057 -2247223 -2114507 -2707411 -2418378 -744054 1279564 2686132 3390990
39962 3390990 3535317 3199895 2751369 2452110 1845924 564680 -539329 -398977 328713
39953 328713 -6014 -1248192 -1295556 532039 1869958 456640 -2500426 -3877653 -2744351
39944 -2744351 -1057409 -533390 -691987 -346106 560892 1454114 2382687 3688988 4900724
39935 4900724 4983780 3746457 2282303 1724246 1960796 1983932 1340684 698588 743865 1004188
39925 1004188 416676 -1083441 -2378279 -2777593 -2919976 -3490544 -3904951 -3294201 -2199595
39916 -2199595 -1934144 -2459472 -2405777 -1384987 -664224 -901458 -862200 389543 1459928
39907 1459928 557352 -1503519 -2333590 -1588788 -1285635 -2353993 -3204741 -2532438 -1419304
39898 -1419304 -1305149 -1598734 -994862 134317 511924 209470 256581 627311 489827
39889 489827 17692 -8142 -134569 -1595546 -3612968 -3644213 -1076564 1349016 967981
39880 967981 -1526415 -3469562 -3563936 -2454156 -1017890 345753 1190993 1106104 243053
39871 243053 -964445 -2318962 -3534076 -3911450 -3043954 -1489424 -265514 -73392 -1186883
39862 -1186883 -3248836 -4863006 -4536637 -2649662 -1313338 -1530050 -1855591 -935129 134487
39853 134487 -399508 -1988499 -2592582 -1723407 -682344 -154999 457967 1381787 1963368
39844 1963368 1987718 1958472 1908411 1300532 184630 -840021 -1735281 -2753866 -3309896
39835 -3309896 -2722529 -1855907 -2129836 -2970422 -2422761 -552848 176833 -1241624 -2448038
39826 -2448038 -1057712 1911827 3583066 2848251 879382 -949457 -2072363 -2316059
39818 -2316059 -1877344 -1458330 -1535086 -1766481 -1588532 -834355 497818 2167904 3107433
39809 3107433 2179183 52145 -1050660 -195631 1060511 1105582 348492 -187271 -705098
39800 -705098 -1626849 -2180281 -1650998 -893418 -972824 -1380042 -1226669 -1095801 -1878252 -2765835
39790 -2765835 -2346752 -856475 576771 1990894 3740713 4540451 2996587 586876
39782 586876 252029 1990420 2690066 843136 -1304427 -1330636 10682 463271 -445685
39773 -445685 -1327451 -1083524 90743 1264093 1636379 1261994 972213 1016155 364127
39764 364127 -1451266 -2667521 -1488627 686427 922851 -509995 -272809 2564494 4643528
39755 4643528 3474658 1236779 1078000 2348899 2414842 1121795 252908 -31566 -919759
39746 -919759 -1948453 -1488808 105928 859059 615874 1128358 2412081 2110706 -533927
39737 -533927 -2878002 -2599405 -984804 -629684 -1578443 -1914840 -1157871 -790839 -1575297
39728 -1575297 -2265121 -1492790 323052 1655257 1753065 1160944 668101 441026 346595
39719 346595 593148 1452691 2426492 2391374 958024 -783206 -1383074 -620344 504265
39710 504265 1088275 1093535 982056 1176963 1848501 2755373 3299502 3094474 2421455 1850129
39700 1850129 1588303 1485686 1409090 1296180 1148801 1244476 1866101 2480569 1896159 -126259
39690 -126259 -2111668 -2575976 -1903292 -1544213 -1889528 -2134360 -1896715 -1633960 -1508847
39681 -1508847 -1105135 -408741 21765 38297 109775 459236 894250 1424865 2015614 1886852
39671 1886852 393973 -1402200 -1549027 187338 2050826 2935379 3544001 4325970 4236882
39662 4236882 2754139 1333764 1181423 1024102 -851189 -3340356 -3652874 -1401671 699202
39653 699202 520910 -1063624 -2145149 -2482840 -3080450 -4120505 -4656457 -4084063 -2969193
39644 -2969193 -2310109 -2425097 -2675090 -2172121 -795111 567157 1025361 848770 1162563
39635 1162563 2407274 3609589 3512373 2095463 577739 80539 693969 1827934 3014995
39626 3014995 4065666 4651962 4199513 2402741 -286001 -2829850 -4278584 -4377781 -3754140
39617 -3754140 -3434160 -3762249 -3775208 -2279493 243768 1682974 890319 -618196 -609169
39608 -609169 908215 2067019 2037617 1777845 1888114 1652644 764851 166622 235818 -161240
39598 -161240 -1586813 -2614960 -2068931 -1212254 -1717828 -2617509 -1696375 706693 1970821
39589 1970821 1287211 754969 1628014 2001585 -189405 -3707314 -5495549 -4589669 -2679352
39580 -2679352 -1295137 -269019 923790 1846409 1753690 682012 -714722 -1896031 -2491679
39571 -2491679 -2012599 -157423 2547094 4860514 5839461 5560124 4687258 3647729 2652141
39562 2652141 2249562 2993959 4305161 4461764 2394673 -906626 -3339851 -3731865 -2509396
39553 -2509396 -839986 260756 438977 396600 1386825 3507019 4960704 4101471 1890744
39544 1890744 991786 2365093 4063381 3768015 1400472 -1316074 -2961417 -3409215 -3320702
39535 -3320702 -3310231 -3474986 -3564318 -3650234 -4198389 -5029332 -4949175 -3444182 -2030206 -2321248
39525 -2321248 -3191201 -1958125 1443176 3750173 2688218 -34039 -1326609 -611447
39517 -611447 434336 701977 547156 709672 1710086 3552987 4944857 3919536 546764
39508 546764 -2214463 -1993037 -165897 364787 -566160 -771878 298271 715286 -656474
39499 -656474 -2557989 -3601965 -3985252 -4139266 -3601528 -2304666 -1446912 -1896815 -2814534
39490 -2814534 -2853011 -1872674 -691090 61391 197812 -104542 -98295 969395 2570007
39481 2570007 3052520 1638991 -555783 -1961172 -2133204 -1491776 -527457 133608 -115055
39472 -115055 -929440 -1124596 -362836 202951 -336030 -1269749 -1491228 -1167045 -1182704 -1651243
39462 -1651243 -1982341 -1907673 -1604571 -1302066 -1384498 -2162376 -2916952 -2179934 107839 1755546
39452 1755546 903144 -1373455 -2433055 -1423613 204390 1085738 1235556 1041012 461721
39443 461721 -471755 -1403979 -2119631 -2541224 -2369661 -1484573 -416107 417677 1456504
39434 1456504 2912186 3564351 2194176 -128827 -1014909 -48424 772105 260985 -245630
39425 -245630 714465 2391639 3222720 3247553 3565414 4197283 4088952 2948467 1702475
39416 1702475 1074412 778135 339220 -111903 -265899 -384790 -1155352 -2760637 -4294083
39407 -4294083 -4437570 -2992160 -1451066 -1465190 -2830911 -3736452 -3089512 -1743360 -1064436
39398 -1064436 -1131656 -1012082 -221732 851658 1671756 2038785 1986246 1667258 1260655 726674
39388 726674 -142490 -1250781 -2139312 -2625151 -3051973 -3612979 -3947005 -3823685 -3689459
39379 -3689459 -3949361 -4146047 -3543941 -2269642 -1220090 -1002848 -1543139 -2527997 -3526448
39370 -3526448 -3730463 -2398099 87111 2075404 2055342 192739 -1732745 -2045960 -848824
39361 -848824 176999 -205545 -1258062 -1300526 -99755 726384 21255 -1164440 -981975
39352 -981975 673514 2082644 1970895 858864 16897 -98678 23661 -115282 -422675
39343 -422675 -466444 -110010 260709 312923 439261 1313652 2644663 3137796 2246231 1218363
39333 1218363 1464164 2406556 2208177 486882 -1084766 -1187828 -521271 -333264 -459353
39324 -459353 -21974 638558 251509 -1180342 -1867858 -521372 1814476 3046922 2529903
39315 2529903 1268176 -12441 -1663078 -3710460 -4988305 -4636652 -3592322 -3305535
39307 -3305535 -3432310 -2279736 459630 2933463 3514302 2605081 1438836 430852 -342481
39298 -342481 -344905 378544 407835 -1181539 -2918614 -2744051 -1225646 -830278 -1982637
39289 -1982637 -2198958 51681 2702072 2767378 289915 -1996772 -2131822 -577976 1061502
39280 1061502 1519143 257597 -2214159 -4194611 -4031035 -1975912 -213097 -684508 -3201513
39271 -3201513 -5785418 -6504933 -4951609 -2357400 -460282 -33912 -426384 -592111 -346614
39262 -346614 -290841 -708395 -1086237 -825763 -6194 804670 1285193 1653635 2240659 2913622
39252 2913622 3060928 2219633 633018 -956776 -1974805 -2251649 -1765313 -643564 522612
39243 522612 934456 447863 -244596 -572248 -729318 -949690 -699190 645045 2539888
39234 2539888 3515986 2801973 1172229 36399 98360 1020637 2002968 2483271 2496381
39225 2496381 2458136 2468151 1952334 365218 -1786375 -3110870 -2735125 -1230301 54545
39216 54545 303650 -331034 -1302846 -2259279 -3071982 -3624363 -3803903 -3667841 -3447534 -3287609
39206 -3287609 -3075335 -2707112 -2456246 -2720070 -3260805 -3106104 -1663526 214062 796797
39197 796797 -733347 -3327591 -5018364 -4671582 -2833283 -1121646 -834496 -1871807 -2869424
39188 -2869424 -2517509 -777038 1339798 3038896 4329849 5279016 5310440 3830620 1333486
39179 1333486 -750014 -1469073 -1238033 -1077521 -1253380 -1056945 60308 1492711 1946920
39170 1946920 910712 -621360 -1150910 -340711 644697 590515 -293429 -698330 157970
39161 157970 1720897 2930800 3286000 2821074 1672181 346084 9932 1488368 3855557
39152 3855557 4971921 3892517 2015854 1246819 1671125 1861335 1000357 -318793 -1221174
39143 -1221174 -1432687 -987285 -80219 512384 -166227 -1925933 -3266713 -3096337 -1951521
39134 -1951521 -955757 -297027 453104 1114391 1064181 422989 83091 502799 1265145 1906483
39124 1906483 2395704 2609585 2134607 1026200 156475 221015 724616 526917 -697628
39115 -697628 -2039103 -2495107 -2171822 -2039448 -2589441 -3130582 -2694405 -1413767 -470411
39106 -470411 -561170 -955864 -485796 910769 2196687 2626641 2527175 2612696 3011934 3212460
39096 3212460 2726188 1621413 476130 -163615 -331235 -545493 -1089727 -1627321 -1754717
39087 -1754717 -1653541 -1796919 -2178443 -2277891 -1746911 -767311 210308 756973 634321 85208
39077 85208 -155162 420720 1443717 2152093 2346702 2320352 2028118 1103102 -266261 -1278663
39067 -1278663 -1589939 -1756670 -2288211 -2867648 -2909546 -2373756 -1601222 -778207 -10661 393495
39057 393495 128436 -815951 -2257360 -3872316 -4964553 -4719366 -3147649 -1430402 -830882
39048 -830882 -1391215 -1996015 -1575089 -75718 1518666 2015760 1167176 56402 -69554
39039 -69554 667986 1047873 553707 -24927 -58004 -43993 -500151 -962426 -1003729 -1253747
39029 -1253747 -2204571 -2842431 -1960009 -288566 326014 -351068 -753894 -135784 359112
39020 359112 -281888 -1418007 -2016369 -2139991 -2315464 -2494376 -2522315 -2703112 -3038165 -2810377
39010 -2810377 -1834574 -1229915 -1890260 -2942057 -2851020 -1455020 197048 1425493 2173656
39001 2173656 2278212 1811267 1687645 2528670 3304440 2623740 1035875 272230 366646
38992 366646 -320471 -1887588 -2054570 378038 3277473 3982826 2792129 1824221 1619916
38983 1619916 1028692 -119984 -446695 733770 2309786 2892698 2193339 648138 -1131259
38974 -1131259 -2239005 -1931515 -649467 264950 191345 -187052 -68165 600386 1596041
38965 1596041 2711761 3223836 2159537 -252958 -2236062 -2281024 -766760 751073 1296614
38956 1296614 1033781 640690 665606 1129942 1453785 1173017 780473 1140781 2015580 2204480
38946 2204480 1424362 831789 1110806 1323215 570089 -388992 -375562 315116 626492 622704
38936 622704 1185043 2224139 2587541 1644902 -75750 -1613183 -2055567 -814716 1493287
38927 1493287 2961677 2374472 741710 -349519 -1087347 -2457917 -3743018 -3339861 -1809944
38918 -1809944 -1492958 -2734411 -3136672 -1480473 161149 -225628 -1308649 -557585 1811598
38909 1811598 3278329 2617250 1030908 14488 -198897 -112738 -236216 -920782 -1949483
38900 -1949483 -2395105 -1702356 -607315 -114566 46971 911968 2472596 3464360 2982185
38891 2982185 1486689 132466 -355642 -224259 -500670 -1912404 -3619639 -3694461 -1499684
38882 -1499684 1186328 2324884 2106232 2056738 2334552 1599259 -485123 -2271981 -2212085
38873 -2212085 -795214 289286 318536 228263 1229842 2977688 3404955 949320 -3033303
38864 -3033303 -5103425 -3558690 -381905 1478713 1578784 1383914 1392283 907505 118830
38855 118830 139091 893815 1039153 347730 247640 1398996 2541244 2551322 2016803 1845031
38845 1845031 1824021 1620389 1809622 2671813 3115613 2115667 350297 -780340 -958379
38836 -958379 -636392 194312 1558323 2502747 2065350 914006 605678 1316040 1625835
38827 1625835 651609 -841965 -1770703 -2102722 -2339767 -2416030 -1925497 -1184591 -1258074 -2547445
38817 -2547445 -3722246 -2803326 392349 3522622 4137275 2387857 404068 -630682
38809 -630682 -1389746 -2416392 -2942139 -2353503 -1371540 -803511 -335288 389467 661013
38800 661013 -74799 -925228 -894305 -626861 -1246429 -2190747 -1977226 -691430 131565 -13305
38790 -13305 -54881 559359 948544 449681 -275980 -400858 -45771 303979 497526 372688
38780 372688 -366418 -1528698 -2528228 -3310142 -4243167 -4985075 -4646609 -3297178 -1975980
38771 -1975980 -926332 567534 2051381 1587251 -1146310 -3232396 -1975696 1157898
38763 1157898 2284769 263582 -2143927 -2329493 -890879 74267 -38860 -273391 -9185
38754 -9185 323251 109744 -650962 -1284578 -822148 1191048 3889291 5508017 5111706
38745 5111706 3631539 2738617 2942810 3312229 2909114 1906464 1168838 1165501 1580769
38736 1580769 1844062 1811451 1868205 2402717 3260755 3825373 3637789 2803361 1750321 783262
38726 783262 3914 -536294 -894311 -1391295 -2401634 -3867660 -5204626 -5847840 -5835574
38717 -5835574 -5730460 -5956269 -6281963 -6039229 -4915082 -3482409 -2725447 -2886629 -2995117
38708 -2995117 -1898818 282130 2168886 2713181 2306580 1979285 1948771 1616927 854037
38699 854037 482364 1151957 2255622 2504533 1476324 194976 68560 1381297 2886128
38690 2886128 2881448 779894 -2273869 -4319853 -4185777 -2358332 -500105 -123842 -1423807
38681 -1423807 -3157367 -3828525 -3163726 -2210655 -1875989 -1890833 -1632530 -1323624 -1531604
38672 -1531604 -1897496 -1544019 -661504 -354175 -652938 -133649 1721996 3086524 1949021
38663 1949021 -1084262 -3453559 -3676830 -2540982 -1583008 -1593126 -2523839 -3708523 -4032952
38654 -4032952 -2869208 -1042603 -80902 -407190 -1070098 -1285683 -1278299 -1393021 -1362069 -900327
38644 -900327 -282676 96351 152501 -129525 -660780 -764593 373221 2351699 3541254
38635 3541254 3011060 1665532 796483 349259 -426184 -1277788 -1135781 199980 1651677
38626 1651677 2246008 2080372 1756892 1556084 1433313 1346778 1331670 1492756 1936053 2422577
38616 2422577 2227895 839426 -1213737 -2720425 -3034527 -2513367 -1720085 -838103 -97459
38607 -97459 -90442 -1075731 -2330775 -2814974 -2355210 -1655828 -1221594 -884691 -505318 -481687
38597 -481687 -1110960 -1848154 -1777632 -701051 706373 1721084 2058056 1640508 588221
38588 588221 -423039 -537909 134540 400279 -435496 -1453433 -1348459 -309214 289633
38579 289633 -162855 -961028 -1536219 -2326306 -3733092 -5121091 -5552310 -4962198 -3971869
38570 -3971869 -2967015 -2015825 -1389883 -1442455 -1999908 -2440318 -2468531 -2388766 -2443543 -2223166
38560 -2223166 -1114603 637782 1687227 870439 -1244951 -2701436 -2420362 -1530185 -1718696
38551 -1718696 -2828284 -3273710 -2597082 -2036651 -2236604 -2083272 -815044 204601 -551470
38542 -551470 -1996580 -1606231 873235 2890851 2654730 1429136 1322192 2184192 2116413
38533 2116413 339772 -1910883 -3249542 -3678800 -3974207 -4388832 -4488680 -3882299 -2704105
38524 -2704105 -1495378 -773453 -617302 -659560 -626820 -749671 -1292919 -1825925 -1593172 -718225
38514 -718225 -286316 -782167 -1130239 -39920 2148826 3834712 4094653 3331545 2199231
38505 2199231 1023577 320152 593845 1237710 865168 -646823 -1615933 -838050 734279
38496 734279 1576349 1715106 2010540 2358395 2181772 1931826 2354687 2779190 1937341 161243
38486 161243 -1069310 -1493678 -1950005 -2034736 -304693 2759759 4419461 3284751 1200645
38477 1200645 425775 866126 1385601 1974932 2988955 3769489 3731353 3578399 3891378
38468 3891378 3787056 2597808 1551073 1902719 2588049 1807780 -4271 -967347 -744109
38459 -744109 -493902 -390632 469314 1918693 2738844 2798588 3083986 3637571 3604133 3317844
38449 3317844 4007486 5183581 4776806 2517670 825245 1372662 2910233 3630095 3655348
38440 3655348 3785044 3611073 2588703 1565119 1478160 1562517 540653 -1139406 -1842651
38431 -1842651 -1061839 162951 787425 532086 -572628 -2216958 -3464191 -3375973 -2130970
38422 -2130970 -937090 -788186 -1622731 -2539370 -2583512 -1586000 -416052 -90545 -589112
38413 -589112 -1002361 -769528 -104626 668507 1307312 1304049 467249 -233391 251097 1161669
38403 1161669 809017 -509704 -537850 1383110 3019793 2666146 1653794 1763798 2147046
38394 2147046 1038160 -1022646 -2171137 -2337356 -2811826 -3408016 -2748044 -1172989 -734716
38385 -734716 -1953537 -2869677 -1952259 -66163 1171633 1432900 1356408 1412729 1656749
38376 1656749 1677964 668346 -1394984 -2826397 -2010240 -11627 460859 -1085041 -2177943
38367 -2177943 -1118120 683221 1245946 935192 1170558 1700741 1100689 -831211 -2926104
38358 -2926104 -4431421 -5429132 -5787084 -5119693 -3718083 -2349657 -1187133 41043 982041
38349 982041 899197 42400 -357229 197071 668969 -94890 -1751972 -2759762 -1988529
38340 -1988529 221344 2346924 2880276 1538040 -547431 -1982919 -2390186 -2263876 -1827577
38331 -1827577 -803818 530823 979930 -112293 -1542407 -1436800 231637 1366709
38323 1366709 473010 -1228763 -1340828 540389 2356828 2311877 933782 -21983 172442
38314 172442 764002 760658 -69083 -1130795 -1451274 -532051 870312 1319011 453320 -517817
38304 -517817 -614051 -446203 -847131 -1127592 -221631 1042651 720300 -1209449 -2469557
38295 -2469557 -1631281 75763 890962 876932 955250 884802 -178504 -1735339 -2174209
38286 -2174209 -966771 552382 846529 -184863 -1483532 -2132671 -2008258 -1440115 -639722
38277 -639722 361789 1274631 1442504 602440 -443920 -555501 332636 1177231 1281926
38268 1281926 982125 632673 -176102 -1804771 -3658768 -4758953 -4753272 -3903254 -2692551
38259 -2692551 -1963591 -2618898 -4319211 -5164252 -3752200 -1105311 578343 718402 579264
38250 579264 881704 815470 -117359 -786617 -28661 1400530 1745414 725424 -139293
38241 -139293 273388 1211276 1184934 -127264 -1659116 -2237763 -1575572 -256232 751401
38232 751401 741873 -27391 -403038 312555 1198030 711751 -1091972 -2370112 -1920201 -723970
38222 -723970 -280162 -430734 -85058 651615 680087 -10977 -94278 1081807 2641083 3632903
38212 3632903 3953076 3398501 1314319 -1924548 -4276137 -4017776 -1733211 502414 1358331
38203 1358331 1070969 718595 1275766 2719865 3610131 2416391 -238411 -1747682 -651525
38194 -651525 1527338 2458443 1828743 888771 383080 375093 1134508 2557881 3398234 2635829
38184 2635829 1010515 -249227 -1353567 -2859570 -3618306 -2157118 416713 1489889
38176 1489889 842780 803060 2223614 3141104 2306557 1294331 1621381 2143378 1169257
38167 1169257 -727553 -1934648 -2233338 -2070590 -936837 1299422 2715177 1546141
38159 1546141 -688109 -886395 1136674 2490124 1657446 460015 835527 2031463 2319927
38150 2319927 1692071 1247245 1098227 519269 -430986 -859032 -425614 244118 474057
38141 474057 123843 -631771 -1470179 -1928920 -1774199 -1342667 -1140601 -1173790 -975509 -180815
38131 -180815 1155984 2570902 3241882 2402154 235703 -1818513 -2255863 -1085110 178284
38122 178284 171565 -1013672 -2270963 -2807762 -2709795 -2373357 -1842098 -965020 -20813 297690
38112 297690 -239534 -922267 -1017332 -925046 -1617546 -2867027 -3065580 -1400656 705979
38103 705979 1350952 705984 501640 1250061 1593267 697641 -341827 -371691 -61447 -543170
38093 -543170 -1140615 -206093 2072930 3433050 2396494 14997 -1704299 -1917935 -888791
38084 -888791 997479 3085222 4053870 2958857 645239 -750455 66924 2295754 3906451
38075 3906451 3448198 1122848 -1480811 -2627727 -1711943 431249 2313760 2853884 1990883
38066 1990883 713403 350419 1275015 2347201 2235447 1169818 508918 601435 332467
38057 332467 -810539 -1584747 -800756 850562 1919598 2203353 2305407 1976451 503957
38048 503957 -1590777 -2819322 -2680601 -2036806 -1556786 -1080057 -573327 -399962 -436948
38039 -436948 -124326 388157 276006 -604275 -1526251 -2159548 -2767637 -3045875 -2238412 -698330
38029 -698330 222813 262055 554942 1295114 1022248 -673581 -1637279 -4072 2872716
38020 2872716 4242858 3714111 3243930 3964602 4892835 4648880 2952130 479558 -1561541
38011 -1561541 -1950673 -690389 601431 635692 242403 924777 2309429 2776721 2196472
38002 2196472 2000562 2524113 2360841 848475 -674162 -883374 -223628 201345 224190
37993 224190 281801 561730 1197084 2356572 3622583 4321613 4826293 6139123 7673585
37984 7673585 7180739 3931555 355887 -895525 -134228 676172 1026853 1628031 2108471
37975 2108471 1402666 99072 9202 1218399 1754918 676141 -596684 -832526 -906394
37966 -906394 -1907397 -2982934 -2698187 -1390387 -400326 314544 1911794 4202605 5285285
37957 5285285 4049978 1679646 53704 -322323 -193288 -270980 -812308 -1755435 -2435837
37948 -2435837 -1719263 608449 2896648 3139310 1430638 -100277 -9024 863144 1028602
37939 1028602 545885 505505 950133 738889 -391311 -892100 752466 3931739 6434778
37930 6434778 6794681 5482817 3914677 2930725 2427542 1986385 1391395 572780 -541411
37921 -541411 -1767813 -2388780 -1691811 -82167 868691 158656 -1177830 -1273783 -46513
37912 -46513 583176 -506509 -1880148 -1570869 124885 1236861 884422 -123781 -1168771
37903 -1168771 -2480739 -3684762 -3571415 -2169792 -1409171 -2445825 -3688900 -3089682 -1308098
37894 -1308098 -588947 -1102319 -750720 1265962 3030423 2856407 1615401 828435 171668
37885 171668 -1317998 -2769617 -2387498 -405157 931857 478987 -460556 -307135 835793
37876 835793 2046329 3035881 3806914 3907943 3109474 2191800 2120266 2857938 3693009 4194639
37866 4194639 4114594 3037546 1177165 -30531 561176 1931478 1930608 299775 -793878
37857 -793878 244151 2237565 2969276 2067667 930788 439660 239797 183874 937501
37848 937501 2566903 3693155 3072973 1446633 762718 1704782 2918665 2819903 1341675
37839 1341675 -460010 -1824398 -2712446 -3269583 -3554794 -3653051 -3496306 -2653551 -822435
37830 -822435 1472843 3128679 3440528 2521448 920591 -679787 -1572386 -1545111 -1309094
37821 -1309094 -1700790 -2384681 -2137300 -639913 797538 653568 -1314995 -4197587 -6661652
37812 -6661652 -7261083 -5199982 -1625281 767318 435586 -1329648 -2259374 -1803298 -901879
37803 -901879 7360 1153007 2096564 1999635 1200625 935448 1346598 1300089 443684 -129309
37793 -129309 221052 624573 286148 -200908 9294 727450 1460253 2314641 3219578 3368572
37783 3368572 2586463 2212346 3247686 4469411 3935214 1799142 19841 -410455 -308775
37774 -308775 -482800 -769673 -1129880 -2085902 -3497505 -4266891 -3970696 -3566752 -3647737 -3173363
37764 -3173363 -1123440 1457824 2513936 1731808 868660 1258030 2196953 2225137 1080799
37755 1080799 -238672 -777848 -334126 795587 2128114 3110204 3410906 3194074 2883518
37746 2883518 2720339 2733087 2863877 2705600 1446598 -1117016 -3569447 -3922319 -2097333
37737 -2097333 -410665 -847266 -2683707 -3802987 -3588450 -3076771 -2685176 -1627210 159642
37728 159642 1264554 790275 -285413 -704289 -706321 -1111828 -1703530 -1870581 -1994744 -2639347
37718 -2639347 -2972946 -1746350 418096 1515217 1009923 419501 702747 919356 281559
37709 281559 -219540 469043 1515274 1540829 856703 590545 356550 -1061302 -2919962
37700 -2919962 -2824058 -467350 1179204 -110575 -2345281 -1968022 1014096 3061063 2215721
37691 2215721 636162 1022360 2620753 2633127 393057 -1980598 -2727957 -2245510 -1515861
37682 -1515861 -547657 795206 1692604 1194283 -438171 -1955255 -2277045 -1074053 1098470
37673 1098470 2808693 2759792 1450316 953953 2224383 3565864 2983581 1254014 1017778
37664 1017778 3080293 5323884 5590012 4180844 2861976 2517042 2667113 2661542 2483505
37655 2483505 2478869 2670526 2398084 881972 -1505909 -3011199 -2415600 -873435 -620621
37646 -620621 -1927999 -2839546 -2216291 -1269046 -1159647 -827111 1127961 3605341 4150365
37637 4150365 2473914 779899 548873 951144 891482 717580 927915 840149 11798
37628 11798 -206951 1651667 4514749 5655118 4250177 2332925 1769570 1909193 1157822
37619 1157822 -440158 -1529977 -1512258 -811570 442739 2377580 4036899 3779287 1625291
37610 1625291 -157193 230164 1782605 2143382 689015 -1044021 -1676600 -1487510 -1485247
37601 -1485247 -1975352 -2474386 -2518148 -2166866 -1829685 -1648046 -1103776 319433 1890498
37592 1890498 1829327 -479455 -3105621 -3604463 -2213605 -1675692 -3598461 -6209089 -6440423
37583 -6440423 -3484146 484252 2698150 2281415 560558 -546561 -324551 439971 771025
37574 771025 641386 476662 149131 -602474 -1045010 27330 2443498 4452794 4850521
37565 4850521 4369467 4355552 4877321 4921541 3931830 2391451 1091501 307693 -374516
37556 -374516 -1481248 -2645440 -2516809 -514764 1623620 1490178 -620455 -1695472 -90318
37547 -90318 2135198 2269756 714901 -189588 121159 250908 -215780 -122308 765077 1028748
37537 1028748 45861 -870895 -768855 -694456 -1700376 -2691852 -1970721 -32285 968172
37528 968172 229154 -805859 -625682 635973 1966563 2801398 3043758 2629903 1770324
37519 1770324 1115411 1050783 1117127 597560 -631202 -2277763 -4193830 -5995856 -6522382
37510 -6522382 -4882958 -2170847 -781378 -1337614 -1588373 352924 2751188 2249796 -1197137
37501 -1197137 -3779902 -2894640 -523223 -11841 -1228070 -1260374 833607 2558083 1615362
37492 1615362 -1048551 -2800159 -2532599 -1197165 -12684 636319 809868 517593 -209441
37483 -209441 -1156774 -1916038 -1971250 -1070631 275648 974556 383927 -945953 -1807249
37474 -1807249 -1527514 -467707 551982 1118175 1496037 2097833 2746476 2657782 1329043
37465 1329043 -703421 -2270085 -2655535 -2005666 -793729 604291 1681288 1679779 222628
37456 222628 -1987705 -3490638 -3325935 -1933166 -668245 -421169 -859878 -1054343 -513623
37447 -513623 644442 2146188 3574152 4140518 3271195 1504002 21220 -880395 -1990581
37438 -1990581 -3613325 -4889169 -5286276 -5636501 -6665411 -7423769 -6526577 -4391750 -2814628
37429 -2814628 -2539684 -2628440 -2248651 -1781343 -1868924 -2415418 -2880864 -2780546 -1719870 231815
37419 231815 1993393 2113334 306408 -2154765 -3681892 -3558832 -2118265 -469444 141478
37410 141478 -454870 -918169 -6264 1661082 2429028 1851230 909326 346306 226316
37401 226316 815684 2069523 2362657 -37601 -3855272 -5527936 -3946574 -2146930 -2878371
37392 -2878371 -4725282 -4673274 -2724689 -1416686 -1813140 -2603302 -2795605 -2835542 -2874543
37383 -2874543 -2088658 -364363 948394 768292 -277268 -777343 -171837 971440 1735513
37374 1735513 1598763 806289 133105 27516 166700 155318 189971 459758 412405 -527137
37364 -527137 -1822145 -2287253 -1541851 -273380 750307 1208857 1002064 298571 -258699
37355 -258699 -44364 882015 1963126 2710196 2813135 2307864 1983279 2652921 3421552
37346 3421552 2007733 -1981483 -5368229 -4823736 -1171770 1740406 2000580 1253398 1427786
37337 1427786 2220727 2511549 2285929 2046650 1678916 966985 312555 122311 206770 333512
37327 333512 660408 1236552 1804862 2331366 2939957 3265068 2866496 2300596 2539351 3214201
37317 3214201 2868495 1258308 -113846 -240674 171060 352138 679072 1284981 1069611
37308 1069611 -607633 -2543697 -3348911 -3347463 -3448734 -3270907 -2068765 -659752 -540439
37299 -540439 -1489689 -1833831 -995255 -125385 -56440 -153988 317603 897046 677499 -365672
37289 -365672 -1370432 -1532403 -757981 314752 787178 253584 -833892 -1707757 -2089307
37280 -2089307 -2246806 -2437871 -2603439 -2550732 -2250868 -1991972 -2208114 -2964964 -3750879 -4101985
37270 -4101985 -4144749 -3969582 -2944185 -695042 1584582 2300708 1897096 2318350 3689336
37261 3689336 3699066 1394297 -554419 684235 3922560 5558630 4448915 2752497 2259568
37252 2259568 2325949 1826182 1088550 982351 1407278 1598172 1256306 868594 1280156 2940894
37242 2940894 5089811 5991683 4710355 2321593 613123 80853 100225 355367 798959
37233 798959 820563 27141 -585205 82260 1156999 908442 -346945 -698838 -24146
37224 -24146 -333180 -2126715 -3063069 -1547687 739549 1642446 1721771 2452390 3026418
37215 3026418 1761840 -309404 -331327 1933918 3354118 1775689 -1254580 -3210077
37207 -3210077 -3943424 -4657055 -5086362 -3984533 -1851998 -859992 -1682717 -2383090 -1432444
37198 -1432444 -160418 -555767 -1795870 -1243812 1345382 3049480 1875047 -530780
37190 -530780 -1520837 -930021 -164884 637902 2240096 3974409 4249374 3142307 2258214
37181 2258214 2029425 1352188 57102 -572755 -245657 -340204 -1324371 -1688471 -571677
37172 -571677 612094 572501 265316 939741 1753460 1333275 407943 673838 1827433
37163 1827433 1937492 509986 -792564 -640668 298429 513750 -601280 -2415069 -3771234
37154 -3771234 -3954378 -3353712 -2954161 -2965101 -2645092 -1792295 -1292149 -1494743 -1293855 108175
37144 108175 1667829 2001751 1368253 785094 255640 -520251 -685490 637387 2498053
37135 2498053 3324335 3335430 3767261 4320326 3668802 2180885 1686628 2464943 2820835
37126 2820835 1984177 1161505 1173199 1205908 640796 138506 91136 -184348 -913106 -1286425
37116 -1286425 -1168193 -1526965 -2325405 -1940649 207472 2329460 2822185 2347530 2011959
37107 2011959 1366484 -70397 -1064625 -534968 210237 -669636 -2485081 -3067121 -2120901
37098 -2120901 -1228942 -977841 -449617 471532 561752 -576502 -1735195 -2084658 -2326668
37089 -2326668 -3167404 -4001441 -3957681 -3267400 -2779248 -2762613 -2848085 -2736703 -2487768 -2315580
37079 -2315580 -2306054 -2207779 -1616713 -590633 232317 470106 484103 538066 87886 -1296546
37069 -1296546 -2835895 -3346495 -2794881 -2125255 -1913709 -2153657 -2885913 -3843169 -3934280
37060 -3934280 -2571650 -1246675 -2073792 -4706230 -6471792 -5916419 -4375918 -3344556
37052 -3344556 -2209862 45875 2421941 3024581 1877754 859996 1023648 1451220 916053
37043 916053 -528446 -2001639 -2954749 -3373427 -3382310 -3178167 -3092689 -3246142 -3179252 -2263128
37033 -2263128 -689901 280418 -420711 -2205311 -3255357 -2632884 -1279727 -485742 -193053
37024 -193053 316800 820058 597887 133642 802099 2764315 4701001 6079096 8266969
37015 8266969 12679400 18936342 25450706 30574969 32500858 29709555 23046791 16208876
37007 16208876 12406107 11135235 9752174 7457744 5712003 5067520 4044602 1786654
36999 1786654 -220752 -314085 879535 1539895 1303578 1310254 1959346 2068944 588564
36990 588564 -1739641 -2971779 -1951012 572695 2760940 3511881 3333968 3286211 3365528
36981 3365528 2611054 862580 -491403 -191982 1026389 1155748 -656757 -3245417 -5022451
36972 -5022451 -5537782 -5087175 -3632420 -1030235 1913035 3577829 3122875 1509037 499856
36963 499856 799491 1594451 1935302 2033794 2732003 3949131 4441800 3431884 1824738
36954 1824738 1060857 1081313 451999 -1366236 -2963692 -2834632 -1429023 -402511 -366227
36945 -366227 -478600 16433 1037325 2382325 3920894 4879162 4254835 2418358 1037412
36936 1037412 771958 386573 -932606 -1860536 -1045711 305370 44323 -1370449 -1310214
36927 -1310214 965332 2991808 2591086 776155 59009 1303255 3449432 5195334
36919 5195334 5661224 4312334 1651509 -495207 -632531 708993 1862556 2184630 2247241
36910 2247241 2236052 1521073 2258 -1249490 -1238498 -327403 169808 -615803 -2329044
36901 -2329044 -3761732 -3871730 -2619884 -922891 194891 325816 -293636 -1058831 -1261511
36892 -1261511 -593707 423009 977418 1071303 1505751 2645500 3957703 4958918 5617543
36883 5617543 5471837 3677330 787411 -837049 207118 2127907 2038845 -333916 -2663176
36874 -2663176 -3270491 -2606399 -1705163 -1030629 -994331 -1829899 -2583000 -1919165 -426279
36865 -426279 -366235 -2354708 -3998976 -3027131 -372845 1251081 791480 -585117 -1555255
36856 -1555255 -1707367 -1014303 203813 833139 -186228 -2333445 -3817635 -3665458 -2668057
36847 -2668057 -1957452 -1441055 -262723 1590830 2907031 2703705 1663392 1508040 2812275
36838 2812275 4091158 3662962 1890487 583306 475600 634446 439025 529746 1115022
36829 1115022 899195 -1026700 -3377254 -4293580 -3991520 -4082895 -4672817 -4067179 -1639516
36820 -1639516 729992 932395 -747688 -2220036 -2180492 -1269358 -892239 -1558140 -2472771
36811 -2472771 -2485095 -1292189 300801 1214747 949655 -340849 -2062519 -3220488 -2931059
36802 -2931059 -1486298 -329383 -239214 -163511 1112118 2711003 2581177 547342 -1223612
36793 -1223612 -1226539 -500772 -621638 -1176301 -637829 1007371 2026916 1251184 -529271
36784 -529271 -1645922 -1273499 61719 1111829 965533 -55962 -589745 226999 1583094
36775 1583094 2017167 1461174 1308487 2264225 3182372 2705425 1251834 412745 821889
36766 821889 1678319 2225866 2569347 2809960 2448039 1226772 -235441 -1340760 -2366931
36757 -2366931 -3629930 -4404535 -3754228 -2130256 -993964 -883451 -978997 -697538 -497639
36748 -497639 -703559 -756005 -398786 -568681 -2018621 -3723708 -3873937 -2260983 -663786
36739 -663786 -785132 -2495027 -4195504 -4425637 -3070505 -1336347 -519116 -672106 -776112
36730 -776112 -299114 83732 -324625 -1140271 -1643833 -1893140 -2231753 -2329311 -1721743 -804729
36720 -804729 -249684 99793 673725 1089217 932927 1062598 2438853 3979588 3576638
36711 3576638 1371420 -67648 615938 1793955 1636669 683930 264072 124902 -504051
36702 -504051 -815387 426445 2326122 2628826 947159 -692988 -720094 305102 1317767
36693 1317767 2384377 3756556 4521969 3519406 1127419 -999695 -1973924 -2573075 -3780480
36684 -3780480 -5037691 -4668280 -2074241 1112279 2574240 1745093 117190 -739273 -661404
36675 -661404 -259629 252852 935283 1413175 1105696 14414 -1211001 -1865425 -1589146
36666 -1589146 -553476 406979 318440 -781177 -1635920 -1243596 -92155 690073 956910
36657 956910 1482868 2527020 3348653 3204954 2160791 804372 -337527 -1015193 -1256587
36648 -1256587 -1209188 -843872 -35463 939090 1494910 1634894 2072599 2919781 3032598 1561845
36638 1561845 -510338 -1543166 -1491184 -1651356 -2372806 -2527160 -1474148 -120618 574958
36629 574958 985742 1886137 2988424 3361765 2883484 2393660 2446804 2539408 1816483 296264
36619 296264 -976571 -1231659 -1171900 -2192372 -4311932 -5839748 -5643599 -4700067 -4378943
36610 -4378943 -4220528 -3007339 -1338359 -1082063 -2350391 -3130144 -2368112 -1455950 -1854839
36601 -1854839 -3041109 -3863769 -4293785 -4516946 -3783456 -1813847 -241645 -830258 -2856524
36592 -2856524 -3924241 -3011577 -1205912 288583 1293463 1809903 1513676 475013 -610385
36583 -610385 -1207443 -1299828 -1023610 -706741 -1087117 -2531271 -4101918 -4375936 -3202809
36574 -3202809 -1733725 -753988 -26336 688910 1136192 1338318 1759752 2324303 2317399 1713528
36564 1713528 1522020 2170587 2593539 1858510 856969 1187353 2800143 3997774 3752683
36555 3752683 2889657 2615507 2820505 2619648 2102040 2482525 4219891 5800048 5308354
36546 5308354 3047728 1536369 2454699 4461800 4885512 2990367 470347 -1025304
36538 -1025304 -1552341 -1867533 -2022430 -1669255 -978846 -468600 -322464 -461466 -927469
36529 -927469 -1640958 -2063139 -1673585 -698799 33007 -69432 -861098 -1643384 -1690305 -831741
36519 -831741 302861 841962 589369 124203 -23380 167177 636716 1473826 2397813
36510 2397813 2666482 2020170 1204581 982204 1076417 736024 -59357 -720089 -1097323 -1560209
36500 -1560209 -2068910 -1990306 -1037274 204498 930426 896390 396805 -161984 -490481 -461999
36490 -461999 -60602 752403 1914898 2852197 2666007 1296956 124277 552695 2084551
36481 2084551 2714402 1410791 -670619 -1797596 -1652733 -1166143 -1083683 -1480175 -2244341
36472 -2244341 -3184774 -3778009 -3530621 -2634138 -1749484 -1157206 -624165 -87279 137141
36463 137141 -20162 -109506 153997 351020 -62725 -855474 -1144652 -411530 942876 2122167
36453 2122167 2740316 2940277 2902268 2546031 1805377 984590 573537 684949 918178 958608
36443 958608 1124355 1954255 3225767 3821806 2948996 1276246 324504 628239 1027774
36434 1027774 179458 -1595150 -2578191 -1710646 225668 1617825 1651203 658585 -580565
36425 -580565 -1350992 -1192541 -243527 706772 1019639 959635 1172480 1601727 1567305 826006
36415 826006 -183369 -1158206 -2163187 -2896167 -2656351 -1473891 -453885 -440977 -1049996
36406 -1049996 -1575439 -2060682 -2717902 -3099701 -2873350 -2762840 -3491343 -4212093 -3337007
36397 -3337007 -781508 1890451 3490070 4066621 3804391 2628633 1181330 544061 372695
36388 372695 -1082041 -4166191 -6588224 -6310337 -4364009 -3175963 -3124997 -2670623 -1305561
36379 -1305561 -288488 -413026 -917929 -1027879 -1027915 -1245492 -1313745 -1159046 -1589412 -3054919
36369 -3054919 -4643873 -5115895 -4343908 -3077001 -1831395 -682807 267506 841875 953404
36360 953404 472855 -685638 -2055230 -2757812 -2599041 -2457993 -3017841 -3643538 -3272877
36351 -3272877 -2059432 -1251839 -1511029 -2191636 -2500635 -2618968 -3092050 -3503549 -2636264
36342 -2636264 -267363 1864936 1776908 -182855 -1546084 -930397 95071 -651106 -2703604
36333 -2703604 -3607267 -2419171 -733159 -45224 92827 607198 1187787 1143949 852481
36324 852481 1192399 2233141 3358686 4035688 3803720 2388900 562165 -135754 567229
36315 567229 958838 -291936 -2176695 -3058953 -3224569 -4030706 -5343062 -5742068 -4867368
36306 -4867368 -3709107 -2767884 -1709155 -770641 -697513 -1108303 -619142 1068276 2672907
36297 2672907 3208167 2954545 2363873 1466172 618840 359719 249998 -607995 -1685090
36288 -1685090 -1432900 12996 478448 -1126417 -3173805 -3799287 -3280636 -2785790 -2407817
36279 -2407817 -1826179 -1464376 -1500413 -1001614 428235 1316349 268757 -1739610 -2684130
36270 -2684130 -2281432 -1829116 -1979227 -2334792 -2696782 -3074119 -2883088 -1696950 -430590
36261 -430590 -293488 -914765 -956995 -200448 502877 961863 1649622 2174828 1486821 -275433
36251 -275433 -1619693 -1561350 -469518 849326 1690656 1359390 -28334 -934433 -181267
36242 -181267 944033 224013 -1999236 -3025404 -1734843 -82312 69941 -482581 -68971
36233 -68971 1144322 1597110 516493 -1348509 -2489077 -1708795 634889 2303744 1394631
36224 1394631 -984460 -1903760 -684637 328815 -314373 -928064 258016 2012609 2017323
36215 2017323 229074 -1678938 -2946192 -3817000 -4099587 -3634805 -3348594 -3950515 -4383358
36206 -4383358 -3418921 -1952070 -1702280 -2391873 -2369050 -1418727 -682294 -293544 409910
36197 409910 625950 -1144583 -3854911 -4327474 -1766955 738368 459289 -1533879 -2679805
36188 -2679805 -2581956 -2405281 -2222620 -1261744 -4384 138898 -844551 -1265040 165
36179 165 2120652 3511580 3577577 2881018 2068412 1100479 -344026 -1843094 -2173507 -838364
36169 -838364 812890 1065738 298535 571983 2476701 3931841 2994383 543669 -1102399
36160 -1102399 -1307508 -1369456 -2110021 -2699482 -2019122 -181858 1603825 2183693 1412188
36151 1412188 282370 -40201 466237 737396 273375 50763 1163135 3132560 4398497
36142 4398497 4181968 3158144 2491212 2734816 3418891 3357097 1864439 6846 -219607
36133 -219607 1445045 2754726 1858288 -150196 -1061630 -930960 -1560787 -3088913 -3520322
36124 -3520322 -1996873 -269393 14226 -417108 -169463 403194 129427 -678017 -635285
36115 -635285 409088 1090358 600578 -227042 -222809 648578 1567396 2041639 2326398 2841144
36105 2841144 3530616 3993340 4217327 4797569 5961177 6662445 5560653 3049324 1280125
36096 1280125 1555548 2573329 2170389 145135 -1806497 -2582413 -2716960 -2806186 -2272593
36087 -2272593 -501666 1646977 2566396 1972801 1321242 1893986 3151470 3563505 2718838
36078 2718838 1761438 1591870 1518725 414169 -1334096 -2068143 -1028377 677900 1537788
36069 1537788 1299756 852258 1088637 2201771 3490699 3657801 2091810 114529 -87361
36060 -87361 1703802 3117903 2257676 211356 -736847 -355519 -203253 -735027 -674845
36051 -674845 676422 2315385 3139015 3166663 2655455 1422757 -241326 -1252681 -1202972
36042 -1202972 -1127161 -1903991 -2790524 -2547571 -1327748 -409947 -502556 -1223860 -1927713 -2214512
36032 -2214512 -1878610 -1088433 -422561 -133325 328965 1458677 2752860 3379943 3464790
36023 3464790 3805923 4452468 4562628 3863543 3332004 3859455 4785740 4491523 2411507
36014 2411507 -115998 -1325743 -1048170 -703039 -1261691 -1971269 -1608275 -283863 971017
36005 971017 1929077 3105826 4066376 3432908 1110468 -994271 -1401619 -939170 -1058854
35996 -1058854 -1429603 -736182 851290 1707134 1097292 65077 -145478 564494 1521627
35987 1521627 2035311 1566422 -62079 -2272043 -3917203 -4034368 -2444698 -18284 1607243
35978 1607243 1396998 326505 411363 1885890 2711685 1696390 436847 753285 1859636
35969 1859636 2079998 1892773 2722845 3814139 3270578 1630825 1271065 2381590 2775039
35960 2775039 1970390 2112789 4031634 5644006 5495278 4824582 4702850 4201863 3136300
35951 3136300 3493150 5876183 7443063 6050424 3843346 3797543 5131265 5476185 5438742
35942 5438742 7166758 9917818 11091043 10829091 11741600 14526879 17577053 20628764
35934 20628764 24981040 30021113 33462449 35772091 40844301 51206699 65560610 82215657
35926 82215657 102650388 131147957 172663890 229046596 291958451 339640758 348380615
35919 348380615 312617686 251221009 190869912 145655690 114322425 91319853 73852570
35912 73852570 60335751 49052826 39971670 34300042 31424790 28946716 25871116 23108269
35904 23108269 20802035 17867919 14351928 11683310 10302415 9340593 8725693 9135135
35896 9135135 9717207 8532563 5753642 3842975 3848144 4025895 3033214 1972537 2015290
35887 2015290 2305292 1788103 1165728 1338341 1542802 800974 -96770 218537 1531491
35878 1531491 2578273 2790034 2127519 295699 -2248072 -3514295 -2122632 406110
35870 406110 1405776 695768 447539 1547628 2317446 1452292 273827 808404 2867547
35861 2867547 4425977 4277703 3054289 1837207 939533 282991 62194 439393 1009559
35852 1009559 1167910 905788 776468 1070814 1453577 1504115 1241173 1025457 1320413 2514012
35842 2514012 4327659 5375509 4358492 2129894 1326827 2958102 4571253 3420265
35834 3420265 576020 -258241 2183529 5106703 5505452 3513820 1081080 -697721
35826 -697721 -1598399 -1260892 145710 1300289 1324230 1166356 1925108 2620144 1377403
35817 1377403 -1620750 -4124342 -4664538 -3853680 -2798763 -1772247 -834745 -432510 -691645
35808 -691645 -960365 -620137 181160 892981 1146267 838544 195917 -155803 240369 956662
35798 956662 1105704 522547 -77850 -165016 5852 -67637 -568381 -1369200 -2053009 -1973457
35788 -1973457 -945656 165529 274304 -495987 -953672 -423371 623267 1571651 2381850
35779 2381850 3105116 3574009 3839835 4066016 3784654 2320130 321568 -384871 724081
35770 724081 1683808 537609 -1794672 -2602730 -1016128 934033 1066091 -407401 -1663845
35761 -1663845 -1698323 -1124903 -925324 -1224342 -1458524 -1274228 -883666 -644628 -629072 -690995
35751 -690995 -675359 -395271 268122 939487 810733 -306726 -1278149 -789986 842845
35742 842845 1875692 1326462 146311 -142904 777539 2061260 2815621 2643015 1662984
35733 1662984 577549 232851 607953 727786 2406 -1012101 -1691230 -2308957 -3101382
35724 -3101382 -3221469 -1836949 257199 1404889 1194079 610718 365347 365447 642010
35715 642010 1271123 1328605 -391804 -3180994 -4577822 -3515985 -1823636 -1557252 -2244188
35706 -2244188 -2187268 -1354378 -1124504 -1711424 -1778663 -726595 290184 139742 -744438
35697 -744438 -1253660 -1106829 -752198 -425597 -20309 491412 1080764 1808648 2462482 2370443
35687 2370443 1208294 -133024 -183590 1375720 3128779 3525524 2816048 2742639 4151010
35678 4151010 5599373 5085577 2863337 1442223 2410988 4253217 4256167 2017997 -161409
35669 -161409 -341905 809266 1284110 330827 -990873 -1408444 -817160 -66334 161755
35660 161755 59695 300118 953348 1085077 -123956 -2019958 -2991698 -2502972 -1778026
35651 -1778026 -1982046 -2505908 -1881207 118990 2254423 3438955 3616362 3095127 2074421
35642 2074421 1110363 1116631 2293467 3580754 3723912 2604047 1174252 392875 518501
35633 518501 1111164 1385209 853796 -66485 -396212 182106 837243 688037 -90810 -818940
35623 -818940 -1503176 -2637396 -4006195 -4635910 -4073337 -2896784 -1709619 -441693 906060
35614 906060 1608727 1077208 -91468 -748432 -675546 -661959 -1164003 -1677717 -1596044 -993889
35604 -993889 -277227 342330 651004 290185 -619593 -1107956 -286167 1492522 2997508
35595 2997508 3575046 3633529 3672350 3548897 3020350 2414136 2200523 2175035 1609764 195201
35585 195201 -1528793 -2694441 -2799952 -1903094 -433251 1023586 1864109 1604065 118447
35576 118447 -2063831 -3821753 -4177601 -3122509 -1508704 -116192 821466 1191767 792139
35567 792139 -131971 -822829 -1045193 -1519249 -2520546 -2734508 -797387 2322384 4017959
35558 4017959 3299382 1829996 1206310 849392 -283151 -1364218 -866067 759436 1588153
35549 1588153 1229003 1303870 2537943 3291312 2031174 -207571 -1261739 -816341 -387833
35540 -387833 -789750 -1249762 -1150260 -1129245 -1799636 -2491799 -2212655 -1176297 -348064 187771
35530 187771 1252769 2847208 3495783 2007722 -715899 -2464147 -2141236 -727942 147017
35521 147017 -104803 -950278 -1652150 -1751876 -1011782 513419 2313587 3624036 3853538
35512 3853538 2842599 997171 -708582 -1285528 -625408 476943 1474855 2698554 4287774
35503 4287774 5144237 4042943 1595368 -93666 70816 1090085 1627795 1695185 1907571
35494 1907571 2146983 2039259 1991728 2493751 2857833 2039967 533787 -39200 601045
35485 601045 879376 -56416 -724146 520360 2763494 3589427 2411464 1060966 912181
35476 912181 1046596 62860 -1540514 -2073800 -1171709 -250118 -406570 -996023 -768878
35467 -768878 356013 1369083 1651164 1611698 1788169 1909568 1262497 -209141 -1601963
35458 -1601963 -1999471 -1488840 -949273 -891230 -899563 -414606 325581 617043 411909 461502
35448 461502 1127421 1594168 771817 -1235162 -3072797 -3589698 -2977578 -2315966 -2231286
35439 -2231286 -2276132 -1629783 -190951 1232250 1795379 1438747 743425 264168 259413 755654
35429 755654 1379261 1334214 227819 -1097173 -1306221 -300499 578035 334672 -560750
35420 -560750 -1294287 -1930625 -2647126 -2626578 -983858 1618589 3506276 3944102 3433524
35411 3433524 2323363 531927 -1284422 -1790692 -740116 482136 672533 170840 -139560
35402 -139560 -154134 -170470 -145949 -131134 -575188 -1342753 -1297684 79170 1406314 990414
35392 990414 -774752 -1904057 -1506143 -676861 -622604 -1067646 -951784 48076 1107290
35383 1107290 971258 -1002619 -4085955 -6479549 -6855408 -5580809 -4004902 -2765711
35375 -2765711 -1456670 176216 1542824 1922809 1318653 374666 -264548 -502832 -906812
35366 -906812 -2023144 -3317078 -3344685 -1592746 424653 821704 -326527 -1360630 -1402140
35357 -1402140 -1056159 -865342 -515251 145511 631939 860776 1480325 2584556 3211633
35348 3211633 2836364 2347365 2673527 3254827 2811465 1075787 -1050377 -2611469 -3181700
35339 -3181700 -2758215 -1702347 -489011 821282 2378655 3659456 3698159 2609153 1820696
35330 1820696 2136809 2643457 2349555 1711235 1395458 746175 -958048 -2683594 -2897388
35321 -2897388 -1978766 -1452553 -1325132 -409010 847890 380955 -2093532 -4059990 -3658653
35312 -3658653 -2131625 -1455949 -1358397 -462396 1013705 1795379 1939778 2563051 3545304
35303 3545304 3565382 2497788 1868093 2471259 3215774 3056870 2589640 2692650 2803961
35294 2803961 1879023 296599 -616494 -596341 -550698 -703688 -153208 1222743 1805494
35285 1805494 284191 -2181894 -3185135 -2130166 -721148 -323377 -232509 829635 2676821
35276 2676821 4136477 4781352 4976567 4617101 3139985 819565 -1136888 -2070813 -2438590
35267 -2438590 -2553354 -1861569 -202343 1115981 589498 -1467692 -3102438 -2836635 -936464
35258 -936464 1298122 2783462 3158462 2731835 2207828 2104401 2259190 2114559 1477670
35249 1477670 722815 298639 358078 781519 1155324 832654 -394046 -1615743 -1465787
35240 -1465787 213147 1889494 1989606 644681 -719068 -1237560 -1381344 -1878414 -2522140
35231 -2522140 -2420185 -1177071 492525 1365509 902396 -149442 -503663 144260 607467
35222 607467 -320404 -2049604 -2623775 -1182591 841570 1644487 1492968 2181213 4284719
35213 4284719 6187964 6162320 4402279 2422277 1235372 860125 995013 1283575 1267307
35204 1267307 923018 982589 1867209 2581121 1757952 -224218 -1400006 -813705 231072
35195 231072 183703 -563202 -552083 396223 1037914 716207 242513 487563 1109455 1282471
35185 1282471 1023267 1014288 1349969 1228833 97476 -1390228 -1984683 -1264862 -39793
35176 -39793 695301 746670 451975 -38003 -620230 -773305 -156270 361788 -647844 -3093347
35166 -3093347 -4945508 -4653783 -3132724 -2298262 -2273569 -1459988 742762 2744457 2711844
35157 2711844 633944 -2042879 -3870041 -3909797 -1843639 1379142 3626494 3493336 1948054
35148 1948054 1117898 1597093 2047969 1509822 791899 936270 1378354 792758 -704427
35139 -704427 -1464747 -569270 815285 863699 -727182 -2590078 -3382341 -2962073 -1910565
35130 -1910565 -543604 1188039 3015904 4024400 3329467 1175113 -876002 -1279622
35122 -1279622 -170342 733093 225592 -800866 -538829 1169569 2376443 1409922 -1102543
35113 -1102543 -3172465 -3796987 -3573459 -3323780 -3058858 -2399289 -1278368 31478 1073482
35104 1073482 1209810 54650 -1780402 -2928866 -2744345 -2109224 -2187871 -2723548 -2408788
35095 -2408788 -934884 262523 -185716 -1638256 -2088254 -581646 1770391 3326093
35087 3326093 3719455 3622659 3252866 2062160 27147 -1571955 -1312207 641292 2492270
35078 2492270 2584196 970831 -793282 -1192267 -29665 1576652 2245905 1391753 -555245
35069 -555245 -2675566 -4127668 -4406285 -3542674 -2241081 -1424693 -1272479 -954529 232763
35060 232763 1655303 1910858 735141 -321818 316787 2075055 2549684 262107 -3362317
35051 -3362317 -5301306 -4195222 -1772564 -721070 -1592632 -2529500 -1963083 -613991 -258083
35042 -258083 -1216291 -2071046 -1738272 -818968 -543862 -1085017 -1489969 -939689 473634
35033 473634 2071072 3187120 3430714 2790248 1702080 793027 307373 -141768 -1023623
35024 -1023623 -2068116 -2263542 -938574 1249791 2761050 2717979 1741224 1079232 1196936
35015 1196936 1533560 1437130 878416 234933 -203857 -324141 -64457 503378 1040029 1152987
35005 1152987 880582 831446 1569835 2792707 3437682 2887156 1765156 1081753 897822
34996 897822 594525 265460 693888 1732176 2017025 1014789 116697 573196 1415683
34987 1415683 952121 -466473 -1018524 -346450 129149 -122199 78026 1149035 1499650
34978 1499650 -77950 -2332356 -3222935 -2493662 -1282090 -203909 764580 1304124 1106635
34969 1106635 730369 914134 1504881 2008115 2412287 2413252 979034 -1704702 -3008407
34960 -3008407 -857139 2714718 3652248 1410091 -482112 92175 846216 -886367 -3837896
34951 -3837896 -4964074 -4126685 -3771182 -4686474 -4864379 -2777043 436740 2749171 3617848
34942 3617848 3783497 3836976 3846269 3751633 3449901 2811477 1947487 1166910 593448 239431
34932 239431 383922 1201144 1990720 1637917 136229 -1143521 -1137848 -303717 397251 973293
34922 973293 2034797 3495300 4633301 5199354 5469299 5278387 4080818 2182604 888730
34913 888730 939577 1636964 2055673 2251380 2524004 2383406 1405719 480983 783465 1811450
34903 1811450 2037988 1480122 1764238 3152477 3503091 1412728 -1347060 -2326771 -1979455
34894 -1979455 -2422335 -3385242 -2219506 1719082 5318590 5575104 3287034 1359163 881232
34885 881232 745899 289906 229446 949092 1559690 1236758 433447 97442 286437 182718
34875 182718 -739909 -2015549 -2708112 -2469241 -1918063 -1856524 -2235182 -2224919 -1307450 144794
34865 144794 1479765 2428787 2902683 2697680 1913336 1283085 1500478 2332416 2803076
34856 2803076 2195159 681718 -816689 -1256704 -333141 1036350 1457277 512163 -935404
34847 -935404 -1979093 -2488383 -2439767 -1447045 299884 1511535 1274639 456005 499651
34838 499651 1266685 1346931 332399 -554470 -254887 850839 1754452 1926578 1266844
34829 1266844 -161525 -1862743 -2992945 -3108693 -2424922 -1266551 112129 1110950 1009146
34820 1009146 -94477 -1217330 -1614396 -1358183 -700570 299694 1229748 1305306 442178
34811 442178 -370629 -362029 -50239 -397844 -1371870 -2034115 -1848233 -1340358 -1457333 -2481111
34801 -2481111 -3545027 -3343690 -1635404 189382 623447 -119124 -640382 -506808 -578226
34792 -578226 -1100017 -1051466 -65046 501273 -462016 -1950397 -2281693 -1492831 -885391 -904463
34782 -904463 -1032147 -1293660 -2125428 -2842160 -1996980 347699 2188101 2051196 727907
34773 727907 -199709 -577000 -1434428 -3059722 -4355400 -4219150 -2954789 -1926405 -1896221
34764 -1896221 -2090791 -1306061 246654 979648 53538 -1417344 -1895317 -1307836 -524376
34755 -524376 195050 939197 1007039 -289523 -1914628 -1981893 -487085 588616 291432
34746 291432 -56137 577194 1004069 -79894 -1515087 -1099309 1113147 2758963 2261405
34737 2261405 458995 -987987 -1562145 -1879744 -2545567 -3410563 -3637575 -2571161 -879545
34728 -879545 -369471 -1932206 -4111581 -4755498 -3839548 -3360610 -4329573 -5306404 -4606001
34719 -4606001 -2796562 -1880499 -2577059 -3576585 -3392170 -1959895 -171710 1385136 2657450
34710 2657450 3489871 3466608 2551077 1499852 1308791 2296611 3878689 5115353 5287174
34701 5287174 4152631 2125232 231620 -599029 -429763 -159775 -326424 -504276 -118223
34692 -118223 683894 1379287 1794716 1958023 1678939 920593 205141 -78686 -413455 -1314714
34682 -1314714 -2055633 -1399317 355440 1300811 310232 -1576116 -2734867 -2878803 -2539195
34673 -2539195 -1603248 295541 2355417 3004664 1887876 372802 -249691 -178832 -312648
34664 -312648 -889129 -1554652 -2127159 -2461344 -1952554 -143369 2195053 3476863 3062947
34655 3062947 1930231 1278537 1172719 1066331 959208 1170744 1421237 1220231 1021762
34646 1021762 1788907 3211375 3599653 2136150 109027 -937957 -1219510 -1686853 -1945950
34637 -1945950 -926199 769702 1152691 -203327 -1267436 -388105 1438489 2219616 1754607
34628 1754607 1471391 2177092 3274752 3899975 3734574 2881495 1899927 1789804 2957538
34619 2957538 4260382 4041867 2179722 218487 -636856 -732773 -892974 -1023990 -422852
34610 -422852 954582 2113032 1941362 442012 -978648 -784901 850396 1995833 1341921
34601 1341921 39517 150902 1743078 2976225 2987865 2932192 3648633 4052952 3005562
34592 3005562 1442866 1147865 2193520 3082156 2962093 2315757 1709844 1211833 990829
34583 990829 1239899 1405481 641969 -783302 -1603901 -1304016 -714469 -555965 -459058 58531
34573 58531 633278 790748 848306 1259576 1625130 1233485 278016 -297585 -103598 221054
34563 221054 -74899 -954189 -1770039 -2025727 -1730440 -1116785 -275372 719186 1421493 1240722
34553 1240722 353812 -38937 1038282 3028518 4360679 4120275 2636906 710882 -910161
34544 -910161 -1536492 -1141530 -953803 -2221798 -4230399 -4913179 -3809700 -2861433 -3510201
34535 -3510201 -4628032 -4605997 -4039044 -4499585 -5555676 -5093629 -2437599 605839 1980203
34526 1980203 1360790 -136465 -1058022 -489716 1002664 1461252 -203697 -2316424 -2296071
34517 -2296071 -183997 1505447 1433605 777920 520043 -182512 -1748873 -2529409 -1268289
34508 -1268289 408263 101614 -1779974 -2697597 -1680632 -267793 99890 -315639 -759418
34499 -759418 -1079962 -1126792 -485782 497764 523224 -1083265 -3309624 -4581394 -4397169
34490 -4397169 -3406541 -2423588 -1857117 -1693577 -1549320 -961751 41059 833003 855967
34481 855967 218417 -486867 -737867 -342915 598050 1757435 2655043 2821685 2057100
34472 2057100 719878 -292445 -240600 607718 1175294 842318 154054 28126 702006
34463 702006 1778343 2781853 3218102 2639691 1271294 87613 -368467 -692886 -1379515
34454 -1379515 -1544135 -85812 2238220 3277524 2101640 -42828 -1581333 -2278934
34446 -2278934 -2696337 -3026435 -3084704 -2800915 -2236258 -1541607 -1085706 -1134281 -1388522 -1453139
34436 -1453139 -1625458 -2345190 -2994724 -2458475 -1045837 -579168 -2099067 -4580138 -6382427
34427 -6382427 -6847479 -5990090 -3963630 -1648211 -510842 -841753 -1176537 -454834 416786
34418 416786 337862 61782 778647 1647868 854292 -1239585 -2093496 -334122 2635049
34409 2635049 4712424 5233097 4573082 3145091 1624686 1069490 1867142 3127593 3676160
34400 3676160 3156165 1900519 425798 -663789 -1044285 -1253078 -2089258 -3134391 -2872548
34391 -2872548 -848626 1243983 1427475 -311463 -2367182 -3381607 -2920772 -1044040
34383 -1044040 1568818 3384556 3172529 1516029 238554 180009 404377 -167865 -1258123
34374 -1258123 -1913922 -2030808 -2405001 -3457755 -4571924 -4832475 -4047506 -2821475 -1784968
34365 -1784968 -978064 -39146 1103858 1897197 1658626 432595 -790368 -893415 274496
34356 274496 1726425 2315122 1760656 615045 -545692 -1511418 -2099966 -1989741 -1169706
34347 -1169706 -178014 468661 825100 1159608 1330075 958507 26688 -1154755 -2378932
34338 -2378932 -3442262 -3823087 -3128890 -1811987 -764755 -196985 345600 787727 304363
34329 304363 -1267440 -2614918 -2258673 -225709 2148310 3655462 3907938 3105344 1890202
34320 1890202 1151243 1189779 1220350 409759 -759237 -1017606 -157000 664516 707281 683304
34310 683304 1364255 2058847 1525638 -56865 -1199832 -1137505 -615756 -370574 30378
34301 30378 1042000 1742506 858648 -1097958 -2088930 -1227086 24059 48488 -526633
34292 -526633 180130 2391004 4098584 3576970 1401398 -468900 -812684 177159 1624369
34283 1624369 2593691 2372437 978508 -609393 -1329780 -1202501 -1120229 -1450092 -1463350
34274 -1463350 -440576 1193835 2370103 2723046 2833377 3157845 3358046 2965546 2223894
34265 2223894 1789283 1832405 1928499 1751974 1416987 1143703 1051772 1320995 2047891 2805832
34255 2805832 2861337 2075814 1157208 775616 864700 1014068 1021127 783662 268655 -69142
34245 -69142 387272 1143949 576457 -1877104 -4305006 -4391705 -2432742 -890472 -1143079
34236 -1143079 -2130584 -2316912 -1561019 -664137 -314824 -974604 -2690430 -4466839 -4834422
34227 -4834422 -3623068 -2268312 -1859257 -1867140 -1375228 -511531 107838 417559 539794
34218 539794 202900 -633591 -1312694 -1429091 -1501076 -1956150 -2310110 -2165652 -2028022 -2115577
34208 -2115577 -1434660 614357 2652167 2967830 2099037 2039248 3262273 4306679 4169032
34199 4169032 3321161 2243307 716917 -988497 -1787965 -1305256 -542021 -461257 -921367
34190 -921367 -1433619 -1910354 -2217222 -2041719 -1694559 -2025167 -3043767 -3637911 -3188241
34181 -3188241 -2456485 -2288151 -2449932 -2425995 -2370303 -2472825 -2285887 -1554670 -922651 -909496
34171 -909496 -915595 -212982 693945 724989 -216119 -1328833 -2196992 -2980417 -3550680 -3435096
34161 -3435096 -2651477 -1846253 -1535314 -1701149 -1992170 -1795004 -401474 2128969 4381239
34152 4381239 4683520 2982582 1053375 644906 1844415 3424400 4350991 4581489 4532006
34143 4532006 4163282 2907007 553425 -2081424 -3712980 -3712963 -2409883 -565836 908397
34134 908397 1078306 -173997 -1453147 -1149676 266230 456939 -1674115 -4280296 -4913578
34125 -4913578 -3518064 -1887349 -1013950 -489046 -43041 -23106 -327332 -330994 -147977 -694794
34115 -694794 -2066345 -2972419 -2419135 -1094690 -410409 -802100 -1628889 -2230033 -2358278
34106 -2358278 -1875957 -782652 419656 934612 467896 -424348 -951175 -914019 -741380
34097 -741380 -780755 -883999 -868859 -1046161 -1782958 -2659224 -2722921 -1765516 -739041 -558320
34087 -558320 -1002305 -1227979 -905908 -305391 410362 1367380 2548188 3589643 4018822
34078 4018822 3590575 2583831 1739000 1484577 1298717 505980 -390285 -249313 701233
34069 701233 843066 -228955 -656640 907818 2873725 2789528 891929 -405321 -102406
34060 -102406 331913 -486995 -2071645 -3169758 -3218467 -2343069 -1077898 -284675 -303065
34051 -303065 -270088 536796 1036956 -302159 -2645436 -3386952 -1814069 -33691 353518
34042 353518 308459 1091265 2087930 2339504 2352495 2632101 2040520 -305158 -2728567 -2893388
34032 -2893388 -1317607 -697513 -1940782 -3074886 -2382776 -676817 280583 149250 -170476
34023 -170476 -190164 -303951 -867613 -1457624 -1208268 141650 1593552 1626233 -117417
34014 -117417 -2134838 -2400023 -283321 2947082 5213673 5198528 3391758 1692294 1378279
34005 1378279 1570172 696490 -644341 663 3213657 6206388 6369321 4690185 3834131
33996 3834131 4133949 3762061 2161571 826843 658289 738520 180621 -600039 -1023089
33987 -1023089 -1254163 -1403950 -1116228 -524295 -471870 -1217863 -1882643 -1623537 -514120
33978 -514120 914485 1960960 1507006 -1074393 -4296726 -5283367 -2962880 534866 2447911
33969 2447911 2290032 1354218 455421 -504264 -1322928 -1242695 2419 1665187 2664528
33960 2664528 2481114 1492707 636379 534380 854164 823239 293945 -263807 -732342 -1429976
33950 -1429976 -2080437 -1709935 -83766 1570205 1935222 1170303 542092 898002 1948234
33941 1948234 2745122 2587702 1727922 1214238 1626369 2150815 1632361 331177 -412780
33932 -412780 -196530 46697 -186435 -246923 171422 265425 -431802 -1183481 -1464400 -1914581
33922 -1914581 -2872101 -3255878 -2172657 -540911 225326 180120 107772 -217380 -1388994
33913 -1388994 -2671124 -2695290 -1560251 -690377 -781222 -1296084 -1825580 -2487403 -2962674
33904 -2962674 -2504202 -1140888 132236 485099 -174285 -1508795 -2758130 -2847663 -1563210
33895 -1563210 -230458 -135580 -807891 -1107409 -1240771 -1965809 -2483869 -1386620 553008
33886 553008 1065369 81007 73314 1941975 3246279 1960045 -458117 -1698387 -2208250
33877 -2208250 -3681853 -5448932 -5286290 -3250924 -1867005 -2294389 -2799846 -1780715 -195696
33868 -195696 261105 -140299 136765 1330324 2087213 1552042 415553 -367077 -833688
33859 -833688 -1413157 -1847256 -1585020 -887548 -592786 -833036 -940324 -742753 -844393 -1224682
33849 -1224682 -875076 274966 423291 -1561111 -3697738 -3106904 -231024 1500900 417290
33840 417290 -1365652 -1434563 -316420 196916 68118 428022 1187455 1271006 662570 411440
33830 411440 785928 908322 212172 -914241 -1897113 -2391458 -2058736 -899658 307839
33821 307839 777377 731262 813296 841147 205537 -733457 -852904 98163 1112458 1256714
33811 1256714 478924 -892375 -2426225 -3289923 -2761050 -1343518 -461365 -719125 -1296964
33802 -1296964 -1384951 -1337405 -1890448 -2942815 -3741693 -3868432 -3525977 -3092719 -2767092 -2527693
33792 -2527693 -2258731 -2025113 -2228510 -3253427 -4907884 -6376293 -6738939 -5552597 -3200062
33783 -3200062 -743963 998078 2359073 4176703 6050131 6247091 4029147 1110498
33775 1110498 -214117 374084 1605084 2678823 3457294 3291210 1517124 -999556 -2496335
33766 -2496335 -2546128 -2197587 -2012756 -1658050 -1398935 -2019061 -2957904 -2561082 -785398
33757 -785398 308623 -439906 -1691121 -1916349 -1386423 -780241 147111 1083421 408820
33748 408820 -2163496 -4009614 -2949386 -738864 -670173 -2717168 -3814128 -2473731 -387871
33739 -387871 621649 760788 948952 1437914 2283842 3463667 4096386 3176762 1436748
33730 1436748 851807 1947153 3210361 3452078 2952633 1931085 -20580 -2237336 -2848870
33721 -2848870 -1521552 -437256 -1172069 -2392060 -2280683 -1553690 -1966103 -3087601 -2948205
33712 -2948205 -1293972 26317 -248993 -1610697 -3155813 -4296168 -4102825 -1887251
33704 -1887251 1177013 2703304 1878660 147418 -1239354 -2593673 -3997062 -4046430 -1871180
33695 -1871180 915896 1983388 1251047 559431 962412 1967797 3092483 4324497 4923356
33686 4923356 3631222 816815 -1083646 -339746 1871565 3080853 2480346 1109724
33678 1109724 -147230 -1246318 -1953965 -1700978 -697708 46508 137546 115513 80982
33669 80982 -668966 -2046081 -2632190 -1799966 -1119338 -2142198 -3697516 -3275237 -751562
33660 -751562 1270662 1083801 -52075 -230495 333934 171425 -806788 -1031170 581807
33651 581807 3261424 5221704 5298029 3828043 2324060 2091533 2843712 3016777 1798579
33642 1798579 288609 -4493 699399 830599 -155061 -954259 -426669 495333 -105445
33633 -105445 -2365180 -4008544 -2986549 -111400 1842103 1520928 356969 142166 489315
33624 489315 -59437 -1246741 -1296498 146328 1238603 767846 -27867 307718 871647
33615 871647 -210405 -2689991 -4384817 -4216153 -3340941 -3107227 -3366702 -3268090 -2587995
33606 -2587995 -1703234 -973261 -553746 -318098 137848 876747 1165961 440321 -487315
33597 -487315 -288985 822872 1201673 191409 -914756 -912973 -374407 -389283 -717375 -330206
33587 -330206 934298 2368735 3507246 4168961 3835202 2157082 -52886 -1380573 -1429880
33578 -1429880 -1100270 -1231202 -1700758 -1928261 -1618031 -903630 -256465 -247519 -918765 -1477164
33568 -1477164 -1136345 -158038 466116 178379 -890944 -2498269 -4220057 -5051405 -4294538
33559 -4294538 -2992789 -3182840 -5157976 -6633643 -5518062 -2600705 -400820 -852
33551 -852 -286226 -5736 784429 1454403 1740996 1499146 517512 -748712 -1033799 288439
33541 288439 2039231 2381247 967834 -819693 -1720088 -1856896 -1994922 -2361710 -2736399
33532 -2736399 -3168134 -3917646 -4849228 -5416118 -5221414 -4237670 -2606584 -673916 863754
33523 863754 1414148 1215012 1132098 1532779 1772920 1081770 -355056 -1501651 -1500322 -451505
33513 -451505 609125 463727 -1118348 -2779679 -2710965 -835972 667356 -248294 -2898574
33504 -2898574 -4510237 -3441296 -906654 719300 504970 -607896 -1302251 -1064833 -175482
33495 -175482 697370 832029 -20280 -1196352 -1559677 -638641 862094 1868144 2053232
33486 2053232 1911105 1892054 1886014 1636915 1275554 1133668 1236653 1337148 1361411 1456065
33476 1456065 1635810 1811008 2167737 2959836 3768514 3650137 2463906 1420390 1622937
33467 1622937 2577723 3026821 2829867 2829899 3004842 2232002 286968 -1353072 -1566649 -1254073
33457 -1254073 -1777824 -2708789 -2621633 -1526816 -803762 -890469 -807334 -203988 -121591 -1078628
33447 -1078628 -2010356 -2059166 -1958303 -2439511 -2655808 -1769322 -911994 -1548079 -2677797
33438 -2677797 -2025388 221429 1342044 81209 -1724225 -2316043 -2396471 -2972096 -3068543
33429 -3068543 -1622899 60708 93706 -956847 -1250708 -1003792 -1953400 -3950828 -4961926
33420 -4961926 -4576394 -4622055 -5623231 -5469372 -2888718 201943 1443555 1076090 518907
33411 518907 -127259 -1092830 -1164932 621314 2642055 2516558 554348 -979997 -1408556
33402 -1408556 -1911400 -2620522 -2203231 -565436 619935 651984 687504 1173213 807583
33393 807583 -816949 -1811347 -789959 799092 887687 -204876 -840182 -874668 -1348059
33384 -1348059 -2161142 -2136818 -1118164 -236585 -139303 -431206 -859882 -1654222 -2552510 -2755210
33374 -2755210 -2157941 -1665159 -1959075 -2655239 -2887666 -2238075 -1093845 -492954 -1312091
33365 -1312091 -3054908 -3905791 -2778611 -875792 -251235 -1189317 -2120829 -1904521 -954268
33356 -954268 -111079 365177 463881 181990 -79056 190778 688581 646490 333125 1051411
33346 1051411 3068519 4583915 3665699 645340 -2231068 -3243941 -2654021 -1906960 -2007626
33337 -2007626 -2838210 -3772045 -4527058 -5065861 -4863292 -3165780 -421391 1434777 1049718
33328 1049718 -619517 -1701829 -1909767 -2259935 -2812876 -2561520 -1621068 -1566791 -2948448
33319 -2948448 -4133858 -3559058 -1841871 -731450 -1003073 -2155545 -3141854 -2741040 -434282
33310 -434282 2332822 3103098 1507232 -54457 112139 562483 -636350 -2506144 -2704237
33301 -2704237 -1326820 -532262 -863442 -625721 971344 2563904 3049153 2973841 2691076
33292 2691076 1282888 -1370025 -3177319 -2175413 729679 2853906 2936543 1937336 1092253
33283 1092253 547007 -18509 -482105 -476931 -80347 109351 -306786 -805231 -311591 1360448
33273 1360448 2849486 2756083 1552726 968852 1485705 1702182 626882 -642172 -442250
33264 -442250 1127010 2500972 2772501 2389827 1899993 1110205 -189579 -1432699 -1779398
33255 -1779398 -1182992 -502793 -463654 -754025 -436268 793198 2142507 2683796 2354236
33246 2354236 1676405 941011 203362 -308433 -469907 -648104 -1106656 -1364427 -974536
33237 -974536 -540898 -874670 -1467664 -1155403 -162928 75233 -704631 -1039367 -18145
33228 -18145 1479662 2456749 3104947 3634600 3447942 2535721 2052518 2205615 1266587 -1630616
33218 -1630616 -4344916 -4540698 -3257348 -3053901 -3601052 -2281682 1022546 3103258 2170503
33209 2170503 441871 518863 1648717 1579255 305267 -346397 158977 599270 292638
33200 292638 -65170 105680 526038 1035901 1935948 2926240 2925675 1682794 660351 1331498
33190 1331498 3039114 3610859 2162897 340176 230982 1690582 2626028 1759288 85016
33181 85016 -731206 -469917 -141412 -315057 -656355 -840207 -886887 -568443 527884 2033732
33171 2033732 2709266 1839290 229547 -676508 -382240 369800 706272 591206 568349
33162 568349 768577 590864 -323076 -1117029 -517774 1279941 2475888 1944496 725087
33153 725087 362209 619090 126200 -1230301 -2060946 -1508709 -181077 1005883 1677551
33144 1677551 1634220 908898 332670 766344 1608253 1436169 345671 74954 1324198
33135 1324198 2577964 2375048 1224386 294975 -341528 -961142 -991911 -1865 1073641
33126 1073641 1063835 159186 -811230 -1794416 -2855321 -2997771 -1302470 1256411 2700415
33117 2700415 2466817 1591875 876348 341271 209297 835464 1690349 1863659 1612543
33108 1612543 2021171 3084495 3605163 3199623 2923721 3467665 4087638 3951641 3393068
33099 3393068 3098772 2949757 2404055 1426844 492154 111017 613203 1821471 2768603
33090 2768603 2444493 1079693 33499 194988 1140064 1991299 2332286 2092743 1395932
33081 1395932 855049 1222037 2332677 3092092 2895432 2394904 2431426 2818149 2702956
33072 2702956 1771797 704397 589858 1899895 3772350 4571466 3698286 2491846 2517505
33063 2517505 3333004 3139926 1520303 110182 262440 1319158 1720438 812290 -901744
33054 -901744 -2393454 -2655843 -1532866 -213725 63899 -254660 52688 508789 -590497
33045 -590497 -2883196 -3562297 -1435666 963348 1074314 37382 428488 1945557 2160311
33036 2160311 622634 -715552 -908255 -1054938 -1664795 -1541107 -65715 1501211 1989177
33027 1989177 1941052 2317921 2979033 3386970 3599702 3620140 2850373 1172932 -351999
33018 -351999 -834639 -775478 -967028 -994023 -46055 1321198 1641342 708315 6801 593109
33008 593109 1590031 1575134 826510 1050124 2819349 4438806 4173508 2837394 2738885
32999 2738885 4108986 4280076 1317342 -2851659 -4423592 -2201562 1408536 3621037
32991 3621037 3974845 3711837 3904663 4759962 5773154 5962686 4586732 2043266 -402620
32982 -402620 -1885438 -2361623 -1903944 -550668 1045697 1910932 2052982 2495343 3587924
32973 3587924 4271541 3589920 2024662 682374 7747 4535 844292 2305101 3304912
32964 3304912 3079513 2386538 2471615 3141016 3027329 1757543 676966 991913 2082271
32955 2082271 2370710 1409510 310731 117053 471182 360889 -236126 -264196 740540
32946 740540 1713455 1393966 54561 -890094 -713881 -13728 306914 -155060 -1406414
32937 -1406414 -3051029 -4160162 -4052182 -3263607 -2866245 -2884773 -2516634 -1898605 -2177634
32928 -2177634 -3496989 -4494562 -4468319 -4441229 -5088400 -5213692 -3719806 -1693551 -738089
32919 -738089 -335591 1018249 2763145 2772554 866838 -525163 183264 1610431 1686629
32910 1686629 448400 -633923 -875874 -565787 235685 1635071 2972849 3243021 2495783
32901 2495783 1817809 1729264 1491157 423431 -823878 -1050532 -222135 433638 124427
32892 124427 -513887 -558613 -229520 -344235 -775528 -589356 269866 630134 -168359 -1256280
32882 -1256280 -1573581 -1242077 -847278 -364157 164446 -147439 -1678042 -2836693 -1674271
32873 -1674271 1249970 3348074 3487168 3238073 4099286 5192860 4892016 3527640 2976103
32864 2976103 4046579 5624341 6402070 6376643 6245537 6007592 4854209 2464477 -74067
32855 -74067 -1146502 -436566 678538 873409 428467 429083 986994 1269705 1015965 818392
32845 818392 844180 495398 -323194 -757340 -392062 -52562 -461466 -972379 -584957 365314
32835 365314 515282 -770872 -2709714 -4033946 -4102026 -3269557 -2578126 -2841784 -3745006
32826 -3745006 -4223723 -3961058 -3807210 -4248692 -4317990 -2936859 -728151 614203 436941
32817 436941 -462541 -1281660 -1840216 -1810653 -746447 677186 765482 -946159 -2499857
32808 -2499857 -1759786 664508 2055399 1099495 -595312 -1008596 -493935 -819638 -2059429
32799 -2059429 -2166443 -51991 2406700 2624612 709426 -902488 -920035 -623526 -1415329
32790 -1415329 -2500156 -2128355 -249407 1367255 1378331 195077 -883892 -1004819 -110425
32781 -110425 1335596 2658603 3329648 3228450 2539858 1560589 710376 342514 198632
32772 198632 -598488 -2549037 -4993957 -6690542 -6895576 -5606583 -3301963 -1011256 -45527
32763 -45527 -759641 -1905450 -2073419 -1438377 -1092001 -1032573 -233193 1270074 1927593 884930
32753 884930 -675388 -1253527 -1029279 -1085542 -1417886 -963269 655081 2444131 3113666
32744 3113666 2183059 141512 -1868956 -2640645 -1794413 -131864 1245129 1999643 2433513
32735 2433513 2704975 2736376 2571155 2193222 1303426 -32380 -866863 -384876 820397
32726 820397 1484719 1504307 1839039 2600774 2661115 1545187 304205 -197220 -513281 -1157217
32716 -1157217 -1233450 22679 1347983 899569 -898637 -1836508 -1168610 -496390 -1046882
32707 -1046882 -1886187 -1709613 -945574 -885080 -1658121 -2232900 -1863120 -620646 1005017
32698 1005017 2218226 2127838 666864 -1093436 -2188487 -2729020 -2928031 -2045318 426452
32689 426452 3062948 3537100 1427136 -1175803 -2027781 -760300 1466480 3269151 3791935
32680 3791935 3101400 2144523 1666724 1183974 -181120 -2028390 -2985481 -2662785 -2007258
32671 -2007258 -1578355 -958784 -281358 -703105 -2476253 -3984509 -3863355 -2909618 -2617910
32662 -2617910 -2856980 -2478460 -1474481 -924590 -1159135 -1430084 -1245057 -759420 -4684
32653 -4684 1006738 1516161 694591 -826501 -1381340 -486782 533598 497186 -181394 -518850
32643 -518850 -473364 -662299 -1160774 -1323168 -633970 634028 1526377 1163720 -331842
32634 -331842 -1758747 -2067951 -1496101 -982835 -776134 -400447 207334 527069 431034 343107
32624 343107 335282 109789 37482 992267 2711824 3553903 2641332 1204862 879153 1549357
32614 1549357 1939276 1625633 1268503 1247677 1249076 1075790 864368 527344 -140188 -813375
32604 -813375 -936921 -687993 -789956 -1267003 -1274476 -475962 201649 -309510 -1854167 -3256116
32594 -3256116 -3505489 -2411748 -515860 1198498 1851304 1443274 918365 1038104 1401896
32585 1401896 1078937 32695 -758854 -656408 -111474 266465 734520 1844486 3215136
32576 3215136 3701770 2826054 1365594 339828 -18781 -38580 67974 235955 350101
32567 350101 506954 1141133 2370081 3469757 3565140 2690148 1618276 774116 -51028
32558 -51028 -888566 -1167564 -390154 1135234 2453748 2654587 1419219 -731126 -2634840
32549 -2634840 -3299543 -2730509 -1826417 -1445754 -1742461 -2297132 -2563794 -2215214 -1370317
32540 -1370317 -494835 119782 606585 977658 682263 -675272 -2356771 -3020101 -2377392
32531 -2377392 -1659110 -2092049 -3361428 -3972345 -2971074 -1060133 47170 -552816 -1855713
32522 -1855713 -2081246 -961700 -131177 -793524 -1969812 -2068151 -1345800 -1275497 -1896482
32513 -1896482 -1652900 -54395 1286331 961348 -291458 -758676 260606 2325009 4519867
32504 4519867 5446212 3786456 61364 -3068311 -3457233 -1824834 -461806 -310016 -501245
32495 -501245 -224102 315282 670018 769260 645787 245222 -482306 -1694575 -3537206
32486 -3537206 -5493866 -6397664 -5650109 -3857055 -1739290 717255 3252311 4560594
32478 4560594 3885810 2623340 2713757 3810678 3744425 1815655 -37804 174565 2053440
32469 2053440 3591740 3464646 1912681 7460 -1337362 -1894087 -2011159 -1978611 -1701069
32460 -1701069 -1198503 -924911 -1032529 -831882 218282 1403708 1556302 633544 -461486
32451 -461486 -1294559 -2023102 -2383116 -1860792 -849344 -332969 -274225 415054 2014900
32442 2014900 3346284 3425384 2646286 1754971 672394 -907051 -2480424 -3092537 -2407537
32433 -2407537 -985441 237584 562834 9382 -669123 -754382 -313802 107926 212851
32424 212851 -122945 -1123124 -2525141 -3259084 -2721648 -1825986 -1558294 -1111307 857125
32415 857125 3478021 4219068 2303071 -374435 -2031040 -2673760 -2562556 -1336794 310316
32406 310316 345454 -1642874 -3053512 -1653970 1183175 2611493 2413334 2688430 4152888
32397 4152888 5119930 4233407 2323505 1086687 1159711 1887351 2193004 1507262 342636
32388 342636 -237698 -150065 -662381 -2490946 -4274083 -4108741 -2152453 -444816 -309796
32379 -309796 -1077301 -1384560 -754148 255986 747252 228193 -860303 -1485850 -1271478
32370 -1271478 -1032027 -1583566 -2505706 -2736094 -1995449 -995382 -572446 -1075881 -2140283
32361 -2140283 -2713742 -2028786 -891188 -967668 -2292020 -2850430 -1543089 -36011 -257859
32352 -257859 -1465998 -1670576 -884901 -781046 -1731316 -2392020 -2002644 -1088696 -1212
32343 -1212 1266523 1832524 550752 -1848401 -3133306 -2502325 -1444463 -1301175 -1716549
32334 -1716549 -2048401 -2585000 -3500275 -3980680 -3309497 -1878239 -531787 253367 284858
32325 284858 -243662 -402777 634394 2333756 3517436 4159407 4970872 5412361 4135100
32316 4135100 1616832 190575 768161 1526847 738961 -925870 -1880669 -1656616 -474211
32307 -474211 1469646 3191362 3109530 1241437 -391413 -652154 -790203 -1839705 -2581943
32298 -2581943 -1819924 -747602 -957446 -1748079 -1702610 -1473229 -2430025 -3680173 -3212583
32289 -3212583 -1368465 -458223 -1192173 -2034933 -2038666 -1841950 -1681464 -811957 595975
32280 595975 1120467 357804 -248403 437456 1736855 2403005 2063202 965748 -452563
32271 -452563 -1366552 -1119161 -247864 150154 54391 202495 320417 -590523 -2179610 -2915521
32261 -2915521 -2582468 -2513969 -2867078 -2012062 383023 2018685 1284489 -113729 206671
32252 206671 1683031 2072420 1182777 901290 2005078 3243817 3591568 3398971 3029578
32243 3029578 2160985 1034251 865824 2104806 3336232 2919055 1128115 -229249 -60289
32234 -60289 933135 1426034 1041120 390403 -33128 -337095 -566667 -306104 536512 1109607
32224 1109607 598549 -498920 -1008756 -765111 -525756 -304861 743838 2458639 3255292
32215 3255292 2389122 1243570 1272881 1881033 1672783 767379 301090 419452 499031 839719
32205 839719 2214478 3835123 3691625 1284860 -1600438 -3329977 -4114312 -4666379 -4715379
32196 -4715379 -3916801 -3071790 -3155344 -3760505 -3627090 -2386031 -883599 52063 483774
32187 483774 1057572 2145479 3122228 2530200 -342906 -3954102 -5647830 -4792266 -3593076
32178 -3593076 -3969411 -4943255 -4525450 -3026245 -2456026 -3184574 -3465212 -2377845 -1044580
32169 -1044580 -358228 383897 1562004 1889144 470649 -1323738 -1735644 -1153245 -987616
32160 -987616 -1094982 -395429 733065 1028502 894364 1818527 3248812 2853251 518757
32151 518757 -810507 318279 1205182 -913723 -4314307 -5159101 -3024494 -941715 -536519
32142 -536519 -344641 793998 1690519 1179877 76259 -642449 -1623789 -3479465 -4912415
32133 -4912415 -4399454 -2731988 -1973861 -2458795 -2704503 -2143512 -2037400 -3215450 -4472457
32124 -4472457 -4193955 -2655283 -1618451 -1993715 -2884766 -3050418 -2512162 -2190889 -2373653
32115 -2373653 -2321622 -1483585 -354783 340718 730632 1309721 1775208 1352403 233252
32106 233252 -362744 171416 1068839 1467423 1518949 1590488 1206596 -250757 -2217240 -3270144
32096 -3270144 -2731992 -1316311 -171784 269379 475187 1120096 2218108 2967018 2703082
32087 2703082 1861649 1385674 1261703 601050 -635722 -1200093 -476516 326066 -66136
32078 -66136 -971718 -726544 984685 2992841 4237567 4201068 2416021 -755041 -3173085
32069 -3173085 -2681824 -24095 1728321 1051996 -416412 -751689 -459113 -1175186 -3012214
32060 -3012214 -4599600 -4954745 -4087306 -2370513 -469218 554113 122406 -1119630 -2180011
32051 -2180011 -2846104 -3200957 -2766825 -1296587 106335 31291 -1233069 -2002099 -1485628
32042 -1485628 -538682 -39421 159942 291999 -45583 -959790 -1598301 -1287703 -687941
32033 -687941 -961812 -2184320 -3315781 -3509134 -2811831 -1739032 -740239 -80753 167774
32024 167774 106824 -128157 -378166 -341807 173332 770647 722598 -62580 -841377 -1053010
32014 -1053010 -895499 -540026 357601 1655326 2149456 1185123 196098 1117324 3482093
32005 3482093 4746249 3698473 1891029 1089225 936752 280930 -517507 -191563 1178683
31996 1178683 2066228 1525850 176209 -794049 -705936 341119 1375593 985653 -1096749
31987 -1096749 -3003973 -2492703 280451 2883727 3581923 2920791 2094987 1171498 -277590
31978 -277590 -1865724 -2729662 -2600529 -1799996 -656751 501008 1293762 1751209 2297620
31969 2297620 2863094 2697410 1569013 395859 70904 385019 713907 917566 848892
31960 848892 -20927 -1507993 -2284286 -1812935 -1709784 -3506460 -5851387 -6025596 -3939058
31951 -3939058 -2338453 -2766711 -3567002 -2764436 -944799 90598 31373 -200881 -464316
31942 -464316 -1466680 -3156461 -4439624 -4572744 -3928730 -3291558 -2987494 -2705872 -1788517
31933 -1788517 106526 2273591 3249862 2308859 340402 -1201031 -1823075 -1973269 -1993193
31924 -1993193 -1849464 -1609020 -1379277 -873963 237950 1552976 2160361 1733484 840131
31915 840131 69848 -599856 -1360506 -1964258 -1915889 -1077609 187321 1406925 2329678
31906 2329678 2824124 2660298 1739747 648655 514382 1742290 3115039 2952064 1271764
31897 1271764 -43950 387455 1759394 2435781 2309460 2755147 4410448 6019198 5826290
31888 5826290 3620722 1054152 59041 1032055 2509231 2645456 977223 -1398222 -3150610
31879 -3150610 -3727803 -3223238 -2104747 -1253351 -1348454 -1789130 -1127392 868291 2557201
31870 2557201 2611553 1838650 1705795 1951673 1137975 -954064 -3018464 -4085757 -4267876
31861 -4267876 -3801678 -2782566 -1795771 -1411999 -1127379 -259528 329025 -712416 -2497097
31852 -2497097 -2594399 -933690 -396899 -2318370 -4035261 -2966148 -824709 -908629 -2742910
31843 -2742910 -2817882 -161569 2240267 2080019 783167 734350 1838490 2447358 2006267
31834 2006267 1118983 172110 -550907 -299105 1082381 2179544 1584178 12732 -580857
31825 -580857 241104 992701 636503 -65155 36527 895787 1713176 2063049 1908046 1190222
31815 1190222 163547 -365203 39333 522965 -209215 -2107446 -3619547 -3576877 -2556459
31806 -2556459 -1853508 -1651737 -1104638 -116546 67948 -1331907 -2991204 -2700467 -110831
31797 -110831 2712687 3691140 2839381 1605723 967646 883683 973061 831310 76858 -983749
31787 -983749 -1074142 557475 2537375 2604734 625647 -1072789 -929363 -190166 -627042
31778 -627042 -1609803 -1255965 260309 713167 -760113 -2241280 -1774075 34623 1214809
31769 1214809 1070233 397443 -106514 -330281 -100385 662787 1312976 1162606 721418
31760 721418 1059107 1864819 1478433 -672346 -2898799 -3344097 -2277860 -1259529 -782745
31751 -782745 -121838 809728 1017877 156798 -672490 -630953 -589734 -1736389 -3393753 -3645844
31741 -3645844 -2058212 -351210 83927 58264 1034453 2670880 3300943 2485518 1589361
31732 1589361 1624587 1891708 1393705 467725 50955 122615 1199 -301644 -244374 -63512
31722 -63512 -622008 -1800693 -2297122 -1540768 -723140 -1120749 -2251662 -2759107 -2591108
31713 -2591108 -3020569 -4500413 -5698657 -5165417 -3144237 -1049476 336312 1316910 2102494
31704 2102494 2093563 767776 -1212596 -2383263 -1932236 -393585 1100163 1847558 1759072
31695 1759072 998294 -132117 -1172800 -1820193 -2172933 -2289151 -1679697 92767 2241543
31686 2241543 3027696 1790562 118072 93469 1577962 2279791 789286 -1461472 -2058737
31677 -2058737 -762106 379900 -10164 -853313 -422615 1025340 1593939 445816 -1035883
31668 -1035883 -1109956 158031 1177366 777085 -751746 -2328237 -3227424 -3529451 -3750951
31659 -3750951 -4105346 -4105471 -3107270 -1302562 249968 839615 888363 1085701 1216468 595212
31649 595212 -560797 -1100682 -461274 520920 732666 228967 31949 672485 1430320
31640 1430320 1190367 -154078 -1451330 -1574864 -721484 -24092 48384 250673 1270676
31631 1270676 2563138 3060408 2575253 1825358 1401816 1386037 1675627 1967861 1715525
31622 1715525 870154 340389 810737 1441634 864889 -735129 -1812247 -1684197 -1165582
31613 -1165582 -834939 -218659 818619 1392605 1094310 816736 1153904 1215469 136935
31604 136935 -1323012 -1921420 -1747845 -1621945 -1479079 -762062 140078 252202 -495204
31595 -495204 -1334888 -1917889 -2377558 -2485992 -1916388 -1090837 -683853 -582556 -395420 -544161
31585 -544161 -1584524 -2823913 -3030524 -2300469 -1790587 -1735914 -1239394 -64832 832196
31576 832196 744543 -79718 -1189229 -2068300 -1656101 627339 3291437 3949812 2367314
31567 2367314 652151 176752 246422 246599 855118 2125444 2485978 1071703 -679843
31558 -679843 -1209019 -1006236 -1111165 -1074237 -204526 598345 283532 -245499 416538 1561632
31548 1561632 1449544 345583 137765 1182666 1806679 1084347 107408 115968 993052
31539 993052 1962368 2432292 1987225 804108 35387 459833 1000062 172757 -1259828
31530 -1259828 -1068964 971618 2540761 2135427 919408 502955 825371 1178029 1545577
31521 1545577 1851680 1486671 704410 937874 2529594 3673283 2939026 1343951 397437
31512 397437 -384062 -2061966 -3626065 -3138841 -1001627 198646 -845453 -2700619 -3410986
31503 -3410986 -2622635 -1218263 -196206 -277944 -1514211 -2920454 -3349700 -2870308 -2475176
31494 -2475176 -2502409 -2361073 -1819049 -1431688 -1480258 -1481573 -1011163 -171272 885471 2008204
31484 2008204 2554086 1848022 276717 -1087289 -2027525 -3121526 -3983657 -3171870 -570094
31475 -570094 1643887 1625744 349031 56344 1015935 1459868 504026 -526172 -130074
31466 -130074 1166654 1437752 -262784 -2767602 -4053358 -3374378 -1954710 -1459126 -2013608
31457 -2013608 -2262766 -1391387 -306279 -370129 -1623524 -2933937 -3432688 -3068740 -2130739
31448 -2130739 -1077985 -613852 -1015844 -1456246 -882931 387551 886610 3926 -1127704
31439 -1127704 -1138469 -8001 1321753 2152733 2233867 1444918 94184 -885361 -816367
31430 -816367 -72340 663742 1486857 2686158 3453806 2526266 283671 -1109585 -293128
31421 -293128 1586607 2538365 2165770 1422390 736485 -156288 -810977 -153176 1653608
31412 1653608 2763904 1827976 -318168 -1919109 -2465951 -2680119 -2955721 -2949371 -2499283
31403 -2499283 -1872377 -1005851 586146 2832760 4656461 4876309 3307381 904234 -920914
31394 -920914 -1292593 -663656 -449780 -1318906 -2126024 -1396055 366145 1087520 9276
31385 9276 -1216430 -926978 346417 1076595 1040585 1069173 1258408 1009349 536701 751254
31375 751254 1574426 1824891 1069969 228838 -123001 -690534 -1949892 -2955953 -2770021
31366 -2770021 -2154819 -2541003 -3854531 -4726872 -4643475 -4507437 -4902194 -5065368 -4182996
31357 -4182996 -2805625 -2177196 -2582703 -3059971 -2624210 -1295579 46254 471849 -314035
31348 -314035 -1754092 -2784083 -2616941 -1403509 -114124 363133 60530 -205952 176770
31339 176770 983204 1643889 2022070 2216964 1884634 632987 -857828 -1215650 -379660
31330 -379660 -64358 -1221890 -2122678 -581666 2552805 4175023 3159631 1652430 1584958
31321 1584958 2155885 2042637 1996152 3139424 4203453 3093920 537792 -553803 610933
31312 610933 1662803 932592 -133991 347243 1702189 2059774 1134720 -217743 -2015686
31303 -2015686 -4563778 -6507374 -5784933 -2675242 24339 423429 -344737 -154345 1166689
31294 1166689 1920033 951617 -924372 -1859669 -935768 853777 1651461 871223 -123246
31285 -123246 77932 918589 704798 -923438 -2587001 -3183357 -2966432 -2418826 -1524251
31276 -1524251 -743836 -1241033 -3074270 -4320303 -3284197 -780237 1073195 1646199 1923835
31267 1923835 2295651 1931980 519767 -862136 -1149997 -558891 69299 359407 377468
31258 377468 256923 352236 1113537 2276945 2769466 2032317 948509 740754 1292729
31249 1292729 1417770 728305 286121 958037 1859371 1353497 -555313 -1896497 -1289220
31240 -1289220 98206 220485 -778251 -789563 835211 1928948 570051 -2077812 -3566302
31231 -3566302 -3578200 -3477546 -3241847 -1453436 1574038 3313132 2543691 1058398 570581
31222 570581 38815 -2125883 -4943378 -6191519 -5654505 -4713603 -3580197 -1539149 475973
31213 475973 431439 -1348266 -1995843 -278453 1522101 1260230 183286 608288 2145408
31204 2145408 2630884 1728755 1072182 1252158 1136214 315027 -84229 340664 250295 -1098948
31194 -1098948 -2171308 -1268716 794180 1716000 795183 -531835 -996838 -878106 -902223
31185 -902223 -1034611 -907814 -602046 -380865 -178083 118715 278179 153809 213936 1046972
31175 1046972 2387971 3161656 2670343 1457487 803646 1478844 3099404 4625404 5339746
31166 5339746 5285296 4852939 4209419 3331081 2417992 1843432 1614030 1317678 877108 943590
31156 943590 2039468 3544257 4170051 3464939 2254099 1458839 1118323 919557 1039972
31147 1039972 1745625 2482283 2230398 873684 -441056 -585368 353818 1424644 1965183
31138 1965183 2062161 2127103 2377557 2605838 2228973 801131 -1212583 -2451732 -1976783
31129 -1976783 -488523 335138 -191893 -1022944 -862391 156742 797987 397288 -441398
31120 -441398 -805801 -529626 -77256 150218 -1176 -676393 -1918918 -3300107 -4069970
31111 -4069970 -3962933 -3646041 -3989235 -4874914 -5113366 -3788322 -1431749 508749 1236448
31102 1236448 1185603 1083289 1066278 985276 964463 1092261 954150 148819 -920136 -1418493
31092 -1418493 -1147538 -620848 -217852 -10864 -327520 -1496491 -2891210 -3303405 -2671205
31083 -2671205 -2353539 -3056857 -3600183 -2703538 -1000120 9189 201614 470984 642309
31074 642309 -397451 -2469448 -3842724 -3687756 -3167657 -3335044 -3425863 -2324579 -548237
31065 -548237 490467 370677 -419312 -1748823 -3604132 -4916522 -4128058 -1212293 1830268
31056 1830268 2829425 1276762 -1663789 -4266833 -5263328 -4425566 -2520346 -541520 989049
31047 989049 1878260 1892730 1073896 134748 -99907 421486 1106330 1556211 1805226 1937541
$$ [...]
##END NTUPLES=NMR SPECTRUM
##END=
