##TITLE=31Pdec_BAU-j-FCH3
 CDCl3, 24 sc
 5.6.2019
##JCAMPDX= 6.0         $$ Bruker NMR JCAMP-DX V2.0
##DATA TYPE= NMR SPECTRUM
##DATA CLASS= NTUPLES
##ORIGIN= UXNMR, Bruker Analytische Messtechnik GmbH
##OWNER= root
$$ XWIN-NMR		Version 3.5
$$ Wed Jun  5 15:32:18 2019 Russian Standard Time (UT+4h)  she@DPX200
##.OBSERVE FREQUENCY= 81.013821
##.OBSERVE NUCLEUS= ^31P
##.ACQUISITION MODE= SIMULTANEOUS
##.ACQUISITION SCHEME= undefined
##.AVERAGES= 24
##.DIGITISER RES= 17
##SPECTROMETER/DATA SYSTEM= spect
##.PULSE SEQUENCE= zgpg30
##.SOLVENT NAME= DMSO
##.SHIFT REFERENCE= (INTERNAL, DMSO, 0, 182.463)
##AUDIT TRAIL= $$ (NUMBER, WHEN, WHO, WHERE, WHAT)
$$ ##TITLE= Audit trail, XWIN-NMR		Version 3.5
$$ ##JCAMPDX= 5.01
$$ ##ORIGIN= Bruker BioSpin GmbH
$$ ##OWNER= she
$$ F:/spectra/data/she/nmr/P31/1/pdata/1/auditp.txt
$$ ##AUDIT TRAIL=  $$ (NUMBER, WHEN, WHO, WHERE, WHAT)
(   1,<2019-06-05 15:31:19.35 +0400>,<she>,<DPX200>,
      <created by zg, POWCHK disabled, PULCHK disabled
       configuration hash MD5:
       00 E9 B6 7A A2 85 ED C7 34 08 36 98 17 FE 4E 26
       data hash MD5: 32K
       39 84 C4 3B 89 17 CB C1 DC B7 B4 5A ED C8 8E 04>)
(   2,<2019-06-05 15:31:22.00 +0400>,<she>,<DPX200>,
      <Start of raw data processing
       efp BC_mod = 2 LB = 1 FT_mod = 6 PKNL = 1 PHC0 = -2180.872 PHC1 = 46.39912 SI = 64K 
       data hash MD5: 64K
       67 25 3E 8E 65 69 DA 7E 41 78 EB 24 AE 15 61 99>)
(   3,<2019-06-05 15:31:35.31 +0400>,<she>,<DPX200>,
      <pk PHC0 = 18.39726 PHC1 = 0 
       data hash MD5: 64K
       8B 45 A6 CF B8 30 8E 40 81 2A 10 FB 22 AA 4D 25>)
(   4,<2019-06-05 15:31:41.39 +0400>,<she>,<DPX200>,
      <abs ABSG = 5 
       data hash MD5: 64K
       DA 2C BB F0 7C 71 C9 E9 15 88 62 AB 09 C9 6E 1A>)
$$ ##END=
$$ 
$$ hash MD5
$$ D9 95 34 6E 45 CD 74 5C F4 E0 1A 92 84 17 7A DE
##$RELAX= 
##$RELAX= 
##$RELAX= 
##$RELAX= 
##$RELAX= 
##$RELAX= 
##$RELAX= 
##$RELAX= 
$$ Bruker specific parameters
$$ --------------------------
##$DU= <F:/spectra>
##$EXPNO= 1
##$NAME= <P31>
##$PROCNO= 1
##$TYPE= <nmr>
##$USER= <she>
##$AMP= (0..31)
100 100 100 100 100 100 100 100 100 100 100 100 100 100 100 100 100 100 
100 100 100 100 100 100 100 100 100 100 100 100 100 100 
##$AQSEQ= 0
##$AQ_mod= 1
##$AUNM= <au_zg>
##$AUTOPOS= <>
##$BF1= 81.014009
##$BF2= 200.13
##$BF3= 200.13
##$BF4= 200.13
##$BF5= 200.13
##$BF6= 200.13
##$BF7= 200.13
##$BF8= 200.13
##$BYTORDA= 1
##$CFDGTYP= 0
##$CFRGTYP= 5
##$CHEMSTR= <none>
##$CNST= (0..31)
1 1 145 1 1 1 1 1 1 1 1 1 1 1 1 1 1 1 1 1 1 1 1 1 1 1 1 1 1 1 1 1 
##$CPDPRG= <waltz16>
##$CPDPRG1= <>
##$CPDPRG2= <waltz16>
##$CPDPRG3= <>
##$CPDPRG4= <mlev>
##$CPDPRG5= <mlev>
##$CPDPRG6= <mlev>
##$CPDPRG7= <mlev>
##$CPDPRG8= <mlev>
##$CPDPRGB= <>
##$CPDPRGT= <>
##$D= (0..31)
0 1 0 0 0 0 0 0 0 0 0 0.03 2e-05 3e-06 0 0 0 0 0 0 0 0 0 0 0 0 0 0 0 0 
0 0 
##$DATE= 1559734278
##$DBL= (0..7)
120 120 120 11 120 120 24 19 
##$DBP= (0..7)
150 150 150 150 150 150 150 150 
##$DBP07= 0
##$DBPNAM0= <>
##$DBPNAM1= <>
##$DBPNAM2= <>
$$ [...]
##$SUBNAM3= <"">
##$SUBNAM4= <"">
##$SUBNAM5= <"">
##$SUBNAM6= <"">
##$SUBNAM7= <"">
##$SUBNAM8= <"">
##$SUBNAM9= <"">
##$SW= 369.568048894756
##$SWIBOX= (0..15)
0 1 3 0 0 0 0 0 0 0 0 0 0 0 0 0 
##$SW_h= 29940.119760479
##$TD= 32768
##$TD0= 1
##$TE= 0
##$TE2= 300
##$TE3= 300
##$TEG= 300
##$TL= (0..7)
0 120 53 12 22 120 120 120 
##$TP= (0..7)
150 150 150 150 150 150 150 150 
##$TP07= 0
##$TPNAME0= <>
##$TPNAME1= <>
##$TPNAME2= <>
##$TPNAME3= <>
##$TPNAME4= <>
##$TPNAME5= <>
##$TPNAME6= <>
##$TPNAME7= <>
##$TPOAL= (0..7)
0.5 0.5 0.5 0.5 0.5 0.5 0.5 0.5 
##$TPOFFS= (0..7)
0 0 0 0 0 0 0 0 
##$TUNHIN= 0
##$TUNHOUT= 0
##$TUNXOUT= 0
##$USERA1= <user>
##$USERA2= <user>
##$USERA3= <user>
##$USERA4= <user>
##$USERA5= <user>
##$V9= 5
##$VALIST= <valist>
##$VCLIST= <CCCCCCCCCCCCCCC>
##$VD= 0
##$VDLIST= <DDDDDDDDDDDDDDD>
##$VPLIST= <PPPPPPPPPPPPPPP>
##$VTLIST= <TTTTTTTTTTTTTTT>
##$WBST= 1024
##$WBSW= 4
##$XGAIN= (0..3)
0 0 0 0 
##$XL= 0
##$YL= 0
##$YMAX_a= 14434
##$YMIN_a= -8509
##$ZGOPTNS= <>
##$ZL1= 120
##$ZL2= 120
##$ZL3= 120
##$ZL4= 120
##$ABSF1= 182.463
##$ABSF2= -187.1042
##$ABSG= 5
##$ABSL= 3
##$ALPHA= 0
##$AQORDER= 0
##$ASSFAC= 0
##$ASSFACI= 0
##$ASSFACX= 0
##$ASSWID= 0
##$AUNMP= <proc_1d>
##$AZFE= 0.1
##$AZFW= 0.5
##$BCFW= 0
##$BC_mod= 2
##$BYTORDP= 0
##$COROFFS= 0
##$CY= -3
##$DATMOD= 1
##$DC= 0
##$DFILT= <>
##$DTYPP= 0
##$F1P= 0
##$F2P= 0
##$FCOR= 1
##$FTSIZE= 65536
##$FT_mod= 6
##$GAMMA= 0
##$GB= 0
##$INTBC= 1
##$INTSCL= 5.30512e-09
##$ISEN= 30
##$LB= 1
##$LEV0= 0
##$LPBIN= 0
##$MAXI= 10000
##$MC2= 0
##$MEAN= 0
##$ME_mod= 0
##$MI= 50
##$NCOEF= 0
##$NC_proc= -5
##$NLEV= 6
##$NOISF1= 182.463
##$NOISF2= 159.3651
##$NSP= 0
##$NTH_PI= 0
##$NZP= 0
##$OFFSET= 182.463
##$PC= 4
##$PHC0= -2162.475
##$PHC1= 46.39912
##$PH_mod= 1
##$PKNL= yes
##$PPARMOD= 0
##$PSCAL= 0
##$PSIGN= 0
##$REVERSE= no
##$SF= 81.0140089999434
##$SI= 65536
##$SIGF1= 159.3651
##$SIGF2= -187.1042
##$SINO= 113.3802
##$SIOLD= 16384
##$SREGLST= <1H.CDCl3>
##$SSB= 0
##$STSI= 65536
##$STSR= 0
##$SW_p= 29940.119760479
##$SYMM= 0
##$S_DEV= 0
##$TDeff= 32768
##$TDoff= 0
##$TI= <>
##$TILT= no
##$TM1= 0
##$TM2= 0
##$TOPLEV= 0
##$USERP1= <user>
##$USERP2= <user>
##$USERP3= <user>
##$USERP4= <user>
##$USERP5= <user>
##$WDW= 1
##$XDIM= 65536
##$YMAX_p= 435549858
##$YMIN_p= -27495541
$$ End of Bruker specific parameters
$$ ---------------------------------
##NTUPLES= NMR SPECTRUM
##VAR_NAME=  FREQUENCY,     SPECTRUM/REAL,   SPECTRUM/IMAG
##SYMBOL=    X,             R,               I
##VAR_TYPE=  INDEPENDENT,   DEPENDENT,       DEPENDENT
##VAR_FORM=  AFFN,          ASDF,            ASDF
##VAR_DIM=   65536,         65536,           65536
##UNITS=     HZ,            ARBITRARY UNITS, ARBITRARY UNITS
##FACTOR=    0.456856943014862, 1,           1
##FIRST=     14782.0589164792, 0,            0
##LAST=      -15158.0608439998, 0,           0
##MIN=       -15158.0608439998, -27495541,   0
##MAX=       14782.0589164792, 435549858,    0
$$ Real data points
##PAGE= N=1
##DATA TABLE= (X++(R..R)), XYDATA
$$ [...]
41616c42788n64516M43668J311533J353886P80922N0504n59555q52219p46552
41607H74883m39143k20299j56533j29192n0582J22814M02074O02512L76878l35980
41597A047432j025769j037381k88410N83088Q37108L84713j14685j1057M97233
41588H72272N61198j43090q31965o24657J77185M65525j05654o61263m04135K91023
41578d03561N11871P8165l73469l78128j73560j77650l36835k56979J64992N41020
41568h04134N09034K21143P5930J10546L3701j66855j37157J81196L13786k1422
41558C15768m19074m04929j08236J29169L45672O03455N28571n9644m94323j44479
41548B91950L78977L97r72368j049036J82190J266698R36823j28229m35877K17410
$$ y = [-342788, -907304, -463636, 847897, 2201783, 2982705, 3033209, 2473654, 1621435, 874883, 435740, 215441, 58908, -70284, -120866, 1948, 404022, 1006534, 1383412, 1047432, 21663, -1015718, -1304128, -721040, 116068, 500781, 386096, 375039, 872272, 1433470, 1290380, 458415, -166242, 10943, 476468, 370814, -290449, -694584, -403561, 108310, 186475, -186994, -565122, -738682, -916332, -1253167, -1510146, -1345154, -804134, -295100, -73957, 1973, 112519, 146220, -20635, -157792, 23404, 337190, 315768, -103306, -508235, -616471, -487302, -141630, 461825, 990396, 930752, 436429, 291950, 670927, 671324, -301044, -1350080, -1167890, 98808, 1035631, 907402, 471525, 688935]
41538F88935P44539M14599m20136j060166j159350p31327n3389M06493L84239
41529g85563J35601O7154J80941K00315O4286r2427k92325n93226o95783j80731
41519a991758P75383J362045J040590K06911l15308k75262j57036l33055m48947
41510a36437n739O54820N83884l64276j027775m42763O50706P28395k88054q31296
41500d78535N6195J335901J440633K95985r00144j321381j088349n88475q3450
41491a331620J67526J19068J70080N80277Q60933M25979l64742o17248k25840
41482b15587J06685J24192K73374N75695L68426m09191p60703j47035N13150K53827
41472F82833l61857k02247N06460N44337k73661q08780m26803J60026K17690K2452
$$ y = [688935, 1433474, 1848073, 1427937, 367771, -791579, -1522906, -1576295, -1169802, -785563, -649962, -582808, -401867, -201552, -137266, -229693, -522018, -1115244, -1811027, -1991758, -1216375, 145670, 1186260, 1393171, 1077863, 802601, 645565, 312510, -136437, -142176, 512644, 1096528, 732252, -295523, -738286, -87580, 640815, 352761, -478535, -422340, 913561, 2354194, 2650179, 1750035, 428654, -659695, -1248170, -1331620, -1164094, -1045026, -874946, -294669, 566264, 992243, 627501, 10253, -215587, -108902, 15290, 288664, 864359, 1232785, 823594, 62891, -84144, 429006, 682833, 320976, 118729, 625189, 1169526, 895865, 87085, -339718, -179692, 37998, 60450]
41462F0450N8217J70682J47203K79716O48756O22118j36551q42799o64535l4954
41452C08303R4275j70662K9475O93540Q57706J36454p10912r42786o64757l06026
41442f75390q3317j55024n22833o53785k6926Q42577Q62317J530n68583k34070
41432a213504K93910L77552L97409O50351N16442l40857r83630n08564M67656
41423c43235P45422K76705j54287l52386o16270p30387k96136K70610K51051j44998
41413a093911j79081Q7587L9297k03151p055M36575L27592k44524l45857K00997
41403i81531N76093M58799M36993O72221M86446l06950q86603p29811l35384j81102
41393g90829m9398J42924k4910m72943l84494L85074P83411J80053n86485o18273
$$ y = [60450, 118667, 289349, 436552, 716268, 1365024, 1987142, 1850591, 1007792, 343257, 308303, 402578, 231916, 261391, 954931, 1812637, 1949091, 1238179, 295393, -369364, -675390, -758707, -913731, -1436564, -2090349, -2117275, -1274698, -412381, -410851, -979434, -1213504, -919594, -542042, -144633, 505718, 1022160, 681303, -302327, -810891, -343235, 402187, 678892, 524605, 172219, -444051, -1174438, -1470574, -1199964, -948913, -1093911, -1272992, -1185405, -1146108, -1349259, -1356314, -919739, -592147, -836671, -1182528, -981531, -405438, 53361, 490354, 1162575, 1649021, 1342071, 455468, -274343, -609727, -790829, -840227, -697303, -722213, -1195156, -1579650, -1194576, -411165, -231112, -817597, -1435870]
41383a435870l25305l77166l26580M52135J244300Q49136m61235j196434p19447
41374b296466J37835N28053N38996N04087L44719N001j52362J40237N39269M92801
41364G82170j8338m40862l30282J16137L24215Q7420j85271r5676J42144M3706
41354D25363m14123q00042p97002l66212M05606J132390J130510K49678o13452
41345C52716n85953m2866J22991j6997J33662K32195m50619j247328p41801P00346
41335a543654J108458O5758n00142M38560J216382L32134r58049p80004L05518
41326c15039N33321o1032j55676K12227j37718j090183j222871j87650P90718
41317a633903Q78095M73345L6444m29522o68262l11440K39997K96533R8144L05940
$$ y = [-1435870, -1761175, -2138341, -2464921, -2012786, -768486, 80650, -380585, -1577019, -2296466, -2158631, -1630578, -1091582, -587495, -242776, -237775, -390137, -249900, 289369, 782170, 763832, 322970, -7312, 108825, 433040, 520460, 335189, 239513, 381657, 425363, 11240, -788802, -1585804, -1952016, -1546410, -414020, 716490, 966168, 352716, -233237, -276103, -153112, -170109, -36447, 195748, -254871, -1502199, -2244000, -1543654, -435196, -369438, -869580, -431020, 785362, 1117496, 159447, -620557, -315039, 218282, 157250, 1574, 213801, 76083, -1014100, -2236971, -2424621, -1633903, -755808, -282463, -246019, -675541, -1343803, -1655243, -1415246, -1118713, -1020569, -714629]
41307g14629N76443Q4197p90149q65108j02884M43705N02046P09112R41764L66139
41297A150636p04086q68301J07447Q79681P48020M77139M56360k2158r55193j044136
41287B25409R8529R40536L66963o09406p12374m04398n78333o61322K74096J532769
41277D72469J654388O06612l82910o87377o33674m52445j55222j01536n21366
41268b01061p92770k62825N60585O87165J62170j61075m8750J3303q1792L9587
41258h5463L47783M42424L93577N75582P21469J65501q86642j312000n66370N44953
41248C40814Q93763K46657p59170j338907j069084j36531P17589Q33368L24514
41239E3013j27208j38827O3971J73184K05612K80663L34751K39833L4677j00107
$$ y = [-714629, -138186, -53989, -844138, -1709246, -1812130, -1368425, -866379, -157267, 784497, 1150636, 446550, -421751, -314304, 565377, 1313397, 1790536, 2246896, 2224738, 1269545, 225409, 323938, 1264474, 1631437, 1022031, 309657, -94741, -673074, -1334396, -1060300, 472469, 2126857, 2733469, 2350559, 1663182, 1029508, 577063, 421841, 320305, -201061, -993831, -1256656, -696071, -8906, 153264, -7811, -56561, -43258, -125050, -85463, 262320, 704744, 1098321, 1673903, 2395372, 2560873, 1674231, 362231, -204139, 340814, 1234577, 1481234, 722064, -616843, -1685927, -1822458, -1104869, -271501, 53013, -74195, -213022, -149051, 24133, 229745, 510408, 845159, 1084992, 1119669, 1019562]
41229A019562n6768N0942j0452k80979m73832l14565Q1324L94620N18595M69608
41219A398055J05274n48988q81562l23400O35326Q56202R9698o36883n39914N2773
41209B16581L88728K49999j43726m76011l45155L18106P32282J13532q74437p75399
41199e95500L29549P17854j93784p57102J60257J126326M54943r43813j029149
41190g30419J31483P59686L27350p8601q369j00090l45880O740O84619N32791
41180A179310k95761l09927O99666J069142N6186p88780j97303O73088J72296
41171B257917j175472j623664q57881k3608K94683N16127P64493N98558O8084
41162H19237j72199J5494p490n35341r31375n33710L73152Q75974N09990k13699
$$ y = [1019562, 962794, 1013736, 1003284, 722305, 248473, -66092, 15232, 409852, 928447, 1398055, 1503329, 954341, 72779, -250621, 384705, 1240907, 1340605, 703722, 163808, 216581, 605309, 855308, 711582, 235571, -109584, 208522, 940804, 1054336, 179899, -595500, -265951, 451903, 258119, -498983, -338726, 787600, 1242543, 298730, -730419, -598936, 160750, 488100, 409499, 401130, 301040, -44840, -38100, 646519, 1179310, 883549, 573622, 1273288, 2342430, 2398616, 1609836, 1412533, 2085621, 2257917, 1082445, -541219, -1399100, -1422708, -1128025, -611898, 152595, 751153, 819237, 647038, 662532, 655042, 119701, -811674, -1345384, -972232, -96258, 413732, 200033]
41152B00033l60984L30857J000278O13369o13702j272064n19371P51086J018218
41143A147720L9359r71999r12448N5181R18028R18050J44759o64572q10228k62199
41133c98349L80219N99802M56057K67629J00191j53947m30784n87919o81805p82619
41123a231525o49284m0366O79893P58193N1285o21534m57357K89495O82125L83197
41113a55878K1259J57478M41088K33143l07408m20278P5696N14412M32399J91070
41103A182981K21736K98107O1015k89435m31130n47123q00558o65932K75599J201871
41093E07131Q65249m72788j130996l44279O41378M50246m23762m73201N38742
41084A57720J256397O47897o58880j278257p78815k3514P9561k92414k99966K34039
$$ y = [200033, -160951, 169906, 1170184, 1783553, 1169851, -102213, -621584, 129502, 1147720, 1187079, 215080, -697368, -642187, 275841, 1193891, 1338650, 674078, -136150, -398349, -18130, 581672, 1037729, 1305358, 1405549, 1251602, 820818, 232899, -448906, -1231525, -1880809, -1921175, -1241282, -483089, -431804, -1053338, -1510695, -1221200, -539075, -155878, -134619, 22859, 463947, 697090, 389682, -30596, 45100, 559512, 991911, 1182981, 1404717, 1702824, 1763839, 1474404, 1043274, 496151, -304407, -970339, -694740, 507131, 1372380, 899592, -231404, -575683, 65695, 515941, 92179, -381022, 157720, 1414117, 2062014, 1403134, 124877, -653938, -677452, -597891, -890305, -1190271, -956232]
41074i56232N60714K65216M6539N58493J091393N21238p13542r74217P0308P62642
41064A232552n9518j236318j035904K79528R97710M67715l51174o10395m76519
41055g92323k66625Q1772M16688L07413q5909k6689N43371P10709L7938o34508
41045B91837n07560p1461j46214m05514J7217Q92886J111417M29209k04094k13988
41035A193735j33488l72799l62906L55047J061827Q14236r1031n74456l68816
41026A521349j86618m11937n84710l22029N8590J13119j42199m80998p93177r20821
41016b149431o26495K8928O37484R26280R43874P31509K63103k50284n03474n63086
41006e61592o34276m45101L45850J148918Q91098l15309j074665o97719r4321
$$ y = [-956232, -395518, -130302, -83763, 474730, 1566123, 2087361, 1373819, 399602, 469910, 1232552, 1173034, -63284, -1099188, -819660, 178050, 645765, 294591, -315804, -792323, -1058948, -977176, -560488, -253075, -338984, -365673, 177698, 888407, 926345, 291837, -215723, -287184, -433398, -838912, -821695, 71191, 1182608, 1611817, 1407723, 1193735, 1060247, 687448, 324542, 679589, 1741416, 2555652, 2464621, 1890165, 1521349, 1334731, 922794, 338084, 16055, 74645, 187764, 45565, -435433, -1228610, -2149431, -2775926, -2746998, -2109514, -1183234, -239360, 492149, 755252, 504968, 1494, -561592, -1195868, -1640969, -1295119, -146201, 744897, 429588, -645077, -1342796, -1437117]
40997a437117m9315P5136Q78627J405739N80270p12137o97959N40181J122822
40988A706247J69835j052908j112751k30184M01845J85329m95390q61149m38138
40979a727264M21761P80432L09161j37659J84756O25694J95839o38082o22680
40970f08042J41233L45501k83645n99391j10224K82293Q1906L2926M68193M69324
40960B20074l86557r49124k99156O70296P06777J07767j09505L3096r5202l38610
40950d40144j66748J18586r1962m58932k26258L71825M66118M2835r6994K83590
40940a98084N85039M12901l871l56536m81643k41620J54485P8258n67073q56273
40930a474417j68577O15130L56821m63221m81596L16526O56358J78838n1212M72621
$$ y = [-1437117, -1486432, -1411296, -532669, 873070, 1453340, 741203, 43244, 583425, 1706247, 1876082, 823174, -289577, -519761, -117916, 67413, -427977, -1289126, -1727264, -1305503, -525071, -215910, -353569, -168813, 456881, 652720, 14638, -608042, -466809, -121308, -404953, -1004344, -1114568, -832275, -750369, -717443, -249250, 220074, -166483, -1115607, -1414763, -744467, -37690, 70077, -39428, -6332, -101534, -440144, -606892, -488306, -580268, -1039200, -1265458, -893633, -427515, -384680, -481674, -198084, 386955, 799856, 795985, 439449, -42194, -283814, -129329, -51071, -618144, -1474417, -1642994, -1027864, -671043, -1134264, -1615860, -1299334, -642976, -464138, -515350, -42729]
40920d2729P59212J2775r92645j070325k57306N15439P31835N31817J41226k54120
40910G5179l84023j93864l8564j74188l16868r3749L18780M41275K36108J62742
40900C2828M48445O73732L31688l71018o52068j89852L83766L83258P4012J32176
40890A246967L97901J42373m73728m50620K31329K39139r03417j630440o10740
40881a811236R82626J138613Q4126k72174M56827O65657l55751j187827o64585
40872i63724L04753L85437j01483k7356N79517P52531K49335j98785j11519K05191
40862A073897L21595J82395r3135m04884o07415n74964l60419j21580N1586J40059
40852c92865J56310J70858K32996K57865J64894N4448Q449j37770m72506o28503
$$ y = [-42729, 716483, 729258, -263387, -1333712, -1591018, -1075579, -343744, 188073, 329299, 75179, -308844, -502708, -541272, -715460, -1032328, -1126077, -807297, -366022, -129914, 32828, 481273, 1155005, 1486693, 1115675, 463607, 273755, 657521, 1040779, 1114791, 1246967, 1644868, 1787241, 1313513, 862893, 1094222, 1333361, 429944, -1200496, -1811236, -828610, 310003, 394129, 121955, 578782, 1244439, 888688, -299139, -963724, -658971, -273534, -375017, -402373, 177144, 929675, 1179010, 980225, 868706, 1073897, 1395492, 1577887, 1484752, 1079868, 472453, -102511, -462930, -584510, -532924, -392865, -236555, -65697, 167299, 425164, 590058, 644506, 652955, 515185, 42679, -585824]
40842e85824k23713M13655N40220M4876l67872j65617L41924M99975J00025m63860
40832A33789n70819P6457J008724J255089M14486p44934j169036p10704L8527
40823b68421O76944J050181Q17238r8686r03979p86918j77753j09412n39073n39179
40813h79058k4493J58327o3621K10070R91816J002447j67751j061078n21294N11926
40803A57291N89676l1411j62263K20732J89004l36069m97883p4426J83737j03056
40793A35332l30686O0518O85336P10387r3491j022627j123278k49362O68401P29785
40783A70315K37878J01848K66158j50147j050509j118768M1832R57695M59794
40774h3904m84688m07308L15961L36687k79941l24604L44716O55009K69213j1211
$$ y = [-585824, -809537, -395882, 144338, 189214, -178658, -344275, -2351, 497624, 597649, 133789, -437030, -360573, 648151, 1903240, 2317726, 1572792, 403756, -306948, -268421, 408523, 1458704, 2275942, 2177256, 1273277, 486359, 308606, 199194, -339879, -879058, -903551, -745224, -808845, -598775, 393041, 1395488, 1227737, 166659, -354635, 157291, 746967, 715556, 553293, 774025, 963029, 626960, 129077, 54651, 238388, 135332, -195354, -134836, 550500, 1260887, 1167396, 144769, -978509, -1227871, -559470, 170315, 408193, 510041, 776199, 626052, -424457, -1543225, -1501393, -543698, -83904, -568592, -975900, -659939, -323252, -603193, -927797, -583081, 71928, 341141, 329930]
40764C29930R6154r4170p06921q33483j22927M79006K65313r3294K49761Q90549
40754D59918Q50237O9371o18599o64952k82253N4400Q2135j42542k86729l1245
40744e10259M94588P70622M98332r7661o38933r15387p74687j48237O19654R01318
40734A99350N30342P6340Q1770L33126K53246k05876n10610l58234j04871j67702
40724A26881l03742P2840Q79079J219094N77296l29596n07405j29497j37788n61270
40714I05892m13492M91814R07993M3525j058116j057020l01780j2379k00202Q5990
40704f07775Q07756Q66203N1481m71691m8534M11661o5577r89836j180711m07655
40694a634678M99872Q01123N07376R8918k3211J05103P3232l30329o90865m72106
$$ y = [329930, 426084, 331914, -375007, -1208490, -1331417, -852411, -587098, -680392, -430631, 459918, 1310155, 1379526, 760927, 95975, -186278, -131878, -49743, -192285, -479014, -510259, -15671, 754951, 1253283, 1155622, 516689, -398698, -1173385, -1321622, -701968, 199350, 729692, 806032, 887802, 1220928, 1474174, 1268298, 757688, 399454, 294583, 126881, -176861, -104021, 775058, 1994152, 2571448, 2241852, 1734447, 1604950, 1467162, 905892, 492400, 984214, 1892207, 1935732, 877616, -179404, -481184, -493563, -693765, -607775, 199981, 1066184, 1117665, 645974, 597440, 1009101, 943524, -46312, -1227023, -1634678, -1134806, -333683, 173693, 272611, 249400, 354503, 427735, 97406, -593459, -1065565]
40684a065565J56819N05129L32489P4780P9334K00401K41447K45923K37077J56130
40674A163964J06569J78337Q0367m70649j061853r68400k12861M71258P20767
40665G499Q04958Q16013N17270J11382J71238N43050L11180p37068j557453j288458
40655c00389m05431J39089J60009N116k26167n37201o30164k78280K64127O29394
40645a179897O97215L73413l44067q57434l88932P26537J130620L26237n67377
40636h3685n93103l30607n56141o94087O5489J013397Q50633j71105o16491j12392
40626a228092K96098J041l78169k21013K99320Q44255J255479J144515K27427
40617B240861p90979p88897J26580O81398L50103m6715l396j89625r62157j334924
$$ y = [-1065565, -908746, -403617, -71128, 3652, 82986, 283387, 524834, 770757, 1007834, 1163964, 1270533, 1448870, 1529237, 1058588, -3265, -971665, -1184526, -713268, 7499, 812457, 1628470, 2145740, 2257122, 2428360, 2971410, 3282590, 2545522, 988069, -300389, -705820, -566731, -406722, -401606, -627773, -1164974, -1795138, -2073418, -1809291, -1179897, -482682, -109269, -453336, -1310770, -1699702, -973165, 157455, 483692, -83685, -676788, -1007395, -1563536, -2257623, -2192134, -1178737, -328104, -499209, -1115700, -1228092, -931994, -930953, -1309122, -1530135, -1230815, -386560, 868919, 2013434, 2240861, 1449882, 660985, 787565, 1468963, 1819066, 1772351, 1768955, 1579330, 617173, -717751]
40607g17751m74674P75570J028995L13905k42403j87609m8930j28351r2818K27792
40597D53726M99445M38505R8441l86437q20920q44288l67585O0682n4275l03141
40587a225847M0134P31750P57612j25216r52090r02242k75482K10477L31142J54018
40577a255744l16402p46662m32258O54164J368642P74758m44804q78838l47378
40568a624522J03892K5227J19367P10157Q94276k8842j178754j139298Q2707J107189
40558i28601J008147K14851m17487o12030n11964j91820K55398N42176M95180
40549a46150L20436K71019K58684R8663m3509J47555N18394M64253k35755r37442
40539G16148q72354k10802J33676j72106l71615J69850Q29801N93785k68384m57063
$$ y = [-717751, -1192425, -416855, 612140, 926045, 683642, 496033, 447103, 318752, 225934, 453726, 953171, 1391676, 1490117, 1103680, 282760, -561528, -929113, -868431, -922706, -1225847, -1185713, -453963, 303649, 178433, -773657, -1675899, -1951381, -1740904, -1409762, -1255744, -1572146, -2318808, -2751066, -2096902, -728260, 46498, -398306, -1277144, -1624522, -1520630, -1495403, -1376036, -665879, 228397, 199555, -979199, -2118497, -2035790, -928601, 79546, 294397, -123090, -735120, -1247084, -1438904, -1183506, -641330, -146150, 174286, 445305, 703989, 802652, 759143, 906698, 1425092, 1889345, 1653590, 716148, -156206, -367008, -233332, -405438, -777053, -607203, 222598, 816383, 547999, 90936]
40529I0936L44211Q57818J32288r60908j028065j64005M36263L59902K28611K85999
40519E83050M2831n31082o75255j11364L63329J00780m08929l84785Q5756L85152
40509e50517L38882K04326P4204j07947k06219o4665J98203M26226O51446P61734
40499A725673L82455m58407r81609n53457L78130Q21539M75299j23132m45864
40490A220627l90918m2835L69889L90175j97605q64219q64599k47595K05218M6256
40480c75606l75082n45449l42130J13802O17130P76082K97945m31218n79886L8891
40470h05521N90616K95694n21471r07981n21003J20026M93472O47416Q09284Q68644
40460A069176N67517J6483l31477k66201j19049k98440o79508p30483k43486L53030
$$ y = [90936, 435147, 1292965, 1425253, 464345, -563720, -727725, -291462, 68440, 297051, 583050, 625881, 94799, -580456, -691820, -328491, -227711, -636640, -1021425, -935669, -550517, -211635, -7309, 66895, -41052, -247271, -311936, -113733, 312493, 963939, 1725673, 2108128, 1649721, 668112, 114655, 492785, 1314324, 1789623, 1666491, 1220627, 829709, 786874, 1156763, 1546938, 1349333, 485114, -379485, -627080, -421862, -375606, -750688, -1296137, -1638267, -1524465, -907335, -131253, 166692, -264526, -844412, -805521, -214905, 80789, -440682, -1348663, -1869666, -1749640, -1256168, -608752, 200532, 1069176, 1636693, 1653176, 1321699, 1055498, 936449, 638009, -41499, -771982, -1015468, -662438]
40450f62438N54706M16516L64229M89353L78369k48301r80792j082675l84900
40441a155933M63923P91243O83737O27358N70731J0672q84541j073132j24730
40432i0672Q18706M90344n86473q02627J38087Q89873O54574K28024L37205L87048
40422B464089j88674o02373l3190P08856L57038o38314p80743m7447M9047r55707
40412C32582j570368o39435Q72159J297571M90428l30023l36574J88319N74706
40403H79365N02518J15725k04535k51836k56665m66704n53081k7300P52117Q20006
40393A309610P6255l97025M9552O13670L36874m13099o85786n10075n90643q51584
40383a062251n19892M10637R82734P36381L24024L12419L13924j40925o43133
$$ y = [-662438, -107732, 308784, 673013, 1162366, 1540735, 1292434, 311642, -771033, -1155933, -692010, 99233, 782970, 1410328, 1981059, 1991731, 1107190, 34058, -90672, 728034, 1218378, 631905, -170722, -32635, 857238, 1511812, 1739836, 2077041, 2464089, 2275415, 1673042, 1639852, 2348708, 2705746, 2067432, 1286689, 1239242, 1288289, 332582, -1237786, -1877221, -1005062, 292509, 782937, 452914, 116340, 304659, 879365, 1381883, 1497608, 1293073, 1041237, 784572, 317868, -235213, -262513, 489604, 1309610, 1385865, 988840, 1038392, 1652062, 1988936, 1575837, 890051, 379976, -210667, -1062251, -1582143, -1171506, -188772, 547609, 871633, 1184052, 1497976, 1357051, 713918]
40374G13918n32412K4684L12220J25385j17347j49848j00784j8996K15612M36983
40364I09415K37401l37653o59404l73787O6678J12826n1417P9035L87101K88626
40354F58821k41331n25443k24203J61308J51185J4501J29408J84996k40748o92569
40344f24075l63825M65684N24645o18492j704260j364786P1105J108335J039221
40335a466448N17801K90681K53123L4341k12129j41485R4551R3056p8920j1525
40325f26954K53048J82980l42328o98264m25475L8473L9974k79247k99601Q4O2016
40314b095294j90209j43910M36917R17503P77389M16991M18519N49930K04048
40305A291884n19879r08941o61809j67526J84719L81285M57794L34903O7726j51697
$$ y = [713918, 181506, 206190, 518410, 643795, 526448, 376600, 275816, 256820, 472432, 909415, 1146816, 809163, 149759, -224028, -157350, -44524, -95941, -16906, 370195, 658821, 417490, -107953, -332156, -170848, -19663, -5162, 124246, 309242, 68494, -624075, -987900, -522216, 2429, -616063, -2320323, -3685109, -3614004, -2505669, -1466448, -948647, -657966, -404843, -370502, -582631, -724116, -629565, -536509, -615429, -626954, -373906, -190926, -533254, -1231518, -1656993, -1618520, -1578546, -1857793, -2157394, -2157310, -2095294, -2285503, -2429413, -1992496, -1074993, -297604, 119387, 537906, 1087836, 1291884, 772005, -136936, -798745, -966271, -781552, -400267, 57527, 392430, 460156, 308459]
40295C08459k88401m12695l98062p6310L41971M39662J86927n3902j01529r3070
40285a46950o6751R8289K88382K03263j20049l12728k80076k81985l07156K4856
40275i00905O87880R70646M04059m62902p06488k10490K45540J5340o24595p94088
40265a376003m6625R69289J086003K5628j072488r81593J3445N42517Q2147m21178
40255a178858n7585Q00915J221576R29293K28964o26032j288545j105523R2733
40246i83062J321675J409195M72460l39901m41828k98008l20141k11933K58121
40237H66578N97550K52203n19447r57663p47167k28763J72154L34221L15000J77212
40227B61878p275j84125l89254o58153q56959p49244k68871L75069Q80719J042733
$$ y = [308459, 20058, -392637, -790699, -867009, -525038, -85376, 101551, 47649, -53880, -146950, -213701, -115412, 172970, 376233, 256184, -56544, -336620, -618605, -925761, -900905, -213025, 757621, 1161680, 698778, -7710, -218200, 27340, 42680, -581915, -1376003, -1422628, -453339, 632664, 658292, -414196, -1395789, -1382344, -839827, -757680, -1178858, -1236443, -435528, 786048, 1715341, 1944305, 1318273, 29728, -1075795, -983062, 338613, 1747808, 2220268, 1880367, 1438539, 1140531, 820390, 608457, 866578, 1464128, 1716331, 1196884, 239221, -507946, -736709, -564555, -230334, 84666, 261878, 254603, 70478, -318776, -976929, -1833888, -2583132, -2852003, -2476934, -1596215, -553482]
40217e53482P91372K46248k21758k45496M5964N9039m28773p36697j31491R13254
40207b61820J074912J666j021392p64035K62418O20326P447m95952j48066M77624
40197b46872M74816j96579q42491q53231j49597P48730R95321K77024n48537l42249
40187f83665P01310J173570M45954m32926l91527P4163j33169q87904j109955
40178a244149m76864K62534N77536P07531Q38974O84217J46147l62074n51184
40169E82668n61228m05339J62164Q75271Q32890k44387j268005j089556j24105
40160a239627K72519j50770k22024P11826J610303J201674j49753r86588p45066
40151C02494j49582K27868O22863J054293Q17548l13016j270971r89832Q7063
$$ y = [-553482, 237890, 484138, 262380, 16884, 62848, 121887, -306886, -1043583, -1175074, -261820, 813092, 814758, -206634, -970669, -708251, -87925, -80478, -576430, -724496, -246872, 227944, 31365, -811126, -1664357, -1813954, -1065224, -69903, 207121, -341416, -683665, 17645, 1191215, 1637169, 1204243, 812716, 886879, 753710, -134194, -1244149, -1721013, -1458479, -880943, -173412, 665562, 1349779, 1495926, 1133852, 582668, 21440, -383899, -221735, 653536, 1486426, 1242039, -25966, -1115522, -1239627, -967108, -1117878, -1339902, -628076, 982227, 2183901, 2034148, 1047560, 302494, 152912, 380780, 1003643, 2057936, 2875484, 2562468, 1291497, 301665, 388728]
40142C88728P02529N17704J65435n1701l86711p25161n94969j49229n1039k63292
40132d47706o9447N10346N46953j72956o06565j43462L87592K09532p8021K81469
40122D17735O96923K40150o24938p41218j63820Q1517j65510q6541M63265O52245
40112G69808K06274j04580J18380K29856j96210n35928k19274K72218K86334J09662
40102I36540L26838O42196K93476o42862j249305j015945l56621J61920M44060
40093d59703N62956M27813P5985j21373N9039K58947j154n65254p96677m84259
40083a043680j06238l6400l637K83225M45319O063o19814n15938L42582R00352
40073c48166M88908k45498l24278K50983P34218P46360N14911K39459j60766o76297
$$ y = [388728, 1091257, 1608961, 1774396, 1722695, 1335984, 610823, 15854, -133375, -184414, -447706, -517153, -6807, 540146, 367190, -239375, -382837, 4755, 214287, 136266, 417735, 1114658, 1354808, 729870, -11348, -175168, -93651, -259161, -345702, 117563, 769808, 976082, 871502, 989882, 1219738, 1023528, 487600, 268326, 540544, 826878, 936540, 1263378, 1905574, 2199050, 1556188, 306883, -709062, -1065683, -903763, -459703, 103253, 531066, 607051, 485678, 544717, 803664, 802510, 237256, -559421, -1043680, -1149918, -1186318, -1189955, -906730, -461411, -455348, -1075162, -1591100, -1248518, -348166, 140742, -104756, -429034, -178051, 556167, 1302527, 1817438, 2056897, 1896131, 1219834]
40063A219834j030657r74097n63416j22986M5667L618J25777M81425N09630j57546
40053d62751p92972l74471P49528J104022K45598n56963l50970R5102j66585n72962
40043a083424k17564L27504j9178p71995n83402L42114M68470m08539o71826M47822
40033b170018J492319R73010m58185j132402o32057J92274P31403R93161Q92193
40024H81698K46591o03015r82547p23563k55817R5786L69256N19556K83688k84604
40014d52971n67291q3859P09100Q04992k5210p65310m52016M45937O92110J22740
40004D28222k24741N4055M1235p47716j191298k62796J100986J259383L26063
39995G83393j98072J39035L39449q1720m08120k53770k41275o60367p89424j65662
$$ y = [1219834, 189177, -784920, -1348336, -1471322, -1425655, -1422037, -1296260, -814835, -305205, -462751, -1255723, -1630194, -880666, 223356, 468954, -88009, -438979, -343877, -510462, -1083424, -1300988, -973484, -992662, -1764657, -2348059, -2005945, -1537475, -1946014, -2617840, -2170018, -677699, 295311, -162874, -1295276, -1927333, -1735059, -1003656, -10495, 881698, 1128289, 525274, -457273, -1180836, -1436653, -1340867, -971611, -452055, -168367, -452971, -1020262, -1104121, -395021, 409971, 384761, -380549, -832565, -386628, 305482, 428222, 203481, 257536, 298771, -448945, -1640243, -1903039, -802053, 457330, 783393, 585321, 724356, 1063805, 982085, 573965, 320195, 78920, -581447, -1370871, -1536533]
39985a536533N87834P88463N49624J20108n79143j214080r27545L13179J226623
39976f71470Q59911j08170m71577j20904K44442L24557K75849J00864k03040k96970
39966f6508M789K77507J21277j59767q4244K22572L38284K37078J27114l1886
39956I86216l29757n58875n15417l24059j15673K16533O20619P20228L84722j7064
39946A067473k28384m16102n89458l78512K31678O37320N22031L33292L93189
39937A572527K84065l01997q22332o79765j75126J426k52218n41874n68437j78995
39927a662726O10597J249218R92181J9632n74701l37097m6947k37651k68904L23395
39917F6997P18678J55909o24568n52689L158J6267l35037p2670P39876J031306
$$ y = [-1536533, -948699, -160236, 389388, 509496, -69647, -1283727, -2211272, -1898093, -671470, 188441, 80271, -391306, -512210, -267768, 56789, 332638, 433502, 230462, -66508, -61719, 215788, 337065, 177298, 93054, 315626, 653910, 890988, 1018102, 986216, 656459, 97584, -417833, -741892, -857565, -641032, -20413, 699815, 1084537, 1067473, 839089, 422987, -166471, -544983, -313305, 324015, 846046, 1179338, 1572527, 1856592, 1554595, 732263, 52498, -122628, -121202, -373420, -915294, -1483731, -1662726, -1052129, 197089, 1189270, 1208902, 634201, 297104, 250157, 12506, -256398, 66997, 785675, 941584, 317016, -235673, -232515, -216248, -551285, -623955, 115921, 1147227]
39907A147227M30733l34433o64073o13278l20506Q1256J54588k87151n70439o2007
39897a038083O79324P02924K16720J34621M24402K59014l72915o09556k55016
39888A41435l6914k50429m22432m28096o53638q85468l62106P65223J298540P33799
39878a00086l6954k12672j28838k72306l38442L0536M53699M81917L65293M89628
39868G31775O18748L12547l24363q06066q60856n59911j74404n5417k74322l55425
39858a747694J37570P92980P86364J21251l31759j23595K55917L20293K12966
39849D24293J14626j67634o25190p58030l01828K92015M68365K08141j85097m66549
39839i96888m40046o2095L08494K68807K7643J13135M24996L24286k44847n55236
$$ y = [1147227, 1577960, 1243527, 579454, -33824, -354330, -273074, -118486, -405637, -976076, -1038083, -358759, 344165, 560885, 695506, 1119908, 1378922, 1006007, 396451, 141435, 104521, -145908, -568340, -996436, -1650074, -2535542, -2897648, -2132425, -833885, -100086, -137040, -349712, -478550, -750856, -1089298, -1058762, -605063, -123146, 242147, 731775, 1350523, 1663070, 1338707, 532641, -328215, -888126, -1062530, -1117947, -1392269, -1747694, -1610124, -817144, -30780, 90471, -241288, -364883, -108966, 211327, 424293, 538919, 371285, -253905, -1011935, -1313763, -1021748, -553383, -345242, -530339, -996888, -1436934, -1499029, -1190535, -921728, -894085, -780950, -355954, -31668, -276515, -831751]
39829h31751k47610J27737N7748j80610j23398J39347K34171L6710l60599p68840
39819a917095q20291k71351M85932P63344N11437L07354L63399K79542r5135l35413
39809g28277j94044M1444J60513K86184L36892%n34846o00088p0073M06436M37448
39798d58411L49881L66400J94203k10378l32287L908K20848o0040l95816l24635
39788f46327r2617r1418j89960q4999K04801N21647P35188N74110p8220o61036
39778A91169m98795Q8423J99557j04178J14366Q79406J030050J78406n38989l62074
39768A177341r9978m94260p97159j97667N35929K53087o24311p68926L5350Q37816
39758a42778J025302P41607K21309k60482j88425M88952Q98530L72614m88604
$$ y = [-831751, -1079361, -951624, -893876, -1074486, -1197884, -1058537, -824366, -787656, -1148255, -1917095, -2737386, -3008737, -2522805, -1759461, -1248024, -940670, -577271, -297729, -392864, -728277, -922321, -880877, -720364, -434180, -97288, -97288, -632134, -1232222, -1302295, -895859, -458411, -108530, 257870, 452073, 241695, -90592, -86684, 134164, 74124, -321692, -646327, -738944, -830362, -1020322, -1105321, -900520, -378873, 356315, 930425, 852205, 191169, -307626, -219203, -19646, -123824, -9458, 869948, 1899998, 2078404, 1539415, 1177341, 1077363, 583103, -214056, -411723, 124206, 377293, -247018, -1015944, -980594, -142778, 882524, 1624131, 1845440, 1584958, 1396533, 1885485, 2784015, 3156629, 2668025]
39749B668025p71121o19735o49855o70869j97930L26146J32815m33143l82480
39740e98147K56699N04183J3285n83229q10712p31447l08703M84243J009781N77755
39730a86292k88967l46851N13633J016716L28505q49077j302204o30980O46224
39721a099293J596732J396567J00954j049194q54386K91142Q92905L93559k58873
39712A410113k19809J30856R7780k05026k52326j5688J36463Q7364M0184J40065
39702A349976L31604M44830K79993k08825p37714q99225o00719j54742M7801j38228
39692b85249m78266m72526J22397P89031O92721j81476q74198p37366k47005q4135
39682a756072r7944J56001M87794N07227M56890P09353Q67256L35255n30558q38750
$$ y = [2668025, 1896904, 1277169, 627314, -43555, -241485, 84661, 217476, -215667, -598147, -341448, 162735, 176020, -407209, -1217921, -1949368, -2258071, -1773828, -764047, -186292, -475259, -822110, -308477, 708239, 1036744, 187667, -1114537, -1745517, -1099293, 497439, 1894006, 1994960, 945766, 91380, 382522, 1275427, 1668986, 1410113, 1190304, 1321160, 1418940, 1213914, 961588, 945900, 1082363, 1169727, 1209911, 1349976, 1681580, 2126410, 2406403, 2197578, 1459864, 560639, -40080, -194822, -147021, -285249, -763515, -1236041, -1113644, -324613, 368108, 186632, -687566, -1424932, -1671937, -1756072, -1854016, -1698015, -1210221, -702994, -246104, 463249, 1330505, 1665760, 1135202, 296452]
39672B96452n16197k76716l89957m50246k94573j98197j53539J50870N90150O72681
39662e69272L92223K23958K50470Q9381k63581l20588N3615L98503L85130J72091
39652H11930l4662k24805l85459n39926q31715j084472o49328O13026J621487
39643g03924J275787N9703n86429k73477Q5494o8461k58525q7958J06566L9439
39633d11785k8424Q0539J09725p6283k43838k58953k06348l8582K59539K98025
39623e16385j65718n10417n986R03557J115508N29411M5224k3398k50475p21138
39613D00183o96604Q301N16445K07962m43932p28660n00242R4811P57555P91871
39603D07690k15760j360519j233667Q6127J099559J057406O27848K24344n95348
$$ y = [296452, -219745, -496461, -886418, -1336664, -1631237, -1829434, -1982973, -1832103, -1241953, -569272, -177049, 46909, 297379, 386760, 123179, -197409, -143794, 254709, 639839, 811930, 777268, 552463, 167004, -372922, -1204637, -2289109, -2938437, -2325411, -703924, 571863, 631566, 45137, -228340, -142846, -211307, -469832, -557790, -451224, -411785, -440209, -359670, -249945, -326228, -570066, -829019, -1035367, -1073949, -814410, -516385, -682103, -1192520, -1198506, -294949, 820559, 1349970, 1395194, 1371796, 1121321, 400183, -296421, -288120, 228325, 436287, -7645, -736305, -1236547, -1141736, -384181, 407690, 191930, -1168589, -2402256, -2316129, -1216570, -159164, 468684, 693028, 97680]
39594I7680j556853j356435J28306J018294Q7877j222885r29731N55769J271895
39585a906083O75440L1631J88113N48734L61868j62688l48620K1874N43185O71330
39575F24784L25349l01L6762j9161o99369j414811j014890L64999J202058O86510
39565I1930k63147n85932m69746m77654m39563n9228L45295N06506P07162R37452
39555B93075N91329k73941n35308K65224R66073N69217j94924k35271J00694q9579
39545A456589n72016n52306j16125K18796N70388J029631Q46604l03708j162001
39536A415852n73433N11150M46483m53696n83130J96269N02197j08176o18093
39527G35423m85942k65795k01876Q8306M18634J75389k56512J06517R23970Q16320
$$ y = [97680, -1459173, -2815608, -2687302, -1669008, -1581131, -2804016, -3733747, -3177978, -1906083, -1230643, -1199012, -1010899, -462165, -100297, -262985, -611605, -589731, -46546, 624784, 950133, 949832, 986594, 967433, 268064, -1146747, -2161637, -1796638, -594580, 91930, -171217, -757149, -1226895, -1704549, -2144112, -2203340, -1858045, -1351539, -644377, 293075, 884404, 610463, 75155, 340379, 1306452, 1875669, 1680745, 1445474, 1546168, 1456589, 884573, 332267, 216142, 434938, 1005326, 2034957, 2881561, 2577853, 1415852, 842419, 1353569, 1800052, 1346356, 763226, 959495, 1461692, 1353516, 735423, 249481, -16314, -218190, -129884, 288750, 464139, 207627, 314144, 1238114, 2054434]
39517B054434k17115o12313P6147L36035o38400j398018n96038P41072Q19201
39508E65005k34046q71935n55429j45205k27435l91078j72053K63050N20749M67103
39498g81274K15596l1400j36860j79384l06001l99932k00818K26430N41469O40284
39488d11890O41983M28436j67094p31902o06070O0035L97376J45310R769M00459
39478A66412P38569N13202J56244J97742K85688j49381p78123p77603r5061M47669
39468G05358K52907m11101q72424p59973k25952K69367L70640J38454q5921j04038
39458g22683K0054K04161M18844N24346L62049L2832k04769k77382k38936j4040
39448A04476L83432N42391J06497n80449q58314o51841l51146O781N92378R65537
$$ y = [2054434, 1837319, 1225006, 1301153, 1637188, 998788, -399230, -995268, -254196, 565005, 330959, -540976, -1096405, -1241610, -1469045, -1860123, -2032176, -1769126, -1248377, -781274, -565678, -597078, -733938, -913322, -1219323, -1619255, -1820073, -1593643, -1052174, -411890, 230093, 658529, 491435, -240467, -846537, -786502, -389126, -243816, -234047, 166412, 904981, 1418183, 1574427, 1772169, 2057857, 1908476, 1130353, 352750, 257689, 705358, 958265, 547164, -325260, -1085233, -1311185, -1041818, -671178, -532724, -618645, -722683, -702629, -498468, -79624, 444722, 806771, 839603, 634834, 357452, 118516, 104476, 487908, 1030299, 1136796, 556347, -301967, -953808, -1304954, -1298173, -705795, 259742]
39438B59742M75144m64971o80559p7719R4879o62756j095291j81332J085835J164671
39428h2357K88567j50555O9238o2175p16442p99185J04770Q78509O45948J60045
39418C36363M65271J084515P25766o40700j605826j239908k05804L31689J56462
39409e92172j01130j1706K65248M18671L27026K7748k78294k30917L14983R06016
39399A045473Q53875Q9717o69036p68779l61005q9231k66915o35693q15026p02548
39389b319168m03602J7668N39749R53964Q61758J74132m63036k18150P61662J259982
39379A164959N08372o92993j036395m80128p1051k38463l49442o427L30469L18174
39369e52925L05195M90403M27543j14547o19315o64053n12445l93749l7357N58883
$$ y = [259742, 734886, 269915, -410644, -488363, -393484, -1056240, -2151531, -2332863, -1247028, -82357, 206210, 55655, 124893, 62718, -653724, -1452909, -1348139, -469630, 176318, 336363, 801634, 1886149, 2611915, 1971215, 365389, -874519, -1080323, -748634, -592172, -693302, -705008, -439760, -21089, 305937, 333685, 55391, -175526, 139457, 1045473, 1899348, 1989065, 1320029, 551250, 190245, 101014, -165901, -801594, -1616620, -2319168, -2722770, -2705102, -2165353, -1211389, -349631, -175499, -638535, -856685, -95023, 1164959, 1673331, 980338, -56057, -536185, -607236, -845699, -1195141, -1201568, -871099, -552925, -247730, 242673, 670216, 555669, -63646, -727699, -1240144, -1633893, -1671250, -1112367]
39359a112367P94071M74688K33340L44715J78202m54697n95192K54471R91377
39350A108608N61685l50002o11831n44852r65473j303246n14558Q01063J108106
39341g10500L38150k51612k65846l30544l59524K95944J058790O20451o30822
39332b35513q33053L24044R70067R8797q92452o69716K2392O6735n8348M79191
39322g27856J060246O84480j51809k31931L89796O24177J66871k17681p0057J75959
39312A702195J7262m38201p12317n13647o3300P4471k76753m87119J2917O43058
39302d1434L51022o72303j090097m20814K79306J67229j59395J37586P47951Q35105
39292A34156K78602m13999q10655o50380J03467Q87041R21035K87381j78495k60137
$$ y = [-1112367, -318296, 156392, 389732, 734447, 912649, 457952, -137240, 117231, 1108608, 1670293, 1320291, 708460, 163608, -801865, -2105111, -2619669, -1818606, -710500, -372350, -623962, -889808, -1220352, -1579876, -1283932, -225142, 395309, -235513, -1068566, -744522, 225545, 324342, -568110, -1237826, -1215434, -1148699, -1207047, -727856, 332390, 1016870, 865061, 633130, 1022926, 1647103, 1813974, 1596293, 1526236, 1702195, 1719457, 1281256, 568939, 55292, -8008, 66463, -210290, -697409, -684492, -41434, 309588, -362715, -1452812, -1873626, -1594320, -1427091, -1586486, -1448900, -700949, 134156, 412758, -1241, -811896, -1462276, -1358809, -471768, 449267, 736648, 558153, 298016]
39282B98016n64326j101208r65755O0694R28794R97672R28013J123813P69106
39273B474819m95250j375717q10808J78265J19117m53952J900J251785J466413
39264B356572Q2122j282563j094949K14012J093793P12409m47272j269922j026968
39255f62766j7597P61599P15989J79793k63253m68772m86810k46215J23199K32244
39245a32589P0078Q9131L35830K50514k95082o19136l51146l7915j16592k22903
39235a029810p5101l6301j94697O093N33659M03175n92147j102078k76091O89146
39225a674152M08890m55180l93049M68724P87313K63412j93717j73705j16071
39216a077535j82809q6986J32545K18575K73470L56220P1510n53473o09371K24703
$$ y = [298016, -266310, -1367518, -2333273, -2272579, -1343785, -346113, 581900, 1705713, 2474819, 1979569, 603852, -206956, -28691, 90426, -363526, -361626, 890159, 2356572, 2438694, 1156131, 61182, 275194, 1368987, 2081396, 1634124, 364202, -662766, -680363, 81236, 797225, 977018, 713765, 244993, -241817, -488032, -364833, -132589, -62511, 26620, 362450, 612964, 317882, -301254, -652400, -690315, -806907, -1029810, -1104911, -1141212, -1335909, -1329816, -796157, -392982, -985129, -2087207, -2363298, -1674152, -1265262, -1720442, -2113491, -1644767, -857454, -594042, -787759, -961464, -1077535, -1260344, -1347330, -1214785, -996210, -722740, -366520, -295010, -848483, -1457854, -1233151]
39206a233151P39378J3305q85333n72486L29068L96104j9111L96718J217583Q33606
39196A215681n62533j032616p5519O20761N7344o53374m49883P4816J30360R4977
39186e79986M36636O61783L02063j76254k61104j93888k19215k5356M52151O27936
39176A024766K57383p8679j6534k3277m17064o68777l06219K50456L78080J58137
39166E58272N2220J67858K84002K28141k2874k82494j78553L38136O65659L13874
39156B124241k43108k28358J71093J07064n35984j037622j031932p96791m33648
39147a905045J91002P27205O47628K64560L44616P30957N51177j57964l57380
39138A036756K21280N22794j44034j008872j022291k51302M59854N62551J39438
$$ y = [-1233151, -493773, -480468, -1365801, -1938287, -1609219, -1213115, -1232226, -835508, 382075, 1215681, 653148, -379468, -454987, 165774, 223118, -430256, -880139, -805323, -674963, -579986, -143350, 518433, 820496, 644242, 383138, 189250, -29965, -55321, 396830, 1024766, 1282149, 1203470, 1186936, 1163659, 746595, 77818, -228401, 22055, 400135, 558272, 610492, 778350, 1062352, 1290493, 1267619, 985125, 806572, 1144708, 1810367, 2124241, 1881133, 1652775, 1823868, 1930932, 1394948, 357326, -674606, -1471397, -1905045, -1714043, -986838, -339210, -74650, 269966, 1000923, 1552100, 1394136, 1036756, 1258036, 1780830, 1636796, 627924, -394367, -645669, -185815, 376736, 516174]
39129E16174l09516k32859L51008O83370K76354k32869m7396L87213N3510q69343
39119E75646j191250n54285J92327M43769M10691K28638k35754o26225l72022
39110a128465K25856L66812J48145L16139P44263O01374k7939k41283l2120k59632
39100G13150q36089p01745J79601O00967K17608M8233M45914M52843k28619n11143
39090C80720O5407M19843q6713n14294j78263J00381k99692m99286J88037P76130
39080C52270K56898n65803m05630L89834N61843j4191m39303l92543l33205m34110
39070a023940l70062j7092L45275L99566K4234n47607p26875k23424L97083N05287
39060a237555M54650Q26694J059183K78980q21320p50533K44865M62138l28090
$$ y = [516174, 206658, -26201, 324807, 1008177, 1284531, 1051662, 1004266, 1391479, 1444989, 575646, -615604, -1169889, -977562, -533793, -123102, 105536, -130218, -756443, -1128465, -902609, -535797, -387652, -71513, 672750, 1274124, 1246185, 1004902, 972782, 713150, -122939, -824684, -645083, -44116, 173492, 221725, 667639, 1120482, 891863, 380720, 446127, 865970, 779257, 264963, 86700, 187081, -112611, -611897, -423860, 352270, 609168, 43365, -362265, 27569, 589412, 575221, 135918, -256625, -589830, -1023940, -1394002, -1411094, -1065819, -666253, -642019, -1189626, -1916501, -2139925, -1742842, -1237555, -782905, 43789, 1102972, 1381952, 560632, -189901, 54964, 517102, 189012]
39051A89012n17608L50765O79588k52778q74665o2680R18275O75114j04846k65279
39041G34898j79562n05880o05574J13530P45460L92880k40645k50543r4189k87558
39031a77183q5902R25925J474642N85699n46012n08197l9996m61438j122666o45385
39021f00513M15188M81508k66324k88203O42798J251943R49685L83865K8756k19341
39011B779362k88906r8318j07451n78740q65783m81821o5016k09907l47793N2655
39001b11718L38215m799j84764L21915M71527m33889j054003j74474R00411L55157
38991C23578j016639j130864q192O60558M92794L99494K93107n43907j286404
38982a816475m59024J216267J499454J50042p91012m00455k0629n50142r77035
$$ y = [189012, -328596, 22169, 701757, 448979, -425686, -488366, 429909, 1105023, 1000177, 734898, 555336, 49456, -556118, -442588, 302872, 695752, 455107, 204564, 110375, -177183, -263085, 662840, 2137482, 2723181, 2177169, 1668972, 1628976, 1167538, 44872, -600513, -185325, 296183, 29859, -258344, 384454, 1636397, 2586082, 2969947, 2998703, 2779362, 2490456, 2392138, 2284687, 1705947, 840164, 358343, 293327, 83420, -264373, -211718, 126497, 121698, -63066, 258849, 730376, 296487, -757516, -931990, -31579, 323578, -693061, -1823925, -1832117, -1171559, -678765, -279271, 13836, -530071, -1816475, -2275499, -1059232, 440222, 590264, -200748, -601203, -621832, -1171974, -2149009]
38973b149009m33286K81694K15257k12752j32896L96670O80707L72126k39141
38964a220630n12534p8052N17023L16969m86268m96683O96918J559615Q96800
38955A193158k84260n64511l38706n95384q68698l35855L02153R2514k15064L61000
38945a253653Q49112R676r83429k65542J260056J126529o18897j524008o81092
38936b081248L11971L68922J89016K81767J58255j89715j22853J51567j52722
38927a085040o78078l76151N04898Q09949N41660N86899Q27401N44489J41514
38918A817541L43528L80602p31058j859568j204885O63045J794471K042273K447050
38909E692999K369049M82742j999393k509128j189845m60159q61769p95721j11346
$$ y = [-2149009, -2582295, -2300601, -2085344, -2298096, -2430992, -2034322, -1353615, -981489, -1220630, -1733164, -1811216, -1294193, -977224, -1463492, -1960175, -1263257, 296358, 1193158, 908898, 344387, 5681, -589703, -1458401, -1794256, -1492103, -1399589, -1614653, -1253653, -404541, -394865, -1378294, -1643836, -383780, 742749, 123852, -1400156, -2081248, -1769277, -1400355, -1211339, -929572, -771317, -961032, -1083885, -932318, -1085040, -1763118, -2139269, -1634371, -824422, -282762, 304137, 1131538, 1676027, 1817541, 2161069, 2541671, 1810613, -48955, -1253840, -590795, 1203676, 3245949, 5692999, 8062048, 8544790, 6545397, 4036269, 2846424, 2386265, 1524496, 728775, 617429]
38900F17429k85264j066297o49329O91498Q42130j45247j09973R48377P10858
38891A554182r07938j256732K29946R42306r7563n63072O42240J308962J24445
38882A976776r24824l03374M90681Q5586l58843J23695L46147l50193n17339M48493
38872A016805Q03082k91482j032375k96226L48913k13489n62075K67232P27411
38863G67796k41331j048760l77302M77847K26719j23562M13796P95176K04580
38854A094959j83024M49907Q76526J74913o41476q03194j063908j505998q23650
38845b424945R02684J583882N49983l30511q7461m5339o94859n86647M72612O60137
38835d64k58077k56797R13897R98335l41980o55606N42860P19459o51246q85046
$$ y = [617429, 332165, -734132, -1383461, -691963, 150167, 4920, -105053, 843324, 1554182, 646244, -610488, -380542, 561764, 464201, -98871, 543369, 1852331, 1976776, 1051952, 748578, 1239259, 1324845, 966002, 1089697, 1435844, 1085651, 568312, 1016805, 1819887, 1528405, 496030, 199804, 548717, 335228, -226847, 40385, 767796, 526465, -522295, -899597, -421750, -195031, -318593, 95203, 890379, 1094959, 911935, 1361842, 2238368, 2413281, 1771805, 968611, -95297, -1601295, -2424945, -1522261, 61621, 611604, 281093, 193632, 148293, -546566, -1133213, -660601, -464, -258541, -515338, 398559, 1396894, 1054914, 399308, 942168, 1661627, 1010381, 125335]
38825A25335N93063R01524o47513j026964M89554O28097j368689j712768Q01306
38816a217055K068517J68085j027426P02092J656984m69845j825305L35940K234718
38807B626705N35290j650274j000881Q5183q15099r52708J494831K676972K49020
38798C249039j425554P09167K264156k49466k371177j01924K205440J00980k395081
38789A985580o80289J618579K74408j013162J336990K624972p22451k637368J342333
38780D129592M130581o0667l499609J321947O827496M106321m9066L349102P099579
38771B7355276K103687k725833L122481R064076L035639j035543J2654068K5952900
38763G9526751J7314921J5206703O3258572J30056331J21247980Q938600j10694155
$$ y = [125335, 718398, 1619922, 972409, -54555, 434999, 1063096, -305593, -2018361, -1217055, 851462, 1019547, -7879, 694213, 2351197, 1881352, 56047, 391987, 2626705, 3161995, 1511721, 510840, 596023, -219076, -1171784, 323047, 3000019, 3249039, 1823485, 2532652, 4796808, 4547342, 2176165, 2074241, 4279681, 4380661, 1985580, 1305291, 2923870, 3198278, 2185116, 3522106, 6147078, 5424627, 2787259, 4129592, 8260173, 8199506, 4699897, 6021844, 12849340, 16955661, 16906595, 20255697, 27355276, 29458963, 26733130, 29855611, 38919687, 41955326, 40919783, 53573851, 79526751, 96841672, 112048375, 175306947, 305363278, 426611258, 435549858, 324855703]
38756C24855703j33165136p2756051k1759993j9679152k7364808j3517819K095073
38749C8707817j364990r123463m015833L545476l9737o525639m485415j35016
38741A6563200k298232n241589j830378J998379m09049l438372q71226K020835
38733F493568n58583l415320p00400K731651P51016k700219j635349J106097M13663
38724B486124j385846k24694J362536j19870j701545R8688K116705O19367j492830
38715A758635m90783J093743r0967j508699j00933J338944k46687j796862K4220
38706a9389K045635M40589j862317o16631J761884Q53003j509184r47502J284782
38697A430870J109779o29578l46509J095930K92361j826607j650172L54672P61812
$$ y = [324855703, 191690567, 118934516, 97174523, 77495371, 50130563, 36612744, 38707817, 37342827, 28219364, 24203531, 27749007, 27709270, 21183631, 16698216, 16563200, 14264968, 9023379, 7193001, 9191380, 8782331, 5343959, 4472733, 6493568, 5934985, 2519665, 1819265, 4550916, 5301932, 2601713, 966364, 2072461, 2486124, 1100278, 875584, 2238120, 2118250, 416705, 515393, 2632098, 3251465, 1758635, 1267852, 2361595, 2270628, 761929, 660996, 1999940, 1753253, -43609, -19389, 2026246, 2466835, 604518, -12113, 1749771, 2602774, 1093590, 146088, 1430870, 2540649, 1911071, 1564562, 2660492, 2952853, 1126246, -523926, -169254, 592558]
38688E92558m28547l76078Q96480Q98419k81772m18317L31951N4389p99143l55644
38678A14296O81557K43480r89653p79303M80095O91498M195K8430L67978k97756
38668E44817r89724o1794J264818P72134o58357o04833N19958M89412n11317n28660
38658B36454K88033K06340n66642m50658K69944J76018k59317K97968J033809
38649A231949L48382q97342q58731j81996n17478r39344L45600K010631J452176
38640A993847m22019n65018Q07002O91863j165627j819446m01406N87198p0176
38631c63782m98166L98131J010462K73190m34862j2003N30856K47392j43709L4030
38621A041539K30691J10155K31821N83659K91699o24164r63539k89438M48306
$$ y = [592558, 164011, -212067, 684413, 1582832, 1301060, 882743, 1214694, 1269083, 469940, 114296, 795853, 1039333, 49680, -729623, -249528, 441970, 446165, 474595, 842573, 544817, -444907, -506701, 758117, 1530251, 871894, 267061, 787019, 1276431, 765114, 236454, 524487, 730827, 164185, -286473, -16529, 159489, -99828, 198140, 1231949, 1580331, 682989, -175742, -357738, -875216, -1814560, -1468960, 541671, 1993847, 1571828, 1006810, 1813812, 2505675, 1340048, -479398, -880804, -293606, -363782, -861948, -463817, 546645, 819835, 384973, 372970, 903826, 1151218, 1007509, 1041539, 1272230, 1382385, 1614206, 2197865, 2489564, 1865400, 901861, 612423, 1060729]
38612A060729N32915K55639K2034N8472P08262J600114J237849q54394k545766
38603B075854j799241O5964L61614o96208p19812N32453R61971P5410l36454K56788
38593G78339K68933o90841q79998K66968R04524K5283q10877l17866M46787K73330
38583B64582j82615l9909J45892j85834l02570K54135M40840m87044j384217r20710
38573b397450K82954O86226J36522k19421J72318O27480L65462m04808o81706
38564a432423J04314J127818R65935l78316j199889n29253L81688K11289j67427
38555i16264N91320J548149Q58232q78737j352841l00954K70339l25602n09132
38546a015490M05341Q68214r8164j152205r18799m6818K52390Q2340J32385M26446
$$ y = [1060729, 1593644, 1849283, 1871317, 1929789, 2638051, 4238165, 5476014, 4621620, 2075854, 276613, 342577, 704191, 7983, -711829, -179376, 782595, 858005, 521551, 778339, 1047272, 356431, -523567, -256599, 647925, 673208, -137669, -455535, -8748, 264582, 81967, 42058, 187950, 2116, -300454, -46319, 394521, -92523, -1476740, -2397450, -2114496, -1428270, -1291748, -1511169, -1338851, -711371, -345909, -750717, -1432423, -1328109, -200291, 765644, 387328, -812561, -1341814, -960126, -748837, -916264, -324944, 1223205, 2081437, 1202700, -150141, -451095, -180756, -506358, -1015490, -610149, 258065, 159901, -992304, -1911103, -1957921, -1705531, -1623191, -1490806, -1064360]
38536a064360P29204J017387R42242R2515q15185n10820O78510R48336k03107
38527A814722j120605o26507K88646L30869j96230m07848l28870l22309k29944
38518g98076K3734O1350n0457K98745R54016R35214J86569j48285K06519K5514
38508A694843j153006j880167j049823K95680P26194N72766Q54047J247856P50622
38499B059012m17065j075441q27779l28161j09281j03818j03662J5005L01173
38490e90017N27408L41030j05449k05835J79053M79578L12387n9747l29515m74401
38480G4492l76118Q8556N18039M10443R7166K78557P17841N52578j60034n18031
38470A683489l85147m93374q71635p33446j31298r0525p45392r69768l03231L77280
$$ y = [-1064360, -335156, 682231, 1624473, 1716988, 901803, 390983, 1069493, 2017829, 1814722, 694117, 67610, 356256, 687125, 490895, 83047, -245823, -568132, -798076, -774342, -712992, -763449, -464704, 489312, 1424526, 1611095, 1462810, 1669329, 1694843, 541837, -1338330, -2388153, -2092473, -1366279, -793513, 60534, 1308390, 2059012, 1641947, 566506, -261273, -589434, -698715, -802533, -906195, -891190, -590017, -62609, 278421, 172972, -32863, 146190, 625768, 938155, 878408, 548893, 74492, -301626, -213070, 304969, 715412, 812578, 1091135, 1808976, 2361554, 2201520, 1683489, 1298342, 804968, -66667, -800113, -931411, -1021936, -1767328, -2737096, -3040327, -2663047]
38460b663047N78299Q80021J332900R57326l41805j076777l86992N92932O00380
38451D73237L4533j85835j85391m00499m70742p936M88876M52081J11603j74590
38441A35337m99651p50072m68671J21658J85617k02404m1645O55503O23063l45726
38431e86991p54373M0503O10090l2776o65327p8042P64537N16036k00427j15886
38421e02656L53496N4589o86258p16895j21981J47962M7472K00619M71383K73346
38411d78923j93231l27894k17573j89017L5356N95538P17404r2858q81838n51638
38401a584674M28806Q65714O17798K66400j88269r32079j328188o94519M00144
38392b148867Q15975L76129k22839m49996j04604P52848J321408N97346q57361
$$ y = [-2663047, -2084748, -1204727, 128173, 1085499, 743694, -333083, -720075, -127143, 473237, 507770, 321935, 136544, -263955, -734697, -742633, -253757, 198324, 309927, 135337, -364314, -1114386, -1583057, -1461399, -1275782, -1478186, -1519831, -864328, -241265, -586991, -1341364, -1300861, -690771, -723547, -1388874, -1466916, -702379, -186343, -386770, -502656, -149160, -94571, -780829, -1497724, -1619705, -1471743, -1424271, -1223652, -752269, -478923, -672154, -1000048, -1217621, -1406638, -1371282, -775744, -58340, -151198, -1033036, -1584674, -1155868, -290154, 327644, 594044, 405775, -526304, -1854492, -2549011, -2148867, -1332892, -956763, -1179602, -1629598, -1734202, -981354, 340054, 937400, 80039]
38383H0039j090840L34207J286336K52472j199842r47120L55320O69403k6636
38374b86661j85099L77692M72967n6521k38886K516j78530p32959p58484j99918
38364a783883J79629K69391M79203N54959J09294k02888L16306Q74002M02610
38355A198623m14484k54285M55065L78423j94914q497N53185P4459j030949r74511
38345b17885J75359M84809m29531p73146J22505O18251k17617r39301k67471Q49430
38335e94597J028040N21906K28661J12683k06228n00505n27217n30546n12705
38326i80508r3666M82277M45080p1368r7465L86012L15719m50192p50138k46384
38316a060633p5345o56650p48371L23610J285007R67248J51682M9407L52490K09760
$$ y = [80039, -1010801, -676594, 609742, 862214, -337628, -1284748, -929428, -260025, -286661, -471760, -94068, 378899, 322378, 83492, 86008, -92522, -825481, -1583965, -1783883, -1604254, -1334863, -855660, -300701, -191407, -394295, -77989, 796013, 1198623, 784139, 529854, 984919, 1363342, 1168428, 1159931, 1713116, 1787575, 756626, -217885, -42526, 442283, 12752, -760394, -637889, -19638, -237255, -1176556, -1444027, -594597, 433443, 955349, 1184010, 1296693, 1090465, 589960, 62743, -467803, -980508, -1074174, -591897, -146817, -218185, -315650, 70362, 386081, -64111, -814249, -1060633, -1135978, -1792628, -2540999, -2217389, -932382, 34866, 186548, 235955, 588445, 798205]
38306G98205o3319K56480P43900M74200l80202q45227o05992j72706L6068l1459
38296B09948l45350p16154p66590m05288N3062M32171P97272R48737N90500O6113
38286H64421O306J88112j79708r56699j103797m00470K13252K92275M53400Q86762
38276B63854Q10542J0881n29718k58294O5401j48233l15344L2518K89911k480
38266B19038k27768J14792M67969L29470J29760J74069m9726o52727p43671J6620
38256b22174N84180K53704j59007M4808O4308q14815j598928j081569J55566P75211
38246a998716P40047Q15027R23006N60626Q6348P1768N8722n66309j142470o86450
38236a138401L29897O52649J74568k46601l71508n30694n02201P4155O11925L96849
$$ y = [798205, 734886, 991366, 1735266, 2209466, 1829264, 984037, 378045, 205339, 241407, 209948, -135402, -851556, -1618146, -2023434, -1970372, -1538201, -740929, 207808, 798308, 864421, 870727, 1058839, 879131, -77568, -1181365, -1581835, -1368583, -1076308, -622908, 263854, 1074396, 1085277, 555559, 297265, 362666, 214433, -100911, -68393, 221518, 219038, -8730, 106062, 574031, 903501, 1033261, 1207330, 1157604, 504877, -238794, -222174, 362006, 615710, 456703, 501511, 565819, -248996, -1847924, -2929493, -2773927, -1998716, -1258669, -443642, 479364, 1039990, 1126338, 1198106, 1256828, 690519, -451951, -1138401, -808504, -155855, 18713, -227888, -599396, -1130090, -1632291, -1558136, -946211, -549362]
38226e49362L9201N30500J253862P04137r30342j696814o27633R76803J433358
38217A133710O29027l30385m85178K73880J144336R68802m82205j897312j814412
38208h59737m16539Q12349R24760J96227o44823r72785m29129N58110Q50605R0607
38198A09645n14675M2897Q32226M31291o46969p81208M895J67430o07273r11692
38188a873433j40092N53506M03501K46120P54456J132908N82023l14027o70939
38179F74023n82386l81746J87948J039476J099935j90289j618386j672451o02133
38170b046009J84691K21690K19871N35578O73424L30982j01610k67849k91439
38161e40671l01826j43795K05453M11061K44867k0430O5874N24688Q31727M63474
$$ y = [-549362, -510161, 20339, 1274201, 1978338, 1047996, -648818, -1276451, -299648, 1133710, 1762737, 1432352, 947174, 1221054, 2365390, 3334192, 2851987, 954675, -859737, -1276276, -463927, 460833, 657060, 12237, -960548, -1389677, -831567, 19038, 109645, -405030, -362133, 470093, 901384, 254415, -526793, -521898, -354468, -961741, -1873433, -2013525, -1460019, -1056518, -810398, -55942, 1076966, 1658989, 1344962, 674023, 91637, -290109, -102161, 937315, 2037250, 1846961, 228575, -1443876, -2046009, -1861318, -1639628, -1419757, -884179, -210755, 120227, 18617, -249232, -540671, -842497, -986292, -780839, -369778, -124911, -145341, -79467, 445221, 1276948, 1740422]
38151A740422m46565j112792r14925j19713M58334M27676R8144j51605k92387
38142c13411l45726j95566O3093N7317k61959l69322Q9048O52673O22759L0811
38132B9717m81491n96272n64494n33570k54210L14908O56430L93801k8570N7870
38122a005881M65452L77851k97820o11757R670P68353O26527j10364k83014L21767
38112B60784P22916L34013k46022l29163r2969K1132O2687J71496R8119k76859
38102G26134n05195k44558J18230R2644j10567K7790N12735R18856R53450N35311
38092C024830k54344r27602q49125j65624J49377l35837q11884m97997J60458
38083e07748L36621J27276R7956J79296L5943j9260M32105R02773O37754r9408
$$ y = [1740422, 1293857, 181065, -733860, -853573, -395239, 32437, 130581, -21024, -313411, -659137, -854703, -791610, -734293, -996252, -1365574, -1276526, -623853, -1094, 29717, -451774, -1048046, -1612540, -2146110, -2400320, -2085412, -1428982, -1035181, -1063751, -1005881, -540429, -162578, -460398, -1072155, -1062485, -294132, 332395, 222031, -60983, 260784, 983700, 1317713, 1071691, 742528, 649559, 670691, 733378, 904874, 1002993, 726134, 220939, -23619, 94611, 187255, 76688, 104478, 617213, 1536069, 2489519, 3024830, 2770486, 1842884, 993759, 828135, 977512, 641675, -170209, -668206, -507748, -171127, -43851, 54105, 233401, 269344, 250084, 682189, 1584962, 2222716, 2123308]
38073B123308m82907n26024q43256j263407r53553J01083R11985Q65885K92277
38064B25391l47876q38421p95859M2607J025560J090747J96721o51511q41679
38055h94320o57308l32555K97765J020653J157462N57361j61566n41390o39738
38046a93636m29223J82329O70705L28150m51833m62116M59951J029561M20803
38037A554691n35795o82650j19433K41445j3612n72727r50261p93253j03578N55263
38027a419910N66054J02324j23607N3956K08553L14004P39208J160815O94618
38018B296015n48085j238079o83527K01260L74266M1178j27259j27697j82426
38009E646o4498L17157M38775L1462l24866k01010j04239m74230p14457j58368
$$ y = [2123308, 1640401, 1114377, 271121, -992286, -1945839, -1844756, -932771, -66886, 225391, -122485, -960906, -1756765, -1714158, -688598, 402149, 598870, -52641, -894320, -1551628, -1884183, -1586418, -565765, 591697, 1149058, 987492, 446102, -193636, -622859, -440530, 230175, 558325, 106492, -355624, 104327, 1133888, 1554691, 1018896, 336246, 216813, 458258, 444646, -128081, -1078342, -1871595, -1975173, -1419910, -853856, -751532, -875139, -821183, -612630, -298626, 440582, 1601397, 2296015, 1747930, 509851, -173676, 27584, 401850, 443028, 315769, 188072, 5646, -58852, 258305, 697080, 728542, 403676, 202666, 98427, -375803, -1090260, -1248628]
37999a248628O95387R02215M83540J75103K07780K26482P0159j42172l71324m79482
37989E19060j43133M77693N95495k5912m86465j51260J86667l81844j174242q89651
37979a473592K20165O77268Q0508m59184k71919Q18j19196k1281P07972J222488
37969E64047O30995m79253p79941p3545N49708L02022m45505r83957j111218q26682
37959b653329M7863J271607J760584P53850p46734q41173O91726J835901J026366
37950C146661p07390j373806q40622m88052o57206l57952N28216P63677j8522
37941d996m59262K48345Q74000J80389r37820q59019K00177O44896k8885p57427
37931h99602o74836l6747N66597Q25528N47388j96869p78038o43017j38641L6857
$$ y = [-1248628, -553241, 348974, 832514, 1007617, 1215397, 1441879, 1512038, 1369866, 998542, 519060, 375927, 853620, 1449115, 1423203, 936738, 785478, 972145, 590301, -583941, -1473592, -1253427, -576159, -495651, -954835, -1226754, -1225936, -1345132, -1366413, -658441, 564047, 1195042, 715789, -64152, -137697, 412011, 714033, 268528, -715429, -1826647, -2653329, -2605466, -1333859, 426725, 1180575, 433841, -407332, 284394, 2120295, 3146661, 2439271, 1065465, 224843, -263209, -920415, -1278367, -750151, 13526, -4996, -464258, -215913, 658087, 838476, -99344, -958363, -758186, -113290, -142175, -899602, -1574438, -1611185, -1044588, -219060, 328328, 131459, -646579, -1289596, -1428237, -1391380]
37921a391380k5050K68897P59113N94738l48032j039744o29769M32210R76641
37912d02376M64091n05075q95581l74019K94212J95972m59557n83666J85296R17917
37902a162786Q11720K97387Q5143j8128m05377n38170K68074J362533J342969
37893B043365K5478j287557j552200j015856m00333L5306L57096N66616O31123
37884e96962N18204J63357k76512l46536Q3291M16421J24075l61624k29987M66371
37874c9902Q75809N29909j86512o58518o06017j71462J44222o9412m08797L4036
37864e56644J173507J585796M55121j020357j264647n50120k42544n30647n25637
37855a476172j52602j43057l08606L16926J475017J642536M08290p77504p95294
$$ y = [-1391380, -1416430, -1147533, -388420, 206318, -141714, -1181458, -1811227, -1379017, -402376, 61715, -443360, -1338941, -1712960, -1418748, -1222776, -1682333, -2265999, -2080703, -1162786, -351066, -53679, 31464, 13336, -392041, -930211, -662137, 700396, 2043365, 2068843, 781286, -770914, -1786770, -2187103, -2151797, -1794701, -1228085, -596962, -78758, 84599, -191913, -538449, -455158, -38737, 85338, -276286, -506273, -39902, 835907, 1365816, 1179304, 520786, -85231, -256693, -112471, -181883, -590680, -556644, 616863, 2202659, 2657780, 1637423, 372776, -177344, -419888, -950535, -1476172, -1628774, -1771831, -2080437, -1763511, -288494, 1354042, 1762332, 984828, 189534]
37846A89534k58086n8803K608K90494L44155j90777o75293m69496K7194J45526
37836f52944k6402j12163j58527j89566J49104Q09270J013011M19430j88300j18848
37826I44065J47731r4095n52408n68435k66826j40483j03691J13922K09624j07393
37816d17989l18376J21136O80361M87277k11473m04784J07227N44963M41950J20008
37806A150300j04762k90253l98360k42742M2124J50320J81317L95633N17474P4453
37796A475504o25739p23711q4957M86059M50403J40030l7651j71033l18333k22826
37786C67746L5374j07719o58009o55301M22345J493809J136929l21285j110356
37777F03533m37028N17159M11455m17361o77755k4997O90771P91739M57195L8959
$$ y = [189534, -68552, -127355, -124747, 165747, 509902, 319125, -356168, -825664, -798470, -652944, -679346, -791509, -950036, -1139602, -990498, -181228, 831783, 1251213, 1062913, 944065, 1091796, 997701, 445293, -123142, -389968, -530451, -634142, -520220, -310596, -417989, -736365, -615229, 65132, 552409, 340936, -63848, 43379, 588342, 1030292, 1150300, 1045538, 755285, 356925, 114183, 156307, 306627, 487944, 883577, 1401051, 1475504, 849765, 126054, 41097, 527156, 977559, 1117589, 1079938, 908905, 590572, 367746, 403120, 295401, -362608, -1017909, -595564, 898245, 2035174, 1713889, 603533, 166505, 683664, 1095119, 677758, 3, -24994, 665777, 1457516, 1914711, 1953670]
37767A953670m48612r14831r77207n33543k9528J84232K82225M35419M00026N6581
37757D08432j78599m129K00371M2953j39381J01040M24005K36627k43624l53646
37747D94049j23402r2907k13657J5290M27774L39954j51739j94390L26051N02125
37737A329148n8884n89119n04568k37488j45328K30852J008302J174795M7599
37728B255309j324810j427633l91695L51165J77193j54913M3705M58760M98578
37719D85659J62601j15715l9385L17797N84894L99662j63196o12596o60962n26534
37709a67775m04527r1456M76327P75565L45977m34639p83143m86776M0573M23464
37699c06410N52269L88468M0752j64913j11455j20012l59935m35770p9567K10143
$$ y = [1953670, 1505058, 590227, -386980, -920523, -950051, -765819, -483594, -48175, 351851, 408432, 229833, 225704, 426075, 469028, 329647, 430687, 854692, 1091319, 847695, 494049, 370647, 277740, 64083, 79373, 507147, 847101, 695362, 500972, 827023, 1329148, 1270264, 681145, 176577, -60911, -206239, 24613, 1032915, 2207710, 2255309, 930499, -497134, -888829, -537664, -360471, -515384, -471679, -12919, 485659, 648260, 532545, 493160, 810957, 1395851, 1795513, 1632317, 1019721, 358759, -167775, -572302, -663758, -187431, 588134, 934111, 499472, -283671, -770447, -729874, -306410, 245859, 634327, 675079, 510166, 398711, 278699, -81236, -517006, -596573, -386430]
37689c86430o9368m24724k0247Q83458J135573L88956l55930j88389N22338Q27944
37679B313181N00149N3406k06872n29989j064083j324065p06531N19378J182650
37670G37224N22535p27369j120952k99335O60702P95842L58851K1661j96680n38322
37660B14157p00844k86572L26155M11752q277k67775j15499N7079j8973j71448
37650e60245k24436j76058K8845L75517N15132J68663l04916l09219J15945L94823
37640B4051K87195N4197j57880m50838p14507o58923l23203k477K75088O24118
37630a043179P85260M25134j38063k67792j3424M2268r5579J62265P53995Q04729
37620A415614M0079o67061o68200m77356o71336p80979j83385O25756P00671J30609
$$ y = [-386430, -455798, -880522, -900769, -17311, 1118262, 1507218, 1151288, 962899, 1485237, 2313181, 2813330, 2866736, 2659864, 2129875, 1065792, -258273, -964804, -445426, 737224, 1259759, 532390, -588562, -887897, -227195, 568647, 927498, 949159, 752479, 214157, -486687, -773259, -447104, -35352, -43629, -311404, -426903, -369824, -388797, -560245, -784681, -960739, -931894, -556377, -41245, 127418, -177498, -486717, -370772, 24051, 311246, 365443, 207563, -243275, -957782, -1616705, -1939908, -1942385, -1667297, -1043179, -257919, 167215, 29152, -238640, -252064, -209796, -305375, -143110, 610885, 1415614, 1455693, 788632, 120432, -356924, -1028260, -1809239, -1992624, -1366868, -666197, -535588]
37610e35588j88844l895J11243p3844j01060K35419N06547M44620L34974L30598
37600A060170J37420k49468k66064K32042M38454j94799q41020l91491P21949
37591F47193R90294O7566p20822m33092J65930M1406m38959l21643K36466L50825
37581E85164K0314N794K84744L8008p04006q14569Q3010Q12182M05299m23025
37571B92915m77769R7741K52060k81250p67505o85006k63249R6048K45109J88178
37561a302728N5851Q2511K62485K77185O7975N3393L79824M86362k7453o08160
37551b72755m92248J76567O63183P00876N42040L05653j2929j98805j63833k78750
37541I68999o81148p22566N7787Q69753N97671n18429j179617q21321q2982L74958
$$ y = [-535588, -724432, -728327, -617084, -690928, -791988, -556569, -50022, 394598, 729572, 1060170, 1197590, 948122, 682058, 914100, 1352554, 1157755, 316735, -74756, 647193, 1637487, 1705053, 984231, 551139, 717069, 758475, 319516, -2127, 234339, 585164, 605478, 611272, 896016, 934024, 230018, -584551, -501541, 310641, 715940, 292915, -184854, -87113, 164947, -116303, -883808, -1568814, -1832063, -1736015, -1490906, -1302728, -1246877, -1164366, -901881, -624696, -556721, -503328, -123504, 362858, 335405, -272755, -765003, -588436, 74747, 775623, 1317663, 1623316, 1610387, 1411582, 1247749, 968999, 287851, -434715, -376928, 492825, 1090496, 572067, -607550, -1428871, -1511853, -1136895]
37531a136895M82610K77860j34769j89932N03830J175439P07882n19836r11728
37522B54461j5087P65041L34815n11017n17004J05968K64056k04371m45663n7694
37512b6495L66669K47555j56886k41494J2574J2164n30399j027656p47899O4490
37502b027377M40340J02805j99658m9336k532k72204K0427J190791J778270N91796
37492A573322r81182p32278Q80435J330402n811r87882k73314P48484N85429n1724
37482B085881k105K05558l09723q25511k82819N99062L81246o68352j053082n00301
37472c70146j68431n51896q00446k92111M32961O47690M05197K04484L01636N46827
37462C55765N48538M2072o66838r19137n84874k09904l1101L62220R52490Q90525
$$ y = [-1136895, -654285, -376425, -511194, -701126, -197296, 978143, 1686025, 1166189, 254461, 239374, 1004415, 1339230, 828213, 311209, 417177, 681233, 476862, 31199, -26495, 340174, 587729, 430843, 189349, 201923, 214087, -316312, -1343968, -2091867, -2027377, -1587037, -1484232, -1683890, -1733226, -1735758, -2007962, -1987535, -796744, 981526, 1573322, 592140, -140138, 740297, 2070699, 2064888, 1077006, 803692, 1552176, 2137605, 2085881, 2083776, 2289334, 1979611, 1154100, 871281, 1470343, 1851589, 1183237, 130155, -370146, -538577, -1090473, -1890919, -2183030, -1750069, -1102379, -697182, -492698, -191062, 355765, 904303, 946375, 279537, -639600, -1224474, -1434378, -1465479, -1103259, -150769, 739756]
37452G39756o0288o92298n2099R07936O83523m66717j022683n51573J646J46100
37442c66697L53359O60851L39692o33405j121578m58137N26569P61179L63188
37433D25021J28546K47993K58414q4825m90038n55542j68871M17571P35831M83974
37423A398074j04513m14205r2366N21030O83214K9940q96329j096420l32579L99780
37413I5626J57231n03650k96943P01246J042046K54817l06013K66340Q27496J24780
37403B362976r66194q32207J99233M87920j83700n32483k20616k85305r23588
37394h93964q91471K48889J088639N34243m55944m20112M41403Q38352L61485
37385H51520k65555m71571l93920l23158l03089k41199l4241K99683M61434J56921
$$ y = [739756, 679468, -12830, -64929, 843007, 1526530, 1059813, 37130, -514443, -512797, -366697, -13338, 647513, 987205, 353800, -767778, -1225915, -699346, 61833, 425021, 553567, 801560, 1059974, 975149, 485111, -70431, -239302, 178269, 914100, 1398074, 1293561, 879356, 786990, 1308020, 1991234, 2021174, 1124845, 28425, -304154, 95626, 252857, -250793, -547736, 153510, 1195556, 1450373, 1144360, 1410700, 2238196, 2362976, 1396782, 564575, 763808, 1251728, 1068028, 535545, 314929, 29624, -893964, -1785435, -1536546, -447907, 86336, -369608, -789720, -348317, 490035, 851520, 585965, 114394, -279526, -602684, -905773, -1146972, -1181213, -881530, -420096, -263175]
37375b63175l46772m11436O5434M50492K94444p6797j54032O9569K89755L32553
37365B50035J59940j60032l16252k4637M34730M44401n7307m52715l67047j30702
37355b19586j07183j39278M5127L61392N75155N91283L85307L9615j34096N6m3914
37344A353878p24145j428870j000271N24201J638795J231192r5766j009894j014012
37335e24892n24158m0799J97916J83044J63496L55497M96516K07013k28541k28790
37325E6302l2000l72111r55338o28802N58438J019186J07887o66509p6668P18855
37315b70760J52212r60139o93476O93036J059085j78144j162167n41348O84019
37306a217682J009215M86687n181k44928l76779j54101M57763O89898K2395p57058
$$ y = [-263175, -609947, -1021383, -955949, -505457, -211013, -287810, -441842, -372273, -82518, 250035, 409975, 249943, -66309, -90946, 343784, 788185, 730878, 278163, -88884, -219586, -326769, -466047, -420920, -59528, 515627, 1106910, 1492217, 1531832, 1397736, 1397792, 1353878, 629733, -799137, -1799408, -1275207, 363588, 1594780, 1499014, 489120, -524892, -1049050, -1089849, -891933, -708889, -545393, -189896, 306620, 513633, 285092, 56302, 24302, -347809, -1303147, -1931949, -1373511, -354325, -246438, -912947, -989615, -270760, -118548, -1078687, -1772163, -1079127, -20042, -198186, -1360353, -1901701, -1217682, -208467, 278220, 273039, 28111, -348668, -502769, -45006, 644892, 667287, -89771]
37296h9771n75391K68082N10487k14433r34725p99737j15364L06107J77659j81522
37286a648608l45966q3746N23544J018872Q76094J01183o36376o72754n4302N63880
37276c58179O34701K14055j90743j56962K44630N35329L65987n5314k15561K2656
37266A040599K29885N201m96663q47599r08277p83375m24977K51150R21363J054374
37256D1681O52587L09473L54077M13132Q5730m05503o08003n06399l73985k50643
37246b87853p369K73151L75149K54231k2976m09848p01586n91706k14060j49220
37236a482087m73104m05536M38321J081279M55080p94335r76248K72557J494041
37227c90032J449624N32996k06058m35832m13652k91367j48371j67784l10682
$$ y = [-89771, -665162, -397080, 113407, -101026, -1035751, -1835488, -1950852, -1644745, -1467086, -1648608, -1994574, -2078320, -1554776, -535904, 340190, 441373, -195003, -867757, -922059, -358179, 276522, 490577, 299834, 142872, 387502, 922831, 1288818, 1233504, 1017943, 1040599, 1270484, 1275685, 779022, -68577, -976854, -1760229, -2185206, -1934056, -1012693, 41681, 694268, 1003741, 1357818, 1770950, 1856680, 1451177, 843174, 336775, -37210, -287853, -295222, -22071, 353078, 607309, 584333, 174485, -527101, -1118807, -1332867, -1482087, -1955191, -2360727, -1922406, -841127, -386047, -1180382, -2156630, -1884073, -390032, 1059592, 1592588, 1386530, 950698, 537046, 245679, 97308, -70476, -381158]
37218c81158k63618j6918J4184k91851m91991l05648k5704Q9198K25785M96541
37208i51180O14646M38251K61071K31415Q0579k50000l63383j45584o7333l49137
37198e00655n28552l01940o5275j18477r6043K33065L93435J18231L1739N77122
37188b57350J016444N12201m10705o20967j70688j18941p45966j126221n79162
37179b501355M28867J038039R03539J98051o33408r80854n29134K30677M41202
37170a404376n7682n50133m13023J70882N98054N88972L70904K96535M14950M55922
37160D71005K94771K57847O10669Q97370M40948m87929q52531m22228j73630o38824
37150C97468r26935k24828P21211P70361K49486K80616P50632M78585o90611j431480
$$ y = [-381158, -644776, -661694, -647510, -939361, -1431352, -1737000, -1762704, -1673506, -1447721, -951180, -336534, 101717, 362788, 594203, 674782, 424782, 61399, -84185, -151518, -500655, -1029207, -1331147, -1396422, -1514899, -1610942, -1377877, -984442, -866211, -834472, -257350, 759094, 1271295, 860590, 239623, 68935, -50006, -795972, -1922193, -2501355, -2072488, -1034449, -130910, 67141, -566267, -1547121, -2076255, -1845578, -1404376, -1462058, -2012191, -2425214, -2254332, -1656278, -1067306, -696402, -399867, 15083, 471005, 765776, 1023623, 1634292, 2531662, 2972610, 2484681, 1632150, 1209922, 1036292, 397468, -529467, -754295, -33084, 737277, 986763, 1267379, 2018011, 2496596, 1805985, 374505]
37140C74505q58111K80161P54866L27052l60344o81207m41183J22036M91658L48192
37130C57625o1788l19197l96764m21068k15550L05176O18284K22455m73241o69600
37120a053668l23540N5921M32718J042325J412930Q00677l99871q89440k90123
37111G87929L76485K85820j91309m08990l26399o5020M40700Q91091O23522l34880
37101B078949j032230q81090l86257j35090O2676M35298M99155j54185r29483
37092d42257r13254j40282N13095M90299O4155k00104j01252P9926J5726j09675
37082g43623K44279R79657J058235n3821j155280p25558P03091J110053n633r08513
37072E02887m19876L74534K17974j96016K86987R81883M32982r62235j339638
$$ y = [374505, -483606, -203445, 551421, 878473, 518129, -163078, -604261, -482225, 9433, 357625, 295837, -23360, -420124, -841192, -1056742, -751566, -133282, 89173, -384068, -1053668, -1377208, -1321287, -888569, 153756, 1566686, 2367363, 1967492, 1078052, 787929, 1164414, 1450234, 1258925, 849935, 523536, 458516, 899216, 1790307, 2413829, 2078949, 1046719, 165629, -220628, -355718, -293042, 142256, 641411, 487226, -442257, -1355511, -1495793, -982698, -492399, -428244, -628348, -729600, -649674, -633948, -743623, -499344, 480313, 1538548, 1484727, 329447, -396111, 306980, 1417033, 1411400, 502887, 83011, 457545, 675519, 479503, 766490, 1748373, 2181355, 1219120, -120518]
37063a20518j75010J034817J025803K07954m62726p48535p58469l64332L66479
37054E463Q48210O46406K8990m80446o50706m18622K25125Q84939Q14127j96977
37044A706509j307249j467950o13626L77843P93963P37914O48079N83419K67301
37035A726203l37347q47774r18654o25058k41524J45073N66700Q80614Q64318
37026A212551N63617K60842R3269n5558k91087n57066p28552o71522l03696K08817
37016b68385M87665M12732L07931L64704K52951k30039n47985j62948M42711L40534
37006A399871m19828q77572o02600j33168O4329J14017R7395j21202k60556J84602
36996e54712Q83614Q46830k4588o41925l74553J24419K21191K43253M65164L52256
$$ y = [-120518, -295528, 739289, 1765092, 1973046, 1510320, 761785, 3316, -361016, 5463, 853673, 1500079, 1529069, 1048623, 397917, -20705, 204420, 1089359, 1903486, 1706509, 399260, -1068690, -1682316, -1304473, -510510, 227404, 875483, 1458902, 1726203, 1388856, 541082, -377572, -1002630, -1244154, -1099081, -532381, 348233, 1212551, 1776168, 2037010, 2130279, 2074721, 1783634, 1226568, 498016, -173506, -477202, -268385, 219280, 632012, 939943, 1304647, 1557598, 1327559, 779574, 616626, 1059337, 1399871, 980043, 102471, -500129, -633297, -568968, -454951, -357556, -478758, -739314, -554712, 328902, 1175732, 1151144, 509219, 134666, 259085, 480276, 723529, 1188693, 1540949]
36986A540949l12638o45473k5604P12465N49782j01224k26186P5434k9187n43875
36976I94443p36571m76692l15061m07355l63993n5090K55716M19891L98282P5402
36966b11028l31897k10372M61231P63550K38522k33027O6088L18585l49866r96376
36956d84590k39594J163250J176523l12666j267092o41811K87755K64640j65497
36947b19082o2505K99740K82715J26288K86850M50626J66139k63509l47831k30937
36937D88494k17332q9928L76803P61964N74096O8935j48237l598J22072O7504
36927B000773k3898j01315k65571n14043o68816n10052K6810O18032O48143j05176
36917A104887r93244j125685l85380N79334J166573J155584N50940k75569o06606
$$ y = [1540949, 1228311, 582838, 557234, 1269699, 1819481, 1718257, 1492071, 1567505, 1538318, 994443, 257872, -218820, -533881, -941236, -1305229, -1360319, -1104603, -684712, -286430, -211028, -542925, -753297, -292066, 471484, 710006, 476979, 543067, 861652, 511786, -484590, -724184, 439066, 1615589, 1302923, 35831, -605980, -318225, -53585, -219082, -281587, 18153, 300868, 427156, 714006, 1164632, 1330771, 1067262, 719431, 488494, 271162, 181234, 558037, 1320001, 1894097, 1963032, 1814795, 1811197, 1933269, 2000773, 1976875, 1875560, 1609989, 1095946, 427130, -82922, -56112, 561920, 1210063, 1104887, 111643, -1014042, -1399422, -820088, 346485, 1502069, 2053009, 1777440, 1170834]
36908A170834k48666P231m01520o98832j6225Q19101L30985j050291j352466j13365
36898a553214Q94570N18606j49179O3899M41266q1422q73442o88849K22773O27707
36888e77285K53939j48588j88164o1623J71706M91594N19755J51636N6957O22446
36878A292373J024567M00053o79917j048502o81892l79857k49032J32093M44840
36869B54726J2450p30462o26841L25853Q85495M99477q850L1654J91033l8843
36859G95692l74449m32808m00535m87330m41344p2339L41815N12649M64700K25690
36849A31741j90685m03529j7868N43252M41555j80950k44650M89736Q29959n685
36839A392876j022283q85046R5273N48713J03265l43429k14233M8381K219o7884
$$ y = [1170834, 922168, 929399, 527879, -170953, -187178, 631923, 962908, -87383, -1439849, -1553214, -658644, -140038, -289217, -225318, 215948, 134526, -738916, -1427765, -1204992, -577285, -323346, -471934, -660098, -721721, -550015, -58421, 461334, 612970, 669927, 1292373, 2316940, 2716993, 2037076, 988574, 306682, -73175, -322207, -190114, 254726, 267176, -463286, -1090127, -764274, 121221, 620698, 611848, 643502, 834535, 795692, 421243, -11565, -412100, -899430, -1340774, -1413113, -1071298, -558649, -93949, 131741, -58944, -462473, -480341, 62911, 504466, 323516, 78866, 568602, 1398561, 1392876, 370593, -514453, -419180, 129533, 232798, -110631, -324864, -276483, -274264, -342148]
36829c42148J76559M42288K74527k18853n47740m83562j64682K42270O13090O95623
36819F87372K73521m15966p58572m65764L4068J87079J01713L06334P70031P56198
36809A476014q7033j019568j107492m95730j38372l68223m46593K58955J224066
36800g03976J347672L57865p77899r05526M9604J021059J019198K43291k69977
36791A381311l6951L12228P0293m78205n58576j28771J06664j86991n50319n23629
36781e92946k43023l2406P0562J15289J8810j51668n9577M01335P74675N39814
36771H40865k31087r46368j070768m98242M10267J010799Q62416K11010k41668
36762C47224j67610R5740J90270K19144L21152K50381j56870m76143k40306K36913
$$ y = [-342148, -165589, 276699, 551226, 332373, -215367, -698929, -863611, -621341, -8251, 687372, 960893, 544927, -213645, -679409, -645341, -458262, -356549, -50215, 719816, 1476014, 1388981, 369413, -738079, -1233809, -1372181, -1740404, -2186997, -1928042, -703976, 643696, 1001561, 223662, -681864, -632260, 388799, 1407997, 1651288, 1381311, 1344360, 1656588, 1726881, 1248676, 690100, 561329, 667993, 481002, -69317, -592946, -835969, -868375, -797813, -682524, -663714, -815382, -874959, -473624, 301051, 840865, 609778, -336590, -1407358, -1905600, -1495333, -484534, 377882, 588892, 347224, 179614, 275354, 465624, 684768, 1005920, 1256301, 1099431, 623288, 382982, 619895]
36752F19895K18596l40761o70689k73150M19793O87666L68795k00998p16463j019173
36742i06489r34970l91126L47595Q26482Q10677M33708n445k71033k77753q7914
36732d56268J63939L62451L93855J31818l34934n13588L6715R13161J029081j8658
36722A707572j161425j085240m75O32974J44421n24346l75957J78343J49076l91659
36712g26716n00527M6399L62089k03330j107126j341227o16243M73158J118852
36703b494671R41327K64911j38664J15824M63297J11947o93303q22937J10826
36694b141443J041877Q79088J2623l46812P3146L85385m230n69309n21057J26837
36684a063895P27597Q53561N81877J34350l53492o91245o01191m9415N16688N36741
$$ y = [619895, 838491, 497730, -172959, -446109, -26316, 661350, 1030145, 829147, 112684, -906489, -1841459, -2232585, -1884990, -1058508, -247831, 185877, 180432, -90601, -368354, -456268, -292329, 70122, 463977, 595795, 260861, -252727, -216012, 697149, 1726230, 1707572, 546147, -539093, -539568, 93406, 237827, -286519, -662476, -484133, -335057, -726716, -1227243, -1180844, -818755, -1022085, -2129211, -3470438, -4086681, -3613523, -2494671, -1553344, -1288433, -1427097, -1311273, -847976, -736029, -1429332, -2252269, -2141443, -1099566, -220478, -207855, -554667, -481521, -96136, -100366, -669675, -1190732, -1063895, -336298, 517263, 1099140, 1233490, 879998, 188753, -412438, -461853, 54835, 591576]
36674E91576P272m43975l11765J68256M07097K66230P3164n9575l99416r75205
36664f76341j298030r72232k28681M24481P82571R09466Q24880N66864L53227
36655F86205L27692K63004j62761q31738j192933q57404o0704N31292M84868M4305
36645g68174j97803p8463j3612k25644k95097Q2373L88573P2909l42195M8554
36635a328579R33655J082475L05802k12898J01809L06023k95069q20353l15606
36626b42741N53644O10367R0008K2994L28109P5764o67904q38396k37652N1805
36616b54002n59786j179878p36444N46943J465576J159820r1732j073901p12677
36607a436081O60368J426932N97999q50535j307375o55899l6334P3560K34812
$$ y = [591576, 598848, 154873, -156892, 11364, 418461, 684691, 757855, 698280, 298864, -676341, -1974371, -2946603, -3175284, -2750803, -1968232, -1058766, -233886, 332978, 686205, 1013897, 1276901, 1114140, 282402, -910531, -1767935, -1828639, -1297347, -812479, -768174, -965977, -1044440, -1058052, -1283696, -1578793, -1496420, -1107847, -1034938, -1377133, -1328579, -394924, 687551, 993353, 780455, 882264, 1188287, 893218, 72865, -242741, 310903, 921270, 1011278, 1034272, 1362381, 1438145, 770241, -68155, -305807, -254002, -813788, -1993666, -2730110, -2183167, -717591, 442229, 350497, -723404, -1436081, -775713, 651219, 1249218, 398683, -908692, -1564591, -1600925, -1527365, -1292553]
36598a292553O68039Q36296N00021L8918l44747o63450m84507M91781J293546
36589A043344O44659q55225j210441J6205J038349O82378k9177l4758l8029p85056
36579D72249j263036l94695P82939N94884n15688p11585K84790R37557M42534
36570F29949l02958m28252k02547p8737O0936K79441K53928l8297j50359L4919
36560E8023R7232j38154l46507l66581l74723k96691J65128P78602Q58146L03159
36550G37634j81916j19353J96312L68509L72044J51975m53072j093663j026311
36541a047841k44732K96733Q3160j37395L90339J075968Q21281k24594p75451
36532B37468j96172P23710R38212L65184l32976o33806m86742j55170m0977l59639
$$ y = [-1292553, -624514, 211782, 711803, 750721, 405974, -257476, -741983, -250202, 1043344, 1688003, 832778, -377663, -361458, 676891, 1359269, 1330092, 1295334, 1257305, 472249, -790787, -1185482, -402543, 192341, -323347, -1034932, -750142, 187415, 629949, 326991, -101261, -303808, -382545, -321609, -42168, 211760, 173463, 23104, 58023, 155255, 17101, -329406, -695987, -1070710, -1367401, -1202273, -423671, 434475, 737634, 555718, 436365, 632677, 1001186, 1373230, 1525205, 1072133, -21530, -1047841, -1292573, -995840, -912680, -1050075, -659736, 416232, 1237513, 1012919, 237468, 41296, 765006, 1703218, 2068402, 1735426, 1101620, 614878, 459708, 418731, 59092]
36522E9092p26692m23203N83231J276109P91556l25575q08397m59963k96313p55346
36512a085501r01684n3326Q52675O17310k47110k88643N26863P92083L115o84071
36502d68289m50577k8920j72827l14635J95205O92904L40960k37608R8977J029653
36492F84843J211685M01617l08238l24406k58423n96073q51439m66473L02428
36483b04479P87255O21146j06182q67648r18894j41543M84148N7245p72920n68122
36473a629994O92036J409353O67282m94814p00372o6698L79491K87085O4857p8653
36463E29573k74356m28696k71783J06164K93168R8635k71678n05950m45743j84210
36453a354876m905l6224k770L42363O56995M45539j9709J7699N33265O57915J20003
$$ y = [59092, -667600, -1090803, -507572, 768537, 1560093, 1234518, 426121, -33842, -330155, -1085501, -1987185, -2040511, -1187836, -570526, -817636, -1106279, -579416, 212667, 215782, -468289, -918866, -947786, -1120613, -1435248, -1240043, -547139, -206179, -443787, -344810, 684843, 1896528, 2298145, 1989907, 1665501, 1407078, 811005, -40434, -506907, -204479, 582776, 1203922, 1097740, 230092, -688802, -830345, -346197, -288952, -1061872, -1629994, -937958, 471395, 1138677, 643863, -56509, -123207, 256284, 543369, 608226, 529573, 255217, -173479, -445262, -339098, -45930, 52705, -218973, -724923, -1170666, -1354876, -1359781, -1396005, -1398775, -1056412, -399417, 46122, 26413, 44112, 577377, 1235292, 1355295]
36442A355295k70182m1045J13032l35156o39173o8297N84979J35720r41138j094992
36432a200957r4599O93692M86631L3918L0610L3040l44909m29858L17907J081736
36422F07211Q27365J0815r7278N58781P53542o7459r91474j107233p17958n24755
36412g48443m38042J4006O11424O44440L3481m89303l69164J65338N99377P51862
36402G74976P02434M88390J56020j08100j52175p0236q3282k72510n08191n83246
36392C44080m13808j95101k79086p05365r45417m34158O39126J423743J378753
36383H12767Q13569L38518J42845L5815j20514l18203n33038o80303n88812k34426
36373c31782J18024J67409j15327m86121o14872l23434J58263L10016J3341j19613
$$ y = [1355295, 1085113, 1044068, 1157100, 821944, 182771, 114474, 699453, 835173, -105965, -1200957, -1295556, -601864, -115233, -81315, -50705, -17665, -362574, -792432, -474525, 607211, 1434576, 1445391, 1348113, 1906894, 2660436, 2592977, 1601503, 494270, -223688, -748443, -1186485, -1172479, -561055, 83385, 116866, -372437, -741601, -576263, 23114, 774976, 1477410, 1965800, 2121820, 2013720, 1861545, 1791309, 1708027, 1435517, 927326, 344080, -69728, -264829, -543915, -1249280, -2194697, -2628855, -1989729, -565986, 812767, 1626336, 1964854, 2107699, 2143514, 2023000, 1704797, 1171759, 491456, -97356, -331782, -213758, -46349, -161676, -647797, -1262669, -1586103, -1427840, -1117824, -1104483, -1224096]
36363a224096L53969P85446L04065n68354m23525P44759J228881K10198q35207
36354E76136m38485N38177M39558m18714m60135L40499N02150k66203n86058O7131
36344B94056M18674l23167j083144q15223j89792j81132l28836J85362Q02306
36335a220896M98882k71731j68601Q30976J336328O51751l65223p71814o91071
36326a71399n79751l33911K39194P26646O09464J27538k0076K46666K36474l93067
36316F87778q95021l62661Q15452J193813J84975j010510r82497m035N57845L16982
36306E02121J63641N23212O35664m306o63277n64168j39906j99580n44483m17680
36296g08762J19924L04501k6113k20433M9821K89183M3362l98077n04913k49023
$$ y = [-1224096, -870127, -84681, 219384, -348970, -772495, -27736, 1201145, 1411343, 576136, 137651, 675828, 1115386, 696672, 236537, 577036, 1079186, 812983, 226925, 294056, 712730, 389563, -693581, -1508804, -1698596, -1879728, -2208564, -2023202, -1220896, -722014, -993745, -1162346, -331370, 1004958, 1656709, 1291486, 519672, -171399, -751150, -1085061, -845867, -119221, 490243, 617781, 597705, 844371, 1080845, 687778, -207243, -569904, 245548, 1439361, 1624336, 613826, -368671, -372706, 185139, 502121, 665762, 1188974, 1824638, 1820332, 1157055, 592887, 452981, 253401, -291082, -708762, -588838, -284337, -310450, -530883, -481062, -191879, -148517, -546594, -1051507, -1300530]
36286a300530M6409L03505O68816R62327O67353k49700r21055n89390J36447p1094
36276c46912j180579j489684r7370J431988J167116k70218o33660M83429J143226
36267B07336K27979r25683q20797M0772L97917K09607J59486K73768K17333R3414
36257H1132m0831n31933j117483p14303P24893J448385L80078r18824m85128R54371
36247b19643J165967q9722r68717o04944l6355l6747r3415J36622J79917j7165
36237e84202J75771O82669N90350j81305n79104k25752j5924l76650m51459K85432
36227f80174J008551R17012L64929j30732p33829j325881j008739L96495J489438
36218B97070J061042k00727q59305p18488n26060m57894j50744K50651K59929
$$ y = [-1300530, -1254121, -950616, -281800, 680527, 1347880, 1098180, 177125, -412265, -275818, -346912, -1527491, -3017175, -3114545, -1682557, -515441, -785659, -1419319, -935890, 207336, 435315, -490368, -1311165, -1270393, -872476, -662869, -503383, -229615, -12282, 81132, 40301, -491632, -1609115, -2323418, -1598525, -150140, 229938, -688886, -1174014, -219643, 946324, 856602, -112115, -717059, -753414, -790161, -883576, -746954, -567037, -584202, -408431, 274238, 864588, 683283, 104179, -121573, -137497, -514147, -965606, -680174, 328377, 1245389, 1610318, 1479586, 745757, -580124, -1588863, -1192368, 297070, 1358112, 1157385, 298080, -420408, -946468, -1404362, -1555106, -1304455, -1044526]
36209a044526j5009o7890J20616K13536K43188M25179N38850K54179j79114k72938
36199B16071p5773M6835J10157L08318L93219k3528p13619j018197o84309k2913
36189a463739N72347Q01310M33474l58848q75371o03940J30099O27450O35975
36180a01243L25574j46196n56272n19405k3778L17185J00438k00303j2520L53779
36170d62741K55923j46387j84827J27407J22207l46153o00988j47212O87959J265890
36160E71078J280311Q02508J16495m25324o83075q06136q19191m49417K80279
36151a32472P29248M70844K4328O4572L14998J00263l35005j51265N38065O34563
36141B258139k01564q87929n00500L95173O60843J62773l13471l17036j63061
$$ y = [-1044526, -1059535, -1127425, -1006809, -793273, -550085, -124906, 413944, 668123, 489009, 216071, 140298, 187133, 297290, 605608, 998827, 975299, 261680, -756517, -1440826, -1463739, -891392, -90082, 343392, -15456, -890827, -1494767, -1364668, -737218, -101243, 224331, 78135, -478137, -997542, -1021320, -704135, -603697, -804000, -816520, -462741, -206818, -353205, -538032, -410625, -288418, -634571, -1235559, -1382771, -694812, 571078, 1851389, 2653897, 2770392, 2345068, 1661993, 855857, 36666, -412751, -132472, 596776, 1067620, 1091948, 1156520, 1471518, 1571781, 1236776, 1085511, 1623576, 2258139, 2056575, 1168646, 668146, 1063319, 1724162, 1886935, 1573464, 1256428, 1093367]
36132A093367k37079m56302n00506k46711J29614L56274L25069J69686P6731J00720
36122H10863K34652M75186O28045L00688n45027j236636j084472l34022J26602
36113f24121j6673k21432j19009q1892l90878n10404J53706J170618J492562Q30999
36103A683476l6877l79090l03235k32243j63022J09603M07524L67737P3345o3705
36093A463513j7962j71254n39468o20515k64620k6753k17181k87649J74831N10971
36083C913M035o89029l56061P63441J188592M84378j38066R3003L12426l09117
36073A357515j022144p34053K09965O70399M00060n8703n28786j071715j217419
36064a994881n26132M26419P35430N07716M41888M76336R3562l46861J9710R27583
$$ y = [1093367, 856288, 399986, -100520, -347231, -217617, 138657, 463726, 633412, 710143, 810863, 1045515, 1520701, 2148746, 2449434, 1904407, 667771, -416701, -750723, -624121, -640794, -862226, -981235, -1063127, -1454005, -1964409, -1810703, -640085, 852477, 1683476, 1646599, 1267509, 964274, 732031, 569009, 678612, 1086136, 1453873, 1527218, 1463513, 1445551, 1274297, 734829, 114314, -150306, -177059, -394240, -681889, -507058, 3913, 7948, -681081, -1037142, -273701, 914891, 1399269, 1261203, 1354206, 1666632, 1357515, 335371, -398682, -188717, 481682, 881742, 823039, 294253, -777462, -1994881, -2521013, -2094594, -1359164, -851448, -409560, 66776, 160338, -186523, -166813, 760770]
36054G60770J096564J34961q92798j019900m21935K65797O42312M25795l14528
36045F77038p33441j10604Q12566O57991m04618q15612j72559J32643o05137j117839
36035a679572l89254N16703K76286m26420j44551Q19029R75419J42555m48128
36026c57933l27600l40737q85132j145845n37290L16920O28426N42973N82336
36017a523882O81401M34716j02789m47021l68194j31316n7605r9336L5350M05240
36007a173436O69008N33725J90104j3074j56545m86679o70422j01503R12238J183366
35997H86782K93807o84809p50884l65462m10525n96746j26964O26421N45576l14796
35987h97600o71027j2925O71268N44866P6820l0165K5740j38851j54903L54061
$$ y = [760770, 1857334, 1992295, 1099497, 79597, -342338, -76541, 565771, 991566, 677038, -56403, -167007, 645559, 1303550, 898932, 83320, -89239, 43404, -561733, -1679572, -2068826, -1552123, -1275837, -1702257, -1846808, -1027779, -52360, 90195, -357933, -685533, -1026270, -1911402, -3057247, -3594537, -3277617, -2649191, -2106218, -1523882, -842481, -407765, -510554, -957575, -1325769, -1457085, -1514690, -1614026, -1578676, -1173436, -504428, 29297, 219401, 206327, 49782, -436897, -1107319, -1208822, -296584, 886782, 1180589, 495780, -255104, -620566, -1031091, -1627837, -1754801, -1128380, -582804, -897600, -1568627, -1581552, -910284, -365418, -288598, -318763, -293023, -431874, -586777, -232716]
35977b32716P54494K38683o71947o26492N36208J369100P94353m06592p56777
35968I98314j24123L00537j48850p55236o38762j9213K98755J50223J033J7484
35958H0162o1374j96955p074M12530L86940k94623q92516p19922j07178J44548
35948a255462j13113l14829j1063O55543J139972R09320q0530j121437j305871
35939a497470n39120L93262Q87851J050754R77429L58329o89736j232697p10096
35930a001494J65781M93441M65770O31231N91656l02238j422705j450084l51248
35921b179890N72334O35999M45398M59721K52944l45038o09304r8265M97183L99179
35911C0261j18020l13484q9302J23756J14726j3523j16914N50M51376Q52142N92803
$$ y = [-232716, 521778, 760461, 88514, -537978, -1770, 1367330, 2161683, 1755091, 998314, 874191, 1174728, 1025878, 270642, -368120, -387333, -88578, 61645, 62678, 80162, 18788, -178167, -185241, 227289, 614229, 319606, -572910, -1292832, -1400010, -1255462, -1368575, -1683404, -1694467, -1038924, 101048, 1010368, 929838, -191599, -1497470, -2036590, -1643328, -755477, 295277, 1272706, 1631035, 941299, -291398, -1001494, -835713, -342272, 123498, 754729, 1346385, 1044147, -378558, -1828642, -2179890, -1607556, -971557, -526159, -66438, 186506, -158532, -767836, -866101, -368918, 30261, -87759, -401243, -490545, -366789, -252063, -265586, -382500, -381950, 69426, 921568, 1514371]
35900A514371j92555n59283m0615O39005O13809L8999l47750l09786j58877j01332
$$ y = [1514371, 1321816, 762533, 721918, 1360923, 1974732, 2013731, 1665981, 1356195, 1197318, 1095986]
$$ [...]
##END NTUPLES=NMR SPECTRUM
##END=
