##TITLE=31Pdec_BAU-j-DIN02
 CDCl3, 24 sc
 2.7.2019
##JCAMPDX= 6.0         $$ Bruker NMR JCAMP-DX V2.0
##DATA TYPE= NMR SPECTRUM
##DATA CLASS= NTUPLES
##ORIGIN= UXNMR, Bruker Analytische Messtechnik GmbH
##OWNER= root
$$ XWIN-NMR		Version 3.5
$$ Tue Jul  2 14:37:44 2019 Russian Standard Time (UT+4h)  she@DPX200
##.OBSERVE FREQUENCY= 81.013821
##.OBSERVE NUCLEUS= ^31P
##.ACQUISITION MODE= SIMULTANEOUS
##.ACQUISITION SCHEME= undefined
##.AVERAGES= 24
##.DIGITISER RES= 17
##SPECTROMETER/DATA SYSTEM= spect
##.PULSE SEQUENCE= zgpg30
##.SOLVENT NAME= CDCl3
##.SHIFT REFERENCE= (INTERNAL, CDCl3, 0, 182.463)
##AUDIT TRAIL= $$ (NUMBER, WHEN, WHO, WHERE, WHAT)
$$ ##TITLE= Audit trail, XWIN-NMR		Version 3.5
$$ ##JCAMPDX= 5.01
$$ ##ORIGIN= Bruker BioSpin GmbH
$$ ##OWNER= she
$$ F:/spectra/data/she/nmr/P31/1/pdata/1/auditp.txt
$$ ##AUDIT TRAIL=  $$ (NUMBER, WHEN, WHO, WHERE, WHAT)
(   1,<2019-07-02 14:36:44.65 +0400>,<she>,<DPX200>,
      <created by zg, POWCHK disabled, PULCHK disabled
       configuration hash MD5:
       00 E9 B6 7A A2 85 ED C7 34 08 36 98 17 FE 4E 26
       data hash MD5: 32K
       CE 8C 80 16 1A 31 ED B6 0A D9 B8 87 91 4D 40 F3>)
(   2,<2019-07-02 14:36:47.53 +0400>,<she>,<DPX200>,
      <Start of raw data processing
       efp BC_mod = 2 LB = 1 FT_mod = 6 PKNL = 1 PHC0 = -2431.418 PHC1 = -201.0012 SI = 64K 
       data hash MD5: 64K
       DC A9 7B 6A 22 F5 34 67 F3 B0 9F 9A EE BA B0 62>)
(   3,<2019-07-02 14:37:04.51 +0400>,<she>,<DPX200>,
      <pk PHC0 = -54.12535 PHC1 = 152.8 
       data hash MD5: 64K
       53 38 19 1F A5 FE 6E 8E 73 68 F4 2B 46 0B DE 7C>)
(   4,<2019-07-02 14:37:07.37 +0400>,<she>,<DPX200>,
      <abs ABSG = 5 
       data hash MD5: 64K
       77 D9 CA 00 B9 16 1F EF AD 94 D1 C9 75 CE CE F9>)
$$ ##END=
$$ 
$$ hash MD5
$$ 63 82 CE 38 B3 85 A2 79 DD 76 9D 31 9E 25 D8 8D
##$RELAX= 
##$RELAX= 
##$RELAX= 
##$RELAX= 
##$RELAX= 
##$RELAX= 
##$RELAX= 
##$RELAX= 
$$ Bruker specific parameters
$$ --------------------------
##$DU= <F:/spectra>
##$EXPNO= 1
##$NAME= <P31>
##$PROCNO= 1
##$TYPE= <nmr>
##$USER= <she>
##$AMP= (0..31)
100 100 100 100 100 100 100 100 100 100 100 100 100 100 100 100 100 100 
100 100 100 100 100 100 100 100 100 100 100 100 100 100 
##$AQSEQ= 0
##$AQ_mod= 1
##$AUNM= <au_zg>
##$AUTOPOS= <>
##$BF1= 81.014009
##$BF2= 200.13
##$BF3= 200.13
##$BF4= 200.13
##$BF5= 200.13
##$BF6= 200.13
##$BF7= 200.13
##$BF8= 200.13
##$BYTORDA= 1
##$CFDGTYP= 0
##$CFRGTYP= 5
##$CHEMSTR= <none>
##$CNST= (0..31)
1 1 145 1 1 1 1 1 1 1 1 1 1 1 1 1 1 1 1 1 1 1 1 1 1 1 1 1 1 1 1 1 
##$CPDPRG= <waltz16>
##$CPDPRG1= <>
##$CPDPRG2= <waltz16>
##$CPDPRG3= <>
##$CPDPRG4= <mlev>
##$CPDPRG5= <mlev>
##$CPDPRG6= <mlev>
##$CPDPRG7= <mlev>
##$CPDPRG8= <mlev>
##$CPDPRGB= <>
##$CPDPRGT= <>
##$D= (0..31)
0 1 0 0 0 0 0 0 0 0 0 0.03 2e-05 3e-06 0 0 0 0 0 0 0 0 0 0 0 0 0 0 0 0 
0 0 
##$DATE= 1562063804
##$DBL= (0..7)
120 120 120 11 120 120 24 19 
##$DBP= (0..7)
150 150 150 150 150 150 150 150 
##$DBP07= 0
##$DBPNAM0= <>
##$DBPNAM1= <>
##$DBPNAM2= <>
$$ [...]
##$SUBNAM3= <"">
##$SUBNAM4= <"">
##$SUBNAM5= <"">
##$SUBNAM6= <"">
##$SUBNAM7= <"">
##$SUBNAM8= <"">
##$SUBNAM9= <"">
##$SW= 369.568048894756
##$SWIBOX= (0..15)
0 1 3 0 0 0 0 0 0 0 0 0 0 0 0 0 
##$SW_h= 29940.119760479
##$TD= 32768
##$TD0= 1
##$TE= 0
##$TE2= 300
##$TE3= 300
##$TEG= 300
##$TL= (0..7)
0 120 53 12 22 120 120 120 
##$TP= (0..7)
150 150 150 150 150 150 150 150 
##$TP07= 0
##$TPNAME0= <>
##$TPNAME1= <>
##$TPNAME2= <>
##$TPNAME3= <>
##$TPNAME4= <>
##$TPNAME5= <>
##$TPNAME6= <>
##$TPNAME7= <>
##$TPOAL= (0..7)
0.5 0.5 0.5 0.5 0.5 0.5 0.5 0.5 
##$TPOFFS= (0..7)
0 0 0 0 0 0 0 0 
##$TUNHIN= 0
##$TUNHOUT= 0
##$TUNXOUT= 0
##$USERA1= <user>
##$USERA2= <user>
##$USERA3= <user>
##$USERA4= <user>
##$USERA5= <user>
##$V9= 5
##$VALIST= <valist>
##$VCLIST= <CCCCCCCCCCCCCCC>
##$VD= 0
##$VDLIST= <DDDDDDDDDDDDDDD>
##$VPLIST= <PPPPPPPPPPPPPPP>
##$VTLIST= <TTTTTTTTTTTTTTT>
##$WBST= 1024
##$WBSW= 4
##$XGAIN= (0..3)
0 0 0 0 
##$XL= 0
##$YL= 0
##$YMAX_a= 60383
##$YMIN_a= -66369
##$ZGOPTNS= <>
##$ZL1= 120
##$ZL2= 120
##$ZL3= 120
##$ZL4= 120
##$ABSF1= 182.463
##$ABSF2= -187.1042
##$ABSG= 5
##$ABSL= 3
##$ALPHA= 0
##$AQORDER= 0
##$ASSFAC= 0
##$ASSFACI= 0
##$ASSFACX= 0
##$ASSWID= 0
##$AUNMP= <proc_1d>
##$AZFE= 0.1
##$AZFW= 0.5
##$BCFW= 0
##$BC_mod= 2
##$BYTORDP= 0
##$COROFFS= 0
##$CY= -3
##$DATMOD= 1
##$DC= 0
##$DFILT= <>
##$DTYPP= 0
##$F1P= 0
##$F2P= 0
##$FCOR= 1
##$FTSIZE= 65536
##$FT_mod= 6
##$GAMMA= 0
##$GB= 0
##$INTBC= 1
##$INTSCL= 5.30512e-09
##$ISEN= 30
##$LB= 1
##$LEV0= 0
##$LPBIN= 0
##$MAXI= 10000
##$MC2= 0
##$MEAN= 0
##$ME_mod= 0
##$MI= 50
##$NCOEF= 0
##$NC_proc= -4
##$NLEV= 6
##$NOISF1= 182.463
##$NOISF2= 159.3651
##$NSP= 0
##$NTH_PI= 0
##$NZP= 0
##$OFFSET= 182.463
##$PC= 4
##$PHC0= -2485.543
##$PHC1= -48.2012
##$PH_mod= 1
##$PKNL= yes
##$PPARMOD= 0
##$PSCAL= 0
##$PSIGN= 0
##$REVERSE= no
##$SF= 81.0140089999434
##$SI= 65536
##$SIGF1= 159.3651
##$SIGF2= -187.1042
##$SINO= 113.3802
##$SIOLD= 16384
##$SREGLST= <1H.CDCl3>
##$SSB= 0
##$STSI= 65536
##$STSR= 0
##$SW_p= 29940.119760479
##$SYMM= 0
##$S_DEV= 0
##$TDeff= 32768
##$TDoff= 0
##$TI= <>
##$TILT= no
##$TM1= 0
##$TM2= 0
##$TOPLEV= 0
##$USERP1= <user>
##$USERP2= <user>
##$USERP3= <user>
##$USERP4= <user>
##$USERP5= <user>
##$WDW= 1
##$XDIM= 65536
##$YMAX_p= 379005942
##$YMIN_p= -12804103
$$ End of Bruker specific parameters
$$ ---------------------------------
##NTUPLES= NMR SPECTRUM
##VAR_NAME=  FREQUENCY,     SPECTRUM/REAL,   SPECTRUM/IMAG
##SYMBOL=    X,             R,               I
##VAR_TYPE=  INDEPENDENT,   DEPENDENT,       DEPENDENT
##VAR_FORM=  AFFN,          ASDF,            ASDF
##VAR_DIM=   65536,         65536,           65536
##UNITS=     HZ,            ARBITRARY UNITS, ARBITRARY UNITS
##FACTOR=    0.456856943014862, 1,           1
##FIRST=     14782.0589164792, 0,            0
##LAST=      -15158.0608439998, 0,           0
##MIN=       -15158.0608439998, -12804103,   0
##MAX=       14782.0589164792, 379005942,    0
$$ Real data points
##PAGE= N=1
##DATA TABLE= (X++(R..R)), XYDATA
$$ [...]
38942E18719l42515l01341j24139J3890r426m8579J4936K4343j09048q9628L28145
38931a24643P89929P01234N5707n48488o92261m93368j85925J62670M11174L04317
38921C80346j05303l79492k77247q0051r4992j76293n2049J77593K47832K03897
38911a55759K51255K89534N3620l36414m35606j43544J19803N3855j03814l7328
38901d44398J11999K0230k28933k39120P4357L42459K88510R0715M8878J40453
38891B05150J25300n6496k22846k34685j51852j01376j25429j69741j27338Q7940
38881g71373M05711N61831L34077j63007n26658m47811N816M65821N57916J91899
38871F14222l16389m72199j09931L69658M38313N4084l73117n41687m71381k06534
$$ plain form
38942 518719 176204 -125137 -249276 -235386 -244812 -293391 -278455 -254112 -363160 -452788 -124643
38931 -124643 665286 1366520 1422227 873739 181478 -311890 -497815 -335145 76029 380346
38921 380346 275043 -104449 -381696 -461747 -556739 -733032 -785081 -607488 -359656 -155759
38911 -155759 95496 385030 438650 102236 -333370 -476914 -357111 -303256 -407070 -444398
38901 -444398 -332399 -312169 -541102 -780222 -705865 -363406 -74896 15819 64697 205150
38891 205150 330450 273954 51108 -183577 -335429 -436805 -562234 -731975 -859313 -771373
38881 -771373 -365662 196169 530246 367239 -159419 -607230 -601414 -135593 422323 614222
38871 614222 297833 -174366 -284297 85361 523674 577758 204641 -337046 -808427 -1014961
38861a014961K58926O66252N66567l5186n03246l63868O4284K04865N9350K5863
38851g1154J38028P4094j69524k09568P5568L58232M20854M04633L63975Q6473
38841A471611m06062o54981l99040k4384m626k10438j96753O5559K10607J02547
38831d5960j9512n473Q719o4022p7377O6284K13131J97437R8903R2922J59433
38820F24485J12275j11575l30320l26270j05904J15987J70180Q3560m2590j76874
38810A2954k77954k01977J05652L94726L42330J658k44171k09343r3032o6237
38800b35394j0878J60928K56210J17589q6656j53434j56400j82009o3167K44240
38790a08971L26723j29183o65292n51358J31898N60072L47808o716k0472J11051
$$ plain form
38861 -1014961 -756035 -89783 476784 441598 -61648 -425516 -361232 -156367 -97017 -71154
38851 -71154 66874 140968 -28556 -238124 -162556 195676 616530 1021163 1385138 1471611
38841 1471611 1065549 410568 11528 -12856 -17482 -227920 -424673 -359114 -148507 -45960
38831 -45960 -65472 -70945 -62226 -126248 -203625 -137341 75790 273227 372130 465052 624485
38820 624485 736760 625185 294865 -31405 -137309 -21322 148858 232418 189828 12954
38810 12954 -265000 -466977 -361325 33401 375731 377389 133218 -76125 -169157 -235394
38800 -235394 -246272 -85344 170866 288455 201799 48365 -108035 -290044 -353211 -108971
38790 -108971 217752 88569 -576723 -1128081 -996183 -436111 -88303 -95019 -115491 -4440
38780d440P5930M9830K50939L78499Q0147l47041l34679O2253K48942K931k69775
38769A93536k35537o8427l7808r3400p6090k3911m2885q5507m0747R8628K62133
38758a50015L54945K51859o5312l40740k67383P0420K58271J30894l4812k6163
38748A81964j1028j20824j13727J78515M01362J56976k92196l53344l5081N5923
38738D8540k95930n42102k29974K87228L92926R2737j01813K4968J68098M4073
38728a11249k22440l31968j88957M2491J37500L4291p7953M4342L42585M38611
38718A07253J21037l14077m35392k42823o3870M375J56819L86592L69750O181
38708I5845k98923j71781J69059K13300j13420l48661j20357L75848O17668L55104
$$ plain form
38780 -4440 71490 121320 372259 750758 830905 483864 149185 211438 460380 463311 193536
38769 193536 -42001 -110428 -148236 -241636 -317726 -341637 -384522 -470029 -510776 -412148 -150015
38758 -150015 204930 456789 391477 50737 -216646 -146226 112045 242939 208127 181964
38748 181964 170936 50112 -63615 114900 516262 673238 381042 27698 -7383 48540
38738 48540 -247390 -789492 -1019466 -732238 -339312 -246575 -348388 -323420 -155322 -111249
38728 -111249 -333689 -665657 -854614 -812123 -674623 -640332 -718285 -673943 -331358 107253
38718 107253 228290 -85787 -521179 -764002 -827872 -823497 -666678 -280086 89664 95845
38708 95845 -203078 -374859 -205800 7500 -105920 -454581 -574938 -199090 418578 773682
38698G73682j25055l32878j38207Q9178j9575l14145l39099j4680K37859J37459
38688d5461n8784k3959J07685K6824j79208j66562P7838K19890J16233l4448r0085
38677e0037j24850j47474n7518L7048j21698m24493l76358J64817O45285N42861
38667H7583Q3736j57460o8835M5203Q0726J67316K05175o2110m92542n92114k31144
38656i34466J49359J99017Q5408O5124O4908k7465m1506J55849L26115K17654
38646B59997O648l513R8865L4359j27673r0052J20977J92732N4567r6030k43546
38635B07331n05275o42056k40927M89194P64048L41899n4637J43875M47447J41358
38625A092257m94686o13484j43641J84634P7229L6515L41623N20852K02531k13246
$$ plain form
38698 773682 648627 315749 177542 266720 247145 -67000 -406099 -420779 -182920 -45461
38688 -45461 -104245 -128204 -20519 6305 -172903 -339465 -261627 -41737 74496 40048 -50037
38677 -50037 -174887 -322361 -379879 -342831 -464529 -889022 -1265380 -1100563 -455278 87583
38667 87583 171319 13859 -54976 -9773 70953 238269 443444 381334 -111208 -703322 -934466
38656 -934466 -785107 -586090 -500682 -435558 -370650 -398115 -439621 -283772 42343 259997
38646 259997 266645 263132 361997 396356 268683 178631 299608 492340 546907 450877 207331
38635 207331 -297944 -940000 -1180927 -691733 72315 414214 359577 503452 950899 1092257
38625 1092257 597571 -15913 -159554 25080 102309 138824 480447 1001299 1203830 990584
38615I90584k21635j0840n2208k92947l21056p5255J38614J70520R6439q4168
38605C38048l62897m68464j76668K19649K39387n4513j72108j2519K9919j56368
38595e76534j54771K24905N48625M58960K33935K10353J45125k77544o90939m95029
38585c72914J33084L96980L5950l52761k65674N5667J69483R4333Q1100J31398
38575A06646J15480P7512Q5750K8764j29078j51875O9950J96367p8527m55222
38565a34233m21930m5762J68402J08243J36707L37043L31482J5750j64751L0066
38555C61017J94889j102k02360q384K45347K1206m33175l99210J52116N02184
38545D32528L18108P2911J37400J79627j47229n09721l96705P3582L60817K77597
$$ plain form
38615 990584 768949 758109 705901 412954 91898 16643 155257 325777 422216 338048
38605 338048 -24849 -493313 -669981 -450332 -210945 -265458 -437566 -450085 -420166 -576534
38595 -576534 -731305 -506400 42225 501185 735120 945473 1090598 813054 122115 -372914
38585 -372914 -239830 157150 193100 -159661 -425335 -369668 -200185 -105852 -24752 106646
38575 106646 222126 299638 385388 414152 285074 133199 203149 399516 320989 -134233
38565 -134233 -556163 -601925 -433523 -325280 -188573 148470 479952 495702 330951 361017
38555 361017 555906 554804 352444 344060 589407 610613 177438 -221772 -69656 432528
38545 432528 750636 823547 960947 1140574 993345 483624 86919 160501 521318 798915
38535G98915R8608M7977Q7472J30567J27808N973k00163k59713o7503Q3953j08935
38524G44959m18870l40442J38590M47336K14160k30036l24863J757L15816K46520
38514G94927j14311l54013j94994J92857L62189J14166k44314l00565q0989L4111
38504B09064j13600k60655j52737Q8755J67021l673k53856l82754l08247p9859
38494a090541J58705K70722K46186J80898J34421Q4741J8002l6370o7673r3411
38484a94320j12522j27312j71787k24869j69569L2372K20285K59872K72025L95027
38474A79202M34169R7977m46461o59251l55955L6491J18502M6578J66712M26048
38464D4012M91683K78620K5328q3776j00865j46914k62457m03069m41769k39337
$$ plain form
38535 798915 897523 945500 1032972 1163539 1291347 1297320 1097157 837444 769941 853894 744959
38524 744959 326089 -14353 124237 571573 785733 555697 230834 232591 548407 794927
38514 794927 680616 326603 131609 324466 686655 800821 556507 255942 174953 209064
38504 209064 95464 -165191 -317928 -229173 -62152 -65825 -319681 -702435 -1010682 -1090541
38494 -1090541 -931836 -661114 -414928 -234030 -99609 -14868 3134 -33236 -100909 -194320
38484 -194320 -306842 -434154 -605941 -830810 -1000379 -968007 -747722 -487850 -215825 179202
38474 179202 613371 711348 264887 -394364 -750319 -713828 -595326 -548748 -382036 44012
38464 44012 535695 814315 839643 755867 655002 508088 245631 -157438 -599207 -838544
38454h38544J48425M20927L51919Q1533p7833n3162l4440j27730k00715j15305
38444d44925N6299J45164J23389J09580J41687P0314j98863m19944k12198L56336
38434b73161O71506L18360l07796n08000k19108L5861K7446L3466J32810j1738
38424a00354m13009m86175M1838N37021L41340k17521l43064N5741L94207L78966
38414A88990K44287J44293j7495j83260j68650q3943j79533l24681k09332K3365
38404e65959k531j22643J53100O48879O15972k4923m34688j60360J99649Q0352
38394C86848j74960j27134r5511m13081n51405M5907P85216O47372k09604o51178
38384c57530k63365K07729J79548k6502k5689k6844k28973l24233r9711Q2394
$$ plain form
38454 -838544 -690119 -269192 82727 164260 86427 33265 -1175 -128905 -329620 -444925
38444 -444925 -388626 -243462 -120073 -10493 131194 201508 2645 -417299 -629497 -273161
38434 -273161 398345 716705 408909 -99091 -318199 -282338 -254892 -221426 -88616 -100354
38424 -100354 -513363 -999538 -957700 -420679 -79339 -296860 -639924 -584183 -189976 188990
38414 188990 433277 577570 560075 376815 208165 124222 -55311 -379992 -589324 -565959
38404 -565959 -568490 -691133 -538033 110846 726818 701895 267207 106847 306496 386848
38394 386848 211888 84754 -10757 -423838 -975243 -929336 -144120 503252 293648 -357530
38384 -357530 -620895 -413166 -233618 -260120 -285809 -312653 -541626 -865859 -965570 -883176
38374h83176p5542k14387P0981M59847L68818r9287l07058m9607K33232K11755
38364b84424Q7130J24712K09051J06714j05842j49223L3915J79498M2736k77741
38354c3474m30886k23457J34987K79287J35710k7262j322J05489J05097L2054
38344G6223M4239J48124K02606J27153l3001j76473j70971O7466L79467M01292
38334A066125N748m33849m72402j66889P1784Q9622P7736J07863L7128p4651M6938
38323C55153L18302K36234l03440o42518k92683K24896J25342l84882m18783J44227
38313f38152M45708M2861l91467j89528K80659L29382N7418r202O5584j54797
38303a61534n10618m06202J21528L76978J33209o1469R8607J93112m4355j65657
$$ plain form
38374 -883176 -958718 -1173105 -1102124 -642277 -273459 -372746 -679804 -729411 -496179 -284424
38364 -284424 -197294 -72582 136469 243183 137341 -11882 22033 201531 244267 -33474
38354 -33474 -464360 -687817 -552830 -273543 -137833 -165095 -166417 -60928 44169 76223
38344 76223 120462 268586 471192 598345 565344 388871 217900 285366 664833 1066125
38334 1066125 1071873 638024 165622 -1267 70517 160139 237875 345738 382866 308215 355153
38323 355153 673455 909689 606249 -36269 -328952 -104056 21286 -363596 -782379 -638152
38313 -638152 -192444 -149583 -541050 -730578 -449919 -120537 -63119 -72321 -6737 -161534
38303 -161534 -672152 -1078354 -956826 -579848 -446639 -508108 -409501 -216389 -260744 -426401
38293d26401J65215M86721L03265n7291n2641J08935q0546l89432j71160M47208
38283C33873O35402J45731l48707l70868k70388m21741n34140k37178K09067L23121
38273e35828J37060K3832O7209O9925R15P276Q5404R1613J5874k4124P676O7766
38261A4598J39032J64289L3691j85579k15614K0365J85194j878l10880l43102
38251d99884j22047L3434O1139J59733L40361M05977L38630K90166K07776q9874
38241A125411m44637m48520j06088P5667j43419l41007j08269K82402K95568n8588
38231A28520k89230j65085M5362O0486o2050j32146r7172P097J61634K92491K47656
38220A97563q053k51790j97902J51290M31584K65724k98635p58918o54661r0581
$$ plain form
38293 -426401 -261186 225535 528800 471509 418868 527803 447257 57825 -113335 333873
38283 333873 969275 1115006 766299 395431 125043 -296698 -830838 -1068016 -858949 -535828
38273 -535828 -398768 -374936 -307727 -237802 -236887 -229611 -144207 -52594 -36720 -60844 -53168 14598
38261 14598 153630 317919 351610 166031 -49583 -29218 155976 154098 -156782 -499884
38251 -499884 -621931 -588497 -527358 -367625 -27264 378713 717343 1007509 1215285 1125411
38241 1125411 680774 232254 126166 201833 58414 -282593 -390862 -108460 187108 128520
38231 128520 -160710 -325795 -280433 -219947 -281997 -414143 -511315 -504218 -342584 -50093 197563
38220 197563 189510 -62280 -260182 -108892 322692 588416 289781 -469137 -1123798 -1214379
38210a214379L50063K61072j35272k92286L602M38924O08754M64479K50690J27661
38200H63308K4295j33782k20727p8897J76145K24076l2693l05799l23308k13194
38190b0576k54991l88724l01341K8307K38003J24221o2469l1115J37246K09992
38180c21447J79923J63944J37130M8495K4935J62001K60932R0944k09498l24447
38170B12912k44050j94989j81034j2550K41558K92249J59978J86594L99980L60083
38160A220731j33809o35744o65956l50422j04796k5302J7634o237j23865o4902
38150h72668L56641P40629N39558o9886l31738K1148M01419K40016k69509n67317
38140A88293m72917k09659L6579K39703L58913L25057J56258o1557k42387k85476
$$ plain form
38210 -1214379 -864316 -603244 -738516 -1030802 -1027200 -588276 20478 484957 735647 863308
38200 863308 887603 753821 533094 454197 630342 854418 821725 515926 192618 -20576
38190 -20576 -275567 -664291 -965632 -937325 -699322 -575101 -637570 -668685 -531439 -321447
38180 -321447 -141524 22420 159550 208045 232980 394981 655913 746857 537359 212912
38170 212912 -31138 -226127 -407161 -419711 -178153 114096 274074 460668 860648 1220731
38160 1220731 1086922 451178 -214778 -565200 -669996 -695298 -677664 -683901 -807766 -872668
38150 -872668 -516027 224602 764160 694274 362536 383684 785103 1025119 755610 188293
38140 188293 -284624 -494283 -457704 -218001 140912 465969 622227 560670 318283 32807
38130C2807j39091N8721R0880k2431m6686N9906O4113r1053j12014J32031K78043
38119C05226J749m15111m79894k32565j07078j77680q1237K93118N47397L56349
38109A0274q3879l58893k90747L4368L99953N03082J68483l36785m88970j55297
38099e98411K32496K98604J80699J55879J65614L7049j16014j02753n1108j76614
38089B5441l09857j14115K88673L89916M4967k94701k43369J8687J23155N6779
38079a4424L2951N4912n6064k97032m46840l78177j73408P6698L69506O29519
38069b02359O49985L36636q7607k72122j28160P9407O8928j09624j55617P1671
38059B51138L45972L53782R8835j12457q5218J8027p0762l38438n02014l83215
$$ plain form
38130 32807 -106284 -47563 43317 20886 -25800 34106 98219 7166 -104848 27183 305226
38119 305226 306975 -108136 -588030 -820595 -927673 -1105353 -1186590 -893472 -346075 10274
38109 10274 -73605 -432498 -723245 -688877 -288924 214158 382641 45856 -443114 -598411
38099 -598411 -365915 -67311 113388 269267 434881 471930 355916 253163 202055 25441
38089 25441 -284416 -398531 -109858 280058 325025 30324 -213045 -194358 -71203 -14424
38079 -14424 18527 73439 17375 -279657 -726497 -1104674 -1278082 -1201384 -831878 -202359
38069 -202359 447626 784262 696655 424533 296373 375780 444708 335084 179467 251138
38059 251138 597110 950892 1049727 937270 852052 870079 799317 460879 -41135 -424350
38049d24350j26521Q457l2961q4633j2027J34514K25932K15394J52838J11848
38039A68491J44172K33253K50455O4209k24983k92468L180L31590K53537j71975
38029G59461m37193k79680p100O976j60493k08180r7340m900L0537Q0827P0435
38018b46650r5412k19326j7784L68393M75644J98019m3856L5389J58345j6929
38008E95833l08196k82279Q1901L77981L45418J32929j4073n9696r7508j38216
37998F34094q5930J02771K69740J31911l72623q52484q06701k50143K66740L62511
37988f00114K34656J95496J82602N5638Q454K00778K68081j87321p77144p07437
37978a126311J2705M82984K14322k11772j43108J69590J52051q8730m1859K59804
$$ plain form
38049 -424350 -550871 -542414 -575375 -660008 -672035 -537521 -311589 -96195 56643 168491
38039 168491 312663 545916 796371 860580 635597 343129 346309 677899 931436 759461
38029 759461 322268 42588 35488 42464 -118029 -326209 -423549 -428449 -397912 -317085 -246650
38018 -246650 -342062 -561388 -579172 -210779 264865 462884 419028 454417 612762 595833
38008 595833 287637 5358 87259 465240 810658 943587 929514 869818 772310 634094
37998 634094 548164 650935 920675 1052586 679963 -172521 -979222 -1229365 -962625 -600114
37988 -600114 -365458 -169962 12640 68278 76732 277510 545591 358270 -418874 -1126311
37978 -1126311 -1113606 -630622 -416300 -628072 -771180 -601590 -449539 -538269 -580128 -320324
37968c20324L06743q891k62909k25541r8892N449K19052M42807L24493r0207k58322
37957C3458K6001K47414o32l27483k11743Q4194m8869m72634m31567K19921O85701
37946a96239L73846k60507m40133j65635m4781k75145l95707o4306M19255N60162
37936d89190L11100J7062r6533j16149j75277k29427j58878L1907K09068K64035
37926d32282K08918J19089K9223p2099j50346r6760J31909L68605L53486N6447
37916E16190k22565j92144O1887K01961R7937m1851k9859M3413L6297J7276P8217
37905E66759O1949k11460n27859m53932L0257M28942L94326J57242P4304O1258
37895E81786j69579n13309n48514j71129K45196L84339L38790L06612K50858O2269
$$ plain form
37968 -320324 -13581 -22472 -285381 -510922 -609814 -604365 -385313 57494 381987 291780 33458
37957 33458 59459 306873 306241 -21242 -232985 -148791 -197660 -670294 -1101861 -881940 -196239
37946 -196239 177607 -82900 -523033 -688668 -733449 -1008594 -1404301 -1468607 -1049352 -489190
37936 -489190 -178090 -161028 -257561 -373710 -548987 -778414 -937292 -905385 -696317 -432282
37926 -432282 -223364 -104275 -75052 -147151 -297497 -394257 -262348 106257 459743 516190
37916 516190 293625 101481 163368 365329 463266 421415 391556 434969 471266 488542 566759
37905 566759 628708 417248 -110611 -564543 -534286 -105344 288982 446224 520528 581786
37895 581786 412207 -101102 -649616 -820745 -575549 -191210 147580 454192 705050 767319
37885G67319j65267k49303j71914l1704J33466K93579L17434J30656r6981j41951
37875G85334n5298p1556k09741k23475k837K20625J98467K076j28939j29200j06469
37864B78987r4766k6348P7213R8400L7578L9795J37886J53545k0819k02698j65640
37853C13133P078M5869p5746j04776N2300J31375q3963l70313l23373Q7064M59072
37842A37720M36017M9984m00508o23612m77354m9963L35194L68805R9723j04029
37832b28023o540K35878L50297L04137K30875J44852m5509k85118l52820j53632
37822A94397J03986J18586j48747l93378k83961J31738M13323K21161k30501l96297
37812b69693q8888K85242K87293J0530j33296k4205O0821q9264l21004l38237
$$ plain form
37885 767319 602052 352749 180835 149131 282597 576176 893610 1024266 927285 785334
37875 785334 730036 658480 448739 225264 222427 443052 641519 643595 514656 385456 278987
37864 278987 184221 157873 235086 333486 371064 410859 548745 702290 681471 478773 313133
37853 313133 320211 366080 290334 185558 237858 369233 285270 -85043 -408416 -321352 137720
37842 137720 573737 623721 223213 -400399 -877753 -927716 -592522 -223717 -123994 -228023
37832 -228023 -234563 1315 351612 655749 886624 1031476 985967 700849 348029 194397
37822 194397 298383 416969 268222 -125156 -409117 -277379 135944 357105 126604 -269693
37812 -269693 -358581 -73339 213954 224484 91188 66983 127804 38540 -282464 -620701
37802f20701n3230L37766N28704L53591l9280k91551k13366M009O8128l0816r2921
37791d9667n1000M928O2126J54419J52131p5308l00212j47766K64068L55055n2509
37780C16265l73375j19219L03578J88478l47338m90372M3942N68156M21945j18554
37770C93506l20952l9467K06519P4688j56779q7583K17555L75126K33019J1586
37760I07218o1110j5398J3099N033Q32l3489j22267j66892j03323q0830k40129
37749A02744l75199j47071L30101N00776J43495k33344r1128L33775L66492j10554
37739H20087m97606l50005M5301J53013q9459l00500k12651N9113K45917K33787
37729A06997J28900R1077J23439O7531j34663k70199j24740J41166J56602r6671
$$ plain form
37802 -620701 -673931 -336165 192539 546130 506850 215299 1933 5942 74070 43254 -49667
37791 -49667 -100667 -95739 -33613 120806 272937 197629 -102583 -250349 13719 368774 316265
37780 316265 -57110 -176329 127249 315727 -31611 -521983 -478041 90115 512060 393506
37770 393506 72554 33087 239606 314294 157515 69932 287487 662613 895632 907218
37760 907218 846108 830710 843809 848842 849674 816185 693918 527026 423703 342873 102744
37749 102744 -272455 -419526 -89425 411351 554846 321502 230374 564149 930641 820087
37739 820087 322481 -27524 17777 170790 81331 -219169 -431820 -372707 -126790 106997
37729 106997 235897 326974 450413 517944 383281 113082 -11658 129508 286110 189439
37719A89439k03519O4398L52570K04878k73650n52954l80976m6766N4287j30989
37709g23282l44463l17913j116L84064N09586K77566l5129j02151L6909P8272
37699b37657o6522j54187k1692J53979J47418J2717p1435j04720j73402j80064
37689f95565M3552L78620M67771J97186j15315j48264R034N4644o7787j49854
37679b5978q4777R085M4348R2412J71215J37675n3148j73664k3511K27817K48487
37668E69961K4136j43164j07975o3085j75474l15847k98095j61088l0390J05000
37658e96021K65421L05219J25978o3604J078K03904J89846o7563j94489L887K33075
37647D06731J59834j06064k28437j49420j00356k02011l06390k27346L9020L19849
$$ plain form
37719 189439 -14080 50318 402888 607766 334116 -218838 -599814 -646580 -592293 -723282
37709 -723282 -1067745 -1385658 -1386774 -1002710 -493124 -215558 -250687 -352838 -315929 -237657
37699 -237657 -304179 -458366 -480058 -326079 -178661 -165944 -237379 -342099 -515501 -695565
37689 -695565 -652013 -273393 194378 391564 276249 127985 137019 191663 123876 -25978
37679 -25978 -110755 -101670 -57322 35090 206305 343980 290832 117168 93657 321474 569961
37668 569961 594097 450933 342958 279873 104399 -211448 -509543 -670631 -701021 -596021
37658 -596021 -330600 -25381 100597 36993 38071 241975 431821 364258 169769 173656 406731
37647 406731 566565 460501 232064 82644 -17712 -219723 -526113 -753459 -714439 -394590
37637c94590M00129K16977p971K9815K80978L22942k7703l40652j54220K76747
37627F02452L00998j40138m10949j59267J78311J09359j88266k64889j15588l3235
37617a21212n3009m3045j11192l79581n28117j68509M02359M77441J5594k33746
37607g43017J28623N54050M42923M2926n2348J57985K38078J08115N8642J18114
37597A054091L329l08406m75444l26880p8737N9388J22666J68419J66297J77101
37587E61824K99499L85773J85513j62814k23088J7910J3114m80066q70899n27796
37577h01030K39124N50309J60640k87040k40372P0084J26299j05920k42642r6247
37567f26795J36076K43884K49003K12983N5514k51581m56404k52935K57109N69691
$$ plain form
37637 -394590 5539 222516 214545 244360 525338 848280 820577 479925 325705 602452
37627 602452 903450 763312 352363 193096 371407 480766 292500 27611 -87977 -121212
37617 -121212 -174221 -217266 -328458 -708039 -1236156 -1404665 -1002306 -524865 -509271 -743017
37607 -743017 -614394 -60344 382579 425505 373157 531142 769220 877335 935977 1054091
37597 1054091 1057420 749014 273570 -53310 -132047 -72659 50007 218426 384723 561824
37587 561824 861323 1247096 1432609 1269795 1046707 1064617 1077731 597665 -273234 -801030
37577 -801030 -561906 -11597 149043 -137997 -378369 -308285 -181986 -287906 -530548 -626795
37567 -626795 -490719 -246835 2168 215151 270665 19084 -437320 -690255 -433146 136545
37557A36545L70074o2101k29503o7712M7580q9163k05848J8209M40780N91960
37547I50821K49270l00422n90636m59302j45393N2793J05413J56916K01059Q2980
37537C03499j43589j65037R8070K41960m9641m36324l75814J8883J46183r2647
37527d54457j22153L21183O73480L85643k26008m43612j14753L13287M76050L58416
37517A167076N8232k88928m51204l13965o4694P9571J44657J63597k1990l78495
37507I3857m50060j134M23734J94141l80723m35420J35084N13001J98883l22317
37497c0954m02921r4430J47526J33110l1644k17535k84565j22379J16773J34140
37487f52879k9707o562K61741L55518O2690k38827j73341R7348K51071K92232
$$ plain form
37557 136545 506619 444518 215015 147303 194883 105720 -100128 -81919 358861 950821
37547 950821 1200091 899669 309033 -150269 -295662 -242869 -137456 19460 220519 303499
37537 303499 159910 -5127 92943 334903 285262 -151062 -526876 -507993 -361810 -454457
37527 -454457 -576610 -255427 418053 803696 577688 134076 19323 332610 808660 1167076
37517 1167076 1225308 936380 485176 171211 106517 186088 330745 494342 472352 93857
37507 93857 -356203 -357337 66397 260538 -120185 -555605 -420521 92480 291363 -30954
37497 -30954 -433875 -528305 -380779 -247669 -279313 -496848 -781413 -903792 -787019 -652879
37487 -652879 -682586 -689148 -427407 -71889 -9199 -248026 -421367 -324019 -72948 219284
37477B19284L10521J72026j52449l43758k33423j46579k96733k83328K21377O90234
37467A57172L89774m32625q06167m02049J38482K80360K20323K42212J74818j32751
37457a70451l55852j68883J92686K67598K7286j61472p3370J70611L28186K50326
37447C06665k7752k59790j89598R4818J96227m9692k91928j53887J99957L03371
37437A28391O9121j41652j22795j03688k77345l86277r0638M29301O19079K97645
37427D21142j01835j65749l8406o6725j88323q1304K13825K94692L7347k14549
37417A10115k11639j23121j25059q8217O8488J14004p3402j76457Q1036M28488
37407D236M48198K23269J33769K19686K17808N8260j46927m32480p86739q09708
$$ plain form
37477 219284 529805 701831 549382 205624 -27799 -174378 -471111 -754439 -533062 157172
37467 157172 546946 114321 -691846 -1093895 -955413 -675053 -454730 -212518 -37700 -170451
37457 -170451 -526303 -695186 -502500 -234902 -207616 -369088 -442458 -271847 56339 306665
37447 306665 278913 19123 -170475 -75657 120570 70878 -221050 -374937 -174980 128391
37437 128391 197512 55860 -66935 -170623 -447968 -834245 -924883 -495582 123497 421142
37427 421142 319307 153558 115152 48427 -139896 -221200 -7375 287317 324664 110115
37417 110115 -101524 -224645 -349704 -437921 -369433 -255429 -328831 -505288 -424252 4236
37407 4236 452434 675703 809472 1029158 1246966 1305226 1158299 725819 -60920 -870628
37397h70628j68832O98812R78835N58924Q4636o2057j30356k62849j80505J26153
37387G72133J45577k93010n69573k09668K98353K42646k01741l01892O6854L04844
37377B54523O3992l09928l97617k47723j06379K4252K92893O27881O99025L01761
37367A202680l00911n66547k96676P7937N8132k23368k37399Q4630K48440L2521
37357G9439j41268P4836L82529L42954K3518k51004m07060m72205k90832J48605
37347e10488M34211K68083j4040L4458K28736J15045j71938p7468M61837R18563
37337A686999R64778P74514N28862J94535j37309k28883j30588j77598m45079
37328C030231o28543n55535m04776l30535k67493j88723j72226j52434M318J49017
$$ plain form
37397 -870628 -1039460 -340648 638187 1197111 1281747 1219690 1089334 826485 645980 772133
37387 772133 917710 624700 55127 -154541 143812 386458 184717 -117175 -50321 254523
37377 254523 318515 8587 -389030 -636753 -743132 -718880 -425987 201894 900919 1202680
37367 1202680 901769 335222 38546 116483 174615 -48753 -286152 -201522 46918 79439
37357 79439 -61829 13007 395536 738490 762008 511004 103944 -368261 -659093 -510488
37347 -510488 -76277 191806 177766 212224 440960 556005 384067 306599 768436 1686999
37337 1686999 2651777 3426291 3955153 4149688 4012379 3783496 3652908 3475310 3030231
37328 3030231 2401688 1846153 1441377 1110842 843349 654626 482400 329966 334284 483301
37318D83301J0651k63159k23278J42752L23391R1703j34312J4463K96853L10703
37308A053068R4080o5610j07703j64550k86606m39235n58746m71085m3170M62825
37298e26732N50577J69100j57029o7362J84332K51893K13922K51084K39435N3026
37288A162246j06093q6673j37609m36680o14462k65106L34364N62704L32947R5268
37278H40906Q2553R3037o712o3364K5159J42434J72039Q9290j26780l80862l77160
37267D90540j3901K67890r998n83923p05395k04213K62437J79863j32106r0773
37257e39579L00396N53290L98731K9384k43931k91672j59386L5869J89293K66300
37247E38695K57367R8094k24870m91179l99306P693K96814J85795p4179p9601
$$ plain form
37318 483301 493952 230793 7515 150267 473658 565361 431049 445512 742365 1053068
37308 1053068 1147148 1081538 973835 809285 522679 83444 -475302 -946387 -989557 -526732
37298 -526732 23845 192945 35916 -31446 152886 404779 618701 869785 1109220 1162246
37288 1162246 1056153 969480 831871 395191 -219271 -484377 -150013 412691 745638 840906
37278 840906 923459 1016496 1009784 946420 971579 1114013 1286052 1375342 1248562 867700 490540
37267 490540 476639 744529 734531 150608 -554787 -759000 -496563 -316700 -448806 -539579
37257 -539579 -239183 314107 712838 742222 498291 206619 47233 83102 272395 538695
37247 538695 796062 894156 669286 178107 -221199 -213506 83308 269103 194924 115323
37237A15323J29931J72805l6455j24506J40309M09320K11131l26041n86983k99601
37227a94767J31975K58811J75103J88645K33109O1365j71626p6440K48992K52717
37217A107884j88369m93807k57714J28243J29543j05690r4035J33586J24140j99012
37207B84769m00459k09356J26281K42628Q5918j30344j53735J22910N02400N84421
37197A055433K45038j26885j50857l1297k26932o76943q21679l82380L06949P82681
37187b6872Q87420O88047L31270M9510l518L6823l3545j26477o1904n320k31038
37176A504396n28976m28272k7826M2601l72851o58180l97119J0414R8440R3154
37166f64219L76119O74083M46164j90126n56947l40841J02870L29667K52063K4658
$$ plain form
37237 115323 245254 418059 381604 257098 397407 806727 1017858 691817 104834 -194767
37227 -194767 -62792 196019 371122 559767 792876 854241 682615 606175 855167 1107884
37217 1107884 919515 425708 167994 296237 425780 320090 226055 359641 483781 284769
37207 284769 -115690 -325046 -198765 43863 129781 -563 -154298 -31388 471012 1055433
37197 1055433 1300471 1173586 1022729 991432 764500 87557 -734122 -1116502 -809553 -26872
37187 -26872 860548 1548595 1879865 1929375 1925857 1962680 1929135 1802658 1740754 1735434 1504396
37176 1504396 975420 547148 519322 561923 189072 -469108 -866227 -855813 -757373 -664219
37166 -664219 -288100 385983 832147 642021 85074 -255767 -152897 176770 428833 453491
37156D53491j39874m6455K74027M64022K42036j58319k73765p3217L6292j38035
37146F40203l09019j92260Q9921K54727K44211J69282O4216q6329j88925j23402
37136E62625M4650J03105l3794k16997k67674j80625n3172P8273J96931J85548
37126D18870m5444l27907l79832k16321j30260j76825m8355L28216M90701J24425
37116C7268l33515l01133M4861J20621l8954J02857N18691N56063O6976k94405
37106D79330j90758j32653m40026n39213L7293O87366N96933J1366k24494L125
37096B88269J15041m6318p0042J29286J40552j50223l46329k52683j55026k38029
37086e85502k92489j53211O3008K60444M41435M40791R2032l09895k72366J12877
$$ plain form
37156 453491 313617 267162 541189 1005211 1247247 1088928 815163 741946 778238 640203
37146 640203 331184 138924 228845 483572 727783 897065 961281 874952 686027 562625
37136 562625 607275 710380 676586 459589 191915 11290 -41882 36391 233322 418870
37126 418870 373426 45519 -334313 -550634 -680894 -857719 -906074 -577858 -87157 37268
37116 37268 -296247 -597380 -552519 -431898 -470852 -367995 150696 706759 773735 479330
37106 479330 288572 155919 -284107 -823320 -786027 -98661 498272 509638 285144 288269
37096 288269 403310 356992 286950 416236 556788 406565 60236 -192447 -347473 -585502
37086 -585502 -877991 -1031202 -968194 -707750 -266315 174476 266508 -43387 -315753 -202876
37076b02876K54689J7851p8398K01281L84059J29572j77098j19933N1338m9348
37066D11137k20852q8929J43550K2865l21542l37754M6507L05033J33646j46838
37056e3177j39216J04312K85634K78438J53195m612j32320j71064j25887o9878
37046A25425l8283K382O2573J05988J35204J92843K41643J49868j31195m41946
37036D04502n51604m01586j45528M4318J28233J36320O6963n3604j00943j491
37026d74420J03411M8835k9207J56554N29803O29478K61179j66585k04136M7839
37016I02751K09579J89599J13519l9539k91358l88409j57615O4385j05646l93200
37006A04066k50785J94381L10972M1642j3837K98257L74938n6186l94861j86507
$$ plain form
37076 -202876 51813 69664 -8734 192547 576606 706178 529080 409147 460485 411137
37066 411137 190285 101356 244906 267771 -53771 -391525 -345018 -39985 93661 -53177
37056 -53177 -192393 -88081 197553 475991 629186 624574 492254 321190 195303 125425
37046 125425 87142 89524 152097 258085 393289 586132 827775 977643 846448 404502
37036 404502 -147102 -548688 -694216 -649898 -521665 -385345 -318382 -371986 -472929 -474420
37026 -474420 -371009 -322174 -351381 -194827 334976 964454 1225633 1059048 854912 902751
37016 902751 1112330 1301929 1415448 1375909 1084551 696142 538527 602912 497266 104066
37006 104066 -146719 47662 358634 400276 386439 684696 1059634 1003448 608587 422080
36996D22080R8196p5533l40373p7600M83279O44577L69185J80866J50534j39996
36986A715215o55219p76916k80124K74875L81605K26731J90775K27201J25935
36977A430078M198Q8738K34755R6624l02059n53262m53413k80123l32037m42346
36967e08847k27897K75797N73828L90287O0396J4960J57910J20026q2714j28072
36957F45674j7551o2623k29101j18082K52761L06896j47587m72353j58937L34260
36947C33357L00892j11399k09950J31084L85725K57712k1931k28829l71898l85921
36937G8842j50408J47041J58335p4101j58812L8732K66945L53230L42301J90572
36927A192677j74627m77556l14863J65212L36939q714l47206j85617L12282O77540
$$ plain form
36996 422080 520276 444743 104370 26770 510049 1154626 1523811 1704677 1855211 1715215
36986 1715215 1059996 283080 2956 277831 659436 886167 1076942 1304143 1430078
36977 1430078 1434276 1523014 1757769 1854393 1552334 999072 545659 265536 -66501 -508847
36967 -508847 -736744 -460947 112881 503168 563564 578524 736434 856460 773746 645674
36957 645674 628123 565500 336399 218317 471078 777974 630387 158034 -903 333357
36947 333357 634249 522850 312900 443984 829709 1087421 1065490 836661 464763 78842
36937 78842 -71566 75475 233810 159709 897 39629 306574 659804 1002105 1192677
36927 1192677 1018050 540494 225631 390843 727782 719068 371862 186245 498527 1176067
36917A176067P02609M39907Q601l68131m41935k48030p6851m2697J0497J22785
36907A282822J33315O4109J48421L47564K98426q3556m05532l96678k44483j26387
36897A018021Q6715L90548M37520J18442j39429m4509P9705p7540k19639j9945
36887A629889J88895k8473l50935j59734L92097N68139K01047j32754j07979n5749
36877B144443k31090l74925k56669o3748K8849J52527L13395J74202l59157p70515
36867G57312n90264q8818J35949J1475m3000J49292L01574J64732j39775l42416
36857C16061l05218n3553K37682K99865N0764k11505j60756N8086L0877k25761
36847C6542k17276K25347N64208L14189j92147k68242J30466M03821K14063j41565
$$ plain form
36917 1176067 1878676 2318583 2327184 1959053 1517118 1269088 1192237 1149540 1160037 1282822
36907 1282822 1416137 1480246 1628667 1976231 2274657 2191101 1785569 1388891 1144408 1018021
36897 1018021 1104736 1495284 1932804 2051246 1911817 1867308 1947013 1869473 1649834 1629889
36887 1629889 1818784 1790311 1439376 1279642 1671739 2239878 2440925 2308171 2200192 2144443
36877 2144443 1913353 1538428 1281759 1218011 1246860 1399387 1712782 1886984 1527827 757312
36867 757312 167048 78230 214179 225654 182654 331946 633520 798252 658477 316061
36857 316061 10843 -42710 194972 494837 545601 334096 173340 231426 262303 36542
36847 36542 -180734 44613 608821 923010 730863 462621 593087 996908 1210971 1069406
36837A069406l08126l13483k85610j88615n5561p6877k09548r3628L44237O00176
36827D82371K92304k05191k95398l1990Q2758m3064n2974J22311J34962j08864
36817C77225k38047m5522J78984J61131M2787K3180l822j57710k36562k011M03584
36806E03217O07923M58222J27356j24770j68004q0836p1690k08272k61553k3731
36796G57862K93038L00488M2236n1643J42345K52006M7034j94938j80259l6730
36786A371439R047J1512O7011M2311j33550k08057L0882L81410N25060M59646
36776B556711L48756J90653n4780k36473k17549j15758p6141k3336J10246J71492
36766B653821P8466M1405J77813K05480r9158m11556k81941J46610L25394J12212
$$ plain form
36837 1069406 761280 447797 162187 -26428 -81989 -158866 -368414 -462042 -117805 482371
36827 482371 774675 569484 274086 242096 324854 281790 228816 351127 486089 377225
36817 377225 139178 93656 272640 433771 476558 499738 495916 338206 101644 99633 503217
36806 503217 1111140 1569362 1696718 1571948 1403944 1323108 1251418 1043146 781593 757862
36796 757862 1050900 1351388 1393624 1341981 1484326 1736332 1783366 1588428 1408169 1371439
36786 1371439 1380486 1391998 1459009 1501320 1367770 1159713 1190595 1572005 2097065 2556711
36776 2556711 2905467 3096120 3041340 2804867 2587318 2471560 2395419 2372083 2482329 2653821
36766 2653821 2732287 2773692 2951505 3156985 3057827 2646271 2364330 2510940 2836334 2948546
36756B948546p0324R4810L83171L77390J2556l49068l16154R3037M43360L95220
36746D012544J25491K4378J09316J20281R2663K93968N89054N03305L8307k37976
36736E671331r9213N1881M1301K62526P88735R97912O14109L09915O40258J143277
36726A0422032J193017J007130J076776J324864J575022K090080K889257L406465
36718B4984643L642615M605701O616790Q416102R262802J0564209J3596953J6799112
36710I8488927J7574641J5959247J4069982J2523985J0119275O894507M726997
36703A80357561M640438N984773Q285724J1068106J1846077P931703J106342l224356
36695B27996368l019642k041873l343561m298225j180295M880930J0306443J4241039
$$ plain form
36756 2948546 2878222 2973032 3356203 3733593 3746149 3397081 3080927 3173964 3617324 4012544
36746 4012544 4138035 4162413 4271729 4392010 4484673 4778641 5367695 5871000 5909307 5671331
36736 5671331 5572118 5623999 5665300 5927826 6716561 7714473 8328582 8638497 9278755 10422032
36726 10422032 11615049 12622179 13698955 15023819 16598841 18688921 21578178 24984643
36718 24984643 28627258 33232959 39849749 48265851 57528653 68092862 81689815 98488927
36710 98488927 116063568 132022815 146092797 158616782 168736057 175630564 180357561
36703 180357561 184997999 190982772 199268496 210336602 222182679 230114382 231220724 227996368
36695 227996368 224976726 222934853 219591292 215293067 214112772 218993702 229300145 243541184
36687B43541184J6927545J6021564J0410030N686174Q477440J4898097J2032095
36680C27994129o018153k9168326m2378007m1458282l3724567k6672059k1770531
36673A26804204j8042279j5759725j5018350j4220063j1980918q904727o394302
36666C6483840m941789m248193l925820l525255k724309j858922j564604j755856
36658A1939092j702149j174613p20591o95245p85425o58271m23388k83754k59451
36649E236205l49624n15379n25582k70032r5972l20765o02835m14673M6078J39303
36639B326724j50485k30352L7866J34074j39077k94068l7372K26122J17474j17429
36629A873477j26470l6470j05630k26970j86702o8241l2293q303O0804j1144k78002
$$ plain form
36687 243541184 260468729 276490293 286900323 292586497 301063937 315962034 327994129
36680 327994129 321975976 292807650 250429643 208971361 175246794 148574735 126804204
36673 126804204 108761925 93002200 77983850 63763787 51782869 42878142 36483840
36666 36483840 31542051 27293858 23368038 19842783 17118474 15259552 13694948 11939092
36658 11939092 10236943 9062330 8341739 7646494 6861069 6202798 5779410 5495656 5236205
36649 5236205 4886581 4371202 3845620 3575588 3479616 3158851 2556016 2141343 2187421 2326724
36639 2326724 2176239 1945887 1983753 2117827 1978750 1684682 1647310 1873432 1990906 1873477
36629 1873477 1747007 1710537 1604907 1377937 1191235 1122994 1090701 1082398 1143202 1132058 854056
36618H54056l71174j7997L93432K66387k97079n50477j18371M86153N58970J06438
36608A310338k52524j54804P4237m6155m27543m98648N594O31011P41859K79921
36598A663286k47269m26204l07118j32707J0189J57922K83590K90320J21427j79828
36588A233608m55796m89068k02595J75741K95461Q5533j55240j38957O0378J35311
36578E44376n7087l35974m11191j79103J96256M47092M28047K02054n5097k00265
36568E79108j96364j07989l5869m538P2222K34205L19817J32762k16988l49272
36558D27094r8163K33589K70120M6588j14345q0867o802o846j1911K3735J0980
36547F93172q6619j28522J4894K40289K90361M7219l00630m11957j47079K38501
$$ plain form
36618 854056 482882 464885 858317 1124704 827625 277148 158777 644930 1203900 1310338
36608 1310338 1057814 903010 977247 931092 503549 4901 10495 641506 1383365 1663286
36598 1663286 1416017 989813 682695 549988 560177 718099 1001689 1292009 1413436 1233608
36588 1233608 777812 288744 86149 261890 557351 642884 487644 348687 409065 544376
36578 544376 487289 151315 -259876 -438979 -242723 204369 632416 834470 779373 579108
36568 579108 382744 274755 238886 234348 306570 540775 860592 993354 776366 427094
36558 427094 328931 562520 832640 879228 764883 684016 677214 670368 658457 682192 693172
36547 693172 606553 478031 492925 733214 1023575 1070794 770164 358207 211128 449629
36537D49629L38304O0426k63748l00828j05981L9591N2693Q9784J95963J56287
36527G12120j82140n69471n29907N6626O68981O42236j3506n35785l42862J97074
36517A03366K95694j25820l80355j02593K38194J59189r7278q0500J04820J09436
36507B24153M4685K38515N18859M10451m6505l10849j60539R6963K45721L79236
36497A640690M32808J47113l25899m10029K6006L62217J38609k55308k35338Q3444
36487A604313J62490j05364l46749l35988j94382m8052J04628K08709J56746k4533
36477A181818k07071l24260l33276j55727J38007K51611K2794k84589l10316p9667
36467a00676J17820J83819K25100K26806P5037j27704j16848J24886K91399J47274
$$ plain form
36537 449629 787933 848359 584611 283783 177802 217393 270086 359870 555833 712120
36527 712120 529980 -39491 -569398 -512772 156209 798445 784939 249154 -93708 103366
36517 103366 399060 273240 -107115 -209708 28486 187675 90397 9897 114717 224153
36507 224153 268838 507353 1026212 1436663 1390158 1079309 918770 1015733 1261454 1640690
36497 1640690 2073498 2220611 1894712 1484683 1510689 1872906 2011515 1756207 1520869 1604313
36487 1604313 1766803 1661439 1314690 978702 784320 736268 840896 1049605 1206351 1181818
36477 1181818 974747 650487 317211 161484 299491 551102 573896 289307 -21009 -100676
36467 -100676 17144 200963 426063 652869 727906 600202 483354 608240 899639 1046913
36457A046913k05318m81672m74217j81599J61665K49543O2785o1366P7110J71352
36447C65196j33288n78908n62749k6809M25348L88860J43844R1348J69371J47162
36437D29375J20721K92770M85309L18987j81291n41374m49403j32190j3740j81370
36427A47794l39655k41901k9965m3357l07443m02452j5676N25196N99159J50231
36417D1931k06818p0415J79440L404m51705n82295k24254J72006K49347J74814
36407g14545K45605M23056M62561K95644R6457N9810J96204K85841O9731l90215
36397A030149o43461l75826R8639K13217m0387j32325J26508K79806L4890j83986
36387D07224O5516M47902L43168j61117m24009k45717l7153k8446O296J38430
$$ plain form
36457 1046913 841595 359923 -114294 -295893 -134228 115315 178100 116734 193844 365196
36447 365196 231908 -347000 -909749 -936558 -511210 -122350 21494 112842 282213 429375
36437 429375 550096 842866 1328175 1647162 1465871 924497 475094 342904 329164 147794
36427 147794 -191861 -433762 -463727 -507084 -814527 -1216979 -1232655 -707459 -108300 41931
36417 41931 -164887 -235302 -55862 -52458 -504163 -1086458 -1310712 -1138706 -889359 -714545
36407 -714545 -468940 -45884 416677 712321 808778 868588 1064792 1350633 1420364 1030149
36397 1030149 386688 10862 109501 322718 282331 150006 276514 556320 591210 407224
36387 407224 472740 920642 1263810 1102693 678684 432967 395814 367368 373664 512094
36377E12094P2381k32606l45051p5791J53175K6769j11090J17755M34951L84153
36367I36740Q8125p0331j59039m12939n52391j77427L48624K91469k17443k82946
36357b07558K71048N13388r4261p37066m60959L73219O82621K44796j90091j40107
36347B55030J04876K02462K26950K73791J94460m9415k06172j24815K832l3962
36337H46037j70656k40458k07782j12475J5419J00927O9654o172P590P1442L4563
36326D08089q3583j24742q4177q0787n4185J55578M05077L32657n0770k73540
36316E49617q4581J78517J42623o5639j49248j54459k64231l48435j57660J95904
36306a57592L63980K68442J13783m731j25263j42211O9315K80909J08898l64856
$$ plain form
36377 512094 584475 351869 6818 -68973 84202 110971 -119 117636 552587 936740
36367 936740 1024865 954534 795495 382556 -169835 -347262 1362 292831 75388 -207558
36357 -207558 63490 576878 482617 -254449 -715408 -342189 340432 585228 395137 255030
36347 255030 359906 562368 789318 1063109 1257569 1208154 1001982 877167 879999 846037
36337 846037 675381 434923 227141 114666 130085 231012 300666 294494 302084 373526 408089
36326 408089 324506 199764 115587 34800 -19385 136193 541270 873927 823157 549617
36316 549617 465036 643553 786176 720537 571289 416830 152599 -195836 -353496 -157592
36306 -157592 206388 474830 588613 583882 458619 316408 385723 666632 775530 410674
36296D10674o02063l53204J3940J00022k234j3430N0139K0858m5880J1047J26333
36285b83798J20748L7099M9026J09122J1987k13703k99028j58289j6170k6266
36275f69272m5682P2148K14359K27617J88511K25715K43169J00005m9264O3418
36265E70724L11778K31192k77482o48163l54667L05788N33990Q3877m25228l77555
36255d5746L8289J96759n4417k79669j86102m481L546J0778K65954N34379L52728
36244H32018k11735n22988k32682K27776K88999N5355M7378K99418K61627k93863
36234G51303p69862m96558L13699Q08231N87663J04264r4990p8918k12969m49264
36224D62599l82412M5401L40300J29390k79844l15263N0265K78916O8710k05931
$$ plain form
36296 410674 -191389 -544593 -530653 -430631 -432865 -446295 -396156 -375298 -421178 -410131 -283798
36285 -283798 -163050 -125951 -76925 32197 44184 -169519 -468547 -626836 -643006 -669272
36275 -669272 -714954 -642806 -428447 -200830 -12319 213396 456565 556570 507306 570724
36265 570724 882502 1113694 836212 188049 -166618 139170 673160 757037 331809 -45746
36255 -45746 -7457 189302 134885 -144784 -330886 -335367 -331821 -321043 -55089 479290 832018
36244 832018 620283 97295 -135387 92389 381388 436743 484121 783539 1045166 751303
36234 751303 -18559 -515117 -201418 606813 1194476 1298740 1203750 1124832 911863 462599
36224 462599 80187 125588 465888 595278 315434 171 50436 329352 398062 192131
36214A92131o2178L61105M88119J17505l25678m00285j74283K2607R0742J44322
36204D54107J84291R9602n9128q8368O5469K33403K80291K26225Q4434j82155
36194A298171m53616m37608l3807M41413N80773L49829O8402n561Q0615J21693
36184B010304J8788j17779q4105J70549M08637L28815l5580l07055k53607r8641
36174B040326j56472l35568k96911k2757J17914p8802l42048l13322j9621K21269
36164H14008K23707P9532l9801n9377P24P7554R5750J0451j51730k93532k89871
36153D67415q2930K05703L20896J48114j04601j49771o857N5143n3933j40207
36143F58972j00977r4205j77871r5831K91560O09465L88779k23196n71769l32868
$$ plain form
36214 192131 129953 491058 979177 1096682 771004 370719 196436 219043 309785 454107
36204 454107 638398 738000 678872 590504 655973 889376 1169667 1395892 1480326 1298171
36194 1298171 844555 406947 373140 814553 1395326 1745155 1813557 1807996 1888611 2010304
36184 2010304 2029092 1911313 1827208 1997757 2406394 2735209 2699629 2392574 2138967 2040326
36174 2040326 1883854 1548286 1251375 1228618 1346532 1267730 925682 612360 592739 814008
36164 814008 1037715 1117247 1077446 1018069 1018793 1096347 1192097 1202548 1050818 757286 467415
36153 467415 384485 590188 911084 1059198 954597 804826 797969 853112 799179 658972
36143 658972 557995 463790 285919 190088 481648 1091113 1479892 1256696 684927 352059
36133C52059J09297K23918j2249j88051j1869L67440N36534K60785k13959l71301
36123A052604m5857L00834J61218k89209m14720l6395L34784K91603P6679P1748
36113A503289J73840P5901j56952k52402k46768l44917m09890j26631L55278M82023
36103A052771R4586l11105k88593J5857K29527K72791K48694J48797j8728o2882
36093A381715J15226K82000J98004o668q3908r6536k34637l59549j61535K71382
36083A305494M66545K06545j99830l74050k80418q5211Q9636J40110q182k00800
36073A059839j23763K51324N34584M28593J33825P406N0224M3343O342J27183
36063B518900L13362K35311j21493l19560m6951M41370O50321M15063l7653m22793
$$ plain form
36133 352059 461356 685274 673025 484974 473105 840545 1377079 1637864 1423905 1052604
36123 1052604 1006747 1307581 1468799 1179590 764870 728475 1063259 1354862 1431541 1503289
36113 1503289 1677129 1753030 1596078 1343676 1096908 751991 342101 215470 570748 1052771
36103 1052771 1147357 836252 547659 563516 793043 1065834 1314528 1463325 1444597 1381715
36093 1381715 1496941 1778941 1976945 1970277 1886369 1789833 1555196 1195647 1034112 1305494
36083 1305494 1772039 1978584 1778754 1404704 1124286 1039075 1128711 1268821 1260639 1059839
36073 1059839 936076 1187400 1721984 2150577 2284402 2291808 2342032 2385375 2391717 2518900
36063 2518900 2832262 3067573 2946080 2626520 2579569 3020939 3671260 4086323 4048670 3625877
36053C625877n75493m24567m4663K90073L22042J13509k2548P1980K08364J23466
36043C688040j74855m19490l75445n7237K95224M14384K31753n0631j59724m0386
36033C351633J27761K13016K90371M33487N07947L66548J55939J64869L61779
36024E973350L72589L9614k65560j26504L06573N10682L28337J56078L22679O10219
36014H228057O08525L22014J35432K62937N13105O24559O01831O15938P25853
36005A2638251Q41245R10780J029024J315744J710610J944516J808795J480854
35997B3679819J452458K011948K898860L634643M086189M463744M880050N318315
35989E2426026O051913P585462R954037J2566004J5106029J8114296K2154358
$$ plain form
36053 3625877 3050384 2625817 2581154 2871227 3193269 3306778 3284230 3356210 3564574 3688040
36043 3688040 3513185 3093695 2718250 2661013 2956237 3370621 3602374 3551743 3392019 3351633
36033 3351633 3479394 3692410 3982781 4416268 4924215 5290763 5446702 5611571 5973350
36024 5973350 6345939 6385553 6119993 5993489 6300062 6810744 7139081 7295159 7617838 8228057
36014 8228057 8836582 9158596 9294028 9556965 10070070 10694629 11296460 11912398 12638251
36005 12638251 13479496 14390276 15419300 16735044 18445654 20390170 22198965 23679819
35997 23679819 25132277 27144225 30043085 33677728 37763917 42227661 47107711 52426026
35989 52426026 58477939 66063401 76017438 88583442 103689471 121803767 143958125
35982A43958125K6921400L1929908L7401240M2795426M4308679L6027230J5663934
35975C79005942j1160738l3981219m5398120m5632133l9938465l3193253k7382834
35968A42319180k2599232j8584395j5207278j2422254j0203534q389020o715299
35961D8198168n220145m319802m141682m095366l571532k791576k393755k375037
35953A9289273k125346j476890r97048j060656j263629j082128o29852l78172
35945A0275552m62160o35813o90902o03275m27580k98830l85048o30893p20000
35936E421051m88652j86306j17925k30644k89373k58527k38468k10281j49120
35927C251755k26825n52031q21956o16266j0755M56478M47453J31782j81745l66200
$$ plain form
35982 143958125 170879525 202809433 240210673 283006099 327314778 363342008 379005942
35975 379005942 367845204 333863985 288465865 242833732 202895267 169702014 142319180
35968 142319180 119719948 101135553 85928275 73506021 63302487 54913467 48198168
35961 48198168 42978023 38658221 34516539 30421173 26849641 24058065 21664310 19289273
35953 19289273 17163927 15687037 14689989 13629333 12365704 11283576 10653724 10275552
35945 10275552 9813392 9177579 8486677 7883402 7455822 7156992 6771944 6141051 5421051
35936 5421051 4932399 4746093 4628168 4397524 4108151 3849624 3611156 3400875 3251755
35927 3251755 3024930 2472899 1650943 1034677 1023922 1480400 1927853 2059635 1877890 1511690
35917A511690l57857r2794K51731K64003j90570o70254o46191j72168J99293J16236
35907B13119k14036l82845k56891J2509K77833M95925N95682M64064J49151p5408
35897A279103p441J97478K16075m380k13980k65883k74851k86374j15445K60721
35887G85023M52897J62574k75948k99162M4500J60543j61247m23401k26818R8637
35877C17598M4497k57981k57483J47893M61478L28795r75j15463k6933n3442k58236
35866C29748l09709L4466N04980N80432J34575l88172n30365l54362k26327k40830
35856d65564j77237L8046K00081K02446J79978J69486R861k47358k37802J29348
35846a98715L84592J77639j24120j630L64800M08937J29354L5135K15464K06294
$$ plain form
35917 1511690 1153833 1061039 1312770 1576773 1386203 715949 69758 -102410 96883 213119
35907 213119 -917 -383762 -640653 -628144 -350311 145614 741296 1205360 1354511 1279103
35897 1279103 1271662 1469140 1685215 1680835 1466855 1200972 926121 639747 524302 785023
35887 785023 1237920 1400494 1124546 825384 869884 1030427 869180 445779 218961 317598
35877 317598 362095 104114 -153369 -5476 456002 784797 783822 668359 641426 587984 329748
35866 329748 20039 54505 559485 1139917 1274492 886320 355955 1593 -224734 -465564
35856 -465564 -642801 -604755 -404674 -202228 -22250 147236 157097 -90261 -328063 -198715
35846 -198715 185877 363516 239396 237766 602566 1011503 1140857 1175992 1391456 1597750
35836A597750j27883l20738j45884k5014k29444l33775K3193L95501J83172l79800
35826F37078n74530k70239L7093J01285J44257K30149J01908k41274l82279r7527
35816c14079L11347M64378L09677j9778l60693m36671n4421M77122N51546N8868
35806I87296m36920m80735k42878n6337O8514J76214R9515j56495j96331J66516
35796g1641M81579L05402q8097j69661M34q20j38099j0552L43782M26688R6700
35785A175715k04859j49713Q3429K29503K69852K13210j0837k91411l54602j59175
35775H01112P2130K48493M33108M78050J59588k68666k54640J67927L00520j54367
35765A983255n76639l70319J39911K51590j12534m65557m97402k71612N6400K85675
$$ plain form
35836 1597750 1469867 1149129 1003245 978231 748787 415012 438205 833706 1016878 637078
35826 637078 62548 -207691 -170598 -69313 74944 305093 407001 165727 -216552 -314079
35816 -314079 -2732 461646 771323 751545 390852 -45819 -100240 376882 928428 987296
35806 987296 550376 69641 -173237 -229574 -161060 15154 114669 -41826 -238157 -71641
35796 -71641 409938 715340 627243 457582 458016 457196 319097 308545 652327 1079015 1175715
35785 1175715 970856 821143 904572 1134075 1403927 1617137 1606300 1314889 960287 801112
35775 801112 873242 1121735 1554843 2032893 2192481 1923815 1669175 1837102 2137622 1983255
35765 1983255 1406616 1036297 1176208 1427798 1315264 849707 352305 80693 137093 422768
35755D22768J80310j78026l17350k5744K50934P9298k51836k03830J50184L17188
35745D23896J88272M4878m7519k31259l75831k24789N8975Q8749p9198p0404R3202
35734a31028M6513j86138j87625R4415K60646J93695J91548K74372R3693k89639
35724C60452k95960K12230N77663L31911j25882k53798j50522j37717j30129M0071
35714D28319J54257J3118j00208J02699L48111K37475q6647k26620j62906j04007
35704F03591k9698J11849Q7979k07810l72112q3941K65097J50038k14182k53920
35694E6891K4611K13936L22670N84711P00743K11947n00081n87939r6338R5215
35684A026366k29691l05945J77930M93898K10504j1489L31871N75470N2125n91992
$$ plain form
35755 422768 603078 425052 107702 81958 332892 412190 160354 -43476 106708 423896
35745 423896 612168 657046 609527 378268 2437 -222352 -163377 -74628 -153826 -224230 -131028
35734 -131028 -84515 -270653 -458278 -363863 -103217 90478 282026 556398 650091 360452
35724 360452 64492 276722 854385 1186296 1060414 806616 656094 518377 388248 428319
35714 428319 582576 595694 495486 598185 946296 1183771 1097124 870504 707598 603591
35704 603591 573893 685742 773721 565911 193799 109858 374955 524993 310811 56891
35694 56891 81502 295438 618108 1202819 1903562 2115509 1615428 1027489 931151 1026366
35684 1026366 796675 490730 668660 1162558 1373062 1361573 1693444 2268914 2321039 1729047
35674A729047l67882L92199N68201Q7556n4334M64946P94363L87515j30398m8782
35664C822431L66922N09318M41763N70406P56437N19403l7840j97368L92476J186420
35654H330368J380391P95673m7618n55501n75820l71872k66123l69010n76466
35645G744022p21662o99345n17705l02207k16086l07413m47962m72976l60051
35636C698615k31853k20825l63640n66503o40982m68657j78723l8556j01272j26466
35626G61138L9916K11356J71308K6289k2492o6347k78018m50031k17594K64361
35616D39886L84105l8171m10515k03068K82005L63497p0530m94748m90275j65594
35606d03408J23477J57074l8825k27012j37820J89591L52657J08727k07768j33901
$$ plain form
35674 1729047 1361165 1753364 2321565 2409121 2354787 2819733 3614096 4001611 3871213 3822431
35664 3822431 4189353 4698671 5140434 5710840 6467277 6986680 6948840 6751472 7143948 8330368
35654 8330368 9710759 10506432 10458814 9903313 9327493 8955621 8689498 8320488 7744022
35645 7744022 7022360 6323015 5805310 5503103 5287017 4979604 4531642 4058666 3698615
35636 3698615 3466762 3245937 2882297 2315794 1674812 1206155 1027432 988876 887604 761138
35626 761138 801054 1012410 1183718 1210007 1187515 1121168 843150 393119 175525 439886
35616 439886 823991 785820 375305 172237 454242 817739 747209 252461 -237814 -403408
35606 -403408 -279931 -122857 -161682 -388694 -526514 -336923 15734 124461 -83307 -217208
35596b17208J97356K42047q9845k95190j06186J00441j4191j75378j7854K29682
35586a46326J22776j95132j69945K59875N26063K82702j16592j94894M443J23242
35576D96212M0827q3558j43067j71165j72917r3717N5618J78041J85834O4149
35566C56257r7815j21188P8267K83248J57951k59767m90741k37861J53513J65873
35556a2263j24414j62466K25407N37659L31571j25560k59222j3414J26256j08561
35546D14993l83959k83696P9692K44916N3451j87599j97187q1698p8539j72916
35536e92542j88363j15827r3904j16732k4134K01400L72731L95051L97426M65297
35526G00403M51459K05668j63729m16636m57143l49108j70732N620Q9232O6654
$$ plain form
35596 -217208 -19852 222195 132350 -162840 -269026 -168585 -182776 -358154 -376008 -146326
35586 -146326 -23550 -218682 -388627 -128752 397311 680013 563421 368527 372970 496212
35576 496212 537039 453481 310414 139249 -33668 -127385 -71767 106274 292108 356257
35566 356257 258442 137254 215521 498769 656720 396953 -93788 -331649 -178136 -12263
35556 -12263 -136677 -299143 -73736 463923 795494 669934 410712 397298 523554 414993
35546 414993 31034 -252662 -172970 71946 125397 -62202 -259389 -341087 -419626 -592542
35536 -592542 -780905 -896732 -990636 -1107368 -1131502 -930102 -557371 -162320 235106 700403
35526 700403 1151862 1357530 1193801 777165 320022 -29086 -199818 -194198 -104966 -38312
35516c8312L8123N0242J4411q2145m7173K29992M95787M06051K9754k04651j00474
35505G91605L2945j70997n91639p24100l01274L42645O18953L37816j21590l20310
35495a05946k48239j50608p4875Q0881J89096J7450k53235j51719K96070M53174
35485E2049L5845l65698j80087K48809K64633k9986m8945K17340K50533q489q2818
35474C53186R7870L6968l65645n12369r5913L41839K57944j06592k44476j41914
35464c79102m3761O2833K33478K43368l2651k72827j92654j2682J874N5215L51199
35453A4290N25226J87658k94112k67691J71927L59918J44783K2803J82691J86760
35443A234253k07070n65338m31477J7688K79954J64160j30159l24807k72298l8674
$$ plain form
35516 -38312 -189 50053 64464 -17681 -64854 165138 660925 1066976 1096730 892079 791605
35505 791605 824550 653553 61914 -662186 -963460 -620815 -1862 335954 214364 -105946
35495 -105946 -354185 -504793 -579668 -498787 -309691 -292241 -545476 -697195 -401125 52049
35485 52049 87894 -277804 -457891 -209082 55551 25565 -23380 193960 444493 436004 353186
35474 353186 451056 488024 122379 -389990 -485903 -144064 113880 7288 -237188 -379102
35464 -379102 -422863 -360030 -126552 116816 84165 -188662 -381316 -393998 -392124 -336909 14290
35453 14290 539516 727174 433062 165371 337298 697216 841999 864802 1047493 1234253
35443 1234253 1027183 461845 30368 48056 328010 492170 362011 37204 -235094 -273768
35433b73768J22714L7005j50083j76061l2078J07053K01235K87903K48623J2028
35423C84571j48264L2876K83121J40003k59369l38256j6031J76305l200j80521
35413G1235j20250j10362l02541l39610l5615J84578p093k40091o9823K72875
35403f96697L07901O8241j26262k75813m85289m92721p2810L64493K77399j02931
35393a234489r6808L14118M69630J28914j84093q1493J54957K04136K36151M43138
35383C54161N50134K37427k84454n32545l74051o7474J42084J78264K3700k64971
35373c7725m85362m33426j18747K35278L61936J40187k43007l49014O0822O18316
35363b50742O77329J19729m66481n31575j77533J41978K20135J45211J7475p5839
$$ plain form
35433 -273768 -151054 -114049 -264132 -440193 -472271 -365218 -163983 123920 372543 384571
35423 384571 236307 269183 552304 692307 432938 94682 78651 254956 251756 71235
35413 71235 -49015 -159377 -461918 -801528 -837143 -652565 -659658 -899749 -969572 -696697
35403 -696697 -388796 -320555 -446817 -722630 -1207919 -1700640 -1773450 -1408957 -1131558 -1234489
35393 -1234489 -1331297 -1017179 -547549 -418635 -602728 -684221 -529264 -325128 -88977 354161
35383 354161 904295 1141722 857268 324723 -49328 -116802 25282 203546 227246 -37725
35373 -37725 -523087 -956513 -1075260 -839982 -478046 -337859 -580866 -929880 -869058 -250742
35363 -250742 426587 546316 79835 -451740 -629273 -487295 -267160 -121949 -104474 -180313
35353a80313J0384K67265L80579Q8490l97489o07338l91505l3813J62371J47806
35343e53563J4431j38861k02958j16850M2803J63609K52298L41403L24606R7603
35333B24521j93244k84245j57929l6887k4500o622P2426J05158M9736R499J0921
35322b31166m7579j44288j01682Q3450J63583M9576l411J61686K78779R2155j43895
35311A57208j7109L40488L76345n8554m62875l90223k5185J54655Q793k25474
35301a41931l30905k78177r0473J95051M16734L49761j2258l31217k19578K99629
35291a43364P17047N47703q7979n53151m24701N2725L71047L86264K79306R7718
35281A242615k37876n30600m02831Q9189L82183J66712j72525j69471L0187j0559
$$ plain form
35353 -180313 -169929 97336 477915 566405 168916 -438422 -829927 -863740 -701369 -553563
35343 -553563 -539132 -677993 -880951 -997801 -954998 -791389 -539091 -197688 126918 224521
35333 224521 31277 -252968 -410897 -447784 -472284 -478906 -406480 -301322 -251586 -242087 -231166
35322 -231166 -278745 -423033 -524715 -441265 -277682 -228106 -231517 -69831 208948 301103 157208
35311 157208 140099 480587 856932 798378 335503 -54720 -79905 74750 83543 -141931
35301 -141931 -472836 -751013 -841486 -646435 -229701 120060 107802 -223415 -442993 -143364
35291 -143364 573683 1121386 1033407 480256 55555 108280 479327 865591 1144897 1242615
35281 1242615 1004739 474139 71308 160497 542680 709392 536867 367396 397583 387024
35271C87024k70267l26252o5125J35825l676k66786k71564K1516K74463J56629
35261b28213k77867n70781l11952L20088O56642L37130k16417l78894j36859O0112
35251g47011P0155J57882L62908L43569l71k53363r8069J95265K09215k959q9488
35240A47733L0661J33380J03073M3309J3924m7993j18382m0272K16547M00350
35230H82330K19712k74473o46384n05831K1438L85645K55825q2204j41410J04175
35220B18823K54419J01391j31041j89004r7378J9070J22652J59031M1777j42015
35210C57725j70973l8496J2815r6713j55530o9227l7548j39548j19857J49208
35200c08144L50440J96522q5098j08824Q1159J60874N6822n6407j18075j66593
$$ plain form
35271 387024 116757 -209495 -274620 -138795 -142471 -409257 -680821 -659305 -384842 -228213
35261 -228213 -506080 -1076861 -1388813 -1068725 -412083 -74953 -291370 -670264 -807123 -747011
35251 -747011 -676856 -518974 -156066 187503 187132 -66231 -164300 30965 240180 237221 147733
35240 147733 178394 311774 414847 458156 472080 424087 305705 265433 481980 882330
35230 882330 1102042 827569 181185 -324646 -303208 82437 338262 256058 114648 218823
35220 218823 473242 574633 443592 254588 157210 176280 298932 457963 499740 357725
35210 357725 186752 148256 161071 64358 -91172 -160399 -197947 -337495 -457352 -308144
35200 -308144 42296 238818 153720 44896 126055 286929 343751 287344 169269 2676
35190B676j14986Q4221J87672l6276l61024l51506P535L07653K92367Q1087j36225
35179c6806k71371k33213lK09014J52659n3961q0027J35610L42487L73640K68012
35168H06041N6810k33737m14279l11387p2296L8783O1012J83851K97089J57630
35158E69517q3568n7674J45896O6307l13669m58224j38174K04435J89880K8208
35148A52934Q422k716j69491k61084m9000K36421K65245J14910L0796j9519j56230
35137A50688k32025q2771J06684R7345K7673J21934J89781q3681m92928n03141
35127g00441p3138K32465O2662k37373j79947J62721L13230R1130j54794o4342
35117e47827K14469K44772k7636j55523J05902L33928O6974l80665l28851J62833
$$ plain form
35190 2676 -112310 -28089 159583 123307 -237717 -589223 -581688 -274035 18332 99419 -36806
35179 -36806 -308177 -541390 -541393 -332379 -179720 -233681 -313708 -178098 164389 538029 806041
35168 806041 862851 629114 214835 -96552 -168848 -130065 -69053 114798 411887 569517
35158 569517 485949 428275 574171 640478 326809 -131415 -269589 -65154 124726 152934
35148 152934 161356 158640 -10851 -271935 -320935 -84514 180731 295641 326437 306918 150688
35137 150688 -81337 -164108 -57424 39921 67594 189528 379309 295628 -197300 -700441
35127 -700441 -773579 -541114 -478452 -715825 -895772 -733051 -419821 -328691 -483485 -547827
35117 -547827 -333358 -88586 -116222 -271745 -165843 168085 235059 -145606 -474457 -311624
35107c11624L37544k6096k40113J12001M35763J38497l32906k44405J78315J70654
35097B17630k41220l19023R1859L28053P2829j51918O0825L35595K04078j52841
35087D45867l03033k31699j60138n9662J94522M21055L12187q9761m16299m21074
35077c08035j87009N9957J80412J96726K18723K58849J56863j75424n02579n01557
35067f03074k22416k1175k7525k1553J04676J55183M9835M8768L06757N26214
35057B95690L66843k9488k41929j44358K0232L7097p8096k16184k79688j77783
35047d47664Q9485L45822L85570K11539K7141o521N6275J3073k48532n48904n21816
35036f44532m7453M92051O02473K91573K5764N9741J39606j2852k58366l10172
$$ plain form
35107 -311624 25920 -176 -240289 -128288 307475 445972 113066 -131339 46976 217630
35097 217630 -23590 -342613 -250754 77299 150128 -1790 59035 394630 598708 445867
35087 445867 142834 -88865 -249003 -308665 -114143 306912 619099 529338 113039 -308035
35077 -308035 -495044 -435087 -254675 -57949 160774 419623 576486 401062 -101517 -603074
35067 -603074 -825490 -846665 -874190 -895743 -791067 -635884 -586049 -537281 -230524 295690
35057 295690 662533 633045 391116 246758 266990 304087 225991 9807 -269881 -447664
35047 -447664 -358179 -12357 373213 584752 611893 605372 661647 674720 426188 -122716 -644532
35036 -644532 -691985 -199934 402539 694112 719876 779617 919223 906371 648005 337833
35026C37833j84429j05116j29793j33925n8932N0380J73372K94543L43134L02299
35016H89366K61905K21010J3472l67480n65207k89468J63601J88279l13690p26811
35006e25023m68131K93866Q54736P86140L32372L781l8028m2161j86769k88700
34996G22083j35797R7292O6033j89540k70350m1797J46120J6267k17030k37374
34986d4093j19293r7916r3368J25463M31032M16523q480m49822n23495k57428
34976f20877O7904K60215L07747K79203K18096J01975o7063j29175R3452M26066
34966I37543L79273j90162p07983n56274N5543L69374J55491m1765J77062M66446
34956A044548L43491n1920k24002q4569m865j85993l62903k08640K00365M48554
$$ plain form
35026 337833 153404 48288 -81505 -215430 -274362 -223982 -50610 243933 587067 889366
35016 889366 1151271 1372281 1385753 1018273 453066 163598 327199 515478 201788 -525023
35006 -525023 -993154 -699288 155448 941588 1273960 1277741 1239713 1197552 1010783 722083
34996 722083 586286 683578 749611 560071 289721 247924 394044 410311 193281 -44093
34986 -44093 -163386 -261302 -354670 -229207 201825 618348 609868 160046 -363449 -620877
34976 -620877 -552973 -292758 14989 294192 512288 614263 547200 418025 511477 937543
34966 937543 1316816 1126654 418671 -137603 -82060 287314 442805 401040 578102 1044548
34956 1044548 1388039 1336119 1112117 1027548 1022683 836690 473787 265147 465512 914066
34946I14066K52746j89264l73552p1916L50276L82521O0388j19783j689l3037
34936A170756m87526q59709n09241L46774Q43050N94185O5654k22266k91433l05194
34926C45050j14981L82852Q04884O86948J60161k17130k02986k9229J19845L23433
34916B258847N78586O90339O38963O50035P34932N89204J93580P3393N81893J312728
34906H302500J699452J861162K269360K860724L229607L542543M302246N041428
34898C3109022M277733J383189k230220m544104n057917m727290m262117l535743
34890A4412553k562126j916409j831793j740929j219743p22155p91138j076897
34882B551363q56721k03126J42080m7202j96177N4300K62915k6433m67582m08851
$$ plain form
34946 914066 1166812 977548 603996 532080 882356 1264877 1325265 1205482 1203793 1170756
34936 1170756 683230 -176479 -685720 -338946 504104 1098289 1163943 941677 650244 345050
34926 345050 230069 612921 1417805 2104753 2264914 2047784 1844798 1815569 1935414 2258847
34916 2258847 2837433 3527772 4166735 4816770 5551702 6140906 6334486 6407879 6989772 8302500
34906 8302500 10001952 11863114 14132474 16993198 20222805 23765348 28067594 33109022
34898 33109022 37386755 38769944 36539724 31995620 26937703 22210413 17948296 14412553
34890 14412553 11850427 9934018 8102225 6361296 5141553 4419398 3628260 2551363
34882 2551363 1694642 1491516 1633596 1586394 1390217 1444517 1707432 1680999 1213417 804566
34872H04566J00967L78596J03989k76711k54601O7634K47044J45733j3916q7813
34862A215488j70243l18208l87479k41811L1417K18151K16056J13375O7954J28415
34852H73115J59393q228l06981m18113j59130K08638K66729k916j86469K991L63750
34841G92779M89439K33801j97207m68678l70476j195K60771J41889j52584j68284
34831E60255J76844M82813M34059J46638j53126m20355n81733m33963l3659J77115
34821C54888k5586k57520j20042J59802J49779m3246k1942J39878L6076k75777
34811I6310k93720Q1001L49772J97008r9441k04438j56758p4677Q5967K63503
34801B44527K24482j5093j23886j6451l3044l21024n07057l00138K1676R9238
$$ plain form
34872 804566 905533 1284129 1388118 1111407 856806 924440 1171484 1317217 1303301 1215488
34862 1215488 1045245 727037 339558 97747 129164 347315 563371 676746 744700 873115
34852 873115 1032508 1024280 717299 299186 140056 348694 615423 612507 426038 429029 792779
34841 792779 1282218 1516019 1318812 850134 479658 478463 739234 881123 728539 560255
34831 560255 737099 1219912 1653971 1800609 1647483 1227128 645395 211432 177773 354888
34821 354888 329302 71782 -48260 111542 261321 218075 196133 336011 372087 96310
34811 96310 -197410 -116409 233363 430371 330930 126492 -30266 -104943 -18976 244527
34801 244527 469009 453916 330030 313579 280535 -40489 -547546 -847684 -826008 -726770
34791g26770O2931J88128L27360J74792j35988j83895J05552L82593L70255J34075
34781F99033q1878p3680J52865K85757N450m74311n22486O400M18264J28556m52115
34770I1855n23081m4841L58829M14842L93700L80615J11155l74140n93483l49847
34760a34396l3157K0041m4059l6276q0677k28118j85611J80381M50914K04889
34750A13931l02083m56829j35125J92909J55289r5065j94554l4780J93550K72329
34740b90428J68548J3718p7472j23375j71365j53307J1165K04733K12917O0118
34730a44748J8153J93966L33945J87763j20198k72646j81096k1734P5215J60172
34720B28792K81023L40405K25602K910j31999j19553j45123l56651n44497l57569
$$ plain form
34791 -726770 -663839 -475711 -148351 26441 -109547 -293442 -187890 194703 564958 699033
34781 699033 617155 543475 696340 982097 987547 513236 -9250 -2850 415414 543970 91855
34770 91855 -431226 -476067 -117238 297604 691304 1071919 1183074 808934 215451 -134396
34760 -134396 -167553 -147512 -191571 -227847 -308524 -536642 -722253 -541872 -90958 113931
34750 113931 -188152 -644981 -780106 -587197 -431908 -526973 -721527 -756307 -562757 -290428
34740 -290428 -121880 -108162 -185634 -309009 -480374 -633681 -622516 -417783 -204866 -144748
34730 -144748 -126595 67371 401316 589079 468881 196235 15139 -6595 68620 228792
34720 228792 509815 850220 1075822 1078732 946733 827180 682057 325406 -219091 -576660
34710e76660J10570K86977r3012m78268j97105N42253Q79134M86202m4431j18911
34700G96749J10329J88675P8316L4773Q2497L4240j36839k91109l71857l86540
34690A39234k66077j126K03580J58713l3289j43502j26094o1886L4491J23200
34680B7244N1563j75276k47404M943K35414N4138l04719k81269J33634L68033
34670a33699J49513j36282j31262l5145j54868l32580k12248J64806M07203L08611
34660a05951L9871j40520j34840J1120J89038K83280K56918J83573J45175J37645
34650H65309J01599j9752k41775m41188l44313J55994O59528N59065j60498p33461
34640D00508n12604J69594M16892n5979n86331m68572J73344O32783N06458M8460
$$ plain form
34710 -576660 -466090 -179113 -272125 -750393 -947498 -405245 473889 960091 915660 796749
34700 796749 907078 1095753 1174069 1208842 1291339 1325579 1188740 897631 525774 139234
34690 139234 -126843 -127969 75611 234324 201035 57533 -68561 -130447 -95956 27244
34680 27244 78807 -96469 -343873 -338930 -103516 -49378 -354097 -635366 -501732 -133699
34670 -133699 15814 -120468 -251730 -286875 -441743 -774323 -986571 -821765 -414562 -105951
34660 -105951 -66080 -206600 -341440 -330320 -141282 141998 398916 582489 727664 865309
34650 865309 966908 947156 705381 264193 -80120 75874 735402 1294467 1133969 400508
34640 400508 -112096 57498 474390 418411 -167920 -636492 -463148 169635 676093 724553
34630G24553k91987l98220m32588m33570k26726K14890N51266M39744K5199k07022
34620c4461p3250J13632Q4116R342J19688K26599J5768l47322l65536M0239L75291
34609A64106K89293N2138P5056K71699K33508j22825m32880l96886j43083m191
34599a4065r6638k27881j70389M7560J68573M0754j50300j10451J38486K64382
34589a09969R6377j33208j34745O0773K35575L04251K91947J65278o7834k23115
34579D85330j61897l1982l1178p8051l0434n9989l72176o63285m08109K81741
34569a070030O72402M37931Q7170Q6168J57138r2593l79298k16717J82997K03135
34559F8303j59828l00682p785K42750J19775p8445j8668J35120J10973J3197N0877
$$ plain form
34630 724553 432566 34346 -398242 -831812 -1058538 -843648 -292382 147362 172561 -34461
34620 -34461 -107711 5921 90037 99379 219067 445666 461434 114112 -251424 -211185 164106
34609 164106 453399 505537 580593 852292 1085800 962975 530095 133209 -9874 -14065
34599 -14065 -110703 -338584 -508973 -461413 -292840 -252086 -402386 -512837 -374351 -109969
34589 -109969 -13592 -146800 -281545 -220772 14803 319054 611001 776279 708445 485330
34579 485330 323433 291451 260273 182222 151788 91799 -280377 -943662 -1351771 -1070030
34569 -1070030 -397628 40303 127473 213641 370779 278186 -101112 -317829 -134832 68303
34559 68303 -91525 -392207 -399992 -157242 -37467 -115912 -134580 540 111513 124710 175587
34548A75587J14700Q20j76649j50823P1410K42500K17867L2184k36441m56352
34538a65197m31933j30642J91449K86374K08290J35750Q7528M3236J33669L89487
34528G48011M73402O9295n36161p03239l16106K0854j62493n20092l72331L33888
34518i64972R03859P36147K0395n32494n21017k18482r2105j70921j12781J85893
34508g66478L87643K42374J3560J02612M36943N65838K93553j07642l20159l19471
34498E28773k35601j42641q2681q5239o8859Q4369K76603K33602q6018l39730
34488H2578k37231N2130J49670R24r9187K2712J80390J26285j05253k74891k47714
34477c49587r7046M5393J11041P1524p2457k22720k11393K18K17885K32241R8709
$$ plain form
34548 175587 290287 291107 114458 -36365 35045 277545 495412 527596 291155 -165197
34538 -165197 -597130 -727772 -536323 -249949 -41659 94091 181619 224855 358524 748011
34528 748011 1221413 1290708 754547 51308 -264798 -243944 -406437 -926529 -1298860 -964972
34518 -964972 -61113 675034 695429 162935 -358082 -576564 -668669 -839590 -952371 -766478
34508 -766478 -378835 -136461 -122901 -20289 416654 982492 1276045 1168403 848244 528773
34498 528773 293172 150531 67850 -17389 -86248 -1879 274724 508326 422308 82578
34488 82578 -154653 -102523 47147 48071 -51116 -28404 151986 278271 173018 -101873 -349587
34477 -349587 -446633 -401240 -290199 -218675 -291132 -513852 -725245 -725027 -507142 -274901 -176192
34466a76192N5460J80206L04831K96857K29811J92117J18992n0278k13538k72460
34456F65806l18099m51825n28558l11184J53923N24719N39181K51193j07133l50609
34446F7414m09733k99017p5829J88654L89558L78818J09176k00587k34459K1018
34436f4987K50476K54092J48929K2246k46960n91649n86685n4185N13633N99123
34426B44033M02094L86856M04932n69o01487o57665j16762K20446n7828l86143
34416a62093k25702J04308R3264j06679p9039J02379J20780L8016R1152J76933
34406A53319Q5780k5023P7480K00626N5004j67712j16501N0762n1794k66123r4031
34395i8213L86776N23577R4652l34012k56993J09009K71511J42971j2630k7620
$$ plain form
34466 -176192 -120732 59474 364305 661162 890973 1083090 1202082 1151804 938266 665806
34456 665806 347707 -104118 -632676 -943860 -789937 -265218 273963 525156 418023 67414
34446 67414 -342319 -641336 -717165 -528511 -138953 239865 349041 148454 -86005 -64987
34436 -64987 185489 439581 588510 610756 363796 -227853 -814538 -868723 -355090 244033
34426 244033 646127 1032983 1437915 1437346 835859 178194 61432 281878 224050 -162093
34416 -162093 -387795 -283487 -190223 -296902 -375941 -273562 -152782 -114766 -23614 153319
34406 153319 239099 214076 291556 492182 547186 379474 262973 313735 261941 -4182 -98213
34395 -98213 288563 812140 906792 572780 315787 424796 696307 839278 826648 799028
34385G99028K5518r075j88475l54569k52487Q3448K37125k1480l04605j64629
34375a50201J37319P173m58955n37768j9064M50312L82561J15602J08394J92639
34365B28012J1944k80541l09508j25873m0432m4106J02968L47247L70012Q6990
34355C46713k51300m29494m36244k98247k4051K78106M29037L48599J11599j08890
34345c4172j17788J30397L89668L60487J13787o946L7614q7832m24344m69951
34335a09080M6722N83525M74803j12345m69992l80627k40953k39361o3567M36318
34325g4557Q25787O08937j19031p67100q45905l71757J91239L56073R4135j46394
34315b48573k0189K56644K42075q7758l37068k51393L2136K51759K51314Ql26813
$$ plain form
34385 799028 824546 815471 626996 272427 19940 103388 340513 319033 14428 -150201
34375 -150201 -12882 -5709 -464664 -1002432 -1021496 -571184 -188623 -73021 35373 228012
34365 228012 239956 -40585 -350093 -475966 -516398 -560504 -457536 -110289 259723 346713
34355 346713 95413 -334081 -770325 -1068572 -1092623 -814517 -385480 -36881 74718 -34172
34345 -34172 -151960 -21563 368105 728592 842379 835433 873047 785215 360871 -109080
34335 -109080 -62358 521167 995970 883625 413633 33006 -207947 -447308 -510875 -74557
34325 -74557 751230 1360167 1241136 474036 -371869 -743626 -552387 -196314 -102179 -248573
34315 -248573 -268762 -12118 229957 142199 -194869 -446262 -414126 -162367 88947 88955 -237858
34304b37858l63781K4958M25747L40516j04536l34060j56274O3458P7207O7865
34294a96758J58460J28969j35348l48871k62068m3597M0436J9923M4531J01369
34284d92954J39443K01147K36190R3357j25516q6926J84129J99965j82554l63793
34274a97512R4588O34924M45306k81969o09263k39591J63923J03766r4919j6401
34264B852J39114J3340k39320k35439j3327P3088n4449j33416j9569J41165J95358
34253a30603J52728M9135j22268k86329k86585j01247P5226O9716k8839K1558
34243e87508K78015M85117L51852q1119m45129m35959j11902K46104M48292M51380
34233E99143K26217j94163n49068m95613l7836L70498L14309r3847l72802k64851
$$ plain form
34304 -237858 -601639 -576681 -150934 189582 85046 -249014 -405288 -341830 -264623 -196758
34294 -196758 -38298 90671 -44677 -393548 -655616 -699213 -658777 -638854 -594323 -492954
34284 -492954 -353511 -152364 83826 177183 51667 -35259 148870 348835 166281 -197512
34274 -197512 -102924 532000 977306 695337 86074 -153517 10406 114172 19253 2852
34264 2852 141966 155306 -84014 -319453 -332780 -259692 -314141 -447557 -467126 -325961 -130603
34253 -130603 22125 71260 -51008 -337337 -623922 -725169 -649943 -580227 -609066 -587508
34243 -587508 -309493 175624 527476 446357 1228 -434731 -546633 -300529 147763 599143
34233 599143 825360 631197 82129 -413484 -451320 -80822 233487 139640 -233162 -498013
34223d98013K014O4843j06621k05875j6277K87620L50362Q6814k23464l15758
34213e74355k45845k10676k26620j77506o7345J9047J39846L91082N89177M00853
34203C7658j12917m19372j85331K46060L14440k6766l41908l46237j82078q9562
34193a106013q6571l1722J66885M35329N34326K60922k15317l76549L1951N51718
34183A64959N20840k9497l99104j78727K49858L37408Q9194j14014j11614m6750
34173D82553l7700p0425j14791j21832j8696J16115N2505k09422k88274N2991
34163a56976M46678L63741j33812m96513m45705j92422M4303K54955L49225J43105
34153A76579k37565l79151j63885O4215N9413j8204j2483k5039m7038J61393N23084
$$ plain form
34223 -498013 -495999 -431156 -537777 -743652 -759929 -472309 -121947 -35133 -258597 -574355
34213 -574355 -820200 -1030876 -1257496 -1435002 -1502347 -1483300 -1343454 -952372 -363195 37658
34203 37658 -75259 -494631 -679962 -433902 -119462 -146228 -488136 -834373 -1016451 -1106013
34193 -1106013 -1192584 -1224306 -1057421 -622092 -87766 173156 -42161 -418710 -386759 164959
34183 164959 685799 656302 257198 78471 328329 665737 754931 640917 529303 482553
34173 482553 444853 374428 259637 137805 119109 235224 287729 78307 -209967 -156976
34163 -156976 289702 653443 519631 23118 -422587 -615009 -570706 -315751 33474 176579
34153 176579 -60986 -440137 -604022 -539807 -480394 -498598 -511081 -536120 -583158 -421765 101319
34142A01319M92201j30673p05133n79236M59L61680L93537M05817L47639m0669
34132F46941m84997m24222L6722K27727O170p1417K03587L26046K8587k22095
34122B73049p5100J15926L0659j0069K48546L51920r3482n71103l84229J84829
34112G0946L04788q9976k95261k7104K39780J49685q7624k33823l21661k86424
34102e76674N7943N06426N35149R0869k57628j74666l782r9596k67562k10804
34092d00325m8943r014p679P8135Q4949j17494l03782k51370j14679r3575n3285
34081a237062J46346K69413Q2008j83864k02013j02814j42329r4090M05863J068839
34071A0297J187208O42438L6424k39450m12042o46240o30639j95794K04075J04659
$$ plain form
34142 101319 593520 462847 -242286 -821522 -821063 -459383 -65846 339971 687610 646941
34132 646941 161944 -262278 -225556 2171 8341 -63076 140511 466557 495144 273049
34122 273049 197949 313875 344534 334465 583011 934931 841449 270346 -113883 70946
34112 70946 375734 285758 -9503 -36607 203173 352858 265234 31411 -290250 -576674
34102 -576674 -518731 -12305 522844 613713 356085 181419 177637 78041 -189521 -400325
34092 -400325 -449268 -458282 -465961 -387826 -302877 -420371 -724153 -975523 -1090202 -1183777 -1237062
34081 -1237062 -1090716 -821303 -739295 -923159 -1125172 -1227986 -1370315 -1464405 -1058542 10297
34071 10297 1197505 1839943 1876367 1636917 1224875 578635 -52004 -247798 -43723 60936
34061F0936k41061k40962J55697M29577K45423j80052m56249m29159j78577J23577
34051g10850K87326K38942J41668K26388M64084N62281L40293l5949k72033k83251
34041I58899k15709k05323k33031k10680j18333j4895N0611R0613J33747J58843
34031C94742J12999K453p5477l9536M3357O11k24409m44567m17957j56545P7639
34020g26690J23361J13613K04694K76809J31779j15687j52269L9566J44672M5639
34010H5487J2779J80457K20957j28874n35853n06658j44193L1398r1131j11544
34000i87175J42086L23709J75933o4627j12925o6676r5365o1679J91458M54567
33990a00694M28983J96043N1478K5108p4689k42826k64680q6553J09340J88804
$$ plain form
34061 60936 -180125 -421087 -265390 164187 409610 229558 -226691 -655850 -834427 -710850
34051 -710850 -423524 -184582 -42914 183474 647558 1209839 1550132 1514183 1242150 958899
34041 958899 743190 537867 304836 94156 -24177 -39072 11539 102152 235899 394742
34031 394742 507741 510194 434717 395181 438538 439149 214740 -229827 -647784 -804329 -726690
34020 -726690 -603329 -489716 -285022 -8213 123566 7879 -144390 -104824 39848 85487
34010 85487 98266 278723 499680 370806 -165047 -671705 -815898 -784500 -875631 -987175
34000 -987175 -845089 -521380 -345447 -410074 -522999 -589675 -685040 -746719 -555261 -100694
33990 -100694 328289 524332 575810 600918 526229 283403 18723 -67830 41510 230314
33980B30314J69105P3441o8651j21755j926J16133J7303j83751j89110P401J24457
33969A72961O2750J0186M1513p534j65359j94797L20J73068J29106J6170O571
33958B44955p064j40854k21543o8807J42882J33834l6005j06725p3594j44205
33948b77126l03958k86696p565K77606L22525J77398N3246O5522J66051K11889
33938C98892R1265j28233k31996j43675n9178j30173j67242P3957M21506M45841
33928E70964Q0039k55979k22219L6243J55701k3k61902l58904j53227J78516K37582
33917F791j14737m55797k98894J82489L58722P4958j43369M8752L03612K18247
33907A80774l0992j07204j21920l03258m00940m1632N08422N76821O1595m01048
$$ plain form
33980 230314 399419 472860 404209 282454 280528 396661 413964 230213 41103 48504 172961
33969 172961 235711 245897 287410 279876 114517 -80280 -79960 93108 222214 238384 244955
33958 244955 237891 97037 -124506 -193313 -50431 83403 47398 -59327 -132921 -277126
33948 -277126 -581084 -867780 -875345 -597739 -275214 -97816 -44570 20952 187003 398892
33938 398892 490157 361924 129928 -13747 -72925 -203098 -370340 -296383 125123 570964
33928 570964 651003 395024 172805 209048 364749 364726 102824 -256080 -409307 -230791 6791
33917 6791 -107946 -563743 -862637 -680148 -321426 -246468 -389837 -341085 -37473 180774
33907 180774 149782 42578 -79342 -382600 -783540 -825172 -316750 260071 321666 -79382
33897g9382l28698M3302K35626J43740q170j1941K05389N56401P49035N00876
33887B006178p8445n28151n53717k95334k5470J47721J74585l0173l72085n08702
33877f3593k47954J35156K15822m1079k78468k34636j9662J17145J16053R9738
33867b01478J30611J24530K4144q6443j45544k51053m28363l97620O2826N67898
33857f00492M57287j92718m85108K5791N91532L81135k16805k37505K87042M21580
33847D31739j00448m75255j88332K22296J58078j40448j91148n3828K2783J25417
33837a89146L06734K45479j77997m76901k66906J18677K53933L16007N52532O13873
33827A296285J46687m21860m73923j75930q2858j59768l5109J38802k280j74304
$$ plain form
33897 -79382 -408080 -364778 -129152 14588 6418 -5523 199866 756267 1505302 2006178
33887 2006178 1927733 1399582 845865 550531 525061 672782 847367 817194 445109 -63593
33877 -63593 -311547 -176391 39431 -1648 -280116 -514752 -534414 -417269 -301216 -201478
33867 -201478 -70867 53663 77807 -8636 -154180 -405233 -833596 -1231216 -1168390 -600492
33857 -600492 -143205 -335923 -821031 -795240 -203708 177427 -39378 -276883 10159 431739
33847 431739 331291 -143964 -332296 -110000 48078 -92370 -283518 -337346 -314563 -189146
33837 -189146 117588 363067 185070 -291831 -558737 -440060 -186127 129880 682412 1296285
33827 1296285 1442972 1021112 547189 371259 288401 128633 93524 232326 230046 55742
33817E5742J14386N08303K56374m37005o46015k60605r2662l61955l37570K25235
33807i75772N39952J71995j77951R3825M96783M01319R3265R5791K18869R1318
33797A049394l8987J50387L14582N5271k71481j81088J2156k49697p18383p21652
33787e99498k56652J36087K84224L51475K10808k78410o35708l16988K88478L45435
33777d70749r3010k13808J63132L57882Q1449j17099Q6289K23459o8949l76954
33767d28358k12649K09871L56772R6716l00157n22239l60870J35614N31388M31781
33757f2131P6958J6844K19371J51427k29931l52896m7533J53536N721k5196K63076
33746A69246K99903k11574n71104j60338M56575L82929k03645m30504j36874O4388
$$ plain form
33817 55742 170128 678431 934805 497800 -148215 -408820 -501482 -863437 -1201007 -975772
33807 -975772 -435820 -263825 -441776 -347951 148832 550151 643416 739207 958076 1049394
33797 1049394 1010407 1160794 1475376 1530647 1259166 1078078 1090234 840537 122154 -599498
33787 -599498 -856150 -720063 -435839 -84364 126444 -151966 -787674 -1104662 -816184 -470749
33777 -470749 -563759 -777567 -614435 -256553 -175104 -292203 -205914 17545 -51404 -428358
33767 -428358 -641007 -431136 -74364 22352 -277805 -800044 -1160914 -1025300 -493912 -62131
33757 -62131 14827 31671 251042 402469 172538 -180358 -227891 -74355 -68634 -93830 169246
33746 169246 469149 257575 -313529 -473867 -17292 365637 161992 -268512 -405386 -340998
33736c40998o4943j14023J19596L14844K54736J02911k4238j78845k37523p442
33726a75925K93300K36444j00850k16403k8569J3995k01459j80323K89786O29662
33716E59658L01616l46880n89358l25378n3080m4957p2277Q3199K70736K29005
33706A2284l4767k38060j29840K13930M17769K27684j21838j66877J42183L45181
33696F67649J35374j97696k19674K6711J66843O9500p7455j56880k24405k54640
33686f4673j34360O3090J11897o614q3380q0513k01012m27913l78375J09331N70819
33675e21703M85046L3394j52362J07376L62673K61357k7522k32113l56439m19320
33665d59613k38937J90687M44190J80920l12273m79833k16186J51621M05713N16785
$$ plain form
33736 -340998 -405941 -519964 -400368 -85524 169212 272123 247885 69040 -168483 -175925
33726 -175925 117375 353819 252969 36566 7997 21992 -179467 -359790 -70004 559658
33716 559658 861274 514394 -74964 -400342 -453422 -498379 -570656 -487457 -216721 12284
33706 12284 -22483 -260543 -390383 -176453 241316 469000 347162 180285 322468 667649
33696 667649 803023 605327 385653 412364 579207 648707 571252 414372 189967 -64673
33686 -64673 -199033 -135943 -24046 -30660 -114040 -194553 -395565 -823478 -1201853 -1092522 -521703
33675 -521703 -36657 -3263 -155625 -48249 314424 575781 548259 316146 -40293 -459613
33665 -459613 -698550 -507863 -63673 117247 -195026 -674859 -891045 -739424 -333711 183074
33655A83074L46295j83119o60256n05514J83109O25639L69943j64009l50234j15850
33645b70922K15346M14119L77564M2271m00550n14469j63937K30341K68908Q5884
33635B84555k4862j17438l08730l40221L7346M82438M41710j6176k99015j65336
33625b5729L5775N997j32285j87724j78312j43119l4253J11534J92711K57912
33615i7493L97908M66362K79061L3284P1523K52174R8001l70501n57879k40345
33605C32095K8456j90335m77292k10390M32623P09573L53102j68319l69278k56992
33595A83243q2719K8392P0562L4492o2972j47387j68811j52385j39257j25270
33585e62112o8737N7487K07305K68298J77903Q858j25459j94716j91316n6381
$$ plain form
33655 183074 529369 346250 -314006 -819520 -636411 -10772 359171 195162 -155072 -270922
33645 -270922 -55576 358543 736107 778378 377828 -136641 -300578 -70237 198671 284555
33635 284555 259693 142255 -166475 -506696 -469350 13088 454798 438622 139607 -25729
33625 -25729 10046 16043 -116242 -303966 -482278 -625397 -659650 -548116 -355405 -97493
33615 -97493 300415 766777 1045838 1079122 1150645 1402819 1500820 1130319 572440 332095
33605 332095 360551 170216 -307076 -517466 -84843 624730 977832 809513 440235 183243
33595 183243 100524 128916 199478 233970 170998 23611 -145200 -297585 -436842 -562112
33585 -562112 -630849 -573362 -366057 -97759 80144 89002 -36457 -231173 -422489 -478870
33575d78870J65741K21927l9157l36878k66937R3640K66187Q0725j13586n8729
33565d65937K9501r1952k59880k18966n6352M982Q141J35223L53514M73601M23988
33554C35863K51007J1783j49624n0273J99543J88218k11569n45335l93869L755
33544c60501J48521M0990N2932K19163K06995m8637j97164k9396K29864K77052
33534E39819O2980k63477m57256k58866K88981O58891L72950l01668o27148l71678
33524c56472k2966L4316q221O9395N9401k06070l74880m0902N71075Q41997N45913
33513A112586K3581l35141m37380l66667k29178j29955q3131L4081K59486L65274
33503B13556J37319k32327l18908l6971K42049K14380K4466k6550N3499M018k40241
$$ plain form
33575 -478870 -313129 -91202 -130359 -467237 -734174 -640534 -374347 -293622 -407208 -465937
33565 -465937 -436436 -528388 -788268 -1007234 -1063586 -1058604 -1050463 -915240 -561726 -88125 335863
33554 335863 586870 598653 449029 398756 598299 786517 574948 29613 -364256 -360501
33544 -360501 -211980 -170990 -118058 101105 308100 259463 62299 32903 262767 539819
33534 539819 602799 339322 -117934 -376800 -87819 571072 944022 642354 15206 -356472
33524 -356472 -379438 -345122 -353343 -283948 -224547 -430617 -805497 -846399 -275324 566673 1112586
33513 1112586 1136167 801026 363646 -3021 -232199 -362154 -445285 -411204 -151718 213556
33503 213556 350875 118548 -200360 -237331 4718 219098 243564 217014 270513 274531 34290
33492C4290l93427j89894K22131M11060J86124j53517k00925K4918J29080p1362
33482a522k60475q3996K93465L66649k3216m61500m90908j39678K16372L39736
33472b45073K86730J88644J07628R5014J83806K74561J92531p3530l19633l69780
33462C20898k39527j8529K23710L39683J51372k38645m20489k00227P5397K4945
33452A8588j66736q2612J70368J07797k65789l77083q588L25444K06272p0537
33442a42876q9033J4357l8041o0837J94699M21452K00670k14180k54712J9812
33432E1311P5515j15632m7939L39527M66418P8489l30403l49555k32381k84572
33422c49222k84021K9588L79269L64536R3923n3474j0716M8025J02085K03708
$$ plain form
33492 34290 -359137 -549031 -326900 84160 270284 116767 -84158 -59240 69840 -1522
33482 -1522 -261997 -345993 -52528 314121 290905 -170595 -661503 -801181 -584809 -245073
33472 -245073 41657 230301 337929 432943 616749 891310 1083841 1010311 690678 320898
33462 320898 81371 62842 286552 626235 777607 538962 118473 -81754 -6357 18588
33452 18588 -148148 -230760 -60392 47405 -218384 -595467 -604055 -278611 -72339 -142876
33442 -142876 -231909 -217552 -255593 -316430 -121731 299721 500391 286211 31499 51311
33432 51311 126826 11194 -36745 302782 769200 847689 517286 167731 -64650 -349222
33422 -349222 -633243 -603655 -224386 140150 234073 180599 169883 217908 319993 523701
33412E23701K18843K9955j75141j50376L5118J53763J58367R8196p1881l06619
33402E13926l36544m0340K71638K62752L0044j49602k54986l41314k27862J81636
33392i0652N17786L80925l7908k63096k57452k95771l16991n7985K67960J46634
33382f550l43323n17191j15806L12883K95939P1634K3160M9559p9783k06472q6418
33371f02368J22236J21663j7659j4405J45587K45521J96342N4431j56038l59040
33361b63730l52016j02070Q7785J8072l3083K40829N69561M40946p5786l82932
33351A47576k34716j6482k7042l7193J56044K30514j45358o19106n31644J10848
33341i66559N78589M07815k9134j66104n1142j22347m12833m74024r7797L35901
$$ plain form
33412 523701 742544 772499 597358 446982 482100 635863 794230 892426 820545 513926
33402 513926 177382 137042 408680 671432 701476 551874 296888 -44426 -272288 -90652
33392 -90652 427134 808059 770151 507055 249603 -46168 -363159 -421144 -153184 -6550
33382 -6550 -349873 -867064 -982870 -669987 -374048 -302414 -279254 -229695 -309478 -515950 -602368
33371 -602368 -480132 -358469 -376128 -390533 -244946 575 196917 251348 95310 -263730
33361 -263730 -615746 -717816 -630031 -611959 -645042 -404213 165348 606294 530508 147576
33351 147576 -87140 -103622 -130664 -167857 -11813 218701 73343 -545763 -1077407 -966559
33341 -966559 -387970 19845 -9289 -175393 -226535 -348882 -761715 -1235739 -1333536 -997635
33331i97635M18872K81194L04111M81283M31283N551m47330n21184k41543J9326
33321b66072P559j53219j49616J31425M33618M00547J1537l64249m04132j81767
33311e34369K7606J29824K07580K57782J80016j7528k13757l38480l55777j77967
33301h35070J60651L47840J32466k39667k93036k676K09847J88270K51630N33387
33291D53642O28132K31697k86142l81093j11599M3833n4002j16997j4766L9953
33281D32658o1641j10452M4568K19663J78474k0030j39015r8538k1816j0682l7259
33270C75930p7270k13395m81330o63038m41925J32121N33308L55712j13036k39127
33260h32050R5952L81393K64831O516k7786R3900J12765J1899r6858k10842k66625
$$ plain form
33331 -997635 -578763 -297569 6542 487825 919108 924659 477329 -43855 -285398 -266072
33321 -266072 -258513 -411732 -561348 -429923 3695 404242 415779 51530 -352602 -534369
33311 -534369 -506763 -376939 -169359 88423 268439 250911 37154 -301326 -657103 -835070
33301 -835070 -674419 -326579 -194113 -433780 -726816 -729492 -519645 -331375 -79745 453642
33291 453642 1081774 1313471 1027329 646236 534637 578470 524468 407471 392705 432658
33281 432658 371017 260565 305133 524796 703270 683240 544225 445687 423871 413189 375930
33270 375930 298660 85265 -396065 -1059103 -1501028 -1368907 -835599 -479887 -592923 -832050
33260 -832050 -736098 -354705 -89874 -83358 -111144 -17244 95521 107420 10562 -200280 -466905
33249d66905o6511K93329L01960k20918o35839l07802L94382O05022K51931M9923
33239A98572K63305L35407p6095m99298m44639j44604n2583j25245q3004K4787
33229f03397M755l7924Q9195K40839J55381p1851j31409K4758K03499L22844L97722
33218E94412L17778J2225k67966k13134N4264J19162j05374k48286k7423L60938
33208E96596M97098K09854k53029m30657r1570M23424M72753q3974n90268m16548
33198C33679J52690L26632l7362k88760l7933K84830J91704r7782r8572J24505
33188H53631J20745j64974l19821j53502K5145n5925k08101j18584J46550K48914
33178C74078P6837j14862p5792J12054J67076j5070k29712k25456k1484J25388
$$ plain form
33249 -466905 -533416 -240087 61873 -159045 -794884 -1102686 -708304 -103282 148649 198572
33239 198572 461877 797284 721189 221891 -222748 -367352 -419935 -545180 -628184 -603397
33229 -603397 -598642 -636566 -547371 -306532 -151151 -223002 -354411 -329653 -126154 196690 594412
33218 594412 912190 924415 656449 443315 497579 616741 511367 263081 235658 596596
33208 596596 1093694 1303548 1050519 619862 528292 951716 1424469 1340495 750227 333679
33198 333679 486369 813001 775639 486879 448946 733776 925480 827698 729126 853631
33188 853631 974376 809402 489581 336079 361224 305299 97198 -21386 125164 374078
33178 374078 450915 336053 260261 372315 539391 524321 294609 69153 47669 173057
33168A73057O5164n3146k4365P1054m1354l79081n62540k86678K13763M17766
33158d06360J96173m5802K9206K38961K30427L5899m0684L7324P173j68117j42692
33147b8492K61707O60911N54072m916m76960n10238k68466q0359j9478M8665J59195
33136B95641J65255l3866k84255k90293K9800L62392K88923k12987o64856n74228
33126i18474J3512N30874M67287j00106n84410n18186o0391K35965J42736N823
33116g85370J63258M11851L57407O1619r3590m9945p5686j82711j16626M2829
33106b66964p8508l76140k59690L06455N44389J06687k36867J49963O12640K60785
33096G62750m55303m27351K35374L72640k61529o11183j40193L15152N0821l58999
$$ plain form
33168 173057 238221 185075 160710 231764 190410 -188671 -751211 -1037889 -824126 -406360
33158 -406360 -210187 -255989 -226783 12178 242605 278504 237820 275144 282317 114200 -28492
33147 -28492 233215 894126 1448198 1443282 966322 456084 187618 107259 87781 136446 295641
33136 295641 460896 427030 142775 -147518 -117718 244674 533597 320610 -344246 -918474
33126 -918474 -904962 -374088 93199 -6907 -591317 -1109503 -1169894 -933929 -791193 -785370
33116 -785370 -622112 -210261 147146 208765 115175 65230 -10456 -193167 -309793 -266964
33106 -266964 -345472 -721612 -981302 -674847 -130458 -23771 -260638 -110675 501965 762750
33096 762750 307447 -119904 115470 488110 226581 -384602 -524795 -209643 -158822 -517821
33086e17821j77697K48930K60986P5900K24743M29893R3163n19080o20494j89884
33076f91361P9234m323P2045M75050O72625L25433k01074m54046m28043k70760
33066d25220L336K73532K57724n7904l00070k05704P9094L08065M05193L39652
33056F77698R1354j61634j75607n0711j47035m99476o89541m23128J02054N08479
33046g67547N93761L23639j48760m00096j05334M14572M67930n8210n12838m24709
33036f17592j05983l0018j14125k6831J88667K48385J21604j985m3540k6459N6249
33025c51628J09682o9321m02175m34946L9786N53874N29520M2260l54310l67801
33015g05059j62368J8844O9847j8197j18798k1827K47545L62109J62648q4803
$$ plain form
33086 -517821 -695518 -446588 -185602 -109702 115041 544934 638097 119017 -501477 -691361
33076 -691361 -612127 -616450 -544405 -69355 603270 928703 727629 273583 -154460 -425220
33066 -425220 -421884 -148352 109372 51468 -248602 -454306 -375212 -67147 338046 677698
33056 677698 769052 607418 431811 381100 234065 -265411 -954952 -1378080 -1276026 -767547
33046 -767547 -173786 149853 1093 -399003 -504337 -89765 378165 319955 -192883 -617592
33036 -617592 -723575 -753593 -867718 -894549 -705882 -457497 -335893 -337878 -381418 -407877 -351628
33025 -351628 -241946 -311267 -713442 -1148388 -1108602 -554728 -25208 17052 -337258 -705059
33015 -705059 -867427 -848583 -778736 -796933 -915731 -937558 -690013 -327904 -165256 -250059
33005b50059j44487j57753k19485n6933M02080N92265P5214o19938o52869j08602
32995a140567K19201J00301L0478J71012J04183j89376q6253N58509R21940M13996
32985A103424l45503m32239L4496K02590j75338m76341k09708L38696N62626K41219
32975H43922l11502n83476l37872J17256K25077j37776m72404l30050P5086K15092
$$ plain form
33005 -250059 -394546 -552299 -771784 -828717 -426637 165628 240842 -379096 -1031965 -1140567
32995 -1140567 -921366 -821065 -790587 -619575 -515392 -704768 -791021 -232512 689428 1103424
32985 1103424 757921 325682 360178 562768 387430 -88911 -298619 40077 602703 843922
32975 843922 532420 -51056 -388928 -271672 -46595 -184371 -656775 -986825 -911739 -696647
$$ [...]
##END NTUPLES=NMR SPECTRUM
##END=
