##TITLE=31Pdec_BAU-j-BBU
 CDCl3, 24 sc
 13.3.2019
##JCAMPDX= 6.0         $$ Bruker NMR JCAMP-DX V2.0
##DATA TYPE= NMR SPECTRUM
##DATA CLASS= NTUPLES
##ORIGIN= UXNMR, Bruker Analytische Messtechnik GmbH
##OWNER= root
$$ XWIN-NMR		Version 3.5
$$ Wed Mar 13 14:38:58 2019 Russian Standard Time (UT+4h)  she@DPX200
##.OBSERVE FREQUENCY= 81.013821
##.OBSERVE NUCLEUS= ^31P
##.ACQUISITION MODE= SIMULTANEOUS
##.ACQUISITION SCHEME= undefined
##.AVERAGES= 24
##.DIGITISER RES= 17
##SPECTROMETER/DATA SYSTEM= spect
##.PULSE SEQUENCE= zgpg30
##.SOLVENT NAME= D2O
##.SHIFT REFERENCE= (INTERNAL, D2O, 0, 182.463)
##AUDIT TRAIL= $$ (NUMBER, WHEN, WHO, WHERE, WHAT)
$$ ##TITLE= Audit trail, XWIN-NMR		Version 3.5
$$ ##JCAMPDX= 5.01
$$ ##ORIGIN= Bruker BioSpin GmbH
$$ ##OWNER= she
$$ F:/spectra/data/she/nmr/P31/1/pdata/1/auditp.txt
$$ ##AUDIT TRAIL=  $$ (NUMBER, WHEN, WHO, WHERE, WHAT)
(   1,<2019-03-13 14:37:54.90 +0400>,<she>,<DPX200>,
      <created by zg, POWCHK disabled, PULCHK disabled
       configuration hash MD5:
       00 E9 B6 7A A2 85 ED C7 34 08 36 98 17 FE 4E 26
       data hash MD5: 32K
       8B C6 41 02 64 1E 24 A3 9D AD 44 A8 90 D0 E8 75>)
(   2,<2019-03-13 14:38:01.43 +0400>,<she>,<DPX200>,
      <Start of raw data processing
       efp BC_mod = 2 LB = 1 FT_mod = 6 PKNL = 1 PHC0 = -1860.532 PHC1 = 144.599 SI = 64K 
       data hash MD5: 64K
       57 CF 66 91 AF 42 D9 8B 18 C7 19 F9 8E 17 22 E0>)
(   3,<2019-03-13 14:38:19.25 +0400>,<she>,<DPX200>,
      <pk PHC0 = 54.92822 PHC1 = -87.80003 
       data hash MD5: 64K
       F9 4D C3 A3 81 CA 9D E4 97 0E 23 94 58 D1 15 8A>)
(   4,<2019-03-13 14:38:24.25 +0400>,<she>,<DPX200>,
      <abs ABSG = 5 
       data hash MD5: 64K
       2A 95 DA B2 F4 B7 D4 E4 C4 F6 16 1D 45 81 B1 04>)
$$ ##END=
$$ 
$$ hash MD5
$$ BA A7 E0 1B C2 BD AE 4F 07 D3 CB 4B 0C AF CB 5D
##$RELAX= 
##$RELAX= 
##$RELAX= 
##$RELAX= 
##$RELAX= 
##$RELAX= 
##$RELAX= 
##$RELAX= 
$$ Bruker specific parameters
$$ --------------------------
##$DU= <F:/spectra>
##$EXPNO= 1
##$NAME= <P31>
##$PROCNO= 1
##$TYPE= <nmr>
##$USER= <she>
##$AMP= (0..31)
100 100 100 100 100 100 100 100 100 100 100 100 100 100 100 100 100 100 
100 100 100 100 100 100 100 100 100 100 100 100 100 100 
##$AQSEQ= 0
##$AQ_mod= 1
##$AUNM= <au_zg>
##$AUTOPOS= <>
##$BF1= 81.014009
##$BF2= 200.13
##$BF3= 200.13
##$BF4= 200.13
##$BF5= 200.13
##$BF6= 200.13
##$BF7= 200.13
##$BF8= 200.13
##$BYTORDA= 1
##$CFDGTYP= 0
##$CFRGTYP= 5
##$CHEMSTR= <none>
##$CNST= (0..31)
1 1 145 1 1 1 1 1 1 1 1 1 1 1 1 1 1 1 1 1 1 1 1 1 1 1 1 1 1 1 1 1 
##$CPDPRG= <waltz16>
##$CPDPRG1= <>
##$CPDPRG2= <waltz16>
##$CPDPRG3= <>
##$CPDPRG4= <mlev>
##$CPDPRG5= <mlev>
##$CPDPRG6= <mlev>
##$CPDPRG7= <mlev>
##$CPDPRG8= <mlev>
##$CPDPRGB= <>
##$CPDPRGT= <>
##$D= (0..31)
0 1 0 0 0 0 0 0 0 0 0 0.03 2e-05 3e-06 0 0 0 0 0 0 0 0 0 0 0 0 0 0 0 0 
0 0 
##$DATE= 1552473474
##$DBL= (0..7)
120 120 120 11 120 120 24 19 
##$DBP= (0..7)
150 150 150 150 150 150 150 150 
##$DBP07= 0
##$DBPNAM0= <>
##$DBPNAM1= <>
##$DBPNAM2= <>
$$ [...]
##$SUBNAM3= <"">
##$SUBNAM4= <"">
##$SUBNAM5= <"">
##$SUBNAM6= <"">
##$SUBNAM7= <"">
##$SUBNAM8= <"">
##$SUBNAM9= <"">
##$SW= 369.568048894756
##$SWIBOX= (0..15)
0 1 3 0 0 0 0 0 0 0 0 0 0 0 0 0 
##$SW_h= 29940.119760479
##$TD= 32768
##$TD0= 1
##$TE= 0
##$TE2= 300
##$TE3= 300
##$TEG= 300
##$TL= (0..7)
0 120 53 12 22 120 120 120 
##$TP= (0..7)
150 150 150 150 150 150 150 150 
##$TP07= 0
##$TPNAME0= <>
##$TPNAME1= <>
##$TPNAME2= <>
##$TPNAME3= <>
##$TPNAME4= <>
##$TPNAME5= <>
##$TPNAME6= <>
##$TPNAME7= <>
##$TPOAL= (0..7)
0.5 0.5 0.5 0.5 0.5 0.5 0.5 0.5 
##$TPOFFS= (0..7)
0 0 0 0 0 0 0 0 
##$TUNHIN= 0
##$TUNHOUT= 0
##$TUNXOUT= 0
##$USERA1= <user>
##$USERA2= <user>
##$USERA3= <user>
##$USERA4= <user>
##$USERA5= <user>
##$V9= 5
##$VALIST= <valist>
##$VCLIST= <CCCCCCCCCCCCCCC>
##$VD= 0
##$VDLIST= <DDDDDDDDDDDDDDD>
##$VPLIST= <PPPPPPPPPPPPPPP>
##$VTLIST= <TTTTTTTTTTTTTTT>
##$WBST= 1024
##$WBSW= 4
##$XGAIN= (0..3)
0 0 0 0 
##$XL= 0
##$YL= 0
##$YMAX_a= 69651
##$YMIN_a= -81460
##$ZGOPTNS= <>
##$ZL1= 120
##$ZL2= 120
##$ZL3= 120
##$ZL4= 120
##$ABSF1= 182.463
##$ABSF2= -187.1042
##$ABSG= 5
##$ABSL= 3
##$ALPHA= 0
##$AQORDER= 0
##$ASSFAC= 0
##$ASSFACI= 0
##$ASSFACX= 0
##$ASSWID= 0
##$AUNMP= <proc_1d>
##$AZFE= 0.1
##$AZFW= 0.5
##$BCFW= 0
##$BC_mod= 2
##$BYTORDP= 0
##$COROFFS= 0
##$CY= -3
##$DATMOD= 1
##$DC= 0
##$DFILT= <>
##$DTYPP= 0
##$F1P= 0
##$F2P= 0
##$FCOR= 1
##$FTSIZE= 65536
##$FT_mod= 6
##$GAMMA= 0
##$GB= 0
##$INTBC= 1
##$INTSCL= 5.30512e-09
##$ISEN= 30
##$LB= 1
##$LEV0= 0
##$LPBIN= 0
##$MAXI= 10000
##$MC2= 0
##$MEAN= 0
##$ME_mod= 0
##$MI= 50
##$NCOEF= 0
##$NC_proc= -3
##$NLEV= 6
##$NOISF1= 182.463
##$NOISF2= 159.3651
##$NSP= 0
##$NTH_PI= 0
##$NZP= 0
##$OFFSET= 182.463
##$PC= 4
##$PHC0= -1805.604
##$PHC1= 56.79897
##$PH_mod= 1
##$PKNL= yes
##$PPARMOD= 0
##$PSCAL= 0
##$PSIGN= 0
##$REVERSE= no
##$SF= 81.0140089999434
##$SI= 65536
##$SIGF1= 159.3651
##$SIGF2= -187.1042
##$SINO= 113.3802
##$SIOLD= 16384
##$SREGLST= <1H.CDCl3>
##$SSB= 0
##$STSI= 65536
##$STSR= 0
##$SW_p= 29940.119760479
##$SYMM= 0
##$S_DEV= 0
##$TDeff= 32768
##$TDoff= 0
##$TI= <>
##$TILT= no
##$TM1= 0
##$TM2= 0
##$TOPLEV= 0
##$USERP1= <user>
##$USERP2= <user>
##$USERP3= <user>
##$USERP4= <user>
##$USERP5= <user>
##$WDW= 1
##$XDIM= 65536
##$YMAX_p= 422766596
##$YMIN_p= -3446243
$$ End of Bruker specific parameters
$$ ---------------------------------
##NTUPLES= NMR SPECTRUM
##VAR_NAME=  FREQUENCY,     SPECTRUM/REAL,   SPECTRUM/IMAG
##SYMBOL=    X,             R,               I
##VAR_TYPE=  INDEPENDENT,   DEPENDENT,       DEPENDENT
##VAR_FORM=  AFFN,          ASDF,            ASDF
##VAR_DIM=   65536,         65536,           65536
##UNITS=     HZ,            ARBITRARY UNITS, ARBITRARY UNITS
##FACTOR=    0.456856943014862, 1,           1
##FIRST=     14782.0589164792, 0,            0
##LAST=      -15158.0608439998, 0,           0
##MIN=       -15158.0608439998, -3446243,    0
##MAX=       14782.0589164792, 422766596,    0
$$ Real data points
##PAGE= N=1
##DATA TABLE= (X++(R..R)), XYDATA
$$ [...]
40917a89447J61529J17756J711j94132k37747l049K25517J94427J18529K37860
40907D32954L05602M6949k47861j98047l4979j52616l11313o5176L19844K38731
40897C34088j73767k48093N5914J33606j32349j85486J47008L35081J09571r9418
40887B76155J7481J48791J8827j25300m0370P2104q607j42738j60344j34958j13189
40876a92148N27J34835P5744q7994l1174K04400K11450p0446k20319n6907R3437
40865F1405K5437l6091M0990M4037q8412q2294J27875K22456Q6810J0169P4080
40854D86462m1983l73207m32072j8266L43365J98872j46629j86497L1750J69525
40844C1320J80533J71431O2175j73461k68327o6967J53095J28388L2174Q9017
$$ plain form
40917 -189447 -27918 89838 91549 -102583 -340330 -343379 -117862 76565 195094 432954
40907 432954 738556 785505 537644 339597 304618 152002 -159311 -224487 95357 334088
40897 334088 160321 -87772 -31858 101748 -30601 -216087 -69079 266002 375573 276155
40887 276155 293636 442427 461254 335954 295584 367688 359081 216343 55999 -78959 -192148
40876 -192148 -191621 -56786 18958 -69036 -100210 104190 315640 245194 24875 -32032 61405
40865 61405 86842 50751 91741 135778 47366 -34928 92947 315403 402213 412382 486462
40854 486462 444479 71272 -360800 -379066 -35701 163171 16542 -169955 -138205 31320
40844 31320 211853 383284 445459 271998 3671 -63296 89799 218187 250361 339378
40834C39378J36316k6654j99414j22893L9326j861j43068j02893N8857O3571r5997
40823e5332j74857q4764L5468P9122N3130j4489o6984k9396N0642L2933n9472
40812b33999m1642R1951J13458l7130j12507K9220J87815J70225P4145M4821L9009
40801C25366R82p399L389p4965j66114l7383K63454L70121J52280p1593n5681
40790G02457K1662o1242k01598k18479j46683p0487M3162J70174J79014Q9514
40780E07494P8195J37870Q2333m9595j4564J38864P3528k24198l47408j41149
40770B41370N0696L040n7150L4850O4183r4347j92733q4126l296q9104j02429
40759b29046Q6497K01439O0414p8791J4204J57460J39236P3158Q9034P0816l9569
$$ plain form
40834 339378 475694 449040 249626 126733 166059 164198 21130 -81763 -22906 40665 -55332
40823 -55332 -230189 -314953 -279485 -200363 -147233 -161722 -228706 -258102 -207460 -174527 -233999
40812 -233999 -275641 -183690 -70232 -107362 -219869 -190649 -2834 167391 241536 286357 325366
40801 325366 326348 318949 322338 247373 81259 43876 307330 677451 829731 758138 702457
40790 702457 724119 662877 461279 242800 96117 25630 68792 238966 417980 507494
40780 507494 585689 723559 805892 756297 741733 880597 954125 729927 382519 241370
40770 241370 292066 295106 237956 272806 336989 242642 49909 -34217 -37513 -126617 -229046
40759 -229046 -142549 58890 119304 40513 54717 212177 351413 424571 513605 584421 544852
40748E44852p5391l649l7665k03128k32871n9832N7368L9718R8464K18370J13216
40737D59452j67648k17812l742N9802q5790j2316L27764M09772P4915j62560n0897
40726F30940P07j96797k10627J21845K76331j4886k55932j08572L5747r4736j11568
40715G2452J82256K88225n3192k97408o6982J86178R1680K2848K19763K05764
40705H51584k30001m38243m4881K91740M6991k33904p664K57428N3403j69245
40695C77208O4492K86413M3275j39240K25913N79547L91810K44176O89312J030234
40685C793140M87755l48085n23311k89870l70725n34811k50273P9971j06005l31905
40675A605881J733L54848N9435k95776R3267P20739P31504M62132N30479M13740
$$ plain form
40748 544852 469461 465812 428147 225019 -7852 -67684 -10316 29402 127866 346236 459452
40737 459452 291804 73992 70250 130052 44262 31946 359710 769482 844397 681837 630940
40726 630940 631647 434850 224223 346068 622399 607513 351581 243009 278756 184020 72452
40715 72452 254708 542933 489741 192333 125351 311529 403209 426057 645820 851584
40705 851584 621583 183340 138459 430199 477190 243286 235622 493050 546453 377208
40695 377208 441700 728113 771388 632148 858061 1437608 1829418 2073594 2762906 3793140
40685 3793140 4280895 3932810 3409499 3119629 2748904 2214093 1963820 2043791 1937786 1605881
40675 1605881 1607614 1962462 2021897 1726121 1819388 2540127 3271631 3733763 4264242 4677982
40665D677982m38021j114846o39782J58764J2193n66360l81846J48623p0303n46087
40655A240317j40746N73965K70453n79115n27168J57314J20073l88553o2740P48091
40645A411891N67255l63560m69084K33933L00821l06813k79446L52166L22296
40636A769459k57482j25563N05034L23858l54525j18256O35668L50203n22282
40627B206114k21839Q35161P01981l35143k74505O69054N16207m20317o2902J140884
40617D754695Q78636l39690Q2242J645770J506981K16320R67124L149828L006217
40608A5868123R17084J057641L362548L608809K192633L985869Q346122R493492
40600D8832321Q564946J3133808K2010584K5968865K9208917M9954941Q5244007
$$ plain form
40665 4677982 4239961 3125115 2485333 2644097 2656290 2089930 1708084 1856707 1786404 1240317
40655 1240317 1099571 1673536 1943989 1364874 837706 995020 1115093 726540 663800 1411891
40645 1411891 1979146 1615586 1146502 1380435 1681256 1374443 1094997 1447163 1769459
40636 1769459 1511977 1386414 1891448 2215306 1860781 1742525 2378193 2728396 2206114
40627 2206114 1984275 2819436 3521417 3186274 2911769 3580823 4097030 3676713 3613811 4754695
40617 4754695 5633331 5293641 5375883 7021653 8528634 8744954 9712078 12861906 15868123
40608 15868123 16785207 17842848 21205396 24814205 27006838 30992707 39338829 48832321
40600 48832321 57397267 70531075 92541659 118510524 147719441 197674382 282918389
40593B82918389R4721072M5127135l8347546r2689915q8279951n4550347l2180998
40586A16717839k6864980k1915014j2720858p879005q672894p704529l601213
40579B7359346j889652l267384l001561p17556o37986k848262l126218j016788
40571A0853939k86867j596907j766963k57990Q6853j127270j213873J61035L87119
40562E239076r10976j194956N5418M91137n05951q31973J25714M62757l77965
40553B552281o24234K22368M62917l76026o40344J80594N35272r8749l13956L04379
40543B204502L62751m67973o74229J78783N36832k45251p53692k03566K48027
40534A186184j33340l63759J51255M29796j01723m68591k9724L67669R0894j62105
$$ plain form
40593 282918389 377639461 422766596 384419050 291729135 203449184 148898837 116717839
40586 116717839 89852859 67937845 55216987 47337982 38665088 30960559 27359346
40579 27359346 25469694 22202310 19200749 18483193 17845207 14996945 11870727 10853939
40571 10853939 10567072 8970165 7203202 6945212 7032065 5904795 4690922 4851957 5239076
40562 5239076 4328100 3133144 3188562 3679699 3173748 2341775 2467489 2930246 2552281
40553 2552281 1928047 2150415 2613332 2237306 1596962 1777556 2312828 2214079 1900123 2204502
40543 2204502 2567253 2099280 1425051 1603834 2140666 1895415 1141723 938157 1186184
40534 1186184 1052844 689085 840340 1270136 1168413 699822 670098 1037767 1128661 966556
40524I66556J39402L76830J34905M190L00571M56521K94800M14876P89627N41821
40514D420099l64102q11166m36641k19888o18863p92042l03839N8268j32729j63186
40504F35911K82625L95404j59767m63855J844M15070J88660K0798M37923O93991
40494B448604J45612n37605n61728k72348k62696k87634k447K13410N0720n6598
40484H77290J58933J84361k30848m31618k4387L33821J04321j93790l2783J47817
40474H93117j12698l44851o1261K74293J11702j79046p0094J35160l6478l06697
40464C03147k42396q2376j57092j69569J55611L87584J29516k22006j98156n8721
40454a54458j52617j95491P2015K35686j1217j68343J91738N67549L81715j9856
$$ plain form
40524 966556 1105958 1482788 1617693 1621883 1922454 2378975 2673775 3088651 3878278 4420099
40514 4420099 4055997 3244831 2808190 2588302 1969439 1177397 873558 931826 799097 635911
40504 635911 918536 1313940 1154173 690318 692162 1107232 1295892 1316690 1754613 2448604
40494 2448604 2594216 2056611 1494883 1222535 959839 672205 669758 883168 933888 877290
40484 877290 1036223 1220584 989736 558118 533731 867552 971873 778083 745300 893117
40474 893117 780419 435568 374307 648600 760302 581256 511162 646322 609844 303147
40464 303147 60751 -21625 -178717 -348286 -192675 194909 324425 102419 -95737 -154458
40454 -154458 -307075 -502566 -430551 -194865 -206082 -374425 -182687 384862 766577 746721
40444G46721p7032k1311k69926m88198k15358J74919J06511j53988m4088K22516
40434a9234J11919j70228o9209K64964K84343N6190L2315J29700l4820k87041
40424B98899j83356J07040R4242j06668j9085K56682K27748o0854j41077m504
40414D69067l2572j91464j23154Q4457L2000j92686j53341Q6386O0204k07015
40404a68118k09358J25351L01539J04946j14961j01382k138N4262J26125J51047
40394B67313p35j52998j7706K59298K67142P338j27546j5078Q9614P3718O4965
40383G15325M2625j24083k81258j58773R8522R6437j40377k04355K167J54506
40373B00736J04454N6571R4911M2904j25522j98598j30563j11027j69856j17471
$$ plain form
40444 746721 669689 648378 378452 -109746 -325104 -150185 -43674 -197662 -241750 -19234
40434 -19234 92685 -77543 -146752 118212 402555 458745 491060 620760 585940 298899
40424 298899 115543 222583 316825 210157 191072 447754 675502 614648 473571 469067
40414 469067 436495 245031 121877 206334 238334 45648 -107693 -21307 38897 -168118
40404 -168118 -377476 -252125 49414 154360 39399 -61983 -64121 -9859 116266 267313
40394 267313 266578 113580 95874 355172 622314 629652 502106 487028 576642 650360 715325
40383 715325 757950 633867 352609 193836 292358 388795 248418 44063 46230 200736
40373 200736 305190 361761 456672 499576 374054 175456 44893 -66134 -235990 -353461
40363c53461O4414J56867Q3329O732J1904J0231k9705m9480o9513j17976p7617
40352c64275J14702K52150J51477p196K6993J42453J01288j1794Q00J9920j39485
40341B87033k72328r6509J81917J68346m0697n7693Q7008N6379j14980j07073
40331I1403K3985n3233k49864j60123J62173K42346K1413o6807Q3218Q8134j43232
40320C9413k09068J6334J31229l4749j06848R8437J99104l4735k21669m5098J75454
40309G804N1954k07780j81752R2045K66408K15807M5135j58712k69914j04644
40299b43649K52463L99939J67912j05504j12931k8765j04389j87606m6708J40922
40289A31684O8603j61681k19204r4670m7628j16476q7164R2715K25395J93148
$$ plain form
40363 -353461 -289047 -132180 -48851 -42119 -30215 -19984 -49689 -99169 -168682 -286658 -364275
40352 -364275 -249573 2577 154054 146858 173851 316304 417592 405798 406598 426518 287033
40341 287033 14705 -81804 100113 268459 227762 170069 257077 313456 198476 91403
40331 91403 115388 62155 -187709 -347832 -185659 56687 78100 11293 94511 182645 39413
40320 39413 -169655 -153321 -22092 -56841 -163689 -65252 133852 99117 -122552 -167650 7804
40309 7804 59758 -148022 -329774 -237729 28679 244486 289621 130909 -139005 -243649
40299 -243649 8814 408753 576665 471161 358230 329465 225076 37470 -9238 131684
40289 131684 200287 38606 -180598 -275268 -322896 -439372 -526536 -433821 -208426 -15278
40279a5278R1706J9080l7809q9881j01928p0955j8308O9156J78298K11097J10041
40268C45219j7797k4649P7683J44163P6712j00625k87129l58651k47806l7937
40258d30817R3706Q1316M0203Q2749J57959J41311J0471j35820j90997j33710
40248b83629l4877K4466N9146J53293K91378L17020J52170n0169j02239k9587
40238D96972K4366L2080M2025J1399j09742k09117j48180n238L2490l9313p0068
40227E7674j1691O0436J09827J16832j781k24353l05971r7950J49444J14285r8604
40216a31852j43234K68N5607k1496O956J79915K45017J07841k8321n1831r5939
40205A22931k12305k46204j36324j5572O4317J86625K90406J84379q4363k20598
$$ plain form
40279 -15278 76428 95508 57699 -32182 -134110 -205065 -223373 -154217 24081 235178 345219
40268 345219 327422 302773 380456 524619 601331 500706 213577 -145074 -392880 -430817
40258 -430817 -337111 -255795 -215592 -132843 25116 166427 176898 41078 -149919 -283629
40248 -283629 -318506 -294040 -234894 -81601 209777 526797 678967 628798 526559 496972
40238 496972 521338 553418 595443 606842 497100 287983 139803 134565 167055 127742 57674
40227 57674 45983 106419 216246 333078 331297 106944 -199027 -296977 -147533 -33248 -131852
40216 -131852 -275086 -274818 -219211 -240707 -233751 -53836 191181 299022 270701 218870 122931
40205 122931 -89374 -335578 -471902 -487474 -423157 -236532 53874 238253 153890 -66708
40195f6708j26073k0657m1708o5922j5012P888j8746K6539J19138P7448p9031
40184b02844j09222L5358J34520J06305J08421J62501Q9253q8674j08391N3227
40174A80454R7213p0411j76336q7619j6768n8660j2691J40250J00237j67261k36774
40163c08366P7293L37353J67675j54155k02229n9016j7253k2550R7219J79054
40153I5025J0957j87632p3891K17021K51217m7144l35294l62118j87925K8834
40143e90950J70107J57261L7640k2828J9899K9347j6232N2612K29689K34677j1006
40132B90216j82772q4176J4376j19466k42121q6520J26409P1645j09239q4498
40122d06146R5395J57491R2233M2081m7143k24496k42892O3979L62698K67659
$$ plain form
40195 -66708 -192781 -213438 -255146 -321068 -336080 -328192 -346938 -320399 -201261 -123813 -202844
40184 -202844 -312066 -276708 -142188 -35883 72538 235039 324292 235618 127227 180454
40174 180454 277667 207256 30920 -56699 -73467 -132127 -144818 -4568 95669 -71592 -308366
40163 -308366 -231073 106280 273955 119800 -82429 -141445 -158698 -181248 -84029 95025
40153 95025 105982 -81650 -155541 61480 312697 265553 -69741 -431859 -619784 -590950
40143 -590950 -420843 -263582 -225942 -248770 -228871 -199524 -215756 -163144 66545 301222 290216
40132 290216 107444 23268 37644 -81822 -323943 -410463 -284054 -212409 -321648 -406146
40122 -406146 -310751 -153260 -61027 -18946 -66089 -290585 -533477 -469498 -106800 160859
40112A60859k6693p3103R0958Q6085j06559j65814m5183k056o9409k8296J19919
40101e9292J45339L4084j2560J3128m2097j08580M039J75991J10545j45393k68248
40090a53044j96310j41904j25162J6140J94581J60206L121N4753K84278L18610
40080D15269R3642n0461R832L812j75436k54600q7120Q8439P8486J3654L0767
40069A66284M8488P489p181P714m4146r3124K0321J75576Q4379j93011k84848
40058a12059j08753L2365J5324M8621J60425P7485k13894l15563n1792K31167
40048b36674K36548J20105Q1585K7132r2278p3621J08923J23185j49765l13287
40038a68147q6188J96632J24561j39795j98946o8168j3014j7474R9955K40948
$$ plain form
40112 160859 134166 61063 152021 238106 131547 -34267 -79450 -81506 -150915 -179211 -59292
40101 -59292 86047 120131 107571 120699 78602 -29978 -25939 150052 260597 115204 -153044
40090 -153044 -349354 -491258 -616420 -600280 -405699 -245493 -242372 -187619 96659 415269
40080 415269 508911 458450 468282 472094 296658 42058 -45062 43377 121863 135517 166284
40069 166284 214772 222261 215080 222794 178648 85524 105845 281421 365800 172789 -112059
40058 -112059 -220812 -188447 -173123 -124502 35923 113408 -100486 -416049 -467841 -236674
40048 -236674 -126 119979 201564 228696 136418 62797 171720 294905 145140 -168147
40038 -168147 -254335 -57703 66858 -72937 -271883 -340051 -353065 -370539 -270584 -29636
40028b9636J67270m4002j04559J4190P8093j1523j29127j69922j24893M482J46242
40017b03385J32706n8167j86994q2128R7711J41148J05399J14051P4328r8628
40007C6041j95532m739K76450K86205L7874j32983p7018M3691Q2241N5513J308
39996D09051n7506n4134J811n2606k63296l61160j23391K07689K13047q5193k62411
39985d28099j17686J04666J50991P8003M5820O1854M7871j7544j02178j43612
39975c19914o5338J05101J84829O2873r4782o4790Q8002J23218J7319l7818k921
39964d221m7273j94455k13983J7663K90024L38302J76165J3787k6178J1443K9009
39953C90283k3905j08375j11385K7817J90171J74117m6924k60049k52695m3815
$$ plain form
40028 -29636 137634 93632 -10927 3263 81356 69833 -59294 -229216 -354109 -349627 -203385
40017 -203385 -70679 -128846 -315840 -397968 -300257 -159109 -53710 60341 134669 36041
40007 36041 -159491 -164230 112220 398425 436299 303316 226298 269989 352230 407743 409051
39996 409051 351545 297411 299222 246616 -16680 -377840 -501231 -293542 -80495 -165688 -428099
39985 -428099 -545785 -441119 -290128 -212125 -166305 -104451 -56580 -74124 -176302 -319914
39975 -319914 -385252 -280151 -95322 -32449 -127231 -192021 -104019 19199 36518 -1300 -4221
39964 -4221 -51494 -245949 -459932 -442269 -152245 186057 362222 376009 349831 361274 390283
39953 390283 366378 258003 146618 174435 364606 538723 491799 231750 -20945 -64760
39943f4760J65519K11901R9921m6483j23577j37727j56439j89193j69788o0719
39933d71345R3738K29271K95571K31031K9659j51612j20636N9511R7806j07813
39923A85181k84757j74015Q6984J79773N1115r3508j28750q8385J7323J96937
39913e2102L19353K19426k0340j25462j1216R8200L244j93053k40590o4150J61454
39902I4764K08164K4259k06661k43150m8782J69163K18814J32519M8873K072m9392
39891C50643q3795n9789l1086o3496r1264j2770J12061J22966J946r6706o6337
39880H2373K4670M2796n4594j77494j79301j3386J70157J80310N4014P996P8676
39869B16217M4948j67057k73646o0725K19174J93721o0467j58915j4105Q9439
$$ plain form
39943 -64760 100759 312660 412581 366098 242521 104794 -51645 -240838 -410626 -471345
39933 -471345 -377607 -148336 147235 378266 407925 256313 135677 195188 292994 185181
39923 185181 -99576 -273591 -186607 -6834 44281 -49227 -177977 -266362 -249039 -52102
39913 -52102 267251 486677 466337 340875 329659 427859 431103 238050 -2540 -66690 94764
39902 94764 302928 327187 120526 -122624 -171406 -2243 216571 349090 397963 400035 350643
39891 350643 266848 207059 175973 112477 21213 8443 120504 243470 245416 148710 82373
39880 82373 107043 149839 95245 -82249 -261550 -274936 -104779 75531 129545 137541 216217
39869 216217 261165 94108 -179538 -240263 -21089 172632 112165 -46750 -60855 28584
39859B8584J584r3133l7702O7337R5934Q6579R3938P5262J8211j2126k1493r3219
39847B09756j98033j94324o5100M4832O9416Q9823J23543P4519m7872r3909l1303
39836a8652m432n6025m0151P9757J07726n6241k09824j63154m2519n2808j15465
39825e71788p039K47179L81017K62704N0218m6019n729K8382o4026k41675l27481
39814b94257k11140k0416J9187q8908r4582J15494L09896K42566K2497o5852K544
39803f2971L803j24148j65641P220J96220J56982m6503j55039r0781j5034k9622
39792c25514l6517L8021P5329k9364j35669m3296J67764K27952R8140K6283J21749
39781A84878J63577p872j77409q4700J37916J66595m425r4580k8456m1516k43735
$$ plain form
39859 28584 30168 -62965 -100667 -33330 62604 149183 243121 318383 336594 324468 302975 209756
39847 209756 11723 -182601 -247701 -202869 -133453 -43630 79913 154432 106560 12651 -18652
39836 -18652 -23084 -79109 -119260 -39503 68223 11982 -197842 -360996 -403515 -456323 -571788
39825 -571788 -578827 -331648 49369 312073 362291 316272 310543 338925 274899 33224 -294257
39814 -294257 -505397 -525813 -506626 -595534 -690116 -574622 -264726 -22160 337 -65515 -62971
39803 -62971 -59168 -183316 -348957 -341737 -145517 11465 -35038 -190077 -280858 -295892 -325514
39792 -325514 -362031 -324010 -248681 -278045 -413714 -457010 -289246 -61294 36846 63129 184878
39781 184878 348455 340583 163174 78474 216390 382985 378560 283980 255524 214008 -29727
39770b9727l91577k31833J39517M00846L57596Q6460j64666j75559M0971K20003
39760B52031J43534o9818j30011R061J11810L3066j10199j76331j70756j13822
39750b21435K8553J84014J65598m4999j96647r7382J11647J59730N371j48705
39740e4255j22149O7316K46397K52860J04581r971J7946N3850m9003j64836q7391
39729B55345P6101L4732j78662k13442J9276J75653L9368j38243q7682M2791o012
39718A9225j50926j43756J2961J33733J62762J48463P1455n4894r2542k1638n4831
39707C0012k52702k93434L8132L98306L42732J6146j00362L2412L4263j67605
39697G7900k23950k3972J05267J2894k381K18414L21539J2046l85311l59727L6039
$$ plain form
39770 -29727 -421304 -653137 -513620 -112774 244822 331282 166616 -8943 32028 252031
39760 252031 395565 325747 195736 204797 316607 349673 239474 63143 -107613 -221435
39750 -221435 -192882 -8868 156730 111731 -84916 -182298 -70651 89079 94450 -54255
39740 -54255 -176404 -109088 137309 390169 494750 484779 502725 556575 507572 342736 255345
39729 255345 331446 366178 187516 -25926 -6650 169003 208371 70128 -17554 25237 19225
39718 19225 -131701 -275457 -262496 -128763 33999 182462 253917 199023 106481 84843 30012
39707 30012 -222690 -516124 -477992 -79686 263046 279192 178830 211242 245505 77900
39697 77900 -146050 -170022 -64755 -51861 -54242 164172 485711 497757 112446 -247281 -211242
39686b11242K94080J83114k4699l8421Q2559J21162K3939r2942j33759j12032
39676I1759r0240r3900r2512n1036K3491J04288J78883K18149J58371p648j58614
39665B80991j60049l0789R1875J16955L9734j15170k64653k58523o6442R8017
39655b68054L9614j03244n4624J42760J84296K1061m3740J26000K49359Q8427
39645C81855j65086k15201j03898m2290k5856O3463J46044P6438l1044M6857K33693
39634C64975K34960L302k05762k46697k26960k06163q9434R5882J46819M0815
39624h8263L2906K20837L15755R0764k07580k09973P626O7258j04095j95194m2091
39613a12050J27350Q8264m5730n9796J5382J3374n3293k4878J05741J39055m6090
$$ plain form
39686 -211242 82838 265952 241253 202832 285391 406553 430492 337550 203791 91759
39676 91759 1519 -92381 -184893 -235929 -212438 -108150 70733 288882 447253 439605 280991
39665 280991 120942 90153 182028 298983 338717 223547 -41106 -299629 -366071 -268054
39655 -268054 -228440 -331684 -386308 -243548 -59252 -38191 -81931 44069 293428 381855
39645 381855 216769 1568 -102330 -144620 -170476 -107013 39031 115469 84425 131282 364975
39634 364975 599935 603237 397475 150778 -76182 -282345 -371779 -275897 -129078 -88263
39624 -88263 -55357 165480 481235 571999 364419 154446 162072 229330 125235 -69959 -112050
39613 -112050 15300 103564 57834 -1962 13420 26794 -26499 -51377 54364 193419 147329
39602A47329k99253l68389j93785L9656J26095N9861R087R2570K37155K81505
39592A31831J69924j4483j66761k26837j61802M689J46258J36640J9319m0557
39582a779P141M3987m553o7136r4743j42750j88446p9740J74605K82664P5698
39571D948j55970n0611K38757K35525j23767l72341k14726O6777J03363j7813
39561b85858K621J42908J25418r4796k38406j08758J52135K73716J71714m541
39551A36153n4768P7404K53947K83661J20980j08137k60376k74182j42475P0339
39541A02546J83400N5314j74777k05286j179J25376k0322k19184j90244l902R9663
39530b48595J04376J41391J72350P2405o3139k5534J29431J29106p9403k38565
$$ plain form
39602 147329 -151924 -520313 -714098 -674442 -548347 -488486 -479399 -386829 -149674 131831
39592 131831 301755 287272 120511 -106326 -268128 -263439 -117181 19459 38778 -1779
39582 -1779 5362 49349 44796 -22340 -117083 -259833 -448279 -528019 -353414 -70750 4948
39571 4948 -151022 -201633 37124 272649 148882 -223459 -438185 -371408 -268045 -285858
39561 -285858 -283237 -140329 -14911 -109707 -348113 -456871 -304736 -31020 140694 136153
39551 136153 81385 158789 412736 696397 817377 709240 448864 174682 32207 102546
39541 102546 285946 341260 166483 -38803 -39982 85394 65072 -154112 -344356 -348258 -248595
39530 -248595 -144219 -2828 169522 241927 178788 153254 282685 411791 332388 93823
39520I3823j76795k8578K0294k0395m6908k8015J9677Q6170J36622J31451R4175
39509B81521O2650J0405o6202o8529L2565O1075j01187k39842r8211J60480J59839
39498A94564o8533j11593J40522L08495J56999n3010o9450o3548k25183l32774
39488a23511j22213K06526K70602Q7609k8405o74j5187j10055j30913n6615k0136
39477d2972k2732N5218J71045J49848o596j22715j46511j62604j37803L0977K23639
39466a1206J92594j8584r7039M0662J29292L3102k8758R5691J93412M9199j79218
39455C99147k14036o4299P2907J24414J08005k5938k55284l54464j83482L2536
39445c60494Q417j41612q3443J78134K91009J11310r1755o8808Q5466J68115J60273
$$ plain form
39520 93823 -82972 -111550 -91256 -111651 -158559 -186574 -166897 -80727 55895 187346 281521
39509 281521 344171 354576 288374 219845 252410 313485 212298 -27544 -125755 34725 194564
39498 194564 126031 14438 154960 463455 620454 567444 497994 434446 209263 -123511
39488 -123511 -245724 -39198 231404 319013 290608 289934 274747 164692 33779 -22836 -42972
39477 -42972 -65704 -10486 160559 310407 303811 181096 34585 -128019 -265822 -234845 -11206
39466 -11206 181388 162804 65765 106427 235719 268821 240063 335754 529166 578365 399147
39455 399147 185111 120812 193719 318133 426138 400200 144916 -209548 -393030 -360494
39445 -360494 -352077 -493689 -577132 -398998 -107989 3321 -88434 -157242 -71776 96339 256612
39434B56612J24570L0546j33308k31537j45645L7733J47406J47275J10652O4560
39424D08864r174q1755j05750r4509q5794p1987l6116l731j519k2658o5646j21450
39412b91225j08299L9367J87781J08529j52143k43057j609K61678K01081o2954
39402f0851j79666j17557j05133j44461j5651K53865L58638K13328P4896P2058
39392C49466K3463j32916j53451N1829J80098L3394j27744n7886K0767j50176
39382C6844l22128j31752K23443K66953L4059k0301J72920K15909o68j01533O4235
39371D37981J28927j20359l24663j53565J47524K01563Q8992O7743N4095j42367
39361C85871l37252k28032N1301J24775o049k8098Q6995O9683q2300n6463J79760
$$ plain form
39434 256612 381182 411728 278420 46883 -98762 -61029 86377 233652 344304 408864
39424 408864 399690 317935 212185 117676 31882 -40105 -76221 -79952 -81471 -104129 -169775 -291225
39412 -291225 -399524 -360157 -172376 -63847 -215990 -459047 -460656 -198978 2103 -60851
39402 -60851 -240517 -358074 -463207 -607668 -623319 -369454 -10816 202512 277408 349466
39392 349466 372929 240013 86562 138391 318489 351883 224139 166253 187020 36844
39382 36844 -285284 -417036 -193593 73360 107419 87118 260038 475947 475279 373746 437981
39371 437981 566908 446549 121886 -31679 115845 317408 406400 474143 528238 385871
39361 385871 48619 -179413 -128112 -3337 -9386 -37484 49511 119194 36894 -19569 160191
39350A60191K46266k0525k63659j66445P5125J20558k788o6067n3945q2189r4964
39339a48442K3658J67647J52312M7442O6720J87114J80052K764j32830j06535
39329D39902l9195m2457o2442n0142o5867j15791q5920M5513J14520K4578p4874
39318H7825k1057R8531R9911L514k8166J9937J1668p8755j22884p7840n9568j12220
39306a79104j00351N5560J99078J49555j3750n5048P8666J97329J58674O2843
39296E53452Q2543K01485K34627Q9584q8216p8676J44045L73578M16081L10447
39286B238950K48993L23894M46783N18169N68042O69408P76749P24972L86392
39277F902352j84685p43364j009202q99627o15308m29147m03096m03756l62486
$$ plain form
39350 160191 406457 385932 122273 -44172 30953 151511 148723 82656 28711 -53478 -148442
39339 -148442 -124784 42863 195175 242617 309337 496451 676503 679267 546437 439902
39329 439902 400707 358250 295808 245666 179799 64008 -21912 23601 138121 162699 87825
39318 87825 66768 165299 265210 268724 240558 260495 272163 193408 70524 -7316 -66884 -179104
39306 -179104 -279455 -223895 -24817 124738 110988 55940 134606 331935 490609 553452
39296 553452 635995 837480 1072107 1161691 1073475 994799 1138844 1512422 1928503 2238950
39286 2238950 2487943 2811837 3258620 3776789 4344831 5014239 5790988 6515960 6902352
39277 6902352 6717667 5974303 4965101 4065474 3450166 3021019 2617923 2214167 1851681
39268A851681l48021l61857k75936p5790L6417n9877j80667j12990M1462M3036
39258E57458q4267j11850j933N9092J1486k6O3588N1960o3057q5810O0432J61889
39246F18962O0548p2672k5878R9404P2540p8812j33024l8773M1060J3247m7283
39235E09319p9849j16945j55834j19244R430J28558J32737J2816j52606k38383
39225g0001j48987N3572J49110L812k26406k67953p6050J31433J74998R8947L5734
39214a41791K5515L1921M5723J02359K16844L15652K45334o7806m23687m51219
39204a01155m7737L96667M23244Q7097j39758l4841J18083M0192q8570O2921M17264
39193A133407N56994L00707q0272k65373k62409k66125l19587k94968j39022L3597
$$ plain form
39268 1851681 1503660 1141803 865867 790077 826494 766617 585950 472960 514422 557458
39258 557458 473191 361341 359408 418500 429986 429960 493548 545508 482451 396641 457073 618962
39246 618962 679510 606838 580960 680364 752904 674092 541068 502295 543355 556602 509319
39235 509319 429470 312525 156691 37447 46877 175435 308172 320988 168382 -70001
39225 -70001 -218988 -165416 -16306 -12494 -238900 -506853 -582903 -451470 -276472 -177525 -141791
39214 -141791 -116276 -84355 -38632 63727 280571 596223 841557 773751 350064 -101155
39204 -101155 -148892 247775 671019 758116 618358 583517 701600 741792 653222 716143 1133407
39193 1133407 1690401 1991108 1910836 1645463 1383054 1116929 797342 502374 363352 396949
39183C96949J04376Q6908N2006J148j08771k47378k98148j87051J4876J49685
39173c5400J27075M274q7541q0885k2213P616j1843m8109q0236r6788n1456Q7351
39161b88155K29724K16093L3169j22259q0860Q6101J90179J68879P9440n1224
39151D61087j95708k23730m8550J61505J55301k4063r4088J1808M3109j24267
39141A22404k58321j58930J2563L0825j2977Q0501K23176J83515L419o9766p252
39130A49157j8130j49936j93770m2067J41098J90801J42344P4401k6437j40211
39120A27250j50558k7392Q5810P5880J1019q746j1523n5360r2612m8792N1140
39109d3884J29594J54459J23382L6564n4386o5574q529L785o0007p9200K1931
$$ plain form
39183 396949 501325 588233 640239 641387 532616 285238 -12910 -199961 -185085 -35400
39173 -35400 91675 95949 8408 -72477 -94690 -87074 -98917 -147026 -227262 -324050 -375506 -288155
39161 -288155 -58431 157662 190831 68572 -12288 73813 263992 432871 512311 461087
39151 461087 265379 41649 -6901 154604 309905 285842 191754 203562 246671 122404
39141 122404 -135917 -294847 -282284 -251459 -264436 -183935 39241 222756 226175 156409 149157
39130 149157 131027 -18909 -212679 -254746 -113648 77153 219497 293898 267461 127250
39120 127250 -23308 -50700 35110 110990 122009 113263 101740 46380 -46232 -95024 -43884
39109 -43884 85710 240169 363551 400115 345729 280155 271626 275411 215404 136204 158135
39098A58135J24270P7913p0616j42484o9841L8893N8834j1508o8880k1735R9069
39087A72050J42266N015k00055k45387q0633R8401J28907Q8641J17267J64255
39077C90727Q5445q7981j75334j28118r2986j50284j67220j7910J79279J95981
39067C1599J3751j39143q0383J19105K61806K52661J30770l7622j87114k25035
39057A40395j06263O6305J31656P3164K0658L7980M2319k4777r0425q9789p6368
39046A24855r4928p4172L2076J15512O8290l5348o6910n8441j12994j77329j05773
39035c85162Q2513K05207J75409Q8814M3152K2797j6812p1423j06434o9236P9400
39024D8225K60173K88444J14531n8349n1335K6193r178q5026k9850O7898p298
$$ plain form
39098 158135 282405 360318 289702 147218 77377 116270 175104 163596 94716 72981 172050
39087 172050 314316 319331 119276 -126111 -206744 -108343 20564 109205 226472 390727
39077 390727 476172 388191 212857 84739 -8247 -158531 -325751 -343661 -164382 31599
39067 31599 45350 -93793 -174176 -55071 206735 459396 590166 552544 365430 140395
39057 140395 34132 100437 232093 305257 325915 363895 406214 381437 291012 201223 124855
39046 124855 29927 -44245 -12169 103343 171633 136285 69375 10934 -102060 -279389 -385162
39035 -385162 -302649 -97442 77967 166781 209933 232730 215918 144495 38061 -31175 48225
39024 48225 308398 596842 711373 653024 601689 627882 618704 533678 503828 571726 564428
39013E64428j88361k20811j23452j41716k40819j11962K29873L45434O0064k12801
39003d0123j13122J25141J23161k5234o118J29316R3453j00867j78269p8230J1528
38992e9364M0489J30560K47552K02274L807j13066n9630m214n6339j05325m8200
38981A78544N1396J10676J37931J25865J4410j64947k56343j63033L7853J92429
38971B64781J94194L2722j72870k33638j10395o204q8085k12778j43565M6415
38961d29423O8715j11385k12134q6214O8516N5389l5392l8434J6805K6139K5176
38950f52242R7924J95287K13877J64311J14910M8171q5543k29726k67358j75721
38940e76110m1810M9687P8819P9933J17123K16449K87816J98090k9435j90423
$$ plain form
39013 564428 376067 155256 31804 -109912 -350731 -462693 -232820 112614 172678 -40123
39003 -40123 -153245 -28104 95057 69823 63705 193021 286474 185607 7338 -70892 -59364
38992 -59364 -18875 111685 359237 561511 565318 452252 392622 388408 332069 226744 178544
38981 178544 229940 340616 478547 604412 618822 453875 197532 34499 72352 264781
38971 264781 458975 491697 318827 85189 -25206 -31410 -119495 -332273 -475838 -429423
38961 -429423 -360708 -472093 -684227 -770441 -701925 -646536 -681928 -720362 -703557 -677418 -652242
38950 -652242 -554318 -359031 -145154 19157 134067 182238 96695 -133031 -400389 -576110
38940 -576110 -617920 -568233 -489414 -409481 -292358 -75909 211907 409997 380562 190139
38930A90139j50872k4565O45p3921r3894N973J29358J66134R5091m8846j93971
38919A271k19429n1117J94703K79691J21944q5755j18409J504Q0305M9658K6939
38908B81305P5333Q1855l6567j50584r1571P7461J35013J6860j06688q1670M6264
38897B47011J31340R0486n8614k11231k21592o1286P8471M262j73532j68284L7618
38886c05351J48696L0018q5714j8427N1992n5394j52311m603K11050J72626k7673
38875c5091l0323J66950K00224l1250j93060q3118O0647R207q2112l487J17210
38864I5797N9950p3855k2947J84621K56199P1035j66440k29329j34425n9027j06294
38853a24715j94852j44247J12297L89217M10141J49488j06164j17225J9384O2700
$$ plain form
38930 190139 39267 14702 15347 -58574 -152468 -146495 -17137 148997 244088 195242 1271
38919 1271 -218158 -269275 -74572 205119 327063 241308 122899 124403 204708 254366 281305
38908 281305 356638 438493 401926 251342 159771 237232 372245 389105 282417 200747 247011
38897 247011 378351 468837 410223 198992 -22600 -83886 -5415 -1153 -174685 -342969 -305351
38886 -305351 -156655 -126637 -212351 -230778 -178786 -234180 -386491 -391094 -180044 -7418 -35091
38875 -35091 -65414 101536 301760 270510 77450 -5668 54979 64186 -17926 -21413 95797
38864 95797 155747 81892 58945 243566 499765 570800 404360 175031 40606 -18421 -124715
38853 -124715 -319567 -463814 -351517 37700 447841 597329 491165 373940 393324 456024
38843D56024j6226n1882J6001O8634L3334n990K4349O0950K7628k2365N819Q0892
38831F77168Q0450j7448q4883k3468Q9686J08895K1638n5124o1962o0461q7145
38820E87346p5660K472M1764l7367j33584j15675m8266q3498j71966j04341J30427
38809h348K52680P1515k11950k43809K7882L00394K96234N7141j66936k12979
38799A61824j17522M126Q3684R1031K669j37535j91036p9228O2203K7818j56870
38788b48836k49576j44149j2590k677k236J31301K86855K62836R0955k9214l5156
38777D7513k2164k5447N76L2071J1479q569M7214R9815K9613r6362j27334q5703
38765i7298q2329o1378Q4049K15100J04930j35746j58813P2236K12434Q8760n6871
$$ plain form
38843 456024 439798 387916 403917 472551 505885 499895 524244 585194 612822 590457 596276 677168
38831 677168 757618 740170 655287 631819 721505 830400 852038 796914 734952 674491 587346
38820 587346 511686 514158 555922 518555 384971 269296 221030 137532 -34434 -138775 -8348
38809 -8348 244332 315847 103897 -139912 -112030 188364 484598 541739 374803 161824
38799 161824 44302 48428 132112 223143 225812 88277 -102759 -181987 -119784 -91966 -248836
38788 -248836 -498412 -642561 -655151 -657828 -660064 -528763 -241908 20928 111883 82669 47513
38777 47513 25349 -98 478 32549 44028 35459 82673 182488 212101 115739 -11595 -97298
38765 -97298 -179627 -241005 -156956 58144 163074 27328 -131485 -59249 153185 241945 185074
38754A85074q334J03737J02654O0005P2826L1084j50591k96300k04754M4687K18268
38743A58356K15745Q5795q5295j77973j09607J379m9463j96299j38973J56873
38733a39462L29630J70964m3894k7927N5696o1622k36984j45811J62489L40206
38723D03285K66316J43559J42773K52260M06355M88822L03954j70845n94812o14765
38713A026902l26829j09612r0697q5535O926P8538O2742J6318m5372j40314j76415
38702B16652o7509N6808K2805o9648p52J53222J02542j61809l12510j78936L5477
38691b03658J17033J13965J22093P7412p0621j86071j17322Q4516K35733K21792
38681C94872P2817p8168r8513J251O3148Q644l2269M3300R5211k2036j58451j00057
$$ plain form
38754 185074 176740 280477 383131 443136 515962 547046 396455 100155 -104599 -59912 158356
38743 158356 374101 459896 374601 196628 87021 88400 38937 -157362 -296335 -139462
38733 -139462 190168 361132 317238 289311 345007 283385 46401 -99410 63079 403285
38723 403285 669601 813160 955933 1208193 1614548 2103370 2407324 2236479 1641667 1026902
38713 1026902 700073 590461 499764 414229 421155 499693 562435 578753 533381 393067 216652
38702 216652 149143 205951 228756 159108 158356 311578 414120 252311 -60199 -239135 -203658
38691 -203658 -86625 27340 149433 226845 156224 -29847 -147169 -62653 173080 394872
38681 394872 467689 389521 291008 292259 355407 364051 331782 375082 470293 448257 289806 189749
38669A89749K6381n8771k75414k71415j2004J51320N7991m7083J2064P8906M0018
38658a08258N0297J64508J39423j20434k82813q5202K00464J74828p2162j61528
38648a00877n1986j9955j08616n6653J93920L30785J49656j11092j10145J14714
38638B29751K12177n402l16899l56239m8587K90376L16488N3352j75137j72122
38628B7758n6551L569L3861J03633J22970m532j44329q0829J36238K17936L0365
38617C90089k20871k60572o5129J56586K11725Q2757j04868k05804j58205q704
38607a82996J41605K09210J65282M4637o9061j03714o4794j9375j5670n2401j12134
38596e9411j64317j46481k5749J15215J46537O7996K0158P7806J31473M7644j26322
$$ plain form
38669 189749 216130 157359 -118055 -389470 -401474 -250154 -192163 -239246 -227182 -148276 -108258
38658 -108258 -57961 106547 245970 125536 -157277 -242479 -42015 132813 60651 -100877
38648 -100877 -152863 -172818 -281434 -338087 -144167 186618 336274 225182 115037 229751
38638 229751 441928 436526 119627 -236612 -285199 5177 321665 375017 199880 27758
38628 27758 -28793 -25224 8637 112270 235240 230708 86379 5550 141788 359724 390089
38617 390089 169218 -91354 -156483 103 211828 294585 189717 -16087 -174292 -182996
38607 -182996 -41391 167819 333101 377738 308677 204963 140169 120794 105124 52723 -59411
38596 -59411 -223728 -370209 -395958 -280743 -134206 -66210 -46052 31754 163227 210871 84549
38585H4549k06402r3716J12363K18107J24645p6787j92898j28474J7610Q8477
38575e2526O4707N6602J26991K07661J93278N3336j39799k41185j38345R2318
38565B23038J95712K4163k41060l02951j39992r98k3203p0163P97J13008J19057
38554a02592K8663l0473P183R1984J29526N9511q0737j62930j04317K4058J07491
38543c2633J45110J71456J08604j02410k86675k08324N6834J95975J18188L5504
38533B01629M1197m0954k58333l36624j09227J59837J56710j3381k9883J49601
38523g9428K93705K68246J30329m9170k06959k19375m9797J14773R0206l5617
38513B56913p3317m8243r2174j38903l1773J41473J45048n378o2259L7077J01375
$$ plain form
38585 84549 -121853 -215569 -103206 114901 239546 162759 -30139 -158613 -141003 -52526
38575 -52526 12181 68783 195774 403435 596713 650049 510250 269065 130720 223038
38565 223038 418750 442913 201853 -101098 -241090 -242088 -265291 -335454 -334657 -221649 -102592
38554 -102592 -73929 -104402 -97219 -5235 124291 183802 103065 -59865 -164182 -140124 -32633
38543 -32633 112477 283933 392537 290127 3452 -204872 -148038 47937 166125 201629
38533 201629 242826 201872 -56461 -393085 -502312 -342475 -185765 -199146 -229029 -79428
38523 -79428 214277 482523 612852 563682 356723 137348 87551 202324 292530 256913
38513 256913 183596 135353 43179 -95724 -127497 13976 159024 153646 91387 128464 229839
38502B29839O0719O8824J53605J11207j10093k41891j08128P4913M6221r3216
38492A92000r4347J4516L0394k4581N1967K38044K62890L3786k03018k24695j07398
38481A69558j4497O0888J64472J83646J4432j91562j94123k5602N5459l8519j17007
38470F7145m1064P7174R7425O3089O1782N6209M832p961O8676J03127k0708j76891
38458C52835j71451m1646L2927K9932N9636J07281N5556o6128j09593p5167r5579
38447G8603j50544p0374J40525K58151J82006N9796o944j04698k45066k44450
38437a02995l8222J30218M1345j69657k22349q2204O0522R4339Q2377J16569K08868
38426A18811K82115K10057m3585k99474l21073j26933L7667O6765R4020J79170
$$ plain form
38502 229839 290558 359382 512987 624194 514101 272210 164082 238995 285216 192000
38492 192000 97653 112169 142563 117982 169949 407993 670883 704669 501651 276956 169558
38481 169558 155061 215949 380421 564067 578499 386937 192814 167212 222671 184152 67145
38470 67145 26081 103255 200680 263769 325551 381760 386592 378631 447307 550434 529726 352835
38458 352835 181384 139738 172665 202597 262233 369514 425070 358942 249349 174182 78603
38447 78603 -71941 -142315 -1790 256361 438367 498163 491219 386521 141455 -102995
38437 -102995 -141217 -10999 30346 -139311 -361660 -443864 -383342 -289003 -206626 -90057 118811
38426 118811 400926 610983 567398 267924 -53149 -180082 -142415 -75650 18370 197540
38416A97540J89289J00297R4844J90544J09842k32753m47418k12219J79312K20492
38406C89770n9311j93578j4468J73798J51649P7596J27374J95073J13189p1461
38396H89631j88764j56113r832J43368J63487K244j83727j86254k8458N8709l3114
38385D71177j44880r2521Q6066K11584J99382J25752R2789R6758N6506m3513j02156
38374I56944n1212R604m7626j52564j34858l0490m5685j78874j69343N9184K04611
38363D19691M1047k00464j76081N5893J68898P2500k8686m459N5349M2165m0268
38352D05585j26747j23512L9781K61378K96670Q7024r6990k0656J77096K19397
38342A119026R3393j3072j1669P9321K44191L43523J02241m71164q73118o77722
$$ plain form
38416 197540 386829 487126 581970 772514 882356 649603 202185 -10034 169278 389770
38406 389770 330459 136881 122413 296211 447860 525456 652830 847903 961092 889631
38396 889631 700867 544754 534922 678290 841777 844021 660294 474040 445582 504291 471177
38385 471177 326297 233776 319842 531426 730808 856560 949349 1046107 1102613 1059100 956944
38374 956944 905732 915336 867710 715146 580288 549798 504113 325239 155896 215080 419691
38363 419691 460738 260274 84193 140086 308984 381484 352798 348339 403688 445853 405585
38352 405585 278838 155326 195107 456485 753155 840179 743189 722533 899629 1119026
38342 1119026 1212419 1199347 1187678 1266999 1511190 1854713 1956954 1485790 612672 -65050
38332f5050j39351J63747J16311O1705J49728J84249Q0764k724j8840r1815j91076
38321B47648j40568J4980M2692n2674l3457J10862J29847o375l1641J11620J34988
38310E27922p6963k30452j03028J15612J80365J50481J64589J60268N9237k5707
38300I22324j869P416j05317k03855j23907N0172J24253Q7604R9811K58994M76415
38289A592041N22441K08543l47797o97840n18765n5999J55742j3850j92350j07851
38279E44315P3718J04805O387q6267j47204j81380j52853j00908j14873j34737
38269a88997j5992J76695K21624J12888O3511J02796L1126j59317k07137l3639
38259A03558J11789Q7328N4570R7721N1683j12665j39526O1221K07535J20667
$$ plain form
38332 -65050 -204401 -40654 75657 137362 287090 471339 552103 549379 530539 438724 247648
38321 247648 107080 122060 164752 112078 78621 189483 319330 312955 281314 392934 527922
38310 527922 450959 220507 117479 233091 413456 563937 728526 888794 948031 922324
38300 922324 920455 927871 822554 618699 494792 544964 669217 756821 856632 1115626 1592041
38289 1592041 2114482 2323025 1975228 1277388 758623 702624 858366 844516 652166 544315
38279 544315 618033 722838 729225 642958 495754 314374 161521 60613 -54260 -188997
38269 -188997 -204989 -28294 193330 306218 369729 472525 503651 344334 137197 103558
38259 103558 215347 302675 357245 454966 506649 393984 254458 315679 523214 643881
38249F43881J5210O1112N8208j47404l04135j64500P6474J15531K2749K8002R3337
38238D98465O3137K385K8696L2023q5933j18911J21275L91558L26346R632j52413
38227A116260k8202J32819J22848j5782j56361j97272o9284J46939K19138Q6978
38217A358081K4531K39189M99251M57856J71993l7901r5333j57852k01094k4656
38207B234065L26503N17093L66354M9381k06723l57507l88613j95102K11813N49229
38197C106493N47383L73096N47205J272973J950253J672188L33321j057601j469838
38188G275473j017221o12744o56606o93869l87911j13788k72028n91659n75040
38179B354607k49037j4248j0710n5842l4599R297M4733M7681l8366j49922j18277
$$ plain form
38249 643881 659091 720203 778411 631007 326872 162372 238846 354377 377126 405128 498465
38238 498465 561602 563987 592683 624706 538773 419862 541137 932695 1259041 1268673 1116260
38227 1116260 1088058 1220877 1343725 1327943 1171582 974310 905026 1051965 1271103 1358081
38217 1358081 1382612 1621801 2121052 2578908 2750901 2713000 2617667 2459815 2258721 2234065
38207 2234065 2560568 3077661 3444015 3493396 3286673 2929166 2540553 2345451 2557264 3106493
38197 3106493 3653876 4026972 4574177 5847150 7797403 9469591 9802912 8745311 7275473
38188 7275473 6258252 5645508 4988902 4295033 3907122 3793334 3521306 2929647 2354607
38179 2354607 2105570 2091322 2080612 2024770 1990171 1999468 2044201 2091882 2053516 1903594 1785317
38168A785317N971n9763l26629l85979l9868L01920K16699r1737j75314n8861
38158A171756q7957k74033k98725p8342J20620J12317k202n4723L178R9991Q9836
38147H01716q8532k24957n5438K52641K08754k44691n37383l02170P5210J07394
38137g456o4776o2848L7545l9665j67284n0406J85717K04408N1036J1959P1402
38126A69632J8809q3468l5434P5298N7468K5909J53985K47653P4311j23830J648
38115E81981K47949J64978j69272k87468j03921N6062P8658J18840J41159n775
38105H23191j50321j8672K02970J24034j31759r7099K17313L35278J41786L5198
38095A481919J95072L27877K58002K01782L05327M03993L87585L84145M66875
$$ plain form
38168 1785317 1791288 1731525 1404896 1018917 979049 1280969 1497668 1405931 1230617 1171756
38158 1171756 1083799 809766 511041 432699 553319 665636 663434 608711 611889 711880 801716
38147 801716 713184 488227 432789 685430 894184 649493 112110 -190060 -114850 -7456
38137 -7456 -72232 -135080 -97535 -137200 -304484 -354890 -169173 35235 86271 98230 169632
38126 169632 188441 104973 69539 144837 202305 228214 382199 629852 704163 580333 581981
38115 581981 829930 994908 825636 538168 434247 490309 568967 687807 828966 823191
38105 823191 672870 654198 857168 981202 849443 752344 969657 1304935 1446721 1481919
38095 1481919 1676991 2004868 2262870 2464652 2769979 3173972 3561557 3945702 4412577
38086D412577N44221O07738P59579R80040J179700J444659J906222K395424K495077
38077A6725237J917210P59894l78988n79280M83402J619386R96034j537750l860241
38068A6144904m073834k749551j712488j462385j156942n33595k25597l47973
38060C882539k98995k9776j42908o03785o60774k26578o3741l63412m08082M0794
38050A125282K71179o1479l36424j53258J2687j55209k03259J25004L27934J18490
38040A070947o283K59367M12808Q7830k67236k42213j46354k61630k56181O4390
38030G15445K35315l4902k87626j52765R007j17358j66203J53338M22525K66776
38020A043552L1965Q7626J50527p6225k67123j03365J03912K7888n5110J48131
$$ plain form
38086 4412577 4956798 5564536 6324115 7304155 8483855 9928514 11834736 14230160 16725237
38077 16725237 18642447 19402341 19023353 18444073 18927475 20546861 21542895 20005145 16144904
38068 16144904 12071070 9321519 7609031 6146646 4989704 4456109 4230512 3882539
38060 3882539 3583544 3553768 3410860 2807075 2146301 1919723 1855982 1492570 1084488 1125282
38050 1125282 1396461 1334982 998558 845300 857987 702778 499519 624523 952457 1070947
38040 1070947 1064664 1324031 1736839 1824669 1557433 1315220 1168866 907236 651055 715445
38030 715445 950760 915858 628232 475467 484474 367116 200913 354251 776776 1043552
38020 1043552 1075517 1163143 1313670 1237445 970322 866957 970869 998757 943647 1091778
38010A091778L38437J75229j14296j87368j10608j3735J98230M29541L44404N2358
38000B203970J01005M74762M52053j75506o62265n18416k10143j63860n1815L59603
37990A809388O04850L79718J13283J07301J2286k99985l12150J41420M63297M11947
37980C431355N27785Q84379O56542l58628j059820p24037j51300k26438n37947
37971B441891m02024j06210j10488q6456K57413M36917J90382J23215M99709N84659
37961C829008M1974l10221p951K10510n3117l6797N25336O78805K06361L49151
37951E433059J440817K115745K261746L960661P301781Q151900L359818l936489
37943C0089038p794466o807118m410143l067578k097605q76367l08046n93148
$$ plain form
38010 1091778 1430215 1605444 1491148 1303780 1193172 1179437 1377667 1807208 2151612 2203970
38000 2203970 2304975 2779737 3231790 3056284 2394019 1875603 1665460 1501600 1449785 1809388
37990 1809388 2414238 2793956 2907239 3014540 3026826 2726841 2414691 2556111 3019408 3431355
37980 3431355 3959140 4843519 5500061 5141433 4081613 3357576 3206276 2979838 2441891
37971 2441891 2039867 1933657 1823169 1736713 1994126 2431043 2621425 2744640 3244349 3829008
37961 3829008 3870982 3560761 3552810 3763320 3710203 3673406 4198742 4877547 5083908 5433059
37951 5433059 6873876 8989621 11251367 15212028 22513809 30665709 34025527 30089038
37943 30089038 22294572 15487454 11077311 8009733 5912128 5035761 4727715 4134567
37935D134567n95229m2034P4985l87001m58518m7265m3168m21616l18783J23513
37925B019451M3633k82387L8894N46483J60093o02410m32850K90835K29070l29664
37915A681148j28184M61203J67799n09477j66343O49082L73585m79725k50058
37906A799030N88930L39500m92118j46834P90329M37939n37437p5580J091784
37897C795543O60744o46156k85850J088847P81876n33464M1016J759694J407489
37888H069739k42770M16972K716732K835960J623318L299472O521410N807603
37880C1048436K151388J986138M905400M384303K147415P334551J8330066K3454896
37872I5742593K6454995M8573792Q8724461J03202076N3532526l5586843r6314462
$$ plain form
37935 4134567 3539338 3497304 3572289 3185288 2726770 2679505 2636337 2214721 1895938 2019451
37925 2019451 2063084 1780697 1819591 2366074 2526167 1923757 1490907 1781742 2010812 1681148
37915 1681148 1552964 2014167 2181966 1672489 1506146 2155228 2528813 2049088 1799030
37906 1799030 2387960 2727460 2235342 2088508 2878837 3316776 2779339 2703759 3795543
37897 3795543 4456287 3810131 3524281 4613128 5395004 4861540 4902556 6662250 8069739
37888 8069739 7826969 8243941 10960673 13796633 15419951 18719423 25240833 31048436
37880 31048436 33199824 35185962 40091362 44475665 46623080 53957631 72287697 95742593
37872 95742593 122197588 170771380 259495841 362697917 416230443 380643600 284329138
37865B84329138r4559786n9467803l3818656k4942722j7225358p080304l070940
37858D4163569n028776m584084j225624j546723n432452o297048l275949j801192
37850A4971721l065218k863510m45936L47165j194316j590841r1104K79734j058001
37841E289694j272850J52544N01239q02909j198958m107M78542m34478o58786
37832B049931M22012Q06249j89152p32583q0669K14150m58380o68477P7719L73936
37822A814736k66870n15885J06320L80222j27535l09899J49288J77660m02309
37813A005728m13720L23735N37126r4397l69183J08064K74835k16913l82090L8563
37803H11748O1670m79295m83032K65402N70548L2762k54018J82943L72906j47648
$$ plain form
37865 284329138 189769352 130301549 96482893 71540171 54314813 47234509 44163569
37858 44163569 39134793 34550709 33325085 31778362 26345910 20048862 16772913 14971721
37850 14971721 11906503 9042993 8597057 8944222 7749906 6159065 6067961 6347695 5289694
37841 5289694 4016844 4169388 4670627 3867718 2668760 2664653 3143195 2708717 2049931
37832 2049931 2471943 3278192 3089040 2356457 2275788 2489938 2031558 1363081 1440800 1814736
37822 1814736 1547866 1031981 1138301 1518523 1390988 1081089 1230377 1408037 1005728
37813 1005728 592008 915743 1452869 1358472 989289 1097353 1372188 1155275 773185 811748
37803 811748 873418 394123 -88909 176493 747041 779803 525785 708728 1081634 933986
37793I33986m79146j50646N5808k32924k53199K67672M60026j2963k74450Q3995
37783C98159K54680j56116l41880J23617M49361J32680j47058J08884L51022K04226
37773A377575J98250N48987N40690j22636o15701l88302n7120j80387l16475l5792
37763I49089K36185J06902n7034Q6698L00366M63375P97952J018866M27936p26559
37753C603776j235068p39680k62853m18226m95577J0002L77614K2214m16629k81301
37743A64272k9515k15622m12260j11052K68445K03723J4949J14253J75675j04567
37733F8301k73196K3525K77785K8770k77584j31864J37640Q5211l1054Q7178J06198
37722A00910j82828k65289J51213M32034P6435l53236k19458J01665K1545j76355
$$ plain form
37793 933986 454840 304194 360002 127078 -126121 141551 601577 588614 314164 398159
37783 398159 652839 496723 154843 278460 727821 860501 713443 822327 1173349 1377575
37773 1377575 1575825 2124812 2665502 2542866 1927165 1538863 1481743 1301356 984881 949089
37763 949089 1185274 1292176 1235142 1321840 1622206 2085581 2883533 3902399 4330335 3603776
37753 3603776 2368708 1629028 1366175 947949 452372 462374 839988 862202 445573 164272
37743 164272 134757 -80865 -493125 -604177 -335732 -132009 -117060 -2807 172868 68301
37733 68301 -204895 -181370 96415 125185 -152399 -284263 -146623 -61412 -92466 -5288 100910
37722 100910 -81918 -347207 -195994 236040 312475 -40761 -260219 -158554 -137009 -313364
37712c13364p655K12795L1330j78442Q5821M27638K32571k00628k08182Q3880
37702A65764J25434k7741P164J03334k0053q4547K02794L96395L7568l82072j79822
37691C44218K79718J73306l57324m81255r0662J59116M3348l5407N5569L8513
37681A29140p6792r306J49789Q7605o4712K4877J66773l3694l38505k06161K09441
37670C8455K75046k2864j02475J34246J60243j78803l85107j78499J00714J33240
37660b5804L1281l8381r0177q3632N5295J54699J0827j74588p0630J75169J58222
37649A02281o6635q9842J17939J95794O5866K016N5016J1571q9183R781K34387
37638E48991K34046j3694j89543j95053j96944j74282J4676J86172N0946j82170
$$ plain form
37712 -313364 -321019 -108224 -76894 -255336 -169515 258123 490694 290066 81884 165764
37702 165764 291198 263457 270621 373955 353902 269355 472149 868544 906112 524040 344218
37691 344218 623936 797242 439918 -41337 -131999 27117 70465 35058 90627 129140
37681 129140 52348 43042 192831 280436 215724 240601 407374 373680 35175 -170986 38455
37670 38455 313501 290637 188162 322408 482651 303848 -81259 -259758 -159044 -25804
37660 -25804 5477 -32904 -123081 -206713 -151418 3281 14108 -160480 -231110 -55941 102281
37649 102281 35646 -54196 63743 259537 325403 327419 382435 394006 304823 314604 548991
37638 548991 783037 769343 579800 384747 187803 13521 28197 214369 265315 83145
37628H3145n4464L31603M14993R2446j52205r3212m8226j91960k51775r0318R595
37617D9622j12801j88692r636K08338J87323k9399k25787k55464o3343K43610
37607a96229L53283R7513k19988k05560L4757J15967K8964M9946J36198K4673
37597B19524j56287m7271K00848P4133l61462m29204P1534M89955L21108r2692
37587B90186k13887p6068L636p866P860k115q5644q9638O4169J86104J33470L3403
37575B43610j460p2665k22792k69624j02942J27820K68169L23870K75193M7955
37565F17134k31827k95120j41794n2479j14915j20332o200K5671o0497l2519J47415
37554b65463K12946R7782P3937K02902J50885j97790m33125k40927J06690K21275
$$ plain form
37628 83145 28681 360284 775277 867723 715518 622306 574080 382120 130345 40027 49622
37617 49622 -63179 -251871 -261507 -53169 134154 104755 -121032 -376496 -439839 -196229
37607 -196229 157054 254567 34579 -170981 -136224 -20257 8707 58653 194851 219524
37597 219524 63237 15966 216814 290947 -70515 -499719 -428185 61770 382878 290186
37587 290186 76299 231 3867 -3999 3861 1746 -83898 -173536 -109367 76737 210207 243610
37575 243610 242150 169485 -53307 -322931 -425873 -298053 -29884 293986 569179 617134
37565 617134 385307 90187 -51607 -104086 -219001 -339333 -345533 -319862 -380359 -412878 -265463
37554 -265463 -52517 45265 119202 322104 472989 275199 -157926 -398853 -292163 -70888
37544g0888J55951J32077Q0872j34653l32194k54123Q07J36308Q6278Q11l0983
37533b29737M41J14252K33595J70952r0153k91345k47450q5486J9963J01456K10722
37522i2790K33198J00292l3157j9028O8843R7850N3332n0325j96303k33405j8014
37511h9507K48524J95293j18898k21399K3780J86391J1686j53031j1666J35662
37501B06835m1141k62101j12345K17654K60385N6407l343Q2958j5138k64147k64211
37490a38187L7834K14452M4463j68463j26021M3800R8633O8301R7956J53412J12130
37479D38310J560l6581N1309J72024J88870M8952j46833k17252j10620P383l0296
37468C66826j53946j67105m1688N7844L2126l1951l0207j573m8876j65859k18908
$$ plain form
37544 -70888 85063 217140 298012 163359 -168835 -422958 -422151 -285843 -199565 -198754 -229737
37533 -229737 -229296 -115044 118551 289503 199350 -91995 -339445 -424931 -404968 -303512 -92790
37522 -92790 140408 240700 207543 188515 257358 355208 408540 358215 161912 -71493 -89507
37511 -89507 159017 354310 235412 14013 37793 224184 235870 82839 71173 206835
37501 206835 165694 -96407 -208752 8902 269287 325694 322351 405309 390171 126024 -138187
37490 -138187 -100353 114099 158562 -9901 -135922 -92122 6511 74812 172768 326180 438310
37479 438310 439870 403289 454598 626622 815492 864444 717611 500359 389739 397122 366826
37468 366826 212880 45775 4087 61931 94057 62106 31899 30326 -18550 -184409 -403317
37457d03317j08543Q7723J86699J25368L4848K7818J9440j01867k20056j23456
37447d75343J37426K61774J08083j17253j50383J9861J97160J98660j632k32480
37437e4127k48528k3353J62351J00908j7209O8252J97726L7512k87701l14851
37427c79020j253J82226K7416r5658Q5280K80675J63425r5817j74521j03038o7562
37416a77847m0247M5936N7159o9264j05723Q4178K43379J37814l1021P134J14125
37405B65623L0774j36089j35450l8100n4692j05478J404J59370J53457P2992J14457
37394C28268J64530J8409j71135j27555L0200j5827k05325k15903m8903O311q1236
37383c18166p8449J9007o226j13293l4686J99885K64681J02064Q365R9542J54725
$$ plain form
37457 -403317 -511860 -424137 -237438 -112070 -77222 -49404 -29964 -131831 -351887 -475343
37447 -475343 -337917 -76143 31940 -85313 -235696 -215835 -18675 179985 178353 -54127
37437 -54127 -302655 -326008 -163657 -62749 -79958 -11706 186020 223532 -64169 -379020
37427 -379020 -380273 -198047 -170631 -266289 -181009 99666 263091 167274 -7247 -110285 -177847
37416 -177847 -218094 -172158 -114999 -184263 -289986 -205808 37571 175385 144364 151498 265623
37405 265623 296397 160308 24858 -13242 -67934 -173412 -172008 -12638 140819 213811 328268
37394 328268 492798 511207 340072 212517 242717 226890 21565 -194338 -243241 -236930 -318166
37383 -318166 -396615 -377608 -383834 -497127 -531813 -331928 -67247 34817 43182 142724 297449
37372B97449O3050k3024n2505j45713k31105q3034J89801J90939j00013k23450
37362a17605J7291K31095J13518o2570K3848J77780P7594j37274j39100r289p2891
37351A02397k88672k87320J4185K65852K17463N0566M3303J58079J54888j4636
37341D16105j31790l7428J20543Q4385j31204k35006q0728J07212P3992q0624
37331A05457q8625M6981Q9797j6612q6009l9883j0215m2537N452J74216K79609
37320D17631J99925N3833k8226r0651j81216k01830q6079M1586L6543o4323j34483
37309c7290j31490p5434K4608J22619J27290L3939l7041q863M7178M0896q541
37298I7871l7481l4265j5190J1059J7090k7658r9825j51017j69602j33212K5066
$$ plain form
37372 297449 360499 337475 284970 139257 -91848 -174882 14919 205858 105845 -117605
37362 -117605 -100314 130781 244299 181729 205577 383357 460951 323677 184577 175288 102397
37351 102397 -186275 -473595 -459410 -193558 23905 74471 117774 275853 430741 416105
37341 416105 284315 246887 367430 451815 320611 85605 4877 112089 186081 105457
37331 105457 16832 63813 153610 136998 50989 11106 891 -41646 -36194 138022 417631
37320 417631 617556 671389 643163 552512 371296 169466 83387 124973 161516 97193 -37290
37309 -37290 -168780 -244214 -219606 -96987 30303 64242 27201 18338 65516 106412 97871
37298 97871 60390 26125 10935 21994 39084 11426 -88399 -239416 -409018 -542230 -517164
37287e17164K70350L82091K14277l8910p8801N4445O3371j01016j53913L4458
37277A29188J99402Q9679j55133k35383j06208L8156O7143K4226K626L2545N8675
37266A44916r296j66022k48919j24072R1837J55674L2465p6698m4720M1390P5693
37255a27752P2070O2610L1304r158k1747l2874p0352n4221P0939J64512P9728
37244A65059n2380j0336J17061N6369j62252k26836o5788N7177K6318K9739J27808
37233F1939J02006r3699j49553R9276L56884L07127M9230j55129k64649l32742
37223a9310k86679j00949N4050P4628R5625J96109K10024M6854r3273o0116p340
37212A09623o2000o5619P8423J39761l3157j77501n2286J13257J9160j58194q1057
$$ plain form
37287 -517164 -246814 135277 349554 310644 231843 286288 349659 248643 94730 129188
37277 129188 328590 418269 263136 27753 -78455 -40299 26844 51070 53696 86241 144916
37266 144916 135620 -30402 -279321 -403393 -311556 -155882 -123417 -200115 -244835 -203445 -127752
37255 -127752 -55682 6928 38232 29074 7327 -25547 -95899 -150120 -79181 85331 165059
37244 165059 112679 102343 219404 275773 113521 -113315 -179103 -121926 -95608 -65869 61939
37233 61939 163945 70246 -79307 19969 376853 683980 733210 578081 313432 -19310
37223 -19310 -305989 -406938 -352888 -278260 -182635 13474 223498 270352 177079 116963 109623
37212 109623 47623 -17996 60427 200188 167031 -10470 -62756 50501 69661 -88533 -169590
37201a69590J39835J46879l9724r7254K9038J06703P1771N4911L6521r2329k08049
37190b1288j20139L0403k8033j94300j53176N0837R4373l1868l6290R4419Q2059
37179b33003n9088l453K39460K48539q2124l10589j63506N3933M0065k0546J04148
37168a86164K25761R9401j09420j18865j99J5776n4024p4654q4097j20909j5191
37157d22585K89871M54974J88948k25789k85158N638J98998J10339m528L5875
37147C46583R2945M8263M712L2039K9009m0054m8967K8370J6554j62047l12729
37136C4678k48113n8842M6818K4770k2718k1524L8793J31152J56300J1497k10610
37125a17799k47511k0517J95769J29622j02858j82045m7873P2694N2041N516K8245
$$ plain form
37201 -169590 -29755 117124 77400 -19854 9184 115887 187658 242569 279090 186761 -21288
37190 -21288 -141427 -111024 -139057 -333357 -486533 -435696 -341323 -373191 -409481 -315062 -233003
37179 -233003 -292091 -295544 -56084 192455 110331 -200258 -363764 -309831 -269766 -290312 -186164
37168 -186164 39597 138998 29578 -89287 -89486 -73710 -127734 -202388 -286485 -407394 -422585
37157 -422585 -132714 322260 511208 285419 261 5899 204897 315236 310708 346583
37147 346583 439528 487791 492503 524542 553551 513497 464530 492900 509454 347407 34678
37136 34678 -213435 -272277 -225459 -200689 -223407 -244931 -206138 -74986 81314 92811 -117799
37125 -117799 -365310 -385827 -190058 -60436 -163294 -345339 -393212 -320518 -268477 -262961 -234716
37114b34716M7602K0521M9511J75651K46298J42876j4518n9556m3805j10776k05935
37103A3153j45673N5797J58733L1762j73558k43721j50233o052J02962J63013
37093a93817J89602K03625K04559J52386L1720q5159j23602j20374j38210j16699
37083D031K2953J58659P8416j69449k84233j44311K5145M0461M6658K03934L22983
37072C05247J22461k73121m22143j47925K41129L67815K07361L717p3623o4705
37062B66213q3010j52777j95206j40839j9379Q6311J43263J63738J30478K9542
37052B28334o4319p2695p0403j77920k95537j86743J12576K49049O0356j46362
37042c63664m3047K36396L36814K04257M9924n7237k07064l33766k44404L1534
$$ plain form
37114 -234716 -187114 -166593 -117082 58569 304867 447743 433225 373669 329864 219088 13153
37103 13153 -132520 -76723 82010 113772 -59786 -303507 -453740 -459792 -356830 -193817
37093 -193817 -4215 199410 403969 556355 588075 502916 379314 258940 120730 4031
37083 4031 26984 185643 264059 94610 -189623 -333934 -308789 -268328 -221670 -17736 305247
37072 305247 427708 154587 -267556 -415481 -174352 193463 400824 404541 330918 266213
37062 266213 183203 30426 -164780 -305619 -324998 -238687 -95424 68314 198792 228334
37052 228334 164015 91320 20917 -157003 -452540 -639283 -526707 -277658 -217302 -363664
37042 -363664 -406711 -170315 166499 370756 420680 363443 156379 -177387 -421791 -390257
37032c90257K27618K10484J05325K7505n4110j43028j47078n0847M2702Q9421
37022h2265J37789J65150Q5050n3591q7215q57L7323m3943j11762o8921k839j0633
37010c6714m9148m5258p656L9667R6144J09106R462j32379j44390l94J22613R0400
36998E1453k7318r1670n6946M0590J28337J11645k7487j48293j10055J4859N6795
36987e8090K7541O1260J23707O2347o2592k1512J64450J90334l9840k29709j62418
36976E5478k7322n7442j41433p1856O3699M7498q4451j25506m9854k940k2441
36965d16570k3016J956p77K6410J72910L35854K99224N1040j66867j64289j7559
36954I8316N9997l2822j91408k09845N899K95811L79452J81094o6117j11785J5971
$$ plain form
37032 -390257 -162639 47845 153170 180675 126565 -16463 -163541 -214388 -171686 -82265
37022 -82265 55524 220674 305724 252133 164918 164061 201384 157441 45679 -23242 -26081 -36714
37010 -36714 -85862 -131120 -138776 -99109 -2965 106141 115603 -16776 -161166 -161560 -38947 51453
36998 51453 24135 -67535 -124481 -83891 44446 156091 128604 -19689 -129744 -114885 -58090
36987 -58090 -30549 30711 154418 216765 154173 132661 297111 487445 447605 217896 55478
36976 55478 28156 -29286 -170719 -242575 -178876 -131378 -215829 -341335 -391189 -394129 -416570
36965 -416570 -439586 -437630 -438407 -411997 -239087 96767 395991 447031 280164 115875 98316
36954 98316 158313 125491 -65917 -275762 -269863 25948 405400 586494 520377 408592 424563
36943D24563J05778O0817k7427n1639j6070k429p3166j92532k33252j24372J7558
36932a12171K1499p8232q1882N3964J41501P4874q151R221K7345m1803p2213M9843
36920a6205J93398J99449J50038J78534J85137K3532j75619j83027o4883o4784
36910D25570j65746j32237L1823M9933j47339k75820j51154L9271P9613M6246
36900a99840Q3709J17360L2107o5413k8284L9847m3850j84632j27931J06063K16952
36889e3912Q7528m8677j1719L3333j14551l13241k76226k4336J51790J34727R2122
36878c43162J27577J20690J1938l6256P0768J55356O4702m3265L2276J64763J03070
36867D28457r0710j49061o6185q8965k53141l04210j39885K2034K5995O081R0848
$$ plain form
36943 424563 530341 591158 563731 512092 496022 493593 420427 227895 -5357 -129729 -112171
36932 -112171 -90672 -168904 -250786 -196822 -55321 19553 11402 20623 47968 6165 -66048 -16205
36920 -16205 177193 376642 526680 705214 890351 913883 738264 555237 490354 425570
36910 425570 259824 127587 159410 209343 62004 -213816 -364970 -325699 -246086 -199840
36900 -199840 -116131 1229 33336 -32077 -60361 -20514 -64364 -248996 -376927 -270864 -53912
36889 -53912 33616 -15061 -26780 6553 -107998 -421239 -697465 -721801 -570011 -435284 -343162
36878 -343162 -215585 -94895 -82957 -119213 -48445 106911 171613 128348 160624 325387 428457
36867 428457 337747 188686 122501 33536 -219605 -523815 -663700 -641666 -615671 -609590 -518742
36856e18742J73097J39686P7711Q3187Q7322K9395p680K4523L4638j3512k2977
36845H6648J5014k0547j00400l6143J23185O2701k34350l12223O4781M49169L44306
36834D42141m2655j55654O9409K30873J44132k0214j67222l40426m13573k04713
36824d57902J19310K03100N6453R052J29459J58407L5538j653Q5387L4681j94431
36813A77401k72153m8178J84813J79189P7087N1525J649j42207j86692l8876L8795
36802B2353j46704l41870k33613M8246J73129J33958J49478K09679J20874p7816
36792E7714j28257J8128J14990J0848j42516j42839L799J48627J77241O9613j01597
36781H5751j99238j40264Q41Q4351Q5324Q8499J21245J09613K4146l6247K2345
$$ plain form
36856 -518742 -345645 -205959 -128248 -45061 42261 71656 63976 88499 123137 109625 86648
36845 86648 101662 81115 -19285 -55428 67757 130458 -103892 -416115 -351334 97835 442141
36834 442141 399486 243832 313241 544114 688246 668032 500810 160384 -253189 -457902
36824 -457902 -338592 -135492 -79039 -69987 59472 217879 253417 251764 337151 371832 177401
36813 177401 -94752 -142930 41883 221072 298159 349684 351333 209126 22434 -16442 22353
36802 22353 -124351 -466221 -699834 -651588 -478459 -344501 -195023 14656 135530 57714
36792 57714 -70543 -52415 62575 73423 -69093 -211932 -208133 -59506 117735 187348 85751
36781 85751 -113487 -253751 -252910 -168559 -83235 5264 126509 236122 260268 224021 246366
36770B46366J22206P4105j68126l85727l26205l7660J69122J31936L3906P4550
36760f5527J41450L2477j50611j35652O9396J90178J33475P8147R3299L2219j09669
36749C09182j11909M7442O4767j78739l49553j90436L2013k0549j57988J9439
36739e36331L93547M46618O9750k53017j64215R6281J26167p5694k26642k06700
36729c30236j22564n3747K1500R1980J03201Q3507J24278K06114J80896p226j94123
36718A03580j96445o5726J568k8465j052J17733J37960j8476j09604O5318K83468
36707B89859J97431j01508k01310j3940J22154L7637k3982P6549O6418k32604
36697B16704m77050k82577J41457K78621N9654j13436k0808J27371J10361j4609
$$ plain form
36770 246366 368572 442677 274551 -111176 -437381 -475041 -305919 -173983 -140077 -65527
36760 -65527 75923 108400 -42211 -177863 -108467 81711 215186 293333 386632 418851 309182
36749 309182 197273 244715 309482 130743 -218810 -409246 -377233 -397782 -555770 -536331
36739 -536331 -142784 303834 373584 120567 -43648 52633 178800 103106 -123536 -330236
36729 -330236 -452800 -506547 -485047 -393067 -289866 -206359 -82081 124033 304929 297703 103580
36718 103580 -92865 -158591 -157023 -185488 -186540 -68807 69153 50677 -58927 6391 289859
36707 289859 487290 385782 184472 170532 292686 330323 306341 382890 449308 216704
36697 216704 -260346 -542923 -401466 -122845 -63191 -176627 -197435 -70064 40297 25688
36687B5688j15870j67571j38590K8588K28616K22658k5212k40302j89196K4772
36677c46419J42543R0300K290j0189K5003L7764L3098P5576J73919K22149J12165
36666E58199r9975k31939k06002j28854r1584l7816O9861J13233Q433j04068n6449
36655b06961O6543O4544m0231m3642R6301J96150J33221j8465j52188k28343j96184
36644c29255k0390J82477K27755J21577N2845R4852J11727J0035j19153j81184
36634A51286k07010k15036j32163L9688J50600J17129N4463P0101Q1231j1746
36624I8543j10466o2528P3814R9771l6255j91834k44946j95823p0629J05597K21862
36613c12894J43833o3297j29326P8670L22419K71494l7325k24354q2123J41072
$$ plain form
36687 25688 -90182 -257753 -396343 -367755 -139139 83519 58307 -181995 -371191 -346419
36677 -346419 -203876 -113576 -111286 -121475 -96472 -58708 -25610 49966 223885 446034 558199
36666 558199 458224 226285 20283 -108571 -200155 -237971 -168110 -54877 -46444 -150512 -206961
36655 -206961 -140418 -75874 -116105 -159747 -63446 132704 265925 247460 95272 -133071 -329255
36644 -329255 -349645 -167168 60587 182164 235009 329861 441588 451623 332470 151286
36634 151286 -55724 -270760 -402923 -363235 -212635 -95506 -41043 29058 110289 98543
36624 98543 -11923 -74451 -637 99134 62879 -128955 -373901 -569724 -640353 -534756 -312894
36613 -312894 -169061 -232358 -361684 -283014 39405 310899 273574 49220 -32903 108169
36603A08169J00643j64081l12942j84984L9120J49578J48592J17425N4717l6918
36593A9319o8772k494N7553K5489l4455m8448o7450j29894j32770k685J32394
36582b52213J25909N5394Q0194J49559P9699j25496k53124j77460M109J33530
36572a79899J42458N3081m1774l1910O4083Q0628m2404j10935L9990K42776K14692
36561D30786j8031j76403j41566l9919L1657P8120M0149j36639k75249j30455
36551c37550J98998L42120J84119k719k3147j2680j11162k09727j85721j12451
36541b69920p4007k0250N3387L5651n9023m8699Q3761J16242l304j3881J82840
36530a7203K66478J6170k52013j49631J49868J80615q9616k62606j56645m051
$$ plain form
36603 108169 208812 44731 -268211 -453195 -414075 -264497 -115905 1520 56237 19319
36593 19319 -49453 -51947 5606 31095 -3360 -51808 -119258 -249152 -381922 -384607 -252213
36582 -252213 -126304 -70910 9284 158843 238542 113046 -140078 -317538 -313429 -179899
36572 -179899 -37441 15640 -26134 -58044 6039 86667 44263 -66672 -26682 216094 430786
36561 430786 412755 236352 94786 54867 86524 164644 204793 68154 -207095 -337550
36551 -337550 -138552 203568 387687 384968 361821 349141 237979 28252 -157469 -269920
36541 -269920 -343927 -364177 -310790 -275139 -334162 -382861 -299100 -182858 -186162 -200043 -17203
36530 -17203 249275 265445 13432 -136199 13669 194284 104668 -157938 -314583 -318634
36520c18634L750l3496l706K1787j8779m5158j463M3320M0952L9905N7486L3610
36508a80426l9221q2755o6445m2348k4688L4740J31769J92172J80758J21220K1907
36497B46683j00785j56469p8807L6795M4066l0564m0720K4929L3547l7522m7433
36486a06280M7867Q0296p0363k49760k11788M1475K39832J67207q3234k21435
36476c66183j02131J14777J91463J25958R9802J41990O8608j68378l15780j82371
36466c92245L9183O1294m7755l583K01023K78936J12442q6310j25906o5199k1639
36455d9759k094l540n3012q0055J7364J26063J2759k52671k89074K5125K97504
36444b51390J79156j14200j56442M1054J17242l2063j42170n9631M3391J3604
$$ plain form
36520 -318634 -314884 -348380 -352086 -330299 -349078 -394236 -395699 -352379 -311427 -271522 -214036 -180426
36508 -180426 -219647 -302402 -368847 -411195 -435883 -401143 -269374 -77202 103556 224776 246683
36497 246683 145898 -10571 -89378 -52583 -8517 -39081 -79801 -54872 -21325 -58847 -106280
36486 -106280 -58413 21883 -48480 -298240 -510028 -468553 -228721 -61514 -144748 -366183
36476 -366183 -468314 -353537 -162074 -36116 63686 205676 274284 105906 -209874 -392245
36466 -392245 -353062 -291768 -339523 -343106 -142083 136853 249295 162985 37079 -28120 -49759
36455 -49759 -51853 -55393 -108405 -188460 -171096 -45033 -32274 -284945 -574019 -548894 -251390
36444 -251390 -72234 -186434 -342876 -301822 -184580 -216643 -358813 -418444 -375053 -361449
36434c61449m0806Q889P2536J6211q7424o1856J05606K43099K06365J9152j73998
36423e3675k37239j49213j2536O4227Q7168J25104J61585J09918j1055m9097O8095
36412A03282K02467J79591J2163j41917j78056j12070j3004L5871k8936j52023
36402i2632j58814K1677J98021J39387q6214j88960o6350Q1297Q8040M5484P8837
36391E9773J11273K2540j17248j63382j26316r4878l8176J03963K20580J56763
36381A34892r906o3982K358o171j33907j93879r0656L6501P5113R6557J47746
36370e334J28305J0128m7755L8956J10764K4346j17479j71154j81869k07252j27112
36359e45456J17301K89090J66444o0742m1864J84733K55723O3716r7229j6277
$$ plain form
36434 -361449 -402255 -393366 -320830 -304619 -392043 -453899 -348293 -105194 101171 120323 -53675
36423 -53675 -290914 -440127 -452663 -388436 -301268 -176164 -14579 95339 84284 35187 103282
36412 103282 305749 485340 497503 355586 177530 65460 52456 88327 59391 -92632
36402 -92632 -251446 -229769 -31748 107639 21425 -167535 -233885 -152588 -64548 -19064 59773
36391 59773 171046 193586 76338 -87044 -213360 -308238 -346414 -242451 -21871 134892
36381 134892 124986 61004 63362 57191 -76716 -270595 -361251 -324750 -249637 -153080 -5334
36370 -5334 122971 133099 85344 124300 235064 259410 141931 -29223 -211092 -418344 -545456
36359 -545456 -428155 -139065 27379 -33363 -75227 109506 365229 428945 331716 315439
36349C15439J41484J38574j2663j60355k22653j65618K5357K24637K02408p1439
36339D15171l07211k30930O3826K35618R7521k09591l99323l15766n7428J32839
36329e75274J23852K7087J8970R0366R4623J617o3488l1246L5666R3779J68863
36318a5185K21272J45629l5789j51695j21297n0413k3787J7814J04702J24759
36308B16010O591j32757j50925p1941o451O119j8687o9105r6515l6193O4393P6832
36296b12629N435o544N5876L0534j04825j26332O1561K05235P9688j49532k07687
36285c69220j36809j29865j31635K6710K29484K15977M9549L1943J60915J09137
36275E6186j86363l46570j27506K04181K99297K09437J71188J68769L4023j78829
$$ plain form
36349 315439 456923 595497 582834 422479 199826 34208 59565 284202 486610 415171
36339 415171 107960 -122970 -59144 176474 273995 64404 -334919 -650685 -708113 -575274
36329 -575274 -451422 -424335 -405365 -314999 -220376 -218759 -282247 -313493 -277827 -184048 -15185
36318 -15185 206087 351716 315927 164232 42935 -7478 -31265 -13451 91251 216010
36308 216010 222601 89844 -61081 -133022 -139473 -133354 -152041 -221146 -317661 -353854 -289461 -212629
36296 -212629 -207194 -213738 -157862 -127328 -232153 -358485 -296924 -91689 -12001 -161533 -369220
36285 -369220 -506029 -635894 -767529 -740819 -511335 -295358 -245809 -213866 -52951 56186
36275 56186 -130177 -476747 -604253 -400072 -100775 108662 279850 448619 482642 303813
36265C03813k41769j15155N443j0154r1426j31219j06913k9318P8133J34863O7615
36254a36087o1030r7329P685J33645J41919K4215j10500j45410n3995O8200Q8179
36243a40508p227p6631j044J52357K19467J50530L9242l1845o8310q6967o8976
36232H0088k3162j5161q3435j70313j77423p1184Q6345J99340K22135J82064J15600
36221C44894R751j36866k16507r8805J41688K26343J8261k49456k56865k5550
36211b43112J37727Q0668m5137q2076o1869l2836O0048J91816J79146l5614k13657
36200f4896j44340K4344K5836r3670q1298O8877J06833k6886q8204M7707J63638
36189f2059O3998r5035n4813J44315K38099J12338r7689k21247k01993p9506M1228
$$ plain form
36265 303813 62044 -53111 -47668 -57822 -149248 -280467 -387380 -416698 -338565 -203702 -136087
36254 -136087 -197117 -294446 -286761 -153116 -11197 13018 -97482 -242892 -296887 -228687 -140508
36243 -140508 -147735 -224366 -225410 -73053 146414 296944 336186 304341 236031 149064 80088
36232 80088 56926 41765 -41670 -211983 -389406 -460590 -374245 -174905 47230 229294 344894
36221 344894 354645 217779 1272 -97533 44155 270498 288759 39303 -217562 -243112
36211 -243112 -105385 -24717 -69854 -151930 -213799 -246635 -186587 5229 184375 148761 -64896
36200 -64896 -209236 -184892 -159056 -252726 -334024 -265147 -158314 -185200 -273404 -225697 -62059
36189 -62059 1939 -93096 -147909 -3594 234505 346843 249154 27907 -174086 -253592 -212364
36178b12364M2021p2898j42658n2897R4144J23344K6487o7727r4249q1712l6061
36167d74570N7302J43059J40385O2579q976l4241r139P6020J65130J22155o8760
36156A70944j97111j02020N3860J6995j44128j49946R891M8478j20902k06295
36146f20234j104K68350K70814L4082j43919j09231K8985J06646O2594n5199j23466
36135b81682m7685R1268R9729m6393j33686l6170O5575l5868k25050k19536R795
36124g59703K07975K01160Q2686J7259L5296O9012O7090K5336j8426k833P9949
36113D801J38319Q6158k7517p8743m1909j1366n1418j12912j19919p3785l4580
36102c22871k5500Q809J22346K46921K20421M550j94317j52479O3714J86812J26836
$$ plain form
36178 -212364 -170343 -243241 -385899 -438796 -344652 -221308 -194821 -262548 -356797 -438509 -474570
36167 -474570 -417268 -274209 -133824 -71245 -80221 -114462 -123601 -47581 117549 239704 170944
36156 170944 -26167 -128187 -74327 -57332 -201460 -351406 -341515 -293037 -413939 -620234
36146 -620234 -621338 -352988 -82174 -48092 -192011 -301242 -272257 -165611 -103017 -158216 -281682
36135 -281682 -329367 -238099 -138370 -184763 -318449 -354619 -289044 -324912 -549962 -769498 -759703
36124 -759703 -551728 -350568 -267882 -250623 -215327 -146315 -79225 -53889 -72315 -75148 4801
36113 4801 143120 229278 201761 123018 81109 69743 18325 -94587 -214506 -288291 -322871
36102 -322871 -348371 -339562 -217216 29705 250126 254676 60359 -92120 -28406 158406 285242
36091B85242M7580M3854J225j28271j77470n7469M2373l7937j36950m1923J34683
36080b5063J41814J0011l1467M1856N9348J1255N4897J72669J56600k9218j79905
36069C82797j98479k11650k61228j86593N8766K52006K23506J01785P1545R6318
36059C28773N8260q300j1241J2933j6919o7351o7115m3608n1750o5147n2588n7331
36047d1384r5292r2694k7967j3m3937l3941R3889J86291J10366j2395j2689L3727
36035F3961l6188j41743p3732J19512J66868J650j41701j17874p4304j45113j96979
36024e75643o6898J35084J80066O2608k8466j7976n034k8971N002J12009J36447
36013i1772q238j57777j12397O3210J35681M7466l6532k5053j8996o8547m0947
$$ plain form
36091 285242 332822 376676 377901 249630 72160 14691 57064 19127 -117823 -159746 -25063
36080 -25063 116751 126762 95295 137151 196499 207754 262651 435320 591920 562702 382797
36069 382797 184318 -27332 -288560 -475153 -416387 -164381 59125 160910 232455 328773
36059 328773 387033 378733 367492 380425 363506 296155 229040 185432 133682 68535 15947 -41384
36047 -41384 -136676 -229370 -257337 -257350 -301287 -335228 -241339 -55048 55318 42923 30234 63961
36035 63961 27773 -113970 -187702 -68190 98678 100328 -41373 -159247 -233551 -378664 -575643
36024 -575643 -642541 -507457 -327391 -264783 -293249 -311225 -316259 -345230 -340228 -228219 -91772
36013 -91772 -100010 -257787 -370184 -306974 -171293 -123827 -160359 -185412 -204408 -272955 -313902
36002c13902J23792K25079Q1823j47978j79574l3174L1681l7521k8220J23262
35992a54732J92427N3785r3562n9917L3540j069q9994n7213N6161Q7770M2897
35981A0093L1439J8961q9858j92859j03480J05284J60744J3508q1753K8711J80001
35970H0791J83963J01418O9178N4127l8680j53740j65426q1969q210K7438N9816
35959A28706N7580l7463j67665k01832j19191k4623K3862P1473J24901R3884m8001
35948i8369j55398q4368Q3664J26806j0542j31530o5213Q3392Q0741r2928j97372
35937d61117n0974K29464L75805K69319J6366k06038k82660j84567K2329J89948
35927h2125J97838O8333q0309j78474k27638k03234n8313J47955K45080J49200
$$ plain form
36002 -313902 -190110 34969 116792 -31186 -210760 -243934 -212253 -249774 -277994 -154732
35992 -154732 37695 91480 -2082 -61999 -28459 -29528 -119522 -176735 -120574 -32804 10093
35981 10093 41532 60493 -29365 -222224 -325704 -220420 -59676 -46168 -127921 -99210 80791
35970 80791 264754 366172 435350 489477 450797 297057 131631 49662 41452 68890 128706
35959 128706 186286 148823 -18842 -220674 -339865 -364488 -340626 -269153 -144252 -50368 -98369
35948 -98369 -253767 -338135 -254471 -127665 -138207 -269737 -334950 -251558 -170817 -263745 -461117
35937 -461117 -512091 -282627 93178 362497 378863 172825 -109835 -294402 -272073 -82125
35927 -82125 115713 184046 103737 -74737 -302375 -505609 -563922 -415967 -170887 -21687
35917b1687j5209p3218j6367K9054L458k7825j0347J5643K254j7635J4184Q4980
35905c2715J25120R2696J766j08289j85198j68490m3752J05696J56012P0990n7728
35894d3892j05131k2713J28669K10716J03262j49045l08865j89025P5089J60842
35884a40093Q792p5891R9256K69758J02218k51852l45532j05206R4004N0064l668
35873b98150R2968R7612j54293l19078l3024M18990M36410K575k80077r0694J90458
35862F3697J37302j04937j57277j8859K7332q5574j69612j42981r9856n7275O9233
35851e38807K26325K26373M5268j04128o8448N8252J13139O5121l6042j49813
35841a62760j97700q1948J39435K35451Q7114j27883j69501m6068N9085P1471
$$ plain form
35917 -21687 -36896 -110114 -126481 -97427 -93969 -121794 -132141 -116498 -114244 -131879 -117695 -32715
35905 -32715 92405 185101 186867 78578 -106620 -275110 -318862 -213166 -57154 13836 -43892
35894 -43892 -149023 -171736 -43067 167649 270911 121866 -186999 -376024 -300935 -140093
35884 -140093 -131301 -207192 -107936 161822 264040 12188 -333344 -438550 -344546 -294482 -298150
35873 -298150 -205182 -107570 -261863 -580941 -613965 -194975 241435 244010 -36067 -126761 63697
35862 63697 200999 96062 -61215 -80074 -52742 -138316 -307928 -450909 -550765 -608040 -538807
35851 -538807 -312482 -86109 -40841 -144969 -213417 -155165 -42026 23095 -12947 -162760
35841 -162760 -360460 -442408 -302973 -67522 19592 -108291 -277792 -323860 -264775 -193304
35831a93304N3957K1580o3964j35058o2121J17743K04285J15070q487l4826j0063
35820D812j2450j0515K2748J1525p1998r9467J5859J36244Q7889o9900j48857
35809a34110j18811r1744q9450m3789J7153R154j0418P7948J95101J46389k3660
35798f6237n4934R4722J60157K9541m4315J03146K08926K35l09302l19445p0065
35787b67571N0068n2121o1588J66840L36041J77679j35012k71635k02423j25583
35777c85305j04765m1493P1371J12078M1798k8798p124P6413J44554J47732O2595
35766H9056p4744j35223k0628J62671J88924J7158j32135q9212J9583j6311j49453
35755a40314j49785K7277J81359J93649J70665J79662Q8781j60241l34345k05762
$$ plain form
35831 -193304 -139347 -117767 -181731 -316789 -378910 -261167 -56882 58188 49701 14875 4812
35820 4812 -7638 -18153 4595 16120 -55878 -155345 -139486 -3242 84647 14747 -134110
35809 -134110 -252921 -344665 -434115 -477904 -460751 -451597 -462015 -384067 -188966 -42577 -66237
35798 -66237 -121171 -26449 133708 163249 118934 222080 431006 431241 121939 -197506 -267571
35787 -267571 -217503 -269624 -331212 -164372 171669 349348 214336 -57299 -259722 -385305
35777 -385305 -490070 -531563 -460192 -348114 -306316 -335114 -342238 -265825 -121271 26461 89056
35766 89056 14312 -120911 -141539 21132 210056 227214 95079 5867 25450 9139 -140314
35755 -140314 -290099 -262822 -81463 112186 282851 462513 551294 391053 56708 -149054
35745a49054P9923J98673J08650K5599P924r2423k58516k48580n347J99960J76320
35734D3129O8609L9961K031j19592j48099K7844J58611O61k27704j52548J35113
35723a71984K01351m1180k16706j04578N9378M1466j4242J01745K70492K42106
35713C67848M5183p4026l3729j57j01860k41543k38894o6937J12698J40246M7356
35702d3815q44M2267L0933j09750j92257k7976K22539K21886m6226k31028j11560
35691b45831J28024K13399J23403j0559j23317j73933q0720J18058J98087L4149
35681A80760j80056j89168l6847M1297k124Q031J40022K17521P8101j76544k84097
35670b03104j27427J20160J70409m8144k69598j87233J44636L51801K21502l7768
$$ plain form
35745 -149054 -69131 129542 238192 263791 271715 179292 -79224 -327804 -333151 -133191 43129
35734 43129 111738 151699 153730 34138 -113961 -86117 72494 73155 -154549 -307097 -171984
35723 -171984 29367 -11813 -228519 -333097 -273719 -232253 -246495 -144750 125742 367848
35713 367848 413031 339005 305276 305119 203259 -38284 -277178 -344115 -231417 -91171 -43815
35702 -43815 -44659 -2392 28541 -81209 -273466 -301442 -78903 142983 96757 -134271 -245831
35691 -245831 -117807 95592 218995 208436 85119 -88814 -169534 -51476 146611 180760
35681 180760 704 -188464 -225311 -184014 -186138 -178107 -38085 179436 257537 80993 -203104
35670 -203104 -330531 -210371 -39962 -88106 -357704 -544937 -400301 -48500 173002 135234
35660A35234j30211q5244j30928k71418k59257M116K79474K99494J08966l3308
35650h3082m963O7442L3670o7822q8833J494P3113K8355o0493o8848K16M3629
35638a26122J5297m1679q0071o8432K5370J58561J82627L0692j29059j06915L958
35627a35773l3699j99680k38050q8079K8713J9750P1189K45768K89286O9163j25691
35616i7103l1381J31145J8093k38967k33698M4254K00248P3058o3726o077Q2261
35605a21893K3600o4043j5529P9035M2925q7360j37027o4077J2619j892q1286
35594d14928j24018l6996J65236L14702K38555j1889j89644j49161L705J00727
35584a03711J08280O4108l3680j57328j87742o2594R0929J07609J3475l3938J755
$$ plain form
35660 135234 5023 -80221 -211149 -482567 -741824 -737708 -458234 -158740 -49774 -83082
35650 -83082 -88045 -20603 13067 -54755 -143588 -142094 -68981 -40626 -101119 -169967 -169751 -126122
35638 -126122 -110825 -152504 -232575 -301007 -275637 -117076 65551 96243 -32816 -139731 -135773
35627 -135773 -169472 -369152 -607202 -695281 -666568 -646818 -575629 -329861 -40575 28588 -97103
35616 -97103 -128484 2661 20754 -218213 -451911 -407657 -207409 -134351 -198077 -204154 -121893
35605 -121893 -98293 -162336 -177865 -98830 -55905 -143265 -280292 -344369 -331750 -333642 -414928
35594 -414928 -538946 -575942 -410706 -96004 142551 130662 -58982 -208143 -204438 -103711
35584 -103711 4569 68677 34997 -122331 -310073 -372667 -281738 -174129 -160654 -194592 -192837
35573a92837j268r3049j36264m105K00808K43229N2768j78058k24868q4147O9347
35562c48444J26777J45845K03802K53205J88580N924j73008k28475j57996o2599
35552d6389l0598m4007k7400J0869k8739j47237j66404K1678K26022J92445N364
35541c4396k3989J35519J75205k8029j92673j15934j0255q2969j27393Q5091K97938
35530G8115J36838k11452k35843O4982J70465r3694k69280m2801K34560J37814
35520c0296j52053j77985P4401K28902J30928o907j8725J1982j5474o5205r5447
35509a15879j30106j46690o4403J00546K04868J59533L9065l5922m1666l0959
35499f1613l1767j9435K7476P6468O5522j0663o4429j4564R1536J27365O0766
$$ plain form
35573 -192837 -194105 -287154 -423418 -427523 -226715 16514 69282 -108776 -333644 -417791 -348444
35562 -348444 -221667 -75822 127980 381185 569765 575689 402681 174206 16210 -46389
35552 -46389 -76987 -120994 -148394 -137525 -166264 -313501 -479905 -458227 -232205 -39760 -34396
35541 -34396 -58385 77134 252339 224310 31637 -84297 -94552 -177521 -304914 -219823 78115
35530 78115 214953 3501 -232342 -167360 3105 -90589 -359869 -402670 -168110 -30296
35520 -30296 -182349 -360334 -285933 -57031 73897 66990 48265 60247 44773 -20432 -115879
35509 -115879 -245985 -392675 -457078 -356532 -151664 7869 46934 11012 -30654 -61613
35499 -61613 -93380 -112815 -85339 -8871 56651 45988 -18441 -33005 58531 185896 246662
35488B46662j0314j5770p374m3804p1797l077J39923K30514J77256J8705j14683
35477E46241j29093p2265q1740j92150k53730j29578Q2334J56947M8002o4319
35467h9351m1276M9657P8633L1544j1577J7116J19312K04232J32249j05671k91706
35456I3162k21076k238Q2046p933l8756Q8445J83827J08511j0591m0493n2269
35445A82635j01492n6216J36995K46106P5020j91027k40013q7481J3276j983J2378
35434a1802P0396K0561j39847k17727j47549r5932j53656j60913K3719K60982
35424e51768L04244J35087k7742k0450Q5303J11669J1111q3843m5054P6132J21238
35413A15927M4012m3407n4321m1312p6848j28440j26359p0976n135M5069N4195
$$ plain form
35488 246662 236348 220578 213204 169400 97603 94526 234449 464963 642219 660924 546241
35477 546241 417148 344883 263143 70993 -182737 -312315 -229981 -73034 -25032 -89351
35467 -89351 -130627 -80970 -2337 29207 17630 34746 154058 358290 490539 384868 93162
35456 93162 -127914 -130152 -48106 -56039 -94795 -6350 177477 285988 275397 234904 182635
35445 182635 81143 24927 161922 408028 483048 292021 52008 -35473 -22197 -24180 -11802
35434 -11802 58594 79155 -60692 -278419 -425968 -521900 -675556 -836469 -812750 -551768
35424 -551768 -247524 -112437 -140179 -160629 -75326 36343 47454 -36389 -81443 -5311 115927
35413 115927 159939 116532 62211 20899 -55949 -184389 -310748 -381724 -386859 -341790 -287595
35402b87595R560k8896Q479O0374R613q1535k2033J65913K12237K2006j43865
35391g5742q7136J3836m9079j34558l7935R3800K0735j14192r524K28379K25986
35380G4570q454q4011R8810J87537R476j32387o630J48506N9504j21489j19485
35369A05947o246j6110j10112p5632Q3320J79204J64419J30731P0537p7470k08919
35358B39669j66217l6719n3280j96387j86316O8086K85740K05808n0379j75393
35348f5388q7193L5060M6436r291k8859J1875Q3284J61610K03776J33714o1634
35337D23390k48339k49215n6385J27606J09868p2089k01746j32700O2313J84356
35327e2941J18434m5753j00713M2712K21667J99900k2595j99567j71674n4988
$$ plain form
35402 -287595 -278035 -306931 -298452 -238078 -228465 -310000 -332033 -166120 46117 68123 -75742
35391 -75742 -162878 -149042 -198121 -332679 -370614 -276814 -256079 -370271 -379795 -151416 74570
35380 74570 66116 -17895 80915 268452 277928 145541 138911 287417 346921 225432 105947
35369 105947 99701 83591 -26521 -102153 -18833 160371 324790 455521 526058 448588 239669
35358 239669 73452 36733 -16547 -212934 -399250 -331164 -45424 160384 110005 -65388
35348 -65388 -152581 -117521 -71085 -80376 -109235 -97360 -14076 147534 351310 485024 423390
35337 423390 175051 -74164 -130549 -2943 106925 34836 -166910 -299610 -237297 -52941
35327 -52941 65493 19740 -80973 -38261 183406 383306 360711 161144 -10530 -65518
35317f5518q581J5250J26377K46384K20147Q7662J3913N802n8564j54945j35134
35306B92793k6667k8644j58387j83158j094J75620J53688L4090n928J2085n759
35295B58639j7609L2898M9984m9824j46731j06178l1537r4261k12644j56342Q0310
35284c93295K58765K37074J03889k7637j33827j66676n7489J01355R5467q8242
35274g0616j76308O165K35499J79922j13504k68897j14232Q1855J3136k15599
35264d42579k41783L7847L30547L49549J51499j8188n3163k3091j411j1646o8109
35253I472j27477p8092P8186J38869j6049j71078o6796J48453J03040j81346k63408
35242d26226L0757L04199J87008j23461k20392r4015j9857m7858l73J24411J33851
$$ plain form
35317 -65518 -74099 -58849 67528 313912 534059 621721 635634 641436 582872 427927 292793
35306 292793 266126 237482 79095 -104063 -105157 70463 224151 258241 252313 264398 258639
35295 258639 241030 273928 323912 274088 127357 21179 -10358 -104619 -317263 -473605 -393295
35284 -393295 -134530 102544 206433 178796 44969 -121707 -179196 -77841 17626 -70616
35274 -70616 -246924 -240759 -5260 174662 61158 -207739 -321971 -240116 -226980 -442579
35264 -442579 -684362 -646515 -315968 33581 185080 166892 113729 90638 89227 77581 9472
35253 9472 -118005 -196097 -117911 20958 4909 -166169 -232965 -84512 18528 -162818 -426226
35242 -426226 -395469 -91270 95738 -27723 -248115 -342130 -361987 -409845 -410218 -285807 -151956
35231a51956R159m5139M9644J35046J02413L8474K0376j1534r4166j33496m0089
35220a21268J43934K87537K51374k4498l75253m48212j08450K72710K30154j34557
35210b6529k73065q247J99889j0283l21854k41488J29737K79144Q3598n3124J22384
35199a19838L37873K55399k6183j69926r8493l0870j04427j95436j35263N2336
35189b34828J90921J55162p992j34978j13285n079K2998q5669j90099j36093L2380
35178e06562J46228J54742J57019J87395J34414n1993k13650j70782K9643J78045
35168D4499J58521K7240j10708j81964j49138n7610l3286j11386j34429K5913
35158e22348K24768K30368R1877N4452J26977O0326j77010k51348K8353L56712
$$ plain form
35231 -151956 -142797 -187936 -138292 -3246 99167 137641 158017 146483 52317 -81179 -121268
35220 -121268 22666 310203 561577 537079 161826 -286386 -394836 -122126 108028 -26529
35210 -26529 -299594 -307841 -107952 -118235 -440089 -681577 -551840 -272696 -189098 -242222 -119838
35199 -119838 218035 473434 447251 277325 178832 147962 43535 -151901 -287164 -234828
35189 -234828 -43907 111255 103263 -31715 -145000 -150079 -127081 -212750 -402849 -538942 -506562
35178 -506562 -360334 -205592 -48573 138822 273236 221243 7593 -163189 -133546 44499
35168 44499 203020 230260 119552 -62412 -211550 -269160 -302446 -413832 -548261 -522348
35158 -522348 -297580 -67212 24665 79117 206094 266420 89410 -161938 -133585 223127
35148B23127L40373L5489j96510j95860q0819M8431J75987K15371Q5548q2667
35138E68470p8824O0751J04501q454j08183j05064r6002j20612p5585M7155Q2112
35127B70265l6496j38800q9438j703k6018q7567k1281J37808J91105O3002j09066
35116A51811j73792j36223r9579j10891j11095k6600J15554J93755J28827j6002
35106h4235j05212p1811M3753J49785J59426N4175n9777m5778M9176K420k45919
35095a53997m09773k09798K00659M08930K83917P5730p127k3947n8104m4096M0432
35084A02826O1099l9367j00197m18J20923Q0979n7092r6549K56J08842J48411
35073C29713J26427M5041q0742j58966j14071j0260L1429m205m9615q0954j06530
$$ plain form
35148 223127 563500 598989 402479 206619 125800 174231 350218 565589 651137 568470
35138 568470 489646 550397 654898 646444 538261 433197 337195 216583 140998 188153 270265
35127 270265 233769 94969 5531 3828 -22190 -109757 -131038 6770 197875 260877 151811
35116 151811 -21981 -158204 -257783 -368674 -479769 -506369 -390815 -197060 -68233 -84235
35106 -84235 -189447 -261258 -217505 -67720 91706 145881 86104 40326 89502 91922 -153997
35095 -153997 -563770 -773568 -572909 -163979 119938 195668 188541 164594 106490 62394 102826
35084 102826 163925 124558 24361 23943 144866 225845 168753 72204 72460 181302 329713
35073 329713 456140 501181 420439 261473 147402 137142 168571 164366 114751 33797 -72733
35062g2733q7639K07P3432M5072r832N5812K11897K52896R1641r2626r1207M9086
35050D26006J00596k7959j84240k04995j29307r1120r6918o1123j4829p5851j84736
35039e44476j04406K00732M13564K90169L5328j6554P4184n53k27076k71998o4499
35028b15585O7834l3054q2331J25655L08717J40307j92889k66444o7309L6902
35018a78197r9371k13363q1354J59472K35404Q2880j19073j50678M5393K82656
35008c6231K84188Q699k51417k23647j1991P4476l5568j29679p2446L3890P8238
34997b81488J01290J45980J36070K1302q8454o0430O4917J26160N6236m4616n6107
34986A20860L728J1559p9201j51794p8661Q3927J62792J22339J08134J89083K08807
$$ plain form
35062 -72733 -160372 -160165 -86733 -41661 -51493 4319 216216 469112 560753 468127 376920 426006
35050 426006 526602 498643 314403 109408 -19899 -111019 -207937 -269060 -283889 -359740 -544476
35039 -544476 -648882 -448150 -34586 255583 290911 274357 348541 347988 120912 -151086 -215585
35028 -215585 -147751 -180805 -263136 -137481 171236 311543 118654 -147790 -215099 -178197
35018 -178197 -277568 -490931 -572285 -412813 -177409 -94529 -213602 -364280 -318887 -36231
35008 -36231 247957 256656 5239 -218408 -230399 -155923 -191491 -321170 -393616 -359726 -281488
34997 -281488 -180198 -34218 101852 123154 34700 -25730 39187 165347 221583 176967 120860
34986 120860 124588 136147 56946 -94848 -173509 -89582 73210 195549 303683 492766 701573
34975G01573Q749l05491m56750l13852k1500J63996J20257k9814n3205Q8867J40728
34964D3558q8580l53555k52077J37674K92415K4097k12592m2791K31223J54062
34954f6566j25842j44606P7240J13363r8667j69012M4388K15467J41046L6433
34944B3244P0388P4920o1059j29309J0357J45421Q0810l3153j4917J6508p9768
34933A03442j43034L965J89627J59861O861k5119J2232r3888k57526j88018R1156
34922a40441K25186P6212q0924k1531R8002N1331p4713m7948J09362J44406l6210
34911C02732k22192k07456q1071p1450j78276j56304R6511L36908L10484J24995
34901B54881O0535J22491Q7336n4790p2657M4553L662k54819l40261j3213L54569
$$ plain form
34975 701573 710322 404831 -51919 -365771 -387271 -223275 -103018 -132832 -186037 -97170 43558
34964 43558 -45022 -398577 -650654 -512980 -220565 -196468 -409060 -451851 -220628 -66566
34954 -66566 -192408 -337014 -259774 -146411 -245078 -414090 -369702 -154235 -13189 23244
34944 23244 93632 168552 107493 -21816 -11459 133962 214772 181619 166702 183210 103442
34933 103442 -39592 -35627 154000 313861 320722 295603 307835 213947 -43579 -231597 -140441
34922 -140441 84745 160957 80033 58502 156504 207835 133122 85174 194536 338942 302732
34911 302732 80540 -126916 -207987 -279437 -457713 -614017 -517506 -180598 129886 254881
34901 254881 315416 437907 525243 470453 397796 442349 446011 191192 -149069 -162282 192287
34890A92287L01051k5545j37537J4524M5960j55438k60623r9761O1680J6748l7851
34879h4505J01718K47172J21895j69035k87353j46848L1226P6009L1539j2191
34869i0373l7471k8633M8631J51339J57998J9444j50909j83543l4995J52807J89654
34858A93949N1302p7325l4792Q2786M6936j48865k38763o4830J70712J92388N4818
34847B28316K9250J40094R2606k49189n50023l89298J38957M69506K60382j68198
34837B403k52082Q6101L66009K12240j69336l23184j58426J8181N042n2074K0158
34826b44968J20590O2560j01090j57725o8592q365o7104j08501J196J73449K25800
34815a72750J37912M2191N58n7573j54630j70840k3545J60846J88361O7628o745
$$ plain form
34890 192287 493338 467793 330256 344780 390740 235302 -25321 -125082 -63402 -46654 -84505
34879 -84505 17213 264385 386280 217245 -70108 -216956 -185730 -109721 -78182 -90373
34869 -90373 -127844 -156477 -107846 43493 201491 220935 70026 -113517 -148512 4295 193949
34858 193949 245251 167926 133134 215920 262856 113991 -124772 -189602 -18890 173498 228316
34847 228316 257566 397660 490266 241077 -308946 -698244 -559287 -89781 170601 2403
34837 2403 -249679 -163578 202431 414671 245335 -77849 -236275 -218094 -213052 -265126 -244968
34826 -244968 -124378 -61818 -162908 -320633 -389225 -397590 -464694 -573195 -571999 -398550 -172750
34815 -172750 -34838 7353 7911 -49662 -204292 -375132 -398677 -237831 -49470 18158 11413
34804A1413N5872J20063M6953j01080j81089j83405j86099j71562n9131R8143
34794e49922J27221p183j04331K0027K72148L74988J94539j04349k32441p5452
34784h4755J86676K65800Q0245j54883j96622p5064j7788j05298j64053m7752
34774c13494J33515J79904Q8315K6808P3829J27498P6519n2708j48767j42367
34764D9052n5100L3821N7611K4341l955j2542n8977j48433j63733k5689J36421
34753a67183J24088l6181j05686K4577J71173J24127o2200j64989q6072P2951
34743a05395J63615J08816p1182k42754k33004l7669J13910L9878j22487j07858
34733d94130P1805J48997K8437p1651J3965J42161J21516J4895j1815K2564r23
$$ plain form
34804 11413 67285 187348 234301 133221 -47868 -231273 -417372 -588934 -648065 -549922
34794 -549922 -422701 -429884 -534215 -514188 -242040 132948 327487 223138 -9303 -84755
34784 -84755 101921 367721 447966 293083 96461 21397 3609 -101689 -265742 -313494
34774 -313494 -179979 -75 88240 115048 188877 316375 392894 340186 191419 49052
34764 49052 -6048 27773 85384 109725 105770 93228 34251 -114182 -277915 -303604 -167183
34753 -167183 -43095 -79276 -184962 -160385 10788 134915 72715 -92274 -178346 -105395
34743 -105395 58220 167036 95854 -146900 -379904 -417573 -303663 -263785 -386272 -494130
34733 -494130 -422325 -273328 -244891 -316542 -302577 -160416 -38900 -24005 -35820 -13256 -14179
34722a4179m6336J3124J41085J72220P3131l0003o6636p7134p0851k0989J0833
$$ plain form
34722 -14179 -60515 -47391 93694 265914 339045 309042 242406 165272 94421 73432 84265
$$ [...]
##END NTUPLES=NMR SPECTRUM
##END=
