##TITLE=31Pdec_BAU-j-5.02N
 CDCl3, 24 sc
 5.2.2019
##JCAMPDX= 6.0         $$ Bruker NMR JCAMP-DX V2.0
##DATA TYPE= NMR SPECTRUM
##DATA CLASS= NTUPLES
##ORIGIN= UXNMR, Bruker Analytische Messtechnik GmbH
##OWNER= root
$$ XWIN-NMR		Version 3.5
$$ Tue Feb  5 14:18:38 2019 Russian Standard Time (UT+4h)  she@DPX200
##.OBSERVE FREQUENCY= 81.013821
##.OBSERVE NUCLEUS= ^31P
##.ACQUISITION MODE= SIMULTANEOUS
##.ACQUISITION SCHEME= undefined
##.AVERAGES= 24
##.DIGITISER RES= 17
##SPECTROMETER/DATA SYSTEM= spect
##.PULSE SEQUENCE= zgpg30
##.SOLVENT NAME= CDCl3
##.SHIFT REFERENCE= (INTERNAL, CDCl3, 0, 182.463)
##AUDIT TRAIL= $$ (NUMBER, WHEN, WHO, WHERE, WHAT)
$$ ##TITLE= Audit trail, XWIN-NMR		Version 3.5
$$ ##JCAMPDX= 5.01
$$ ##ORIGIN= Bruker BioSpin GmbH
$$ ##OWNER= she
$$ F:/spectra/data/she/nmr/P31/1/pdata/1/auditp.txt
$$ ##AUDIT TRAIL=  $$ (NUMBER, WHEN, WHO, WHERE, WHAT)
(   1,<2019-02-05 14:17:44.43 +0400>,<she>,<DPX200>,
      <created by zg, POWCHK disabled, PULCHK disabled
       configuration hash MD5:
       00 E9 B6 7A A2 85 ED C7 34 08 36 98 17 FE 4E 26
       data hash MD5: 32K
       DA 47 21 1B E1 B0 A9 07 44 A2 B2 5F 4B 62 4D A3>)
(   2,<2019-02-05 14:17:47.42 +0400>,<she>,<DPX200>,
      <Start of raw data processing
       efp BC_mod = 2 LB = 1 FT_mod = 6 PKNL = 1 PHC0 = -1469.246 PHC1 = 113.399 SI = 64K 
       data hash MD5: 64K
       4E 26 DF AA 4D D6 F8 D1 72 74 5F 35 46 E1 77 B1>)
(   3,<2019-02-05 14:18:02.06 +0400>,<she>,<DPX200>,
      <pk PHC0 = -1.532741 PHC1 = 0 
       data hash MD5: 64K
       01 85 59 71 F9 A1 DE 24 65 F1 C2 B8 A9 0B A9 3F>)
(   4,<2019-02-05 14:18:05.20 +0400>,<she>,<DPX200>,
      <abs ABSG = 5 
       data hash MD5: 64K
       F9 61 A7 1D 07 9C 38 B7 B1 AF 0B 09 34 5B CB 8A>)
$$ ##END=
$$ 
$$ hash MD5
$$ 55 9E AD DB 7E B1 4E 6C EA 45 54 D1 AA D1 E7 05
##$RELAX= 
##$RELAX= 
##$RELAX= 
##$RELAX= 
##$RELAX= 
##$RELAX= 
##$RELAX= 
##$RELAX= 
$$ Bruker specific parameters
$$ --------------------------
##$DU= <F:/spectra>
##$EXPNO= 1
##$NAME= <P31>
##$PROCNO= 1
##$TYPE= <nmr>
##$USER= <she>
##$AMP= (0..31)
100 100 100 100 100 100 100 100 100 100 100 100 100 100 100 100 100 100 
100 100 100 100 100 100 100 100 100 100 100 100 100 100 
##$AQSEQ= 0
##$AQ_mod= 1
##$AUNM= <au_zg>
##$AUTOPOS= <>
##$BF1= 81.014009
##$BF2= 200.13
##$BF3= 200.13
##$BF4= 200.13
##$BF5= 200.13
##$BF6= 200.13
##$BF7= 200.13
##$BF8= 200.13
##$BYTORDA= 1
##$CFDGTYP= 0
##$CFRGTYP= 5
##$CHEMSTR= <none>
##$CNST= (0..31)
1 1 145 1 1 1 1 1 1 1 1 1 1 1 1 1 1 1 1 1 1 1 1 1 1 1 1 1 1 1 1 1 
##$CPDPRG= <waltz16>
##$CPDPRG1= <>
##$CPDPRG2= <waltz16>
##$CPDPRG3= <>
##$CPDPRG4= <mlev>
##$CPDPRG5= <mlev>
##$CPDPRG6= <mlev>
##$CPDPRG7= <mlev>
##$CPDPRG8= <mlev>
##$CPDPRGB= <>
##$CPDPRGT= <>
##$D= (0..31)
0 1 0 0 0 0 0 0 0 0 0 0.03 2e-05 3e-06 0 0 0 0 0 0 0 0 0 0 0 0 0 0 0 0 
0 0 
##$DATE= 1549361863
##$DBL= (0..7)
120 120 120 11 120 120 24 19 
##$DBP= (0..7)
150 150 150 150 150 150 150 150 
##$DBP07= 0
##$DBPNAM0= <>
##$DBPNAM1= <>
##$DBPNAM2= <>
$$ [...]
##$SUBNAM3= <"">
##$SUBNAM4= <"">
##$SUBNAM5= <"">
##$SUBNAM6= <"">
##$SUBNAM7= <"">
##$SUBNAM8= <"">
##$SUBNAM9= <"">
##$SW= 369.568048894756
##$SWIBOX= (0..15)
0 1 3 0 0 0 0 0 0 0 0 0 0 0 0 0 
##$SW_h= 29940.119760479
##$TD= 32768
##$TD0= 1
##$TE= 0
##$TE2= 300
##$TE3= 300
##$TEG= 300
##$TL= (0..7)
0 120 53 12 22 120 120 120 
##$TP= (0..7)
150 150 150 150 150 150 150 150 
##$TP07= 0
##$TPNAME0= <>
##$TPNAME1= <>
##$TPNAME2= <>
##$TPNAME3= <>
##$TPNAME4= <>
##$TPNAME5= <>
##$TPNAME6= <>
##$TPNAME7= <>
##$TPOAL= (0..7)
0.5 0.5 0.5 0.5 0.5 0.5 0.5 0.5 
##$TPOFFS= (0..7)
0 0 0 0 0 0 0 0 
##$TUNHIN= 0
##$TUNHOUT= 0
##$TUNXOUT= 0
##$USERA1= <user>
##$USERA2= <user>
##$USERA3= <user>
##$USERA4= <user>
##$USERA5= <user>
##$V9= 5
##$VALIST= <valist>
##$VCLIST= <CCCCCCCCCCCCCCC>
##$VD= 0
##$VDLIST= <DDDDDDDDDDDDDDD>
##$VPLIST= <PPPPPPPPPPPPPPP>
##$VTLIST= <TTTTTTTTTTTTTTT>
##$WBST= 1024
##$WBSW= 4
##$XGAIN= (0..3)
0 0 0 0 
##$XL= 0
##$YL= 0
##$YMAX_a= 24509
##$YMIN_a= -26638
##$ZGOPTNS= <>
##$ZL1= 120
##$ZL2= 120
##$ZL3= 120
##$ZL4= 120
##$ABSF1= 182.463
##$ABSF2= -187.1042
##$ABSG= 5
##$ABSL= 3
##$ALPHA= 0
##$AQORDER= 0
##$ASSFAC= 0
##$ASSFACI= 0
##$ASSFACX= 0
##$ASSWID= 0
##$AUNMP= <proc_1d>
##$AZFE= 0.1
##$AZFW= 0.5
##$BCFW= 0
##$BC_mod= 2
##$BYTORDP= 0
##$COROFFS= 0
##$CY= -3
##$DATMOD= 1
##$DC= 0
##$DFILT= <>
##$DTYPP= 0
##$F1P= 0
##$F2P= 0
##$FCOR= 1
##$FTSIZE= 65536
##$FT_mod= 6
##$GAMMA= 0
##$GB= 0
##$INTBC= 1
##$INTSCL= 5.30512e-09
##$ISEN= 30
##$LB= 1
##$LEV0= 0
##$LPBIN= 0
##$MAXI= 10000
##$MC2= 0
##$MEAN= 0
##$ME_mod= 0
##$MI= 50
##$NCOEF= 0
##$NC_proc= -4
##$NLEV= 6
##$NOISF1= 182.463
##$NOISF2= 159.3651
##$NSP= 0
##$NTH_PI= 0
##$NZP= 0
##$OFFSET= 182.463
##$PC= 4
##$PHC0= -1470.779
##$PHC1= 113.399
##$PH_mod= 1
##$PKNL= yes
##$PPARMOD= 0
##$PSCAL= 0
##$PSIGN= 0
##$REVERSE= no
##$SF= 81.0140089999434
##$SI= 65536
##$SIGF1= 159.3651
##$SIGF2= -187.1042
##$SINO= 113.3802
##$SIOLD= 16384
##$SREGLST= <1H.CDCl3>
##$SSB= 0
##$STSI= 65536
##$STSR= 0
##$SW_p= 29940.119760479
##$SYMM= 0
##$S_DEV= 0
##$TDeff= 32768
##$TDoff= 0
##$TI= <>
##$TILT= no
##$TM1= 0
##$TM2= 0
##$TOPLEV= 0
##$USERP1= <user>
##$USERP2= <user>
##$USERP3= <user>
##$USERP4= <user>
##$USERP5= <user>
##$WDW= 1
##$XDIM= 65536
##$YMAX_p= 377066929
##$YMIN_p= -9004278
$$ End of Bruker specific parameters
$$ ---------------------------------
##NTUPLES= NMR SPECTRUM
##VAR_NAME=  FREQUENCY,     SPECTRUM/REAL,   SPECTRUM/IMAG
##SYMBOL=    X,             R,               I
##VAR_TYPE=  INDEPENDENT,   DEPENDENT,       DEPENDENT
##VAR_FORM=  AFFN,          ASDF,            ASDF
##VAR_DIM=   65536,         65536,           65536
##UNITS=     HZ,            ARBITRARY UNITS, ARBITRARY UNITS
##FACTOR=    0.456856943014862, 1,           1
##FIRST=     14782.0589164792, 0,            0
##LAST=      -15158.0608439998, 0,           0
##MIN=       -15158.0608439998, -9004278,    0
##MAX=       14782.0589164792, 377066929,    0
$$ Real data points
##PAGE= N=1
##DATA TABLE= (X++(R..R)), XYDATA
$$ [...]
43541 343796 147133 -175257 -430288 -361094 -27540 221721 197247 66145 36885 83494
43531 83494 98833 97750 108943 55119 -89466 -189858 -158903 -100148 -87727 -22817 89756
43520 89756 -25827 -510735 -1012406 -1091073 -830697 -655682 -658052 -556102 -286009 -147205
43510 -147205 -262996 -329245 -84244 299418 477127 331423 -28595 -418280 -611823 -488280
43500 -488280 -264617 -317934 -655981 -850915 -636845 -264773 -89142 -120373 -212095 -377800
43490 -377800 -629038 -760438 -621570 -416195 -437673 -673374 -930278 -1145988 -1280508 -1124935
43480 -1124935 -597377 -68859 18137 -223679 -273704 59045 426206 482977 296911 162899
43470 162899 289490 696311 1164748 1296499 904729 347292 175764 450807 730449 757307
43460 757307 770401 1002392 1220979 1016818 352120 -383781 -771217 -714302 -492967 -489637
43450 -489637 -757234 -911085 -622595 -114921 119430 6685 -99523 -85326 -264690 -754550
43440 -754550 -1130089 -987079 -487834 -34730 293164 623145 852924 741476 336178 -36424
43430 -36424 -180802 -175742 -130446 -20430 213779 534150 776481 733597 379325 26540
43420 26540 51865 393124 581506 398203 196332 360965 750387 963531 897848 696336
43410 696336 365531 -143931 -610250 -710298 -477474 -244734 -168636 -136744 -107038 -186018
43400 -186018 -348562 -396236 -254387 -72322 3527 -32510 -101987 -58018 244562 672137
43390 672137 781222 384846 -32846 105433 616243 795687 455673 135385 214490 419024
43380 419024 411421 316319 352671 408538 335151 282864 386259 445039 280628 113859 207512
43369 207512 389025 327501 79567 -49108 -31614 -91445 -230053 -188346 107952 388091
43359 388091 377108 84535 -265667 -439888 -357528 -168817 -99036 -140156 -67378 144416
43349 144416 196008 -53411 -287261 -208901 -23743 -69654 -235195 -207384 -83888 -192782
43339 -192782 -415169 -272604 291967 755777 719723 305395 -203826 -625640 -720077 -327187
43329 -327187 187989 198671 -258500 -416769 54759 455807 115278 -536717 -640941 -235043
43319 -235043 -101548 -486615 -805899 -660906 -371856 -275042 -152120 269654 745672 887253
43309 887253 790579 858394 1169846 1413364 1365688 1112401 818589 560478 406329 429794
43299 429794 572092 651295 585495 504875 577139 782464 914345 791218 460876 190891
43289 190891 205170 405970 438442 98250 -408504 -715878 -728402 -643405 -587271 -445053
43279 -445053 -112439 273399 493787 524463 503432 495663 447895 347983 268950 239282 213419
43268 213419 214411 370313 725148 1115491 1338650 1379670 1369982 1364900 1268388 961396 411053
43257 411053 -329210 -1109371 -1655335 -1690194 -1196342 -514575 -78192 -25719 -125627 -96666
43247 -96666 56495 80990 -177746 -551972 -718563 -541535 -183187 100921 195399 150840
43237 150840 71027 26471 25087 16671 -44517 -118531 -109911 -6101 76897 35396 -85414 -145493
43225 -145493 -62987 120330 284661 329158 289023 356162 669598 1067562 1208363 999397
43215 999397 714861 571611 412127 23762 -431292 -625224 -588516 -659121 -927675 -1103708
43205 -1103708 -996380 -773661 -616604 -449552 -198722 -9258 42711 184966 587825 970753
43195 970753 920589 486299 104494 -12074 -49798 -147825 -158914 5978 117188 -44959
43185 -44959 -296809 -260261 104375 416201 350201 20829 -186060 -57267 265569 492781
43175 492781 466479 229512 -71198 -264678 -203905 128270 534341 726894 597290 299345
43165 299345 35254 -150642 -311934 -444164 -492893 -436656 -246141 155827 725052 1132578
43155 1132578 999685 372936 -210255 -266672 124081 491761 569599 521695 585904 721573
43145 721573 742541 635552 532158 432798 208220 -97945 -221399 -49580 180975 240823
43135 240823 266177 513299 898292 1079858 927628 609813 273521 -18237 -60780 348525
43125 348525 948034 1132195 743576 352801 469072 829540 833924 389303 -101480 -375817
43115 -375817 -471327 -381448 -46194 316011 317754 -59846 -381794 -310045 36279 337844
43105 337844 428130 329792 188468 221915 499213 746935 627106 212545 -102384 -160851
43095 -160851 -159944 -176560 -1733 406807 716978 703397 588883 637596 722838 616197 441094
43084 441094 475123 679665 783132 717532 636100 565725 361175 -8543 -397778 -713941
43074 -713941 -983576 -1181536 -1196658 -994092 -664314 -310097 -1493 203961 330509 510980
43064 510980 792948 987668 890089 594455 394768 400184 454351 439667 444114 548834 620252
43053 620252 454482 71487 -259706 -331193 -264398 -344619 -563536 -525423 -3521 587365
43043 587365 639520 215347 -4077 282284 577303 430144 168653 315975 695556 740198
43033 740198 451619 379774 718237 1067319 1141454 1101750 1053970 797569 305702 -55089
43023 -55089 -74896 -35184 -183228 -273679 -4144 424546 596930 493175 400408 389664 304200
43012 304200 173326 203808 333557 180224 -416513 -1060621 -1210101 -812749 -348846 -227865
43002 -227865 -289686 -60841 526494 943991 779829 392202 464763 1024284 1399905 1213080
42992 1213080 868582 830552 914496 686198 172056 -283579 -570410 -735992 -604271 -29186
42982 -29186 600912 691678 269160 -52084 36741 214357 204362 208479 410327 542564 325704
42971 325704 -19928 -109705 6024 -8848 -186480 -234544 -57666 84552 -10686 -229728
42961 -229728 -390877 -500607 -618807 -649177 -445054 -49128 325913 549618 696732 884702
42951 884702 1060024 1022424 665277 134134 -298606 -490062 -503627 -446082 -315055 -54306
42941 -54306 295220 582958 706222 734621 824031 999502 1081873 893428 504263 170324
42931 170324 18193 -73884 -210264 -236629 66484 603496 962029 832328 319710 -195276
42921 -195276 -420143 -338952 -119752 87392 247850 361411 357739 181300 -31198 -35046
42911 -35046 179800 314234 179723 4801 79862 255265 145851 -218937 -363501 -82165
42901 -82165 197949 3785 -508549 -753310 -432943 211062 765410 994311 848581 384636
42891 384636 -230870 -753803 -980634 -830874 -362368 226012 653082 723800 473263 135503
42881 135503 -14565 174991 615397 1000782 1060695 823504 523232 255986 -73308 -432027
42871 -432027 -570704 -408749 -241298 -309741 -388773 -127611 356741 615396 531169 437717
42861 437717 545195 644186 502495 211393 -22971 -119969 20937 569398 1388144 1885306
42851 1885306 1601818 793015 104768 -190686 -300632 -397821 -435865 -446021 -559141 -652124
42841 -652124 -411394 94638 342880 111563 -106769 169546 620556 571596 26720 -329639
42831 -329639 -139694 191701 195699 -43179 -220141 -328592 -493313 -588121 -408250 -59443
42821 -59443 161765 173958 120533 77649 15261 -51472 -125010 -318514 -612315 -664722 -219101
42810 -219101 407210 652157 488611 435261 756847 1112898 1126701 865761 563390 270474
42800 270474 34021 45284 298450 419396 172718 -136055 -125544 44205 -65418 -473349
42790 -473349 -789305 -824895 -749225 -652278 -381071 112123 600923 866133 892479 735877
42780 735877 448315 172052 50246 5838 -133445 -270284 -102221 388118 822546 910086
42770 910086 732797 432560 -29619 -577917 -821922 -507658 23629 191576 -88784 -354180
42760 -354180 -253105 57106 241260 244103 250980 341991 379305 221305 -83236 -350120 -427074
42749 -427074 -260621 110522 506419 611215 244695 -316471 -518116 -181821 228984 216518
42739 216518 -81246 -154250 92917 248413 71919 -186082 -253368 -206984 -177127 -44095
42729 -44095 300222 662209 791952 712216 567047 346359 -6000 -407276 -780195 -1163391
42719 -1163391 -1451113 -1299003 -609882 137067 431585 409578 559164 909059 1007006 660180
42709 660180 201737 -39601 -108401 -167161 -244634 -344037 -486358 -581525 -564349 -654605 -1080416
42698 -1080416 -1529631 -1385722 -636765 -14836 -18 -223905 -198376 -94018 -295342 -635755
42688 -635755 -699492 -571089 -597932 -596440 -57685 849035 1238495 703317 -81377 -288179
42678 -288179 26980 228663 56678 -200660 -270517 -172955 -13322 121891 80397 -219213
42668 -219213 -545666 -534672 -166612 179740 230680 153096 261728 568191 796675 760250
42658 760250 542873 302689 32417 -393338 -955958 -1366199 -1289415 -720991 -64272 243488
42648 243488 152312 -28136 -34109 111445 279613 480438 776861 1034925 965989 482931
42638 482931 -117588 -442584 -404118 -208970 1582 300746 707377 984686 913608 651757
42628 651757 555890 666461 655962 353641 12991 -111713 -152299 -303432 -376419 -104586
42618 -104586 246812 103979 -532987 -950280 -675737 -126527 20102 -263531 -483424 -389493
42608 -389493 -138669 155412 535159 882266 949301 771454 648623 639211 473697 96274
42598 96274 -125708 40083 282727 188956 -182044 -463949 -497199 -367700 -121734 214959
42588 214959 445889 363495 62604 -167874 -225795 -238404 -289687 -348972 -412775 -465876 -351530
42577 -351530 53072 555916 803006 703004 466001 261988 108858 53683 146423 245129
42567 245129 188577 165966 516407 1099312 1314398 917659 375213 147577 59408 -233069
42557 -233069 -525438 -348583 224393 602382 480241 147305 -43281 -68679 7817 243587
42547 243587 548033 546859 36325 -617143 -847202 -572912 -230019 -138983 -127280 130863
42537 130863 629373 1064617 1228970 1164975 969532 667939 340305 177439 273676 491563
42527 491563 672915 853867 1079467 1130647 731487 13875 -528432 -621234 -475692 -378226
42517 -378226 -313241 -185459 -150790 -429654 -928683 -1328220 -1481844 -1490956 -1431810 -1258324
42507 -1258324 -995079 -812016 -816799 -879744 -742876 -291643 282740 611650 508957 179144
42497 179144 -53365 -167589 -365832 -597733 -541645 -189312 -42300 -440912 -1036448 -1278013
42487 -1278013 -1117511 -832127 -462901 42473 375348 199699 -159472 -28327 593117
42478 593117 973229 719482 256179 36232 -77179 -323776 -523629 -450081 -259106 -150580
42468 -150580 -27232 133633 37269 -355415 -494361 -40659 430789 198115 -470265 -689377
42458 -689377 -254835 222833 391231 537344 816194 890925 593409 283159 233467 207818
42448 207818 -35948 -315846 -427727 -511342 -662298 -626621 -291194 -64661 -281244 -558170
42438 -558170 -300547 362505 715657 460220 56526 20906 315673 559330 527318 303827
42428 303827 124249 147572 279233 252043 -2851 -193564 -68461 176762 176758 -42080 -121688
42417 -121688 74201 338450 530263 700098 757346 445894 -177556 -601446 -427391 170022
42407 170022 728773 994579 971105 765767 598961 691337 903425 773836 202635 -216209
42397 -216209 47515 630374 730654 257518 -82817 113031 389769 232804 -117063 -93887
42387 -93887 293390 519387 374552 224793 364082 528047 294175 -269445 -646821 -514652
42377 -514652 -102788 144579 89379 -67415 -168730 -274651 -406963 -369699 -30606 367404
42367 367404 450004 220185 40568 90936 148143 8227 -172616 -155594 1232 79100
42357 79100 27813 -92986 -331285 -699556 -940557 -788073 -413454 -243787 -309696 -160540
42347 -160540 431418 1026963 1030694 433489 -205849 -394485 -103193 372165 710961 738905
42337 738905 491287 176819 12231 58596 214941 319877 242893 -41054 -417948 -734551
42327 -734551 -948664 -1098652 -1137619 -954810 -593993 -269710 -96018 12132 84127 -14845
42317 -14845 -274031 -378600 -135352 147289 54260 -291072 -382345 -97688 126867 -14249
42307 -14249 -248964 -181880 141618 412033 544739 658725 728239 619114 415868 356248
42297 356248 406192 236810 -251464 -680179 -683172 -423732 -345791 -549394 -742484 -768359
42287 -768359 -797513 -890085 -748237 -191137 392977 471826 132887 -13698 280118 553313
42277 553313 340579 -172948 -499631 -548400 -579997 -628468 -406759 189430 826538 1089874
42267 1089874 894765 484174 178602 145305 258849 205868 -104939 -302744 26689 718698
42257 718698 1140895 970422 538124 287316 212892 46361 -254458 -464100 -408826 -132281
42247 -132281 163317 227677 -33891 -356906 -321457 96590 421090 326883 121383 254832
42237 254832 587000 594155 213054 -17837 257907 714226 816085 479764 37500 -228442
42227 -228442 -283655 -227965 -204984 -335841 -567548 -663521 -496182 -258727 -213785 -318942
42217 -318942 -325066 -204333 -200629 -385274 -439829 -84306 464922 740356 643030 507013 533313
42206 533313 512459 273151 74150 219974 501556 446327 53157 -190066 -94358 -98717
42196 -98717 -566724 -1148140 -1217829 -707172 -102330 236673 344905 307908 86623 -233592
42186 -233592 -380686 -246173 -50802 -12125 -57664 -26006 40362 14989 -17674 171656 588903
42175 588903 894995 745569 189106 -355069 -512822 -283486 69711 354089 547404 636292
42165 636292 584127 496498 569849 758358 750590 471646 332640 657848 1084398 972942
42155 972942 326190 -180738 -125688 172278 242088 105709 52913 91872 -7053 -247411
42145 -247411 -303254 92451 796536 1320859 1252825 678826 135976 -2826 6092 -297601
42135 -297601 -780422 -803245 -195266 367443 248910 -294634 -543383 -282820 109070 335738
42125 335738 448918 501821 381157 43517 -386010 -784225 -1063297 -1075864 -760102 -345587
42115 -345587 -134462 -114255 -85241 -113677 -458189 -1000804 -1186294 -740086 -127961 -26782
42105 -26782 -520592 -1069896 -1177683 -872357 -559758 -557053 -814088 -1047450 -1105805 -1123275
42095 -1123275 -1254144 -1373967 -1224785 -812496 -450852 -386744 -555464 -735114 -775838 -640255
42085 -640255 -378604 -116164 56380 193011 372052 506620 455701 283048 166844 61598
42075 61598 -260589 -770785 -1081184 -924938 -503182 -195669 -123335 -161748 -215445 -291328
42065 -291328 -400268 -526117 -628120 -619907 -457435 -269482 -234277 -306290 -279881 -150506
42055 -150506 -132649 -243844 -196877 138259 483688 574178 527468 554231 606599 611014 737107
42044 737107 1044242 1127920 602308 -218454 -622918 -430020 -130982 -99154 -149299 4906
42034 4906 297099 514325 627403 708433 761112 798175 877185 932333 786439 447829 172686
42023 172686 110814 115672 33846 -57028 -53862 -29569 -40155 36970 241783 322275 76533
42012 76533 -242512 -186852 270044 664255 601355 149309 -357036 -678154 -749422 -573434
42002 -573434 -182990 320502 765578 976249 884880 615578 394882 309742 210711 -62536
41992 -62536 -429406 -661424 -670622 -550297 -351501 -8801 458263 836839 923653 727843
41982 727843 370256 -94028 -580639 -797154 -445635 311199 833392 676043 153000 -30307
41972 -30307 335696 741304 680606 282312 16619 25431 60654 -34651 -131917 -105318 -7356
41961 -7356 111836 290283 442906 309410 -193807 -724257 -830045 -469987 -61663 -10205
41951 -10205 -287514 -504050 -357921 28006 260819 155399 -73477 -162292 -148496 -176405
41941 -176405 -150208 78057 290816 126731 -265622 -297034 181629 567525 372582 -48687
41931 -48687 -56844 350031 671641 696192 597159 404976 -6067 -427266 -422266 -46119 82287
41920 82287 -356568 -897034 -928222 -447956 104717 448344 567619 465157 151046 -231517
41910 -231517 -522065 -698231 -758568 -616205 -297671 -64233 -100128 -228550 -170951 57091
41900 57091 252124 367177 462147 453341 259793 109593 308381 711488 832414 552119
41890 552119 316234 451699 662196 503987 103085 23154 501322 1136368 1368004 1049046
41880 1049046 486630 69155 -69566 -86172 -188175 -374251 -457089 -341378 -153491 -23020
41870 -23020 119960 377240 626460 644438 434160 200697 12239 -256682 -588744 -704422
41860 -704422 -435470 -4901 259800 321849 329274 280554 89523 -111810 -79296 127950
41850 127950 174703 -28909 -161955 632 234792 258983 191981 276428 352865 54795
41840 54795 -516600 -767529 -384385 228507 481679 292509 5713 -153872 -234289 -261564
41830 -261564 -123801 185851 428844 345118 -67181 -553659 -826440 -769757 -505198 -288158
41820 -288158 -281558 -407593 -470706 -418008 -377982 -415667 -386380 -152533 142588 199147 -39833
41809 -39833 -297149 -340896 -275903 -305179 -357874 -213549 61670 119728 -151997 -409782 -327575
41798 -327575 -57582 22176 -153684 -330505 -346568 -244898 -31887 339500 722322 833138
41788 833138 644742 442695 389299 314878 87931 -91417 8133 272133 410064 347029
41778 347029 216306 99519 11979 27482 162692 222732 18210 -327153 -544589 -638011
41768 -638011 -832093 -1110827 -1150526 -814986 -408097 -240202 -181602 90010 532413 730377
41758 730377 461709 30864 -89001 180125 472154 459222 220522 64122 107387 180432
41748 180432 104569 -85332 -206790 -94866 292981 787341 1028230 780212 266240 -32222
41738 -32222 35804 168122 162381 229899 528482 755282 605413 361571 523979 997781
41728 997781 1196899 948374 747739 984226 1387406 1468788 1153660 741727 511127 546236
41718 546236 715172 690298 270804 -208116 -143981 496534 1017191 921587 583268 609509
41708 609509 905049 873419 327052 -328347 -716005 -802795 -626720 -194596 279903 451202
41698 451202 281057 86866 60505 53654 -51018 -81158 123208 392754 427457 173019
41688 173019 -154120 -312704 -213552 31674 169737 47782 -149757 -74165 303221 574493
41678 574493 399302 -39648 -264998 -82339 257793 419613 310169 33499 -302545 -612696
41668 -612696 -746200 -548664 -95958 239011 132749 -263953 -431725 -102015 397291 554436
41658 554436 276803 -104917 -299393 -282501 -149249 1514 63094 29418 73948 305398
41648 305398 528264 526292 489597 772794 1252322 1386347 1011124 610949 593928 743284
41638 743284 686610 509008 500661 598256 526398 303073 168410 136566 45298 -24259 187747
41627 187747 630990 920509 870289 719274 744104 934577 1128582 1195916 1012451 527627
41617 527627 -38750 -321578 -250227 -133739 -196016 -274835 -145900 81238 121209 -59262
41607 -59262 -186235 -19912 373951 680530 624667 249738 -108972 -221536 -257151 -486392
41597 -486392 -778196 -736884 -358439 -127834 -298633 -505506 -401935 -291024 -653093 -1299119
41587 -1299119 -1544692 -1153086 -592132 -326768 -331137 -397365 -473172 -510730 -373818 -124859
41577 -124859 -72749 -296742 -433041 -197152 182308 349952 339959 336868 215927 -182031
41567 -182031 -524566 -343230 132376 144804 -456688 -884194 -529288 132651 236293 -256611
41557 -256611 -603620 -364697 120605 331985 171042 -131136 -347015 -365249 -234914 -196201
41547 -196201 -443996 -802871 -876584 -575296 -227238 -86859 -28208 127590 266702 185536
41537 185536 -74854 -327475 -506909 -619237 -579659 -345564 -104741 -89422 -264903 -406186
41527 -406186 -413053 -344114 -215225 -8165 146252 38755 -321724 -659550 -734032 -583926
41517 -583926 -462119 -599316 -979952 -1278927 -1140768 -636348 -270484 -354381 -580341 -504269
41507 -504269 -237000 -226293 -473404 -505669 -172550 84513 -38872 -208710 -13125 366129
41497 366129 452161 184174 -87825 -169686 -193661 -288712 -420051 -547188 -673711 -743080
41487 -743080 -695134 -589625 -480517 -252586 174106 553518 525799 119330 -242050 -283081
41477 -283081 -177016 -215427 -390011 -433108 -159362 324926 699979 708980 419268 176553
41467 176553 232492 497929 742955 878268 874694 603599 51387 -437790 -481156 -165358
41457 -165358 95060 144268 146922 112279 -159614 -591570 -792447 -673828 -621970 -825875
41447 -825875 -923396 -640177 -310119 -328609 -492342 -389345 -117073 -54901 -180951 -218134
41437 -218134 -266055 -620788 -1057286 -1001996 -462794 -90607 -171901 -248628 6166 217294
41427 217294 26328 -205470 37495 564923 756332 444779 11864 -221836 -236700 -85610
41417 -85610 142035 238962 145677 156360 472045 733571 471328 -134012 -479178 -426009
41407 -426009 -363384 -412979 -246908 193589 481595 453687 526698 899177 1043532 514171
41397 514171 -215521 -335089 191630 699278 806991 738128 748402 801642 832429 858402
41387 858402 791112 545221 351507 539408 970333 1116896 782627 322910 55729 -94561
41377 -94561 -201019 -51950 433260 872161 862452 519750 250153 176434 109899 -39923
41367 -39923 -142323 -86346 88905 279365 376609 307316 145590 100381 270327 509598
41357 509598 628665 580442 354765 -96421 -667350 -1044628 -1048154 -842273 -624435 -341508
41347 -341508 46988 293620 190759 -45781 -101809 -80895 -262099 -506245 -425322 -78913
41337 -78913 55478 -152131 -301194 -169993 -63774 -227099 -414233 -367177 -286154 -431149
41327 -431149 -606536 -490100 -229877 -241752 -533945 -675032 -422980 -24607 156424 36358
41317 36358 -219213 -414855 -453974 -380112 -322392 -339718 -367073 -365224 -395409 -453149 -394263
41306 -394263 -174771 -2043 -63717 -250635 -340028 -311312 -285332 -308709 -406588 -657573 -960614
41295 -960614 -942328 -435514 134580 237868 -37979 -202242 -174988 -335028 -764452 -1046799
41285 -1046799 -965241 -844896 -954282 -1070628 -964444 -869392 -1073154 -1400656 -1526684 -1502057
41275 -1502057 -1521917 -1433272 -991804 -451565 -350715 -731524 -1069282 -1027310 -826269 -753071
41265 -753071 -734179 -601414 -438141 -404471 -445675 -408215 -289634 -182409 -100532 -30652 -41023
41254 -41023 -179689 -352560 -436397 -429251 -376276 -250570 -37809 159586 246594 279266 341051
41243 341051 368906 278692 181444 248183 387488 312626 -18205 -268681 -153895 186835
41233 186835 400438 348180 143033 -107406 -358393 -492668 -385816 -123407 72792 170402
41223 170402 340418 577683 585607 213895 -231956 -376171 -297130 -369395 -687045 -975113
41213 -975113 -1052442 -1042427 -1048350 -919530 -503176 56292 417319 353617 -61583 -457539
41203 -457539 -393964 182737 730408 659639 113570 -168806 143287 543059 472213 80029
41193 80029 -164044 -211286 -292304 -324644 -37553 443842 694892 638640 591129 663795 626169
41182 626169 408089 236359 181547 64057 -71102 86778 487058 579345 92503 -520405
41172 -520405 -737458 -607389 -374878 27719 598472 820153 274940 -549314 -768406 -305176
41162 -305176 105232 90288 77417 388193 609546 279572 -305531 -472093 -78205 408640
41152 408640 587480 475642 260140 77065 71610 363124 822396 1079962 904166 474890
41142 474890 162161 92353 65500 -101090 -297554 -289192 -66733 130970 131521 3978 -108476
41131 -108476 -161559 -154928 -83750 -34833 -132010 -260113 -81463 458975 875088 693517 101673
41120 101673 -303588 -292352 -134321 -31207 115825 319277 347203 126720 -71156 -62173
41110 -62173 -42364 -217354 -423408 -386202 -132867 121499 309156 457697 462844 221621
41100 221621 -74901 -57830 392031 994731 1344550 1235330 777144 298367 75706 85078
41090 85078 86529 -29698 -134240 -119632 -47764 37329 192510 357560 325085 71155 -182437
41079 -182437 -398139 -829558 -1427646 -1580164 -920007 -58930 83274 -493072 -921584 -680054
41069 -680054 -118703 262264 432323 537020 527969 375259 253140 250518 219040 112589
41059 112589 135540 345150 467300 353062 257053 369803 429983 170459 -152688 -106191
41049 -106191 250629 467950 346272 79531 -146329 -314921 -398622 -376918 -396732 -576037
41039 -576037 -698278 -470240 -53115 75305 -178702 -385964 -257509 -22897 35889 23563
41029 23563 126861 209865 62931 -189358 -301768 -351702 -565987 -812863 -720265 -318284
41019 -318284 -105835 -312602 -492855 -151708 498506 778115 416106 -171451 -467827 -390319
41009 -390319 -153045 123077 472814 897283 1275394 1424175 1209739 710886 297077 346302
40999 346302 780311 1077258 897767 492745 278239 227575 24398 -323326 -456592 -259365
40989 -259365 -48797 -39165 -5070 273213 532003 335726 -273201 -762222 -741846 -377329
40979 -377329 -118354 -172339 -336734 -307149 -65245 121149 92490 42011 218655 513429
40969 513429 603858 465671 424013 646057 900002 937250 817142 691034 545832 363244
40959 363244 277212 343280 372960 222912 30531 -65490 -196270 -480707 -707383 -625497
40949 -625497 -369463 -257249 -312478 -314435 -193815 -63388 17261 10363 -202761 -579866 -776860
40938 -776860 -610029 -426218 -577884 -782868 -562904 -109620 -39829 -392801 -609892 -513848
40928 -513848 -516594 -724879 -666243 -193032 147634 86275 217596 1007081 1838871 1800638
40918 1800638 1006435 386119 398771 658012 712371 545324 303000 66338 -48878 33658
40908 33658 158410 136058 66233 146519 289899 301308 296494 518598 836902 876454 592630
40897 592630 279041 49034 -229023 -486757 -423915 7634 492924 779664 838374 607849
40887 607849 46256 -519948 -603493 -244211 -18863 -209194 -439862 -347144 -110135 -18300
40877 -18300 24293 167009 167105 -251671 -830863 -1025667 -712607 -280659 -90417 -155617 -303276
40866 -303276 -364191 -229947 44320 212161 101563 -116767 -91887 289656 756223 888507
40856 888507 463371 -321837 -919406 -903535 -454862 -166174 -275892 -387145 -130132 235444
40846 235444 223387 -125829 -333983 -214902 -68546 -134819 -260563 -228174 -100130 -65832
40836 -65832 -152017 -245969 -278650 -257369 -194718 -102083 -25165 -39286 -199159 -455881 -617092
40825 -617092 -494899 -160602 64027 -21638 -240907 -281712 -90949 116176 145934 -21678
40815 -21678 -276696 -437001 -382879 -281374 -505937 -1118601 -1613907 -1482268 -902398 -530148
40805 -530148 -673231 -1041803 -1283521 -1355018 -1306511 -1100854 -792326 -555757 -388736 -92783
40795 -92783 299338 413504 76700 -325698 -317485 57126 364341 353042 129416 -104735
40785 -104735 -228729 -211692 -157921 -238628 -395783 -286211 233489 755818 800293 511144
40775 511144 460417 786499 986144 671180 105731 -238993 -317526 -382507 -474292 -429028
40765 -429028 -301999 -391963 -778087 -1134565 -1158332 -978326 -946932 -1140724 -1290697 -1197641
40755 -1197641 -1000990 -931143 -943418 -782431 -373356 43996 231236 245883 298072 415645
40745 415645 412819 162748 -242575 -605830 -773035 -671863 -354199 -36656 55825 -41995
40735 -41995 -71058 58230 81591 -239395 -698355 -853979 -598204 -243642 -33884 142983
40725 142983 444773 743201 800436 601999 305350 -6077 -290339 -380822 -132559 287254
40715 287254 515496 433117 269053 226529 233007 141648 -27073 -158421 -190427 -82367 201121
40704 201121 554330 722640 561144 202639 -107260 -213491 -44478 385191 844503 963975
40694 963975 612652 52156 -387276 -575141 -440019 89153 774393 1074352 823267 571147
40684 571147 792189 1088830 817923 271846 402752 1338588 2037686 1726012 919292 524105
40674 524105 552080 390519 -66609 -316804 -142594 76847 29248 -69476 131734 579274
40664 579274 864163 688367 195247 -145345 -45617 199427 32769 -570215 -965215 -717492
40654 -717492 -243227 -188853 -506290 -681776 -643662 -770089 -1061146 -1042133 -644058 -485430
40644 -485430 -929348 -1428398 -1284771 -656933 -270540 -361831 -456432 -144162 405235 783717
40634 783717 851315 754703 659346 617729 607435 594161 568389 533985 460740 308159 132913
40623 132913 86461 228334 412752 446171 297678 75855 -129033 -278841 -324280 -231305
40613 -231305 -64791 39758 3989 -121021 -197135 -112797 97538 251319 210499 75063
40603 75063 87716 343090 703561 994601 1129993 1052840 782275 573487 755956 1252304
40593 1252304 1509196 1152031 523151 283324 596253 1008381 1077918 816447 500541 333625
40583 333625 362138 492760 507771 251469 -127374 -291816 -128436 148296 359986 591356
40573 591356 913409 1105754 896380 369730 -95720 -262435 -213855 -110958 35418 287274
40563 287274 610159 873877 967963 866963 627763 365003 193060 146715 163759 156696
40553 156696 86073 -30878 -137045 -144439 16622 304691 555827 625686 526848 367208
40543 367208 186759 -31158 -183786 -47733 439279 1008364 1315766 1302917 1155483 971539
40533 971539 670340 220338 -248168 -585701 -686800 -404846 318896 1148350 1483374 1119704
40523 1119704 547077 339328 463342 507234 401533 479545 865116 1236495 1286667 1068984
40513 1068984 777716 508532 363224 460285 652439 538667 -1053 -542885 -654943 -458397
40503 -458397 -353945 -415628 -441513 -449173 -653650 -964092 -961755 -507747 -3546 139031 -9577
40492 -9577 -144902 -210529 -354116 -557154 -599831 -364654 28112 376807 540395 451031
40482 451031 135473 -267252 -602737 -794815 -780146 -459095 123327 618566 628318 162880
40472 162880 -320773 -398724 -69182 370093 660036 699480 483536 98850 -263468 -425910
40462 -425910 -369168 -208610 -55684 53822 148565 300597 562969 859173 982177 777921
40452 777921 301386 -247151 -667427 -791677 -507138 99140 690810 960215 949928 948797
40442 948797 1082078 1185103 1114086 990543 1024258 1209032 1314911 1142571 722729 290304
40432 290304 71357 51100 -12664 -256450 -464659 -350670 -57984 -93495 -649294 -1257578
40422 -1257578 -1339146 -906245 -457368 -298864 -280867 -184364 -53767 -28786 -59666 33972
40412 33972 295747 553327 607132 444072 247480 196684 274876 319192 249277 150094 103399
40401 103399 65241 -12240 -64193 -29681 35322 94927 252052 544730 737276 557961 96902
40390 96902 -277958 -390730 -397049 -440054 -441891 -333592 -250703 -337749 -512967 -578029 -454902
40379 -454902 -194388 143575 484037 690462 671586 519106 427750 458884 454087 229631
40369 229631 -167304 -470988 -516507 -465810 -561643 -697990 -504055 65183 543231 582395
40359 582395 468419 656397 1047957 1198464 1072386 1020059 1047182 749835 104152 -311566
40349 -311566 -166794 106757 33330 -156407 31487 527100 829542 730511 427920 96716
40339 96716 -197741 -292044 -67681 277571 464501 529950 655906 782003 782609 827289 1083768
40328 1083768 1240295 893505 301296 110642 350856 384314 -35295 -361645 -163530 230332
40318 230332 380345 449181 759699 1082960 948455 413098 -15645 -97142 -43369 -60114
40308 -60114 -106777 -106279 -73154 -12901 84165 172856 250816 434840 750360 976334 942381
40297 942381 862517 1088302 1600005 2041085 2245571 2441120 2863717 3391163 3665346 3475270
40287 3475270 2970299 2541746 2471687 2672358 2865300 3026879 3425079 4096258 4585122 4507115
40277 4507115 4156953 4158633 4595187 4904183 4671400 4142333 3814007 3830878 3975250 4036804
40267 4036804 3982963 3880971 3821815 3871773 3993569 4042456 3894944 3568177 3218305 3047420
40257 3047420 3146932 3354813 3354909 3053441 2781649 2941366 3481861 3923641 3912637 3575735
40247 3575735 3297888 3304676 3516608 3706269 3758354 3813508 4092688 4517811 4672614 4326255
40237 4326255 3838544 3763152 4148039 4554331 4705815 4730276 4739597 4602264 4282758 4035777
40227 4035777 4044071 4147032 4138310 4077411 4096559 4143524 4141101 4170841 4257429 4193031 3852003
40216 3852003 3492675 3450432 3676213 3876180 3989700 4212000 4599032 4942405 5036388 4857014
40206 4857014 4504107 4142007 3926274 3817800 3589340 3203145 2990173 3176969 3445543
40197 3445543 3359159 3059148 3030282 3237384 3092465 2391885 1697423 1509916 1573871 1395021
40187 1395021 1038325 922517 1085145 1172425 1048143 931737 939594 912674 758783 603688
40177 603688 511936 383810 245768 324312 647165 847423 617188 161420 -85177 -78382
40167 -78382 -188222 -605155 -1015184 -984971 -480272 144837 552827 659319 538268 274561
40157 274561 -61242 -404926 -701864 -855472 -701784 -174653 489438 890320 901305 810570
40147 810570 897067 1033357 921773 591896 366332 372340 414836 386417 467196 752421 966727
40136 966727 804569 384678 116674 210609 517222 762384 753785 450653 23612 -230627
40126 -230627 -202937 -98886 -94985 -47791 207763 463387 400712 122663 6763 98161 119080
40115 119080 73951 292148 744707 901686 554484 238451 417529 721337 543771 41202
40105 41202 -127600 130683 244825 -40483 -256746 12503 486894 634497 397358 153094
40095 153094 179573 422740 647689 623666 281977 -164270 -374382 -258705 -81108 -116798
40085 -116798 -359092 -618526 -730857 -617665 -358437 -258054 -573252 -1070620 -1155219 -607651
40075 -607651 89907 361388 177521 -154914 -520914 -939582 -1228116 -1194510 -1059314 -1214432
40065 -1214432 -1563074 -1557812 -1003428 -408505 -318065 -602713 -689769 -318614 218654 518418
40055 518418 484825 270674 5388 -269920 -473469 -475860 -294347 -169362 -305811 -603908
40045 -603908 -814339 -909101 -1062764 -1262611 -1236179 -882072 -497050 -391300 -509173 -630233
40035 -630233 -714959 -806294 -795159 -566598 -227074 66778 339400 606428 667997 406381
40025 406381 84879 -6963 -5231 -171406 -359385 -273626 -69601 -102702 -195732 147261 776294
40014 776294 891575 209659 -550801 -674719 -348285 -165504 -265239 -410656 -491314 -465526
40004 -465526 -154733 418560 765315 476749 -170710 -580981 -608633 -547574 -545107 -485479
39994 -485479 -351930 -287263 -335182 -431649 -561334 -646571 -447522 99005 611156 696028
39984 696028 502608 469415 671413 821027 782521 645539 387919 -67189 -501683 -569194
39974 -569194 -313578 -101940 -50958 44485 211394 204355 -18579 -177871 -141359 -96605 -139635
39963 -139635 -105039 45948 61564 -198179 -542819 -797804 -1026553 -1243540 -1259306 -1011344
39953 -1011344 -730486 -586512 -483813 -388198 -490154 -794422 -910159 -583470 -142350 -35670
39943 -35670 -155117 -24610 461961 895875 933473 689882 493659 483836 545328 516407 371643
39932 371643 217130 133092 82322 38909 109632 354558 571127 525199 361242 435924 702581
39921 702581 671505 152877 -361714 -353294 11466 184829 25801 -121469 -23907 160726
39911 160726 207800 118191 18680 -17409 24254 140737 302711 467147 612752 741612
39901 741612 878771 1063519 1255632 1272970 976098 519611 230511 205758 241866 210290
39891 210290 248415 466605 702344 718271 468623 60724 -358895 -590382 -473819 -108306
39881 -108306 216236 364218 402325 307629 -8252 -328608 -238458 224269 472776 175407
39871 175407 -267597 -335068 -53090 262774 496890 591487 353697 -148261 -395663 -102290
39861 -102290 297024 327130 202171 288006 301411 -182881 -782177 -755081 -210595 48324
39851 48324 -177350 -283310 -29998 44995 -355435 -715864 -551377 -125368 93076 97178
39841 97178 55320 -113949 -445797 -639959 -470115 -132955 113446 279769 356080 154415
39831 154415 -237060 -316667 114038 523308 372857 -121994 -420109 -476087 -595893 -744211
39821 -744211 -579733 -72525 412289 620610 617990 527458 384357 230898 113433 37063
39811 37063 77790 368851 793055 940534 643624 305048 362950 654384 689908 376683
39801 376683 49531 -98628 -186425 -287165 -307696 -251373 -260943 -339999 -305803 -83347 166064
39790 166064 256684 157445 -51950 -264070 -380671 -358965 -200761 108760 509812 716836
39780 716836 438774 -152711 -500356 -376751 -164756 -188789 -192946 119658 428240 240539
39770 240539 -250804 -375298 50346 546462 738300 736891 701987 566925 341211 223219
39760 223219 239850 175395 21714 95574 491951 793909 618236 174654 -28901 141849
39750 141849 374233 418814 379632 444729 529196 363771 -65042 -345150 -106752 406144
39740 406144 547142 135315 -246703 -61331 420861 554478 257249 21741 109129 246715
39730 246715 151479 -94991 -291563 -383653 -386542 -318841 -262437 -251718 -133046 202614 540795
39719 540795 631019 634823 861748 1157190 1076030 648329 399981 536037 685401 608858
39709 608858 565165 713822 713055 274260 -336957 -724685 -890239 -964541 -796239 -249440
39699 -249440 360437 561243 294898 -121853 -422509 -502986 -340522 -104511 -131297 -477210
39689 -477210 -694834 -361854 346963 897331 1005710 729864 187648 -447141 -829436 -703176
39679 -703176 -229605 191567 334571 203240 -111305 -381721 -291977 157295 510582 448449
39669 448449 269499 386895 591743 343839 -327162 -782415 -670087 -348181 -271798 -388935
39659 -388935 -379430 -204083 -148403 -419215 -856128 -1048002 -745955 -189827 76765 -197336
39649 -197336 -690745 -931569 -817287 -561072 -340568 -227404 -263914 -353453 -268136 -23315
39639 -23315 -612 -375740 -698118 -479115 29157 174377 -118356 -302608 -120888 56866
39629 56866 -67420 -236418 -105900 215002 374369 261150 55595 -18172 153392 514814
39619 514814 864589 1058359 1155192 1215183 1103393 754790 440436 390065 337941 -64502
39609 -64502 -547530 -560874 -242110 -310799 -908971 -1326156 -1135751 -835296 -921036 -1020359
39599 -1020359 -552666 261661 722532 657164 488819 513217 663555 850529 1031779 1032744
39589 1032744 728606 331115 142318 136778 105551 32993 -20657 -189942 -533542 -700016
39579 -700016 -355207 205170 391430 172796 52809 241067 435587 479795 636396 1018701
39569 1018701 1269424 1078772 622028 216541 -107080 -417375 -581816 -479406 -303851
39560 -303851 -347164 -595156 -768151 -672173 -336830 90572 424194 501704 313199 18427
39550 18427 -225196 -350973 -281496 50856 479793 622284 303368 -196330 -502023 -597983
39540 -597983 -694709 -777414 -597058 -112892 341010 451141 307212 232614 317967 299076
39530 299076 -61984 -593404 -840806 -577150 -61629 280167 322458 252588 209916 130999
39520 130999 -37191 -195567 -256931 -272034 -275674 -173828 60741 228168 145304 -42238
39510 -42238 -27919 205460 353608 254660 140081 277704 544680 573594 258623 -99569
39500 -99569 -186019 -41230 51435 -57367 -238329 -281619 -130819 104090 299080 427557
39490 427557 524624 577757 510483 318489 167872 218254 311620 13735 -856457 -1827704
39480 -1827704 -2147618 -1593262 -720196 -224410 -230060 -334298 -195283 141051 440597 567717
39470 567717 499532 224643 -204353 -556040 -544727 -183634 93329 -129059 -676728 -900494
39460 -900494 -490639 68295 110876 -347010 -731153 -762001 -687664 -643399 -347808 309182
39450 309182 858485 833864 434798 186698 181074 98040 -168881 -356438 -245432 129643
39440 129643 622503 1006875 986641 542035 138467 173826 357382 151000 -288180 -269963
39430 -269963 288553 622160 264209 -259226 -296572 -24514 28495 -57507 210137 835780
39420 835780 1298434 1328615 1133582 865700 443323 -4653 -58933 377949 782830 629122
39410 629122 67804 -280481 -68009 494712 1024744 1386292 1650154 1785800 1592324 1017844
39400 1017844 422818 291464 636080 925639 761248 406157 388778 738879 972217 809056
39390 809056 538808 543657 741505 719872 286044 -313734 -680502 -628215 -272478 126967
39380 126967 350905 295369 -27134 -475041 -807590 -858226 -704626 -555960 -466560 -335522
39370 -335522 -222549 -398061 -909966 -1339176 -1257608 -784394 -407970 -359350 -455983 -503506
39360 -503506 -537200 -649568 -838003 -1056238 -1223492 -1208311 -1000441 -820067 -818824 -793946
39350 -793946 -515038 -196215 -211479 -432319 -389199 -100809 -121505 -608350 -983968 -839474
39340 -839474 -565159 -636980 -825082 -693055 -440945 -556856 -907920 -906405 -463434 -84311
39330 -84311 -25827 -12039 139799 223374 117547 5142 -60445 -293785 -676970 -816753
39320 -816753 -554719 -259724 -229830 -246440 -48310 179475 177711 87113 108991 27813 -427169
39309 -427169 -994880 -1181494 -982193 -795967 -746257 -618925 -414519 -402495 -580635 -604017
39299 -604017 -366985 -175018 -179903 -110018 204093 453456 304347 -94190 -369649 -435285
39289 -435285 -430441 -373439 -211273 -64265 -80104 -115111 127343 640718 1045561 1015105 609566
39278 609566 169756 -4131 125325 339359 408831 363032 411820 572271 583071 319402
39268 319402 60128 103783 302024 278158 -4023 -221465 -199211 -107013 -130119 -250690
39258 -250690 -413510 -614894 -727145 -508981 53858 622567 867058 794982 617279 478502
39248 478502 449130 579907 774486 768985 451197 86976 17008 216096 380694 396667
39238 396667 451751 648766 770901 595032 287256 270076 698588 1234245 1423524 1206495
39228 1206495 917997 813804 777790 585344 290169 142725 187245 183345 -23244 -259909
39218 -259909 -271542 -59501 157869 228738 178817 93167 13487 -44903 -46345 70253 333722
39207 333722 635297 716562 384514 -236522 -784443 -1031859 -1064397 -1051381 -999658 -839652
39197 -839652 -614156 -415604 -198712 181551 729083 1203293 1312823 1014333 598504 412465
39187 412465 463756 419741 108329 -154862 6420 414455 549107 357320 368657 850607
39177 850607 1327596 1253844 772876 412679 337980 356280 427871 658890 905280 880463
39167 880463 632051 480761 504025 498991 439378 514139 680068 644306 392948 292567 512621
39156 512621 747503 686954 400637 89682 -183929 -350342 -284920 -99918 -114880 -338338
39146 -338338 -376364 -86939 118437 -59599 -301203 -258475 -228913 -664209 -1298388 -1415763
39136 -1415763 -882992 -313767 -198478 -398034 -569011 -614396 -578852 -481195 -395880 -406885
39126 -406885 -394381 -151331 238414 451680 411911 389012 529810 639970 570654 480606
39116 480606 515762 524606 329428 46798 -107261 -151274 -238062 -354822 -354547 -209862 -45086
39105 -45086 40919 50345 40815 110207 347842 684120 863680 706534 368552 219988 438394
39094 438394 786725 851578 515076 132947 141610 519442 845045 930279 1066632 1423218
39084 1423218 1563564 1019990 118110 -357415 -245456 -117692 -250910 -195486 364227 974556
39074 974556 1078467 800401 571806 412679 142711 -53996 93682 333211 186238 -268073
39064 -268073 -498301 -332010 -90949 34464 161700 269520 168011 -30434 4641 182606
39054 182606 51637 -363097 -450061 -8493 311412 -9696 -520141 -482388 48297 421728
39044 421728 347321 56407 -252690 -515940 -480720 97400 921093 1340147 1142994 730793
39034 730793 473105 345483 270610 323947 420231 243356 -237611 -535526 -246771 362396
39024 362396 687825 536201 237064 111508 130669 96364 -76091 -308904 -455899 -408946
39014 -408946 -199903 -7585 8841 -116097 -206783 -167165 -86454 -105678 -214464 -228272 -8774
39003 -8774 311506 437210 312026 278567 654090 1230489 1472050 1238956 1012530 1249481
38993 1249481 1780358 2108365 2111167 2090758 2182017 2103700 1633267 1040847 809409 1055279
38983 1055279 1446354 1632984 1549179 1302870 1004994 792762 813597 1003679 1012009 580357
38973 580357 -38560 -289800 15762 482256 675894 632932 617393 609910 391435 43822
38963 43822 -41778 254888 535569 412246 40851 -117651 85844 384413 549653 667758
38953 667758 885239 1084274 988206 545979 63162 -117102 -1385 85870 -81221 -374467
38943 -374467 -543244 -560938 -567533 -555138 -364176 -20472 170515 -3715 -354399 -492885
38933 -492885 -245513 226199 625801 768773 729282 789613 1114453 1447549 1339607 756784
38923 756784 206813 100180 257001 301084 274362 463632 780452 807162 478858 248830
38913 248830 409537 638797 487689 38699 -246422 -182068 -36458 -89755 -298515 -457917
38903 -457917 -483089 -411653 -262666 -46237 129274 105356 -133120 -407834 -547777 -553052
38893 -553052 -472689 -228182 250009 745778 868848 527799 80409 -114605 -95605 -79730
38883 -79730 -52981 153238 487715 668419 538150 227653 -21325 -38712 198159 492520
38873 492520 529466 265528 107367 437811 1067268 1465095 1438642 1215155 936828 548318
38863 548318 192330 177598 404441 341204 -174360 -591348 -442295 -48996 1133 -266057
38853 -266057 -363874 -149448 53567 44072 -29644 -32033 -18128 -5216 92068 246534 332984
38842 332984 405562 684667 1198177 1670404 1849050 1773484 1676818 1757707 2032960 2269981
38832 2269981 2122003 1509884 808699 470261 545744 776023 999358 1171435 1127378 736605
38822 736605 252473 79770 176308 133658 -81669 8740 566903 972277 594771 -289992
38812 -289992 -814247 -583540 -11221 336039 319544 116777 -107647 -239659 -139828 235248
38802 235248 666913 798570 506973 89123 -26033 245614 573641 653780 540136 414887
38792 414887 243867 -60127 -275542 -63664 471941 796277 616914 218716 -9897 -61313
38782 -61313 -119016 -167327 -53912 235037 581152 875769 1000968 852988 550004 413639
38772 413639 555173 686267 544130 278828 168459 169359 52887 -187082 -383043 -501592
38762 -501592 -576825 -484802 -161877 61816 -216396 -823333 -1099405 -704550 25037 595845
38752 595845 856492 852333 566007 56168 -407604 -615818 -664536 -720838 -706865 -460302
38742 -460302 -98163 52992 -111481 -331232 -325091 -114281 95235 233701 406855 632739
38732 632739 731096 592211 416141 474267 695283 751495 562374 395689 377770 272856
38722 272856 -26408 -157759 188681 697284 845535 697176 733853 992827 993503 591719
38712 591719 282948 407946 593662 356421 -143821 -377195 -197072 105426 330840 546385
38702 546385 793046 963812 993304 934233 835463 715954 641053 673292 768884 839182 873449
38691 873449 910221 959564 1037751 1181056 1340606 1382928 1282110 1171382 1115461 1005279
38681 1005279 785659 580504 449235 255555 -17200 -62035 355067 984072 1402594 1606444
38671 1606444 1941425 2516611 3039952 3244894 3167359 2948414 2628310 2220009 1795355 1426850
38661 1426850 1158646 1025010 983150 901483 759715 741562 934478 1087402 936301 626523
38651 626523 468580 391587 74939 -399292 -511468 -47131 543096 727831 514374 279484
38641 279484 254239 386138 500820 423342 113545 -207352 -265453 -140447 -201243 -557378
38631 -557378 -898274 -1002292 -1032027 -1116871 -1028173 -582499 -44096 231961 288941 334136
38621 334136 283385 -16584 -315877 -223612 138546 246996 -40949 -280156 -119045 216027
38611 216027 301082 88721 -94688 44075 491186 945600 1066659 815653 531693 526607
38601 526607 683506 682064 546845 651502 1148269 1697531 1867755 1578092 1059732 584772
38591 584772 316284 248085 217638 98677 -36281 -89811 -169258 -396398 -611244 -614546 -597307
38580 -597307 -865283 -1184659 -987409 -313469 109200 -17830 -41463 580653 1294947 1198522
38570 1198522 372133 -275708 -288603 -44105 84145 209137 451232 609453 557145 490978
38560 490978 538029 504209 256058 19130 49672 275884 477247 574685 554314 363139
38550 363139 102730 95830 506602 1047652 1279308 1085013 696733 388441 287320 343558
38540 343558 355822 169381 -64867 -26849 299877 568469 604735 654667 873708 948224
38530 948224 595508 126900 46173 304401 463846 452539 574516 804061 706720 217701
38520 217701 -79967 234891 771003 853144 401044 -82700 -198281 16074 302338 437423
38510 437423 346326 188594 246751 543532 711823 473865 102032 109652 575352 1088436
38500 1088436 1323346 1332567 1238551 979003 513466 42389 -172985 -88652 152131 417883
38490 417883 634942 715627 575879 235517 -143300 -338763 -243223 -3822 82576 -90215
38480 -90215 -289622 -278853 -186141 -289591 -494199 -372362 189424 719059 738064 364815
38470 364815 93220 145256 311656 338505 212339 73961 32976 77068 77599 -55500 -172216
38459 -172216 -3977 397612 570346 212566 -360662 -620319 -495052 -283379 -64034 325781
38449 325781 768658 855510 511811 167814 121305 158081 32012 -104996 -69026 -55959
38439 -55959 -280892 -498045 -337691 61039 215151 9430 -184657 -82021 209020 474773
38429 474773 646771 710531 658263 595446 651017 744969 670368 411481 149680 -20683 -118075
38418 -118075 -61943 232888 561072 602032 430703 453696 752069 930146 785569 659972
38408 659972 828546 976065 706848 250309 152226 440479 605215 355885 -70403 -385525
38398 -385525 -596026 -741956 -660916 -244897 284824 579322 537186 340632 208986 241627
38388 241627 439107 741212 1024573 1137273 999091 689469 412427 326372 413176 563688
38378 563688 749223 984101 1144232 1034459 707421 499781 604633 795134 761264 547282
38368 547282 404097 334662 99606 -337742 -655773 -539287 -21422 591434 1001278 1104889
38358 1104889 1024932 963530 933767 705015 159768 -396670 -526908 -229177 53769 23556
38348 23556 -138537 -104220 183030 551957 849733 972075 820267 445478 147367 207135
38338 207135 513777 626909 290706 -201075 -262950 341476 1194737 1646442 1499732 1137031
38328 1137031 959115 928261 812723 663202 742402 1051973 1250168 1100603 760679 529480
38318 529480 498165 555666 588208 552893 451627 336650 291229 342535 423513 439389 351457
38307 351457 231787 269707 625559 1181421 1550950 1493019 1221437 1125076 1281199 1474010
38297 1474010 1608370 1810767 2129061 2421269 2590749 2693944 2785366 2898744 3200351 3870797
38287 3870797 4754492 5395159 5535201 5366077 5203772 5144511 5122019 5061675 4870239 4490407
38277 4490407 4055301 3768515 3565581 3161038 2523540 2009277 1874237 1927579 1854333 1649349
38267 1649349 1531509 1598866 1733664 1729823 1452337 1025850 837260 1084361 1374885 1178948
38257 1178948 673043 593494 1131170 1597276 1486890 1241439 1454252 1861732 1795100 1279688
38247 1279688 953630 1053588 1182202 1074906 962491 1046840 1128032 954560 598290 311272
38237 311272 250194 445223 837888 1275843 1621723 1887347 2139700 2326492 2342264 2204123
38227 2204123 2023249 1879221 1827822 1905197 2026266 2052051 2039560 2180198 2409752 2432693
38217 2432693 2281027 2414705 3009074 3596194 3764592 3759015 3945257 4130462 3976377 3724759
38207 3724759 3893063 4490636 5095231 5479328 5645858 5529354 5225923 5231419 5848358 6622611
38197 6622611 6960489 7000515 7263586 7820204 8517210 9631800 11472956 13680840 15785959
38188 15785959 18119195 21268190 25022646 28840052 32912881 37688314 42887649 48343110
38180 48343110 55256279 65065125 77707418 93112876 114083038 145111264 187723281
38173 187723281 238517398 291152716 337546979 368211261 377066929 368290946 353646313
38166 353646313 338912770 316322487 275417960 219275995 164228576 123808228 98316266
38159 98316266 80760353 67027469 56958763 49758713 43278499 36805750 31254976 26854359
38151 26854359 22830265 19065022 16209177 14266142 12499101 10633878 9011557 7715363
38143 7715363 6522967 5513709 4865557 4313248 3588875 3060507 3136111 3384032 3085183
38134 3085183 2376289 2015974 2220460 2502180 2502940 2281472 1920902 1506779 1355956 1656110
38124 1656110 2012747 1910339 1454304 1116147 951500 651934 199151 -106923 -142376 13448
38114 13448 359204 800839 957426 674132 453631 781953 1302969 1330631 923259 685802
38104 685802 689578 443808 -85612 -287051 118653 637419 747259 489233 144099 -128209
38094 -128209 -174632 96813 411508 381772 152705 240667 649798 803704 528171 392230
38084 392230 742517 1065999 783408 125598 -318169 -479365 -642550 -720968 -347977 423477
38074 423477 1079416 1322881 1364610 1490627 1701253 1872102 1988537 2082045 2103561 1986006
38064 1986006 1766855 1587514 1587730 1794777 2106865 2428598 2817018 3392765 4090592 4648694
38054 4648694 4932440 5133505 5504515 5973355 6184059 5920065 5349232 4783019 4277114
38045 4277114 3597392 2600734 1519385 742573 391764 290291 306883 464652 671983
38036 671983 668858 408992 203973 254088 317113 149048 -1174 239934 692120 793590
38026 793590 381185 -163922 -521988 -705457 -700581 -362667 175915 456150 279497 -17575
38016 -17575 -72753 76522 269653 519679 750537 625141 29712 -550086 -564534 -132666
38006 -132666 178669 189737 267211 633305 945378 758577 155171 -330131 -354717 -166189
37996 -166189 -285115 -835406 -1317633 -1155688 -395108 323509 475263 130912 -286675 -464712
37986 -464712 -325328 41832 385013 431136 218743 119237 338128 593193 536816 309028
37976 309028 325857 611799 735732 458985 94981 61603 334995 572348 614641 600498
37966 600498 626130 570424 355203 158962 161145 197688 -42364 -487063 -678410 -415249
37956 -415249 -60742 34960 86376 443902 869525 797130 229760 -232692 -330947 -484296
37946 -484296 -958848 -1297292 -995122 -289039 214567 364841 423230 458699 329285 129870
37936 129870 140853 364597 534187 537636 444127 202191 -233849 -546305 -348830 142848
37926 142848 279185 -84539 -373960 -214408 -1544 -214863 -648985 -785985 -577773 -358161
37916 -358161 -222939 -27858 129095 -27119 -388592 -468503 -91161 338272 443376 396853
37906 396853 555094 830703 783350 263349 -334235 -515847 -224737 135498 132754 -275915
37896 -275915 -722940 -819458 -568015 -335607 -403327 -654274 -788735 -728060 -640465 -631036 -616205
37885 -616205 -526523 -437603 -413861 -370430 -198820 71621 331514 522557 631608 650319
37875 650319 621678 621521 612981 453972 155335 -34704 29926 130576 -16373 -333858 -526493
37864 -526493 -538702 -548731 -565980 -406509 -92387 107666 135690 267649 608027 816610
37854 816610 596655 169572 -33864 64120 244056 431997 742090 1152313 1440490 1430908
37844 1430908 1095686 479280 -250542 -755499 -804242 -579281 -464131 -541900 -561499 -406877
37834 -406877 -310716 -499975 -850388 -1035705 -896722 -561307 -282867 -221564 -319491 -367870
37824 -367870 -251248 -89291 -45391 -65760 27567 228300 342192 305565 285693 387801
37814 387801 467284 371693 214568 222868 378813 398648 97121 -349311 -578939 -431397
37804 -431397 -68759 284914 595472 904371 1069763 859903 342234 -65650 -90265 34504
37794 34504 -93720 -472167 -705512 -537301 -124291 223611 353604 272400 36530 -252005
37784 -252005 -446277 -442983 -249461 31754 240441 231139 411 -287356 -473876 -549945
37774 -549945 -554866 -446342 -208892 392 -18058 -280417 -647325 -983047 -1154274 -1024992
37764 -1024992 -662837 -397931 -404754 -368597 85496 738692 984088 675767 307651 250950
37754 250950 281538 77049 -242790 -392571 -414344 -532452 -738690 -881216 -1006117 -1241665
37744 -1241665 -1433625 -1271627 -781843 -355094 -207913 -106198 228698 661649 808494
37735 808494 565838 260354 234125 427571 485093 213752 -208319 -502267 -612977 -653248
37725 -653248 -645588 -507031 -259099 -69189 -50321 -146313 -236747 -249953 -180003 -111460 -203383
37714 -203383 -499470 -770344 -716847 -339422 58118 238319 233696 181902 154449 179714 252702
37703 252702 282144 181781 17655 -94259 -193692 -373795 -536691 -513914 -369594 -269274
37693 -269274 -112934 297637 750778 775684 369386 49309 38780 -28560 -345057 -479280
37683 -479280 -105143 353746 325604 -100906 -506479 -847487 -1195785 -1168106 -418902 507921
37673 507921 671244 52986 -415977 -222646 139907 157952 79218 304740 644853 699276
37663 699276 522720 401631 311389 95454 -74339 75986 382306 394696 17933 -384441
37653 -384441 -499782 -345825 -67145 211742 316900 141086 -94089 7789 465957 775137
37643 775137 499977 -164292 -650520 -730334 -702557 -868512 -1087578 -1013466 -615392 -239266
37633 -239266 -177355 -375433 -598717 -701787 -651222 -456410 -225477 -168220 -372992 -644251
37623 -644251 -708783 -535155 -321139 -225030 -250159 -339496 -424847 -406046 -227968 19042 173948
37612 173948 162304 17633 -180765 -323404 -337914 -317340 -419870 -554551 -418016 -6377
37602 -6377 237674 92776 28505 521458 1167160 1125455 367908 -236177 -189532 -13278
37592 -13278 -321367 -874141 -1025314 -662933 -183921 167998 416722 490175 259070 -98268
37582 -98268 -200024 17448 194745 40145 -294856 -413736 -137491 277315 386359 95934
37572 95934 -100613 329693 1156986 1504569 943710 87707 -220346 40372 270002 223476
37562 223476 205419 372755 433026 164166 -214242 -379123 -288998 -56829 286828 705251
37552 705251 1020989 1057922 829280 497313 237543 170809 301890 494528 614656 681573
37542 681573 757449 769621 648797 568462 761724 1111204 1226563 967770 583687 272556
37532 272556 -42383 -365735 -427113 -75265 411070 685335 767413 818126 712854 239661
37522 239661 -393335 -675954 -448211 -84883 47145 12238 71859 289575 527351 644851
37512 644851 560533 285342 31303 100877 490602 779815 640753 305790 234758 429791
37502 429791 469450 230123 124417 428403 771961 653918 191769 -81387 -26528 -24101
37492 -24101 -298976 -607686 -720349 -756018 -810967 -678781 -280071 -686 -140858 -293461
37482 -293461 164544 1069787 1572348 1302778 835198 746071 782714 437669 -61003 6303
37472 6303 715835 1259039 1016412 371373 107158 328826 451028 132029 -293135 -426259
37462 -426259 -403895 -559144 -780385 -666568 -235011 22141 -101046 -175690 151012 474943
37452 474943 144736 -722004 -1276468 -1047093 -528198 -445691 -812543 -1051869 -835356 -408779
37442 -408779 -130563 -41736 -898 -2161 -159590 -450156 -637973 -497374 -56036 420759
37432 420759 678570 689999 629054 657483 761134 795455 666683 438062 239466 96253
37422 96253 -74297 -253670 -216233 199591 737273 872629 432493 -124680 -230122 129877
37412 129877 494910 577438 532682 572778 618253 481870 195593 -36804 -115799 -110118 -82144
37401 -82144 15937 249548 573544 840694 950733 974127 1056139 1164660 1049547 577107
37391 577107 10210 -239817 -114105 39532 -76188 -388616 -620932 -587570 -288081 101468
37381 101468 299951 200367 100714 374034 852900 915918 361762 -210494 -227558 12037
37371 12037 -190976 -841611 -1212469 -873350 -193905 296995 533354 654141 578746 220815
37361 220815 -159558 -224205 -47217 4846 -182830 -344776 -223167 175863 704522 1200602
37351 1200602 1461381 1317650 817865 203247 -326430 -690658 -808184 -629889 -330228
37342 -330228 -221338 -358566 -431622 -192957 178755 314291 116864 -188845 -361200 -316266
37332 -316266 -96555 141498 184397 -2562 -168027 -98498 44482 -38796 -294509 -388244
37322 -388244 -261914 -249075 -534848 -846479 -863666 -646953 -434814 -255410 5192 320338
37312 320338 545530 597073 436504 54940 -347210 -402074 -56961 208693 -30402 -536147
37302 -536147 -747794 -560051 -332618 -238302 -89668 193047 418662 498868 555857 574829
37292 574829 381108 76015 52063 408686 779403 923783 1037248 1234639 1218414 822853
37282 822853 436390 416604 461497 109378 -418448 -492927 -55656 298648 212858 -35005
37272 -35005 -114715 -93869 -116671 -85537 67565 130554 -69782 -324632 -305321 -34269 158790
37261 158790 85727 -112644 -227105 -251447 -316164 -441347 -486162 -379393 -277883 -342839
37251 -342839 -430324 -259895 91542 199559 -58005 -228579 37790 376182 223620 -289403
37241 -289403 -524902 -320143 -173412 -386201 -630091 -592929 -508240 -671504 -848553 -624195
37231 -624195 -96304 224939 112043 -152790 -217792 -30971 252317 502581 687846 828979
37221 828979 935791 971820 905679 770884 582255 250394 -232013 -565342 -403122 116274
37211 116274 429030 261612 -50790 -144774 -160318 -389893 -715263 -794498 -607884 -419140
37201 -419140 -334033 -282944 -320228 -526169 -687539 -517309 -184118 -175814 -570113 -876577
37191 -876577 -751218 -472570 -481711 -765536 -968073 -900028 -674718 -468383 -368403 -384182
37181 -384182 -438342 -392386 -191293 65023 255755 370128 460402 553215 638105 652310 488837
37170 488837 158099 -87025 9776 349398 600137 686173 835824 1074988 1071312 703482
37160 703482 406189 577992 915352 788659 153763 -370674 -332144 65442 378700 460103
37150 460103 416897 332859 254445 274589 415192 507128 345592 -58714 -456896 -559404
37140 -559404 -249173 309931 755626 825668 613638 440142 464874 549502 509251 330399
37130 330399 90694 -153774 -306875 -227682 73211 358766 432546 384756 431940 598113
37120 598113 710305 654536 480189 271941 61478 -113127 -156015 34946 464142 951260
37110 951260 1176218 948441 470451 174656 221570 340686 276836 160668 227710 388876
37100 388876 381299 195101 18889 -124816 -323114 -441568 -278848 -21473 -59181 -303844
37090 -303844 -242245 171503 278469 -280001 -875979 -752470 -159036 15994 -479287 -1022149
37080 -1022149 -1085128 -805085 -523080 -338539 -279923 -413630 -568308 -386452 105001 359380
37070 359380 14594 -603895 -972830 -1058107 -1174459 -1391949 -1456378 -1204307 -768483 -416083
37060 -416083 -358082 -617520 -944950 -1022429 -886565 -914129 -1205295 -1294121 -794805 -52921
37050 -52921 289501 190241 161238 412385 604058 529686 499764 791398 1125077 1031926 507497
37039 507497 -11216 -191533 -73624 126370 249499 228910 52764 -244485 -582139 -838341
37029 -838341 -894377 -740553 -520107 -399197 -423229 -554566 -747499 -874633 -730038 -317242
37019 -317242 -5379 -116365 -443080 -503577 -216437 61991 161512 295274 526200 512898
37009 512898 40547 -569662 -866313 -788373 -536419 -238220 -12333 -44352 -283015 -350338
36999 -350338 -72498 205742 171953 48178 116289 136071 -177129 -426116 -22711 767603
36989 767603 1069253 667674 236313 194007 162540 -166831 -420156 -246378 19279 -67624
36979 -67624 -344083 -450332 -499659 -742804 -948869 -775177 -475366 -554555 -885744 -862044
36969 -862044 -378940 8760 -27084 -173772 -122042 -79276 -368131 -901918 -1321307 -1390920
36959 -1390920 -1095617 -597573 -214572 -167753 -249478 -34806 485134 824596 692476 387103
36949 387103 288414 313554 177821 -92174 -254291 -258563 -213422 -82609 238841 605614
36939 605614 689866 381739 -92391 -447939 -568493 -494652 -367826 -360274 -500924 -596914
36929 -596914 -466419 -200610 -47991 -90177 -181928 -159188 44004 413904 804221 919938
36919 919938 585110 49132 -177434 129405 654046 902218 717443 372769 213287 288340
36909 288340 363466 272980 158030 240467 440491 458937 258623 160206 318718 419139
36899 419139 159087 -236232 -349405 -228425 -268035 -525172 -639957 -477301 -366279 -534409
36889 -534409 -726014 -649994 -474700 -536694 -762837 -746436 -343863 102285 177835 -155876
36879 -155876 -592053 -833241 -826718 -684429 -477179 -206577 50826 159686 175122 365854
36869 365854 786380 1030706 741844 225639 124633 515576 821972 703100 497111 549645
36859 549645 622062 373277 26895 46861 388968 594012 510468 433391 542279 641927
36849 641927 522240 225719 -105139 -356101 -398157 -221589 -121053 -396122 -823940 -831493
36839 -831493 -330424 32514 -266678 -856590 -946631 -400707 85968 -110468 -809088 -1321826
36829 -1321826 -1257683 -844182 -548613 -571334 -733475 -728495 -401403 139733 578021 601915
36819 601915 210487 -203871 -238673 46463 245106 212980 244293 480598 508459 -73124
36809 -73124 -920112 -1273089 -962737 -596759 -678579 -1005649 -1116642 -917410 -596754 -261896
36799 -261896 16501 48551 -234651 -546090 -577731 -451498 -506659 -723328 -723652 -352414 95314
36788 95314 315892 363157 426820 498600 462598 343714 245133 146345 -16568 -137232 -49576
36777 -49576 151106 158465 -87625 -243291 -44111 257054 216280 -146211 -353235 -134998
36767 -134998 258332 499276 588293 628954 538414 286795 150182 339007 567802 423726
36757 423726 28540 -148583 -65107 -130117 -408280 -414354 64731 509047 408501 8440
36747 8440 -147401 -48701 -52081 -141389 29553 433330 602186 343420 22268 -27448 43893
36736 43893 -43539 -225812 -249565 -92972 26079 -28588 -160088 -167743 54469 385822 518883
36725 518883 252556 -216066 -436302 -208880 176109 267125 -97116 -698060 -1150117 -1154166
36715 -1154166 -713230 -187301 21088 -72856 -59352 276235 602284 487673 28528 -263615
36705 -263615 -143004 91989 38518 -340420 -776733 -1025710 -1007549 -784886 -558838 -568191
36695 -568191 -809564 -935939 -643207 -126613 93514 -150985 -434691 -323867 43141 236560
36685 236560 228399 407383 887855 1211045 943645 298394 -111980 18285 480853 935643
36675 935643 1216929 1286522 1145712 858410 511229 126898 -264094 -502425 -429763 -148104
36665 -148104 19481 -132181 -505106 -849913 -984793 -897546 -779804 -918981 -1374515 -1795588
36655 -1795588 -1766976 -1309208 -811904 -520351 -386408 -393566 -612949 -844977 -663534 -69735
36645 -69735 294713 -55335 -738730 -995479 -653975 -176170 88716 191125 178217 -64891
36635 -64891 -462219 -674694 -567096 -410896 -431525 -447713 -180263 316610 764004 1026189
36625 1026189 1154869 1191088 1114598 916605 606712 243224 15452 111070 404777 512723
36615 512723 318546 194398 460294 865617 934916 638444 322901 103219 -198377 -510745
36605 -510745 -433246 118230 616570 570598 158600 -111392 -142187 -265810 -625879 -927635
36595 -927635 -855790 -467244 -68941 115292 62534 -129836 -328494 -416684 -341995 -132506
36585 -132506 120842 296370 313191 216573 155814 248388 504908 867215 1201466 1262914
36575 1262914 881451 266252 -109046 -86605 -46340 -306256 -566193 -355834 133496 207326
36565 207326 -311849 -769667 -596491 -65431 209475 162379 208909 497640 717157 629080
36555 629080 377421 173364 -13388 -295131 -601482 -733654 -583598 -196116 312824 806622
36545 806622 1124543 1104979 677235 -14327 -606327 -778340 -584692 -387719 -358861 -222921
36535 -222921 291570 893499 958087 333776 -397369 -606454 -326730 -78797 -157470 -354091
36525 -354091 -346219 -110702 136911 254671 291996 361162 513248 722425 877856 787016
36515 787016 330944 -312567 -736183 -727778 -529362 -507608 -657185 -666480 -439529 -254354
36505 -254354 -324464 -475391 -412444 -104382 260154 519519 583986 412969 124418 -34585
36495 -34585 3201 19020 -121154 -217709 -93324 50479 -30971 -137575 101877 567095
36485 567095 709515 298353 -293089 -619220 -639525 -577708 -606060 -762038 -919411 -787384
36475 -787384 -212710 470000 690320 324636 -145175 -213090 185751 798126 1280204 1266667
36465 1266667 652273 -67789 -187684 288274 573848 201008 -306680 -247537 238772 501699
36455 501699 381538 246748 211434 -21495 -525544 -942765 -1039837 -1002694 -1011519 -929420 -627921
36444 -627921 -285333 -105300 11064 241089 462940 393649 42561 -234426 -172455 96784
36434 96784 262011 219406 100452 -18747 -227966 -541637 -744337 -650333 -384704 -188683
36424 -188683 -54863 160089 339974 212664 -125597 -224516 28587 160177 -174921 -612704
36414 -612704 -590103 -149671 191885 194506 79631 56427 73888 41253 -35631 -155467 -302627
36403 -302627 -341210 -153402 160578 423774 622824 780985 740759 381754 -54198 -189096
36393 -189096 993 216635 266474 168565 -42410 -242119 -91788 559349 1230930 1275662
36383 1275662 774113 440691 589138 750933 477241 -23290 -313668 -338514 -284838 -184058
36373 -184058 27547 297842 550515 771146 854171 646804 281169 118412 199822 148897
36363 148897 -163441 -296933 90660 665095 908210 827003 706773 482020 -65361 -660054
36353 -660054 -708460 -142262 418482 444459 47158 -344770 -499991 -431840 -217500 49416
36343 49416 280557 470681 644772 720407 590348 349196 227221 239388 108362 -336703
36333 -336703 -839304 -970248 -651068 -256623 -156579 -283674 -283194 -27450 228724 259500
36323 259500 188777 205870 188901 -51429 -298926 -151894 291810 450347 78138 -388223
36313 -388223 -505588 -400810 -387219 -426994 -362370 -338122 -544314 -779839 -720616 -449749
36303 -449749 -293254 -272233 -153868 53783 102493 -29256 -68628 135418 442171 646661
36293 646661 604045 222122 -347233 -619628 -259917 425445 859102 954523 1057933 1214100
36283 1214100 1053990 480850 -76087 -272757 -257171 -264449 -229867 -54667 105160 89311
36273 89311 -9900 -77935 -204037 -452508 -653320 -643055 -495235 -314784 -44180 301287
36263 301287 442692 171771 -267016 -404603 -110789 254653 234052 -270260 -877878 -1053785
36253 -1053785 -655422 -125296 30403 -129962 -169520 -9929 -25420 -330270 -486531 -173429
36243 -173429 292184 437455 270230 73445 -102172 -323638 -437624 -317924 -250051 -576778
36233 -576778 -1075474 -1172368 -730888 -166387 217293 531691 866183 1003503 779147 402886
36223 402886 195683 206650 261874 236904 136889 12813 -102567 -234196 -441317 -661692
36213 -661692 -648663 -255507 259621 461387 288162 122310 252397 524902 646249 587822
36203 587822 506050 432147 257739 -35181 -289841 -316824 -73019 245250 284660 -143924
36193 -143924 -773593 -1086221 -920830 -696378 -842685 -1170075 -1101953 -499613 79990 85768
36183 85768 -327723 -556771 -366363 -116410 -133601 -191353 146794 858582 1453568 1582747
36173 1582747 1349276 984636 550545 107446 -137234 -121369 -149068 -496626 -933665 -987558
36163 -987558 -623739 -291962 -275209 -367639 -308096 -174549 -142443 -150062 -76864 -30831 -144737
36152 -144737 -234583 -8298 432748 639060 404192 19945 -153824 -111203 -33738 78648
36142 78648 368556 804583 1128867 1130905 842266 462811 201264 168794 304504 396802
36132 396802 282059 25296 -193010 -339554 -518049 -690620 -621592 -213395 262583 431606
36122 431606 221759 -131504 -396036 -502029 -466982 -350783 -264493 -255333 -192540 63025
36112 63025 375547 417343 99290 -246685 -219655 217051 741054 1029941 1030816 919564 870605
36101 870605 878120 793894 524852 141745 -211070 -413452 -358122 -28435 304689 196956
36091 196956 -415179 -962906 -871828 -304034 107401 154851 191148 371659 354209 -31283
36081 -31283 -345921 -144115 365796 646581 527966 220149 -88072 -259478 -100339 335746
36071 335746 542999 142715 -469845 -557541 -53509 369624 257161 -107183 -248064 -102491
36061 -102491 119343 296453 374148 260809 737 -138102 26981 311483 357992 39020
36051 39020 -434952 -735689 -682549 -363091 -30880 159314 280674 442750 591562 641023
36041 641023 659320 704750 616452 266171 -92216 -99039 122585 67823 -403919 -822793 -738286
36030 -738286 -251868 221377 402022 212662 -268172 -716420 -717231 -230027 323941 588748
36020 588748 622110 584574 442316 218814 184645 451117 650146 396409 -133282 -449312
36010 -449312 -404104 -219937 -13268 279624 563253 599356 407609 297286 418121 565811
36000 565811 519006 324287 155468 91045 114648 177189 205233 186683 257128 533848 858607
35989 858607 903892 580651 160882 -62255 -69167 -6340 46172 98372 167971 281964 476675
35978 476675 705299 807425 655004 301408 -67807 -314074 -440971 -521258 -560670 -471054
35968 -471054 -212006 74583 171753 53846 -60997 15585 220887 379513 460839 573165
35958 573165 761498 934315 969298 816334 543218 344491 419557 735383 971577 809520
35948 809520 245686 -435888 -922922 -1052231 -863119 -592586 -509502 -625748 -664231 -426661
35938 -426661 -80712 43989 -174299 -611018 -1077407 -1380891 -1364523 -1093784 -872905 -870299
35928 -870299 -869201 -606216 -181542 138856 344216 560978 685620 561419 409542 591380
35918 591380 965818 1012309 664968 478387 783472 1210243 1339015 1329664 1490336 1627096
35908 1627096 1349193 787801 475884 590461 785313 785326 720168 761031 773836 536043 110395
35897 110395 -192201 -181958 -23077 -68043 -447262 -864071 -911660 -585371 -286610 -270709
35887 -270709 -354761 -315386 -271750 -393893 -498398 -332579 -82671 -121708 -316088 -110891
35877 -110891 605015 1217579 1185246 700982 283332 76665 -85093 -211702 -193532 -157329
35867 -157329 -361394 -772232 -1094946 -1201291 -1190750 -1044152 -600575 59836 591694 872800
35857 872800 1147347 1487155 1489960 849883 -51802 -536809 -460128 -246657 -184200 -119873
35847 -119873 104868 340650 415549 419452 506888 638248 684398 594441 318708 -212380 -851823
35836 -851823 -1197619 -1031398 -634770 -423324 -409340 -313583 -109808 -110398 -474144 -921597
35826 -921597 -1075688 -921484 -793130 -959001 -1293323 -1378222 -971719 -363122 -119940 -418887
35816 -418887 -819515 -846419 -577746 -398294 -360118 -173328 234430 577925 707697 851335
35806 851335 1175984 1422307 1242181 720627 296910 229913 338556 270744 -82917 -458148
35796 -458148 -478266 -77912 360081 388568 2168 -362053 -317669 116892 631947 903632
35786 903632 753789 259377 -230828 -385696 -273231 -267875 -514408 -708670 -527515 -63855
35776 -63855 325411 434739 311802 94781 -73180 -70212 95550 251751 238247 66335
35766 66335 -142136 -278823 -286686 -209289 -222222 -442143 -686008 -640997 -304594 18889 215188
35755 215188 498271 903245 1032210 596667 -98874 -549958 -668128 -657567 -550415 -311755
35745 -311755 -196227 -457548 -780513 -574576 96143 422713 -87857 -910922 -1195248 -844403
35735 -844403 -506003 -612891 -845340 -649631 -31096 413054 235053 -296840 -529457 -224885
35725 -224885 213337 327011 125042 -118660 -299244 -447975 -480278 -311944 -117036 -148863
35715 -148863 -363392 -513086 -549614 -613083 -662491 -473178 -32935 384847 599322 673770
35705 673770 640553 402171 9760 -268854 -310003 -313034 -479716 -742154 -934862 -1007271
35695 -1007271 -934459 -654844 -262257 -50427 -181711 -468440 -633095 -626685 -541259 -362536
35685 -362536 17258 621512 1316526 1829375 1840565 1264884 476606 -2473 -117331 -286965
35675 -286965 -679856 -857016 -421340 287440 554216 199092 -265927 -355963 -142206 -3431
35665 -3431 -105301 -246025 -117962 327677 760524 792613 466422 267456 533346 1023862
35655 1023862 1261519 1138703 944237 901859 955647 960648 824844 479192 -47600 -519546
35645 -519546 -687357 -605780 -538471 -541681 -402441 -47231 262849 284923 116517 -17088
35635 -17088 -111822 -284809 -443746 -348184 -13710 211531 94283 -160088 -217051 -102606
35625 -102606 -121137 -337254 -467735 -374531 -329833 -565776 -853822 -874360 -773333 -891139
35615 -891139 -1066781 -781270 -41085 474590 377608 149039 393305 954153 1226784 1027409
35605 1027409 665017 370798 143864 20440 31656 -10014 -252596 -437698 -234225 172572
35595 172572 321568 215713 254028 457461 419836 131435 157389 716572 1207694 1049257
35585 1049257 466740 3827 -262154 -489140 -487117 -26752 526367 572845 184028 13890
35575 13890 313074 641905 653965 571125 656562 718611 461715 -14604 -370936 -436907 -237808
35564 -237808 134885 460180 457697 164389 -14204 116714 202287 -86907 -438103 -330590
35554 -330590 107510 240539 -125647 -519844 -608152 -625264 -774273 -760677 -331335 157204
35544 157204 214535 -21995 -27798 274412 452636 272915 -51248 -335534 -642003 -913899
35534 -913899 -880255 -532150 -282553 -396540 -606853 -565949 -361738 -267717 -252352 -106289
35524 -106289 122486 191506 68565 -48619 -64700 -65156 -107002 -169330 -256858 -329179 -205766
35513 -205766 208571 663701 784430 515788 118422 -223984 -530426 -780426 -816467 -534950
35503 -534950 -4372 599197 1041781 1116947 869388 618755 567379 562262 481921 574179 996446
35492 996446 1288860 899505 94590 -339008 -278902 -387812 -915592 -1219416 -861815 -408207
35482 -408207 -526050 -910536 -844494 -379191 -135373 -192108 -45392 371515 475082 20579
35472 20579 -408654 -231618 340640 719594 753855 734766 840807 962314 975463 892826
35462 892826 764813 618718 477646 334233 164653 43227 124254 391226 549719 354779
35452 354779 -19828 -149852 90332 358873 333407 185043 335003 799157 1079398 831233
35442 831233 371694 242178 423541 367570 -192109 -855975 -1121174 -980760 -735934 -506544
35432 -506544 -238683 4990 112929 186662 417136 737326 879506 772612 631468 629248
35422 629248 689276 632303 377159 2065 -261606 -159625 292862 717131 754417 476890
35412 476890 231922 178627 211019 235946 230513 83573 -289099 -669310 -704286 -411032 -221877
35401 -221877 -434592 -858145 -1091742 -946482 -522245 -63781 195146 202183 119565 64414
35391 64414 -75253 -349273 -445343 -61506 521569 699914 365244 -9404 -117829 -110318
35381 -110318 -47400 313025 933477 1296540 1160240 991840 1203198 1421767 1054543 209093
35371 209093 -517521 -898148 -1154676 -1376529 -1429076 -1332248 -1216458 -987969 -518417 -67531
35361 -67531 -9752 -208447 -182464 137131 345628 259355 122949 63698 -107095 -410781
35351 -410781 -538612 -366457 -169373 -111547 36963 419514 721330 575226 56267 -460332
35341 -460332 -684949 -507966 -22200 386832 306642 -170572 -517131 -517433 -531251 -812406
35331 -812406 -1046559 -889133 -509100 -199769 125488 579889 843368 625013 283412 367960
35321 367960 746074 824815 516964 316176 419611 445092 154732 -127399 -46444 291306
35311 291306 576309 666308 517725 118740 -311445 -395030 -72325 284169 394186 395590
35301 395590 480629 556933 514867 526020 776034 1101924 1155900 797574 169682 -433540
35291 -433540 -657725 -313370 318416 662274 502322 182115 -6815 -253466 -763294 -1255021
35281 -1255021 -1349952 -1195745 -1245603 -1584612 -1894017 -1941528 -1706928 -1178002 -464244 13601
35271 13601 -76910 -462889 -607311 -488474 -537084 -858341 -1103412 -1150076 -1290869 -1591977
35261 -1591977 -1662924 -1310965 -881655 -657188 -437514 -69634 113189 -171099 -597277 -696031
35251 -696031 -521523 -368743 -165020 291127 749857 788735 515141 381716 405302 211950
35241 211950 -158012 -165373 379600 989110 1218837 1173008 1052997 742249 190294 -240330
35231 -240330 -227125 31759 163191 153451 165850 125161 -61456 -102661 328383 946838 1095610
35220 1095610 659238 241318 299125 549252 476989 81096 -226658 -257479 -215225 -273820
35210 -273820 -305809 -136032 133911 233824 109278 32121 247928 598321 639430 162546
35200 162546 -523635 -913564 -833195 -561006 -481969 -719232 -1065052 -1173010 -852602 -286231
35190 -286231 67746 -84250 -516480 -690459 -353309 173729 360197 33099 -501836 -852328
35180 -852328 -939397 -964657 -1047463 -1022685 -677544 -114565 282506 271263 -13077 -314091
35170 -314091 -580185 -885736 -1157767 -1192558 -906139 -402592 158026 589687 661333 310017
35160 310017 -133502 -215427 76067 277487 83063 -257827 -339760 -142714 63278 155117
35150 155117 210611 246139 194032 90095 18619 -98400 -389180 -709726 -712839 -307495 178157
35139 178157 374868 236613 -6615 -57497 295100 949198 1362797 1007696 114043 -402533
35129 -402533 -34724 637365 752888 353154 198327 550969 826094 575764 186181 244928
35119 244928 686368 1019538 1085893 1080451 991761 570161 -114536 -545881 -361297 210246
35109 210246 655401 696444 398767 6880 -167975 82759 591171 857481 598117 155929
35099 155929 123069 593650 1054507 1070933 820052 760895 956223 1020924 731437 362552
35089 362552 242668 228094 -45244 -493517 -598129 -182391 237986 150729 -230632 -319647
35079 -319647 -7441 299742 382580 432455 545458 513496 285891 167532 297972 353894
35069 353894 107082 -95046 162672 654279 802437 514439 228805 195011 206697 84093
35059 84093 -49397 -91260 -152388 -268474 -279222 -167820 -169124 -323666 -270264 215505 759229
35048 759229 825259 428210 42306 -64666 -13295 102644 371176 726327 855717 638048
35038 638048 378721 375608 476947 348314 23871 -137533 -10871 102370 -79318 -438231
35028 -438231 -676979 -728815 -753952 -838306 -904383 -885431 -803633 -670116 -461466 -214235 -9655
35017 -9655 146187 289878 349798 204278 -82140 -282027 -330458 -408134 -589015 -650516 -440440
35006 -440440 -222509 -364459 -793117 -1057787 -894813 -453768 17012 405878 608385 467486
34996 467486 9923 -449247 -615432 -529544 -449358 -497901 -555515 -474648 -301126 -232259 -350154
34985 -350154 -449674 -254478 168806 396824 186684 -152476 -150821 205144 538290 652823
34975 652823 668842 616831 334972 -115307 -334471 -112254 227043 245279 -74568 -427246
34965 -427246 -588598 -489628 -117838 363983 565460 244745 -340833 -703186 -654396 -346042
34955 -346042 81864 563094 866369 667899 -8687 -658157 -762952 -303409 282898 569846
34945 569846 499687 330633 319517 490489 688103 769110 676185 405666 39189 -240586
34935 -240586 -326272 -335624 -404286 -407493 -162437 152578 157967 -133400 -320395 -302301 -457199
34924 -457199 -916082 -1186984 -871221 -292874 29521 125440 285102 418073 289854 84113
34914 84113 90704 93453 -250789 -656886 -603966 -311384 -450224 -934865 -963424 -381374 -9508
34903 -9508 -297371 -610261 -356655 47976 -2209 -267583 -209540 14306 -75893 -346384
34893 -346384 -319655 -69538 -17213 -40820 369134 1135616 1576058 1400790 1017418 761327
34883 761327 517375 251868 234806 463675 456961 -35722 -583195 -672110 -374642 -98031
34873 -98031 -9020 -32927 -125695 -200744 -18836 500401 1008211 1067240 654049 90533 -383370
34862 -383370 -718733 -876083 -829230 -701170 -651075 -649636 -566169 -432290 -398065 -448490 -403027
34851 -403027 -234277 -165441 -353087 -640181 -746409 -583832 -257664 132736 504299 656541
34841 656541 387920 -158390 -489284 -315325 32075 18900 -325823 -435507 -68554 270911
34831 270911 50263 -480030 -608704 -133119 440620 632702 488037 268399 58563 -128932
34821 -128932 -169117 10723 269191 439615 514256 490911 249877 -194053 -496327 -331259
34811 -331259 136111 407930 295426 153886 379957 853488 1051281 677465 34284 -305295
34801 -305295 -129435 223760 315371 93669 -170282 -297111 -345057 -393942 -412154 -367469
34791 -367469 -280983 -136700 73913 185350 -30979 -492225 -761289 -534909 -19038 326752
34781 326752 287882 14944 -212070 -203614 28084 248352 207299 -39083 -174572 -77022
34771 -77022 11234 -76178 -107893 134239 362878 113283 -533652 -963833 -775628 -170424
34761 -170424 429123 811946 956768 900359 762126 660058 510465 158053 -234168 -260203
34751 -260203 115433 376316 151774 -215187 -163486 245764 429829 141028 -237086 -313278
34741 -313278 -200856 -224864 -420980 -569792 -551084 -437648 -340050 -341638 -499860 -732316
34731 -732316 -772124 -435052 87966 389169 314069 115868 103157 279733 405349 302452
34721 302452 15491 -269149 -391591 -342981 -256743 -244095 -249084 -140740 67894 212623
34711 212623 207308 159319 228101 484772 910444 1359662 1516869 1144988 469485 39637
34701 39637 48339 83280 -212114 -557996 -496664 -155491 -36824 -197912 -231731 -54114 -79880
34690 -79880 -462780 -764412 -676047 -535394 -719719 -974519 -843398 -428978 -176407 -124480
34680 -124480 45032 317059 301185 -70781 -340359 -182949 151996 277462 211516 233025
34670 233025 426723 625089 682123 609041 496403 425563 417064 401574 289474 100113 -30549
34659 -30549 22168 271558 587158 699334 366851 -298358 -788698 -710565 -268222 3299
34649 3299 -78651 -230149 -240881 -251253 -392288 -506247 -435598 -323831 -374542 -479352 -338046
34638 -338046 118214 605840 764945 465962 -93655 -527986 -584051 -393189 -324080 -556758
34628 -556758 -914341 -1129999 -1118583 -944746 -704477 -510232 -424955 -342427 -103836 216133
34618 216133 349129 224454 79143 81163 107451 32846 -40402 -23923 -29230 -85793 29916
34607 29916 379744 557531 200154 -386965 -566140 -240470 63295 -10580 -204826 -107374
34597 -107374 307374 752801 977746 885996 518020 66108 -226911 -285534 -227323 -163087
34587 -163087 -112841 -103078 -149632 -139439 45829 255720 159735 -317389 -871871 -1216676 -1375649
34576 -1375649 -1471089 -1446637 -1182011 -737551 -322455 -110277 -177137 -492151 -864775 -1028629
34566 -1028629 -888942 -592230 -295956 -13203 257892 442178 528631 623582 759318 845925
34556 845925 912736 1128688 1406832 1296388 578243 -276296 -625771 -467470 -302031 -319209
34546 -319209 -251561 -55927 -149548 -716945 -1256377 -1198131 -662310 -206484 -47426 35280
34536 35280 158437 176095 74117 86270 283491 396165 230569 -17560 -77106 5560
34526 5560 33305 30241 160267 385074 495237 437963 345594 259479 105194 -40027 46420
34515 46420 367671 615534 575852 392115 279958 223808 162887 247268 607353 995460
34505 995460 977055 471623 -133176 -415929 -293855 15323 230720 234618 207665 459400
34495 459400 965375 1238186 943582 488163 563881 1147275 1457237 1023775 291146 -108412
34485 -108412 -218257 -473359 -887732 -1054950 -833731 -536650 -416000 -374187 -280455 -229301
34475 -229301 -313151 -379847 -220012 119500 371585 368964 236218 238718 443488 576541 337810
34464 337810 -126950 -284022 105501 570113 472029 -168787 -742707 -888052 -845522 -890978
34454 -890978 -839946 -397531 271845 674166 592276 284359 102653 146585 316192 505511
34444 505511 643269 653016 497822 268527 159139 292337 564234 725858 654056 456530
34434 456530 238753 -90005 -582854 -940764 -767005 -180686 171500 -98209 -607430 -745836
34424 -745836 -501463 -392577 -688740 -1087375 -1189853 -959249 -594856 -232650 47346 101859
34414 101859 -170010 -644294 -1016812 -1031778 -668670 -190912 -7912 -337046 -939033 -1310637
34404 -1310637 -1194728 -773945 -338144 17962 262824 263241 7637 -186046 -12051 345744
34394 345744 408480 70207 -272559 -331221 -308181 -482248 -723420 -717284 -472080 -276430
34384 -276430 -265180 -352864 -534254 -885632 -1229701 -1159615 -555520 182206 582848 573555
34374 573555 345765 10206 -361144 -549934 -383063 -40981 114590 -7225 -199706 -330515
34364 -330515 -426169 -392763 -36198 511932 744944 400030 -133661 -305781 -112553 -4893
34354 -4893 -210163 -481852 -511331 -294240 -34915 84076 -27566 -334922 -639828 -722731
34344 -722731 -576411 -375986 -217291 -61588 54146 -7383 -216353 -320868 -203504 -82685
34334 -82685 -165527 -278497 -100799 327100 602201 480205 182406 104836 344785 597900
34324 597900 494725 17248 -437421 -474887 -171885 23408 -115044 -341084 -413494 -523582
34314 -523582 -925752 -1360537 -1304769 -750392 -269312 -226495 -363905 -324475 -168899 -108211
34304 -108211 -78225 76150 238111 184613 -51347 -276520 -422901 -456172 -220272 269727
34294 269727 597415 460722 251512 573647 1255167 1472225 940199 328617 241027 404365
34284 404365 289442 -5258 -75489 -43476 -378409 -1016584 -1314390 -942331 -304663 65160
34274 65160 104710 59080 75534 153444 230483 156852 -184289 -606692 -725956 -474971 -249678
34263 -249678 -362328 -608492 -606237 -339389 -99387 -71322 -258048 -650821 -1144163 -1383218
34253 -1383218 -1061101 -372046 141251 218438 72788 -66732 -255618 -552336 -767002 -728183
34243 -728183 -582233 -579046 -706365 -770268 -720447 -648900 -549077 -349965 -171064 -258949 -592086
34232 -592086 -783239 -527689 -16405 248404 337 -528873 -873071 -797910 -510063 -417083
34222 -417083 -674090 -1017321 -1103605 -925354 -731225 -594123 -321555 133196 443181 305201
34212 305201 -100643 -300742 -102418 258483 505389 595325 568571 381701 37885 -273508
34202 -273508 -343160 -201769 -97971 -224717 -528123 -782211 -828499 -748032 -774004 -994498
34192 -994498 -1196797 -1113104 -784714 -519568 -464382 -399569 -60914 474655 869576 920010
34182 920010 734155 539892 422390 272144 -44370 -468855 -738601 -671085 -439558 -409792
34172 -409792 -663407 -874045 -778204 -580363 -664422 -1004235 -1131791 -715388 39343 633626
34162 633626 771147 540791 235432 92328 142419 211249 70671 -351599 -882144 -1222226
34152 -1222226 -1187711 -872485 -564054 -438777 -359387 -80104 358185 620189 530320 325063
34142 325063 293036 359109 275724 80160 26159 107153 25670 -275949 -409101 -79196 423371
34131 423371 563169 268638 9654 169478 584639 803802 642333 326975 147787 141632
34121 141632 183667 241725 343735 338712 -20636 -618654 -858663 -309853 636449 1100609
34111 1100609 724036 31919 -295591 -196413 -76962 -157087 -284550 -305238 -291546 -325233
34101 -325233 -270125 65951 596232 938637 811837 380874 85009 124006 269657 241621
34091 241621 74543 -38897 -78447 -125771 -113169 44457 159439 -25559 -377315 -511034
34081 -511034 -409652 -460561 -773670 -948946 -745513 -499678 -523263 -517891 -71810 574341
34071 574341 815279 564871 297093 266262 234306 24639 -165859 -168569 -130832 -183570 -161773
34060 -161773 87513 367115 367228 92974 -170894 -225003 -90403 155360 478594 802895
34050 802895 961334 831964 503629 222468 105251 -39669 -464066 -1059271 -1393086 -1246639
34040 -1246639 -885936 -649723 -519071 -344216 -256723 -479256 -852597 -957946 -689355 -346459
34030 -346459 -159349 -72985 -19972 -45553 -107995 -97472 -103247 -303479 -539174 -408303 115804
34019 115804 593721 789029 952547 1214289 1201229 638161 -98058 -477330 -527718 -568992
34009 -568992 -545560 -202409 265832 370595 108108 14257 374921 876828 1143432 1148605
33999 1148605 960056 545966 72039 -33333 356263 739874 581235 19584 -354536
33990 -354536 -291821 -100242 -123849 -345737 -558970 -655027 -615309 -394143 33600 568871
33980 568871 1031019 1290719 1332136 1227177 1082500 967227 843499 593286 167775 -288859
33970 -288859 -509831 -330668 152129 639111 839832 670634 311555 68348 99174 247598
33960 247598 225940 3285 -107887 143139 569683 758843 597530 363489 281313 227330
33950 227330 -18939 -410849 -665346 -561247 -118987 416010 704211 556942 141275 -164012
33940 -164012 -166948 21289 282542 648132 1050059 1211883 1023906 785603 780951 819034
33930 819034 556160 118607 -34218 177184 336137 195429 16291 63949 162340 47416
33920 47416 -120330 41871 551051 996902 1050924 798673 550929 510216 658149 830649
33910 830649 855412 702229 522807 473559 498927 381603 36322 -328609 -409037 -135373
33900 -135373 247629 427990 314130 72663 -68609 -12419 176535 351438 381529 239491
33890 239491 28674 -116174 -169386 -203177 -240978 -226531 -167932 -173818 -252474 -206137 111239
33879 111239 500116 568759 197358 -293494 -487641 -294913 21537 176509 153436 156946
33869 156946 313970 499993 515943 357266 177987 49602 -44899 -8734 289046 671399
33859 671399 718221 340547 -25968 -39861 58486 -78851 -256601 -60324 353259 386831
33849 386831 -67520 -402313 -164851 329135 511693 316005 99324 63425 69385 -81167
33839 -81167 -407574 -744158 -861472 -666699 -330139 -105678 -30932 31949 100028 70901
33829 70901 6531 93686 278484 294156 143995 169198 476684 704159 599225 441595
33819 441595 561098 790647 814806 779849 1055893 1531015 1648602 1166281 474879 79063
33809 79063 58409 134322 49601 -207814 -422119 -348535 22809 426569 602949 519428 255336
33798 255336 -134010 -494859 -547643 -226434 125960 157444 -51769 -200353 -237790 -311677
33788 -311677 -402983 -378986 -305731 -336902 -372848 -221663 -40279 -179198 -582111 -787666
33778 -787666 -602726 -337886 -247114 -170245 54798 221629 99278 -144398 -186179 -24423
33768 -24423 85690 51490 26260 126741 278171 328988 194741 -74270 -283097 -224990
33758 -224990 82975 367151 377573 129471 -185640 -420511 -531024 -533579 -514932 -603804
33748 -603804 -818518 -982962 -887494 -526714 -123023 95822 129990 197506 447055 699304
33738 699304 598654 64400 -566237 -934689 -1014381 -936579 -714913 -398970 -259964 -441903
33728 -441903 -593957 -304333 189745 242575 -240322 -634886 -513712 -174591 -19478 55926
33718 55926 281617 480544 393506 214820 298297 532112 502656 169514 -98593 -128219
33708 -128219 -131811 -247575 -298674 -154595 -22204 -180442 -595616 -951005 -963991 -588423
33698 -588423 7804 570124 879366 812045 371976 -238882 -637054 -566972 -262149 -268200
33688 -268200 -758485 -1246695 -1200391 -745436 -456728 -560617 -698243 -505081 -115776 51286
33678 51286 -156885 -449059 -431803 -61209 285915 226348 -194690 -607803 -809895 -898767
33668 -898767 -883487 -522115 218174 845610 860218 423070 133417 225857 378967 318251
33658 318251 213893 346247 658534 828810 658846 275686 -89 36028 258139 365953
33648 365953 293788 291043 475229 554554 266120 -127296 -163894 124101 287309 190126 187454
33637 187454 499193 873820 1049039 1127160 1237761 1191343 813288 375293 310542 592772
33627 592772 726657 371234 -249543 -609282 -423930 115168 593413 795818 821841 789422
33617 789422 610489 231323 -78743 -19793 203630 47370 -577892 -1083795 -998872 -625327
33607 -625327 -559530 -815708 -858689 -416743 165820 456532 478817 553575 797246 990799
33597 990799 900577 566620 224145 26513 -54675 -70335 25270 242914 410748 315234
33587 315234 -39019 -444909 -740630 -905909 -955829 -913807 -867212 -868489 -807413 -577047 -311723
33576 -311723 -201465 -127521 158869 493204 390785 -171997 -546206 -287491 166873 131007
33566 131007 -325609 -539171 -268775 19677 -66523 -300400 -289207 -98115 -92009 -334860
33556 -334860 -482186 -286510 28932 39735 -329300 -691437 -663227 -288451 110716 352895
33546 352895 451194 354060 -38231 -564290 -834252 -705123 -462344 -392627 -445573 -479180
33536 -479180 -538121 -642240 -572234 -185174 247982 345167 132021 -18203 150813 608593
33526 608593 1169161 1534461 1401877 846974 427872 571519 1026365 1274808 1260563 1238760
33516 1238760 1122283 618914 -31730 -155126 376155 870285 767084 321850 48529
33507 48529 -11966 -81698 -124646 7253 179311 148974 -40856 -189533 -295638 -475000
33497 -475000 -682126 -802461 -858452 -860533 -671728 -327415 -232381 -625407 -1062633 -937995
33487 -937995 -388955 -117289 -327750 -462277 -136518 253496 178913 -245319 -549977 -630856
33477 -630856 -704353 -760340 -564382 -143102 194926 357103 568439 877029 964991 663616
33467 663616 312824 298716 472148 387031 -13323 -324653 -272012 -19188 161462 206048
33457 206048 147965 -1759 -111167 41812 382583 453898 -807 -587471 -731270 -437019
33447 -437019 -200440 -255761 -346114 -261844 -164888 -221936 -279747 -137091 124334 318381 457052
33436 457052 631381 751445 667033 456743 348440 376786 325016 24210 -431396 -779412
33426 -779412 -800048 -457577 46157 365164 289365 -14649 -122506 215002 776810 1069904
33416 1069904 842191 339956 -10903 -108017 -177234 -280969 -131530 395676 831153 586912
33406 586912 -225663 -856879 -814396 -320579 172992 502182 666670 607275 383823 263559
33396 263559 349217 385103 199316 37043 115705 146756 -245677 -834532 -1039018 -789960
33386 -789960 -621800 -851456 -1157631 -1148932 -939842 -888833 -1027015 -1038621 -707179 -180281
33376 -180281 180397 122935 -278419 -690909 -848172 -783005 -671692 -550167 -357604 -174905
33366 -174905 -157833 -238891 -180280 3637 -45109 -529914 -1108045 -1209297 -669669 103659
33356 103659 563614 521745 247679 149949 365332 657222 725280 555721 390309 400415
33346 400415 502229 476107 182637 -300194 -675469 -649709 -275289 31868 -35116 -310071
33336 -310071 -454457 -460059 -549429 -691112 -606005 -247580 123893 406795 794624 1320245
33326 1320245 1665242 1633959 1455647 1350616 1129128 562155 -108727 -421738 -303535 -64170
33316 -64170 113900 316566 562941 682927 585612 379847 158699 -106490 -367490 -390362
33306 -390362 10247 704339 1308243 1502869 1280752 902170 606999 389048 118464 -154506
33296 -154506 -198627 46925 323217 377419 253776 105319 -83747 -357423 -540127 -430792
33286 -430792 -159614 -46484 -132879 -156179 -6430 96670 -29854 -255271 -361690 -343304
33276 -343304 -330781 -374950 -456695 -590660 -764179 -852987 -746477 -517202 -334671 -222918
33266 -222918 -30154 323955 671268 757847 551072 275144 115510 18825 -102098 -95597
33256 -95597 251147 779307 998369 675965 138416 -186728 -288123 -393579 -500601 -428880
33246 -428880 -225286 -144942 -237561 -281470 -161370 -10372 73653 155655 235222 196437 101201
33235 101201 225760 623764 926173 811438 456026 250740 238854 147290 -103309 -246319
33225 -246319 -78091 224933 322811 119651 -163789 -278583 -209389 -123445 -123425 -151895 -157070
33214 -157070 -212373 -349227 -397674 -213324 4162 -93036 -469636 -690653 -539926 -323873
33204 -323873 -353293 -439562 -237352 136001 232658 -60958 -386255 -445119 -310822 -147637
33194 -147637 31401 192957 182098 -4307 -92243 78522 237751 58389 -273298 -219607
33184 -219607 345061 858974 733206 72510 -502024 -652041 -665915 -946033 -1384755 -1465305
33174 -1465305 -932256 -156017 251478 71313 -380405 -677522 -694274 -564496 -395405 -193483
33164 -193483 -41659 -139247 -534549 -930508 -945517 -560102 -141613 -9002 -149828 -402611
33154 -402611 -671206 -817666 -613933 -100433 193392 -197317 -929984 -1105429 -379843 570492
33144 570492 912672 628777 302603 226564 174431 -47000 -291102 -389497 -408852 -439241
33134 -439241 -398352 -219511 -20091 109373 304523 675360 972265 807161 232312 -182950
33124 -182950 -12576 473272 645770 328249 -7451 91870 468325 622533 389038 58315
33114 58315 -107126 -165258 -248402 -300285 -206072 -6204 162873 220541 142351 -49439 -210890
33103 -210890 -160018 68996 244765 309078 473264 787234 926913 699270 461533 617514
33093 617514 916828 788378 285112 95392 516174 993231 947115 563822 371966 405125
33083 405125 279081 -85481 -329739 -258228 -158521 -373673 -811665 -1054813 -840558 -308093
33073 -308093 181031 375652 284537 53385 -214898 -444825 -466014 -102720 540983 1040527
33063 1040527 1035884 592760 89445 -175841 -170428 -19305 135122 186907 99197 -89964
33053 -89964 -317119 -513862 -575882 -415274 -91775 212296 403538 548215 680655 707676
33043 707676 605460 521653 508563 334788 -179397 -747143 -837479 -317002 378262 748582
33033 748582 697750 459804 286726 311763 548306 882833 1138426 1210875 1086921 751685
33023 751685 233665 -244046 -371469 -130180 95991 -57863 -516058 -913637 -1062383 -1058555
33013 -1058555 -978924 -742891 -375326 -178002 -397871 -796218 -821386 -299569 265741 286829
33003 286829 -146017 -378068 -57021 432225 538141 265689 55712 111284 184473 8088
32993 8088 -376039 -786846 -1135586 -1363715 -1364620 -1140020 -899477 -834630 -871294 -790039 -542100
32982 -542100 -311504 -277491 -414313 -524162 -406225 -20408 441709 668756 505728 150455
32972 150455 18231 349488 938606 1282047 1042957 386999 -171292 -264419 32050 391953
32962 391953 598044 630299 536826 399076 355863 451637 479986 205528 -233474 -396029
32952 -396029 -111761 254893 285250 55456 -24082 209716 515149 628980 545657 365638
32942 365638 91639 -284531 -623317 -742989 -670964 -647300 -812557 -984165 -869185 -475880
32932 -475880 -144931 -103013 -160136 -13989 293919 480594 489730 520670 574957 360325 -181976
32921 -181976 -591813 -428658 106229 388417 103270 -495600 -974852 -1124730 -1030223 -951321
32911 -951321 -1084023 -1281844 -1140141 -556097 -19378 -25628 -345697 -299235 284277 842387
32901 842387 902216 673437 603160 710514 676127 367338 -25255 -254355 -192158 160987
32891 160987 650452 1018845 1124765 1048006 914032 755426 614558 569591 527389 224184
32881 224184 -365980 -831374 -774166 -294633 215576 576267 818333 865968 626452 332733
32871 332733 381572 790007 1166039 1268411 1232488 1161040 903724 443461 120744 156822
32861 156822 236780 -56298 -577131 -809571 -658300 -609099 -999776 -1504788 -1578182 -1167485
32851 -1167485 -696992 -453454 -302374 -51553 179904 138746 -157785 -417922 -457652 -390904
32841 -390904 -392111 -449505 -467495 -473031 -557699 -693052 -763877 -732064 -610929 -345411 63293
32830 63293 344445 158499 -400389 -771811 -584215 -140499 -15089 -310840 -606282 -589605
32820 -589605 -421965 -382713 -427224 -312511 -30009 130800 -34730 -374095 -571995 -517759
32810 -517759 -369115 -291238 -266553 -203304 -114524 -70729 -26651 150350 442596 604435 430212
32799 430212 42234 -210154 -154404 -4214 -90806 -415826 -586049 -279816 283704 515507
$$ [...]
##END NTUPLES=NMR SPECTRUM
##END=
