##TITLE=31Pdec_BAU-j-5.02 NN2
 CDCl3, 72 sc
 5.2.2019
##JCAMPDX= 6.0         $$ Bruker NMR JCAMP-DX V2.0
##DATA TYPE= NMR SPECTRUM
##DATA CLASS= NTUPLES
##ORIGIN= UXNMR, Bruker Analytische Messtechnik GmbH
##OWNER= root
$$ XWIN-NMR		Version 3.5
$$ Tue Feb  5 14:09:43 2019 Russian Standard Time (UT+4h)  she@DPX200
##.OBSERVE FREQUENCY= 81.013821
##.OBSERVE NUCLEUS= ^31P
##.ACQUISITION MODE= SIMULTANEOUS
##.ACQUISITION SCHEME= undefined
##.AVERAGES= 72
##.DIGITISER RES= 17
##SPECTROMETER/DATA SYSTEM= spect
##.PULSE SEQUENCE= zgpg30
##.SOLVENT NAME= CDCl3
##.SHIFT REFERENCE= (INTERNAL, CDCl3, 0, 182.463)
##AUDIT TRAIL= $$ (NUMBER, WHEN, WHO, WHERE, WHAT)
$$ ##TITLE= Audit trail, XWIN-NMR		Version 3.5
$$ ##JCAMPDX= 5.01
$$ ##ORIGIN= Bruker BioSpin GmbH
$$ ##OWNER= she
$$ F:/spectra/data/she/nmr/P31/1/pdata/1/auditp.txt
$$ ##AUDIT TRAIL=  $$ (NUMBER, WHEN, WHO, WHERE, WHAT)
(   1,<2019-02-05 14:08:39.31 +0400>,<she>,<DPX200>,
      <continue with go, POWCHK disabled, PULCHK disabled
       configuration hash MD5:
       00 E9 B6 7A A2 85 ED C7 34 08 36 98 17 FE 4E 26
       data hash MD5: 32K
       62 AF A1 09 DD 99 F5 B6 EB 9D 65 34 A5 9D AB FF>)
(   2,<2019-02-05 14:08:43.85 +0400>,<she>,<DPX200>,
      <Start of raw data processing
       efp BC_mod = 2 LB = 1 FT_mod = 6 PKNL = 1 PHC0 = -1454.353 PHC1 = 59.79899 SI = 64K 
       data hash MD5: 64K
       61 25 17 99 CB 16 2A 9C 5A A7 1C 82 5C 90 78 D5>)
(   3,<2019-02-05 14:09:14.76 +0400>,<she>,<DPX200>,
      <pk PHC0 = -14.8932 PHC1 = 53.6 
       data hash MD5: 64K
       93 08 9B F6 5E 64 A4 94 5E 2E A3 3F 35 22 11 26>)
(   4,<2019-02-05 14:09:18.06 +0400>,<she>,<DPX200>,
      <abs ABSG = 5 
       data hash MD5: 64K
       84 F9 EF 17 33 13 07 57 91 70 B7 36 01 91 C0 F1>)
$$ ##END=
$$ 
$$ hash MD5
$$ 80 CC C8 57 63 A8 33 52 FE 5A 5D D6 0B 94 B5 C3
##$RELAX= 
##$RELAX= 
##$RELAX= 
##$RELAX= 
##$RELAX= 
##$RELAX= 
##$RELAX= 
##$RELAX= 
$$ Bruker specific parameters
$$ --------------------------
##$DU= <F:/spectra>
##$EXPNO= 1
##$NAME= <P31>
##$PROCNO= 1
##$TYPE= <nmr>
##$USER= <she>
##$AMP= (0..31)
100 100 100 100 100 100 100 100 100 100 100 100 100 100 100 100 100 100 
100 100 100 100 100 100 100 100 100 100 100 100 100 100 
##$AQSEQ= 0
##$AQ_mod= 1
##$AUNM= <au_zg>
##$AUTOPOS= <>
##$BF1= 81.014009
##$BF2= 200.13
##$BF3= 200.13
##$BF4= 200.13
##$BF5= 200.13
##$BF6= 200.13
##$BF7= 200.13
##$BF8= 200.13
##$BYTORDA= 1
##$CFDGTYP= 0
##$CFRGTYP= 5
##$CHEMSTR= <none>
##$CNST= (0..31)
1 1 145 1 1 1 1 1 1 1 1 1 1 1 1 1 1 1 1 1 1 1 1 1 1 1 1 1 1 1 1 1 
##$CPDPRG= <waltz16>
##$CPDPRG1= <>
##$CPDPRG2= <waltz16>
##$CPDPRG3= <>
##$CPDPRG4= <mlev>
##$CPDPRG5= <mlev>
##$CPDPRG6= <mlev>
##$CPDPRG7= <mlev>
##$CPDPRG8= <mlev>
##$CPDPRGB= <>
##$CPDPRGT= <>
##$D= (0..31)
0 1 0 0 0 0 0 0 0 0 0 0.03 2e-05 3e-06 0 0 0 0 0 0 0 0 0 0 0 0 0 0 0 0 
0 0 
##$DATE= 1549361187
##$DBL= (0..7)
120 120 120 11 120 120 24 19 
##$DBP= (0..7)
150 150 150 150 150 150 150 150 
##$DBP07= 0
##$DBPNAM0= <>
##$DBPNAM1= <>
$$ [...]
##$SUBNAM3= <"">
##$SUBNAM4= <"">
##$SUBNAM5= <"">
##$SUBNAM6= <"">
##$SUBNAM7= <"">
##$SUBNAM8= <"">
##$SUBNAM9= <"">
##$SW= 369.568048894756
##$SWIBOX= (0..15)
0 1 3 0 0 0 0 0 0 0 0 0 0 0 0 0 
##$SW_h= 29940.119760479
##$TD= 32768
##$TD0= 1
##$TE= 0
##$TE2= 300
##$TE3= 300
##$TEG= 300
##$TL= (0..7)
0 120 53 12 22 120 120 120 
##$TP= (0..7)
150 150 150 150 150 150 150 150 
##$TP07= 0
##$TPNAME0= <>
##$TPNAME1= <>
##$TPNAME2= <>
##$TPNAME3= <>
##$TPNAME4= <>
##$TPNAME5= <>
##$TPNAME6= <>
##$TPNAME7= <>
##$TPOAL= (0..7)
0.5 0.5 0.5 0.5 0.5 0.5 0.5 0.5 
##$TPOFFS= (0..7)
0 0 0 0 0 0 0 0 
##$TUNHIN= 0
##$TUNHOUT= 0
##$TUNXOUT= 0
##$USERA1= <user>
##$USERA2= <user>
##$USERA3= <user>
##$USERA4= <user>
##$USERA5= <user>
##$V9= 5
##$VALIST= <valist>
##$VCLIST= <CCCCCCCCCCCCCCC>
##$VD= 0
##$VDLIST= <DDDDDDDDDDDDDDD>
##$VPLIST= <PPPPPPPPPPPPPPP>
##$VTLIST= <TTTTTTTTTTTTTTT>
##$WBST= 1024
##$WBSW= 4
##$XGAIN= (0..3)
0 0 0 0 
##$XL= 0
##$YL= 0
##$YMAX_a= 19738
##$YMIN_a= -31356
##$ZGOPTNS= <>
##$ZL1= 120
##$ZL2= 120
##$ZL3= 120
##$ZL4= 120
##$ABSF1= 182.463
##$ABSF2= -187.1042
##$ABSG= 5
##$ABSL= 3
##$ALPHA= 0
##$AQORDER= 0
##$ASSFAC= 0
##$ASSFACI= 0
##$ASSFACX= 0
##$ASSWID= 0
##$AUNMP= <proc_1d>
##$AZFE= 0.1
##$AZFW= 0.5
##$BCFW= 0
##$BC_mod= 2
##$BYTORDP= 0
##$COROFFS= 0
##$CY= -3
##$DATMOD= 1
##$DC= 0
##$DFILT= <>
##$DTYPP= 0
##$F1P= 0
##$F2P= 0
##$FCOR= 1
##$FTSIZE= 65536
##$FT_mod= 6
##$GAMMA= 0
##$GB= 0
##$INTBC= 1
##$INTSCL= 5.30512e-09
##$ISEN= 30
##$LB= 1
##$LEV0= 0
##$LPBIN= 0
##$MAXI= 10000
##$MC2= 0
##$MEAN= 0
##$ME_mod= 0
##$MI= 50
##$NCOEF= 0
##$NC_proc= -8
##$NLEV= 6
##$NOISF1= 182.463
##$NOISF2= 159.3651
##$NSP= 0
##$NTH_PI= 0
##$NZP= 0
##$OFFSET= 182.463
##$PC= 4
##$PHC0= -1469.246
##$PHC1= 113.399
##$PH_mod= 1
##$PKNL= yes
##$PPARMOD= 0
##$PSCAL= 0
##$PSIGN= 0
##$REVERSE= no
##$SF= 81.0140089999434
##$SI= 65536
##$SIGF1= 159.3651
##$SIGF2= -187.1042
##$SINO= 113.3802
##$SIOLD= 16384
##$SREGLST= <1H.CDCl3>
##$SSB= 0
##$STSI= 65536
##$STSR= 0
##$SW_p= 29940.119760479
##$SYMM= 0
##$S_DEV= 0
##$TDeff= 32768
##$TDoff= 0
##$TI= <>
##$TILT= no
##$TM1= 0
##$TM2= 0
##$TOPLEV= 0
##$USERP1= <user>
##$USERP2= <user>
##$USERP3= <user>
##$USERP4= <user>
##$USERP5= <user>
##$WDW= 1
##$XDIM= 65536
##$YMAX_p= 318485458
##$YMIN_p= -213199803
$$ End of Bruker specific parameters
$$ ---------------------------------
##NTUPLES= NMR SPECTRUM
##VAR_NAME=  FREQUENCY,     SPECTRUM/REAL,   SPECTRUM/IMAG
##SYMBOL=    X,             R,               I
##VAR_TYPE=  INDEPENDENT,   DEPENDENT,       DEPENDENT
##VAR_FORM=  AFFN,          ASDF,            ASDF
##VAR_DIM=   65536,         65536,           65536
##UNITS=     HZ,            ARBITRARY UNITS, ARBITRARY UNITS
##FACTOR=    0.456856943014862, 1,           1
##FIRST=     14782.0589164792, 0,            0
##LAST=      -15158.0608439998, 0,           0
##MIN=       -15158.0608439998, -213199803,  0
##MAX=       14782.0589164792, 318485458,    0
$$ Real data points
##PAGE= N=1
##DATA TABLE= (X++(R..R)), XYDATA
$$ [...]
40598C782992p732158m042027L471292P130995P019861P631729Q118843N353076
40590C0734603K277010K970289K770671n412920j6618758j7672048o256904N176298
40582b031759O820703K179054j961931n637831j0306853j2165264p624868L42881
40574c0385868O538263R256419Q317145L524222j516445r21231M242704N467519
40566D522728j47908m180208K62480P589659Q430249K926398j612582j264157
40558A6526659K189176M724083J648205q083473j5695890r465274P692378J7935891
40550A7471755J1922766P71122l241691m307542r860642j3405910o321397M228564
40542b742975O525765M181941O606792Q536958j14103j1099080p739331O086010
$$ plain form
40598 3782992 -3949166 -7991193 -4519901 2611094 9630955 17262684 25381527 30734603
40590 30734603 33011613 35981902 38752573 33339653 16720895 -951153 -7208057 -2031759
40582 -2031759 4788944 6967998 5006067 -631764 -10938617 -23103881 -30728749 -30385868
40574 -30385868 -23847605 -14591186 -6274041 -2749819 -4266264 -5187495 -944791 4522728
40566 4522728 4374820 194612 457092 8046751 16477000 19403398 17790816 16526659
40558 16526659 18715835 23439918 25088123 17004650 1308760 -8156514 -464136 17471755
40550 17471755 29394521 30165643 26923952 22616410 12755768 -650142 -6971539 -2742975
40542 -2742975 3782790 7964731 14571523 23108481 22994378 11895298 4155967 10241977
40534A0241977J0798467L109722j561848J360759n6739p443795o952960K597152
40526A2092735L798294p270772j0334172M048031J5214888N999016q783262q814680
40518E950078j555801m339578j1298394n806597O920952P967088k406832o876792
40510a1445876j427324J650233j435130k325375q31487n489736j2856461q968442
40502d3129598N575292J3618736Q992451N209300J0382480J3650967N826649m166358
40494A5959919m708460Q81783L427896L088607M585056O422666M866597J587556
40486C6111620o93924l598706p550820p858333k591948K586989L396132L520661
40478B3321671O205546O819584R67902o565272q606802o086065m576735m953874
$$ plain form
40534 10241977 21040444 24150166 22588318 23949077 23892338 16448543 9495583 12092735
40526 12092735 15891029 8620257 -1713915 2334116 17549004 23548020 14764758 5950078
40518 5950078 4394277 54699 -11243695 -17050292 -10129340 -2162252 -4569084 -11445876
40510 -11445876 -12873200 -11222967 -12658097 -14983472 -15814959 -21304695 -34161156 -43129598
40502 -43129598 -37554306 -23935570 -14943119 -9733819 648661 14299628 20126277 15959919
40494 15959919 11251459 12133242 15561138 18649745 23234801 29657467 34524064 36111620
40486 36111620 35417696 31818990 24268170 16409837 13817889 16404878 19801010 23321671
40478 23321671 29527217 36346801 37314703 30749431 22142629 16056564 11479829 6525955
40470F525955m495195l427402l523136l048984O61147N734791Q196988P924151
40462A4548315P358243O104893J684995n018026r097606o959259n17853M131597
40454A2235299K291193l978276o971466k135390N619109P932740L779727n85028
40446A8187908j230454j72515J50076m39762k867009p655856j0117786m170204
40438h315602P299489J3417509R450396K793648J280324K399215p22358p684643
40430A9917978j0927988n498945M874764J0962803O939170k599830o499999o69873
40422A6498080O125120N135937Q15855K402368P352244N519101k691306o457658
40414C4699741k814509j20270j438479L01037O661419Q456199J854250m751857
$$ plain form
40470 6525955 2030760 -1396642 -4919778 -7968762 -7307615 -1572824 6624164 14548315
40462 14548315 21906558 28011451 29696446 24678420 15580814 8621555 8103702 12235299
40454 12235299 14526492 10548216 3576750 1441360 7060469 14993209 18772936 18187908
40446 18187908 16957454 16784939 16935015 16495253 13628244 5972388 -4145398 -8315602
40438 -8315602 -1016113 12401396 21851792 24645440 25925764 28324979 27602621 19917978
40430 19917978 8989990 3491045 8365809 19328612 26267782 23667952 17167953 16498080
40422 16498080 22623200 27759137 28574992 30977360 38329604 43848705 41157399 34699741
40414 34699741 31885232 31764962 30326483 30627520 37288939 45745138 47599388 42847531
40406D2847531o170810p815310j0816283o148121P023344J3918308P083565L12831
40398D0235055N226193J0282383J213817j2258689j1700470o73868L254684p49586
40390C4829519J074023Q421626O260652o360056j1324951m54047J1633839J0962207
40382E5042812K760964j252271Q45594N035162Q412085O129972o084608k0632938
40374E0256772k2014399q110604M981855N425243Q1152l17457K819547L493570
40366C6615679K668565K437620r69626q386474j1294137m369795L936544L573126
40358B4211502j965272k957561R53897L071209J774821K8624k280492n653754
40350A7182974n443347R85498O019140J202847q698583j1642056n586237P07937
$$ plain form
40406 42847531 36676721 28861411 18045128 11897007 18920351 32838659 39922224 40235055
40398 40235055 45461248 55743631 56957448 44698759 32998289 32324421 35579105 34829519
40390 34829519 35903542 44325168 50585820 44225764 32900813 32446766 44080605 55042812
40382 55042812 57803776 56551505 57397099 62432261 70844346 76974318 70889710 50256772
40374 50256772 28242373 20131769 25113624 30538867 30620019 30302562 33122109 36615679
40366 36615679 39284244 41721864 40752238 32365764 21071627 16701832 20638376 24211502
40358 24211502 22246230 19288669 20242566 23313775 25088596 25117220 22836728 17182974
40350 17182974 11739627 12725125 18744265 19947112 11248529 -393527 -5979764 -5271827
40342e271827K070575J302114K26210k575767m511428N4519R485571J4550578
40334A5330545J0876102L778371j408649n475274q846239p525997o61473M689468
40326A0756854K456125l625910o062169m589797m478597o087667l612994M694165
40318a0549990J1350356Q679957j55685m217038J054556P443784M865908m344041
40310A4127807p684762N34673J0373904Q457787m629013j4905384j2459173k947322
40302i131483O23836n691666j2295594p988307O106277J6770721J3180652o34414
40294I40022r926661n438609P048556J4194670R815404J31511m552539r69123
40286A1243231N155675P066556M630481K427056J842234o76772o469429j0648440
$$ plain form
40342 -5271827 -3201252 -1899138 -1672928 -4248695 -8760123 -8705604 779967 15330545
40334 15330545 26206647 29985018 28576369 23101095 14254856 6728859 6067386 10756854
40326 10756854 13212979 9587069 3524900 -1064897 -5543494 -11631161 -15244155 -10549990
40318 -10549990 800366 9480323 9324638 5107600 6162156 13605940 18471848 14127807
40310 14127807 6443045 6977718 17351622 25809409 21180396 6275012 -6184161 -9131483
40302 -9131483 -8507647 -14199313 -26494907 -34483214 -28376937 -11606216 1574436 940022
40294 940022 -8986639 -14425248 -7376692 6817978 16633382 16764893 12212354 11243231
40286 11243231 16398906 23465462 28095943 30522999 32365233 31688461 25219032 14570592
40278A4570592q797157l643198k75223J584765M412031N481838Q87123m996868
40270I223903l710183L527209O340321J283009l062482p79693K062503j182740
40262A3701847o361212o297411k478416p28503j112083j30856J862700K613595
40254A069661K620296J782996k460295p504860m573586O190802R510323l775873
40246B859464j8407228j3934245M382552J3155489O106484J14473M724135Q443177
40238G444301K640624k331085K835873Q397821L016710n524951m674634m26920
40230A1377739o288501j6807532j4070172K093973J2325696P962742J955854L765059
40222B314858L915529n170209j1076874j052014J2973995R440613q765461j6534978
$$ plain form
40278 14570592 5773435 2130237 1855014 3439779 7851810 13333648 14220771 9223903
40270 9223903 5513720 9040929 15381250 16664259 13601777 12822084 14884587 13701847
40262 13701847 7340635 1043224 -1435192 -2163695 -3275778 -3406634 -1543934 1069661
40254 1069661 3689957 5472953 3012658 -4492202 -9065788 -2874986 6635337 2859464
40246 2859464 -15547764 -29482009 -25099457 -11943968 -5837484 -5723011 -998876 7444301
40238 7444301 10084925 7753840 10589713 18987534 22004244 16479293 11804659 11377739
40230 11377739 5089238 -11718294 -25788466 -23694493 -11368797 -3406055 -1450201 2314858
40222 2314858 6230387 1060178 -10016696 -11068710 1905285 11345898 2580437 -13954541
40214a3954541l324368J2406389J1706442L25410n803252o067613j0407573j7430528
40206c2549634j5055742j299301J1471623J4954415J3713275J2107205O283371
40199I625212m166365r366952l875370K146689j605080p243439j89023J5911756
40191A237428K1718241R374563p726366j5115369j3541026r861479m282136M419736
40183a3776408R885396M999247o221121j2096556p142461L280153J0599044J0783159
40175C10453N982647J952698K453768M509933K214457l826162o486254l859818
40167C251722l453869r364520j2891178m577518R807851J5590859Q713222j289125
40159E787444o451602p793407p181923l011902K886578M145090M34323K60012
$$ plain form
40214 -13954541 -17278909 -4872520 6833922 7159332 1356080 -4711533 -15119106 -32549634
40206 -32549634 -47605376 -48904677 -37433054 -22478639 -8765364 3341841 9625212
40199 9625212 5458847 -3908105 -7783475 -5636786 -7241866 -14485305 -14674328 1237428
40191 1237428 22955669 32330232 24603866 9488497 -4052529 -13914008 -18196144 -13776408
40183 -13776408 -3891012 1108235 -5112886 -17209442 -24351903 -21071750 -10472706 310453
40175 310453 6293100 8245798 10699566 15209499 17423956 13597794 7111540 3251722
40167 3251722 -202147 -9566667 -22457845 -27035363 -17227512 -1636653 7076569 5787444
40159 5787444 -664158 -8457565 -15639488 -18651390 -15764812 -11619722 -11185399 -10925387
40151a0925387P500444J3537821J0028123J932881j161523l55942l017551p282482
40143A0256384m148523N250135P938621j372782j0751371q000612K012984N897413
40135G082249J219616k604604J95660N079774N839078K172795k249325l651260
40127A3083983n3406N677960O082573j509266p983141l111556Q238096J1126352
40119C1551595K316614n148092k481278K626285Q31195m373090o350667p684030
40111A1288532j0770985p207434P651127J8561225Q451860j2313470j6688743
40104a027888p62398J0403274J913964r436026m680092O955624N301838p550044
40096A118252j2084340j975569R844864J3172147J1224643Q975361N762876J960855
$$ plain form
40151 -10925387 -3424943 10112878 20141001 22073882 20912359 20556417 17538866 10256384
40143 10256384 6107861 11357996 19296617 17923835 7172464 -828148 1184836 7082249
40135 7082249 8301865 5697261 5892921 10972695 16811773 18984568 16735243 13083983
40127 13083983 13030577 18708537 24791110 23281844 15298703 12187147 20425243 31551595
40119 31551595 33868209 28720117 26238839 28865124 29696319 25323229 18972562 11288532
40111 11288532 517547 -6689887 961240 19522465 27974325 15660855 -1027888
40104 -1027888 -1790286 8612988 10526952 1090926 -3589166 3366458 8668296 1118252
40096 1118252 -10966088 -12941657 -3096793 10075354 21299997 30275358 36038234 37999089
40088C7999089Q40189R72551l042501j0011446j1917574o504537p74130N64760
40080H126401Q46650K598041K400075r16168j746677K645361N275560p78496j0808282
40071G642465j3644149n759485N184262R596773N458349m52363J80222P022528
40063A5228602R754040J427609r535827r290633P84597N408461q44189n596572
40055G336088p55836K923791m637145j2488254n122212J0094189J2390318J75641
40047I916580p480642k448528J332639n960476j3269592q624783J249396M425058
40039b0860348K926993M012718M141982k326412p931711l040672N077347K648211
40031a5351892n966632m166718Q163031J3410019N997505J405896Q564764J4347206
$$ plain form
40088 37999089 38839278 39811829 36769328 26757882 14840308 8335771 7561641 8126401
40080 8126401 8973051 11571092 13971167 13054999 11308322 13953683 19229243 18450747 7642465
40071 7642465 -6001684 -11761169 -6576907 3019866 8478215 8025852 8206074 15228602
40063 15228602 24982642 26410251 16874424 7583791 8368388 13776849 12932660 7336088
40055 7336088 6580252 9504043 4866898 -7621356 -12743568 -2649379 9740939 9916580
40047 9916580 2435938 -12590 1320049 -4640427 -17910019 -26534802 -25285406 -20860348
40039 -20860348 -17933355 -13920637 -9778655 -12105067 -20036778 -23077450 -18000103 -15351892
40031 -15351892 -21318524 -25485242 -17322211 -3912192 2085313 3491209 12055973 26403179
40023B6403179P208174k431823r96205M250137j478149j3872902j6078039n821106
40015b816734L210997M366516M086340N247040K142447n247380p797516k488758
40007G02952K349612J398494p12658r68020l155589o290125j919258R443278J3042589
39998A3891275J355213j1580734r863286Q04832L955762j537246k987581K675898
39990c285867M459468l034392j0779177j0013006l721728J410919M832720Q342265
39982a1788798R769686O261996k33247m643220l502362K775268R043426P989188
39974A5671937j110485p879504k725064P904679Q308571l463828j1544358n794631
39966f32683L129467J336063o435762n673782L923211Q719741L620747j117042
$$ plain form
40023 26403179 33611353 31179530 30183325 34433462 32955313 19082411 3004372 -2816734
40015 -2816734 394263 4760779 8847119 14094159 16236606 10989226 3191710 702952
40007 702952 3052564 4451058 3738400 2770380 -385209 -6675334 -8594592 848686 13891275
39998 13891275 15246488 3665754 -6197532 -5392700 -1436938 -2974184 -5961765 -3285867
39990 -3285867 1173601 -1860791 -12639968 -22652974 -26374702 -24963783 -20131063 -11788798
39982 -11788798 -2019112 4242884 4009637 -633583 -4135945 -1360677 7682749 15671937
39974 15671937 14561452 6681948 3956884 11861563 20170134 16706306 5161948 -632683
39966 -632683 2496784 3832847 -2602915 -8276697 -4353486 4366255 7987002 6869960
39958F869960J776826N394596K002675m178716o197411o581968r424437q281711
39950a8620186L789586J6565401J2029622p490570j7912490o573066R432238R547895
39942G68430J62044J714042J4900305K0597804J0745548j772997o544374q765208
39934C1805594j2443222r726943J857427Q251511l76451j1006774o542635P029528
39926H848035J0382890N93917p915553q018612n930192m017119K297159Q410145
39918D650670J419632j6635879k4472422r921683J2125562K0436297J3446909
39911A049086L619530k646693o378843n860492Q20217P465999O170389m99326
39903C739867l741589k281205k012225l898018k519261L117129O396055K636966
$$ plain form
39958 6869960 8646786 14041382 16044057 11865341 5667930 -914038 -10338475 -18620186
39950 -18620186 -14830600 1734801 13764423 6273853 -11638637 -18211703 -8779465 768430
39942 768430 930474 2644516 17544821 38142625 48888173 47115176 40570802 31805594
39934 31805594 19362372 9635429 11492856 19744367 19367916 8361142 1818507 8848035
39926 8848035 19230925 19824842 11909289 3890677 -2039515 -6056634 -3759475 4650670
39918 4650670 6070302 -10565577 -35037999 -44959682 -32834120 -12397823 1049086
39911 1049086 4668616 2021923 -4356920 -10217412 -9397195 -1931196 4239193 3739867
39903 3739867 -1722 -2282927 -4295152 -8193170 -10712431 -7595302 -1199247 1437719
39895A437719m751613r406805q352475k263947N942015J1464271J0293798L454050
39887G817013k914882k671147M653495J1987408R677508l790953j6461725j4150613
39879e853896J923861J5490217J5215923O397745p18196m748744q652471j0249726
39871H804713o576782j333965J257669M276844J0424105J2873286N096522n633980
39863B9188412p422134k265066j400260n262214m017105K722644M196170r93482
39855A4746965n06906R377609J4002564K801636j3013302j7455854j2443068r529637
39847a2019993q620719j231535J0251643J3240379M530709m836790o320396l861944
39839h868646l993973n935111o044392m440981k235433K212730R487137J5353698
$$ plain form
39895 1437719 -3313894 -12720699 -21073174 -23337121 -17395106 -5930835 4362963 7817013
39887 7817013 4902131 2230984 6884479 18871887 28549395 24758442 8296717 -5853896
39879 -5853896 -3930035 11560182 26776105 33173850 32455654 27706910 19054439 8804713
39871 8804713 2227931 893966 2151635 6428479 16852584 29725870 34822392 29188412
39863 29188412 21766278 19501212 18100952 12838738 8821633 11544277 15740447 14746965
39855 14746965 14240059 23617668 37620232 40421868 27408566 9952712 -2490356 -12019993
39847 -12019993 -20640712 -21872247 -11620604 1619775 6150484 1313694 -5006702 -8868646
39839 -8868646 -12862619 -18797730 -24842122 -29283103 -31518536 -29305806 -19818669 -4464971
39831d464971J4828754P761074j753363q770777r061157j588787P887550R933283
39823A4771606K266346n788087m635028K239437K772078o161240j3425762r127095
39815a7087745J436817O148690L962953M722695J1495592J4145496N387589o249029
39807B3963058q454299l748064m588221j2561713j5309457o057886N716760Q475129
39799a2564693L742996o3324r87698k021037k156209J163494M087829R93746m210341
39790a2015237j600525Q894900J4816717P958006m069940q199754k045206O047107
39782I786068Q963274O529437J302500m955210r980011j0913204p553756l329751
39774a0150653j444153j378329k62661L205815O963229P146028J449999p814888
$$ plain form
39831 -4464971 10363783 18124857 16371494 7600717 -1460440 -3049227 4838323 14771606
39823 14771606 17037952 11249865 6614837 8854274 11626352 5465112 -7960650 -17087745
39815 -17087745 -15650928 -9502238 -5539285 -816590 10679002 24824498 30212087 23963058
39807 23963058 15508759 11760695 7172474 -5389239 -20698696 -26756582 -21039822 -12564693
39799 -12564693 -8821697 -8885021 -9872719 -11893756 -14049965 -12886471 -8798642 -7804896 -12015237
39790 -12015237 -13615762 -4720862 10095855 18053861 13983921 5784167 3738961 9786068
39782 9786068 18749342 25278779 26581279 21626069 11646058 732854 -6820902 -10150653
39774 -10150653 -11594806 -12973135 -13235796 -10029981 -3066752 4079276 5529275 -2285613
39766b285613j3770136j0148423J729482J2427910J3461585O605101J238479K094260
39758A1352645L624840j099266r738431j3538152q750847J18318P654387J2123975
39750A747469J2251738O349480k291907n392453p7253N508285K909015m193319
39742A6811055n553860o5658K792180k290185q859389r198077n091123k459246
39734a3914303n44481N846966J4977700J6908901O140287r301499j5483320p780058
39726c149807M695803R777673M722375l059144n562160j794505L633245O193728
39718A5457208M303840o87932m624258k635978N098014J0538775N321484q000187
39710B4770966j6678063j2186960k50120P035498O040324L471091M650974O246623
$$ plain form
39766 -2285613 -16055749 -26204172 -24474690 -12046780 1414805 8019906 9258385 11352645
39758 11352645 14977485 13878219 4139788 -9398364 -18149211 -18030893 -10376506 1747469
39750 1747469 13999207 20348687 18056780 12664327 12587074 18095359 21004374 16811055
39742 16811055 11257195 11191537 13983717 11693532 2834143 -6363934 -11455057 -13914303
39734 -13914303 -14458784 -8611818 6365882 23274783 29415070 20113571 4630251 -3149807
39726 -3149807 1545996 11323669 16046044 12986900 7424740 5630235 9263480 15457208
39718 15457208 19761048 19073116 14448858 11812880 16910894 27449669 32771153 24770966
39710 24770966 8092903 -4094057 -4344177 2691321 8731645 12202736 16853710 23100333
39702B3100333K988024l101553m909240k40318M778693L201593m714503j2509867
39694H593162j4476647r694801r83781O924532Q732134K314472p181170j0590598
39686a6362697n183484J112310J28923m744216l715130L778810P585480L064666
39678a4335338j223149J680022M188771l058787j2550317r092043M811754J0223074
39670a9356013J378808m226564N539793J5879692P827849j0154098j3673088J020007
39662a5763614J3723772J2367548O207712L174661l630350j6689221k1019321
39655b1628813o015135J3753695J6923297M991775l671564k526860j259603m765276
39647d198484o128368j675483K756617L587711M284188N389210K140532m565789
$$ plain form
39702 23100333 26088357 22986804 18077564 17837246 22615939 25817532 21103029 8593162
39694 8593162 -5883485 -15578286 -16562067 -9637535 -905401 1409071 -5772099 -16362697
39686 -16362697 -21546181 -20433871 -20304948 -25049164 -28764294 -24985484 -17400004 -14335338
39678 -14335338 -15558487 -13878465 -9689694 -12748481 -25298798 -34390841 -29579087 -19356013
39670 -19356013 -17977205 -22203769 -16663976 -784284 7043565 -3110533 -16783621 -15763614
39662 -15763614 -2039842 10327706 16535418 19710079 16079729 -609492 -21628813
39655 -21628813 -27643948 -13890253 3033044 8024819 4353255 1826395 566792 -4198484
39647 -4198484 -10326852 -12002335 -9245718 -5658007 -1373819 4015391 6155923 1590134
39639A590134o633066k030034J636649O06837K49162K233183r65214j1659657
39631a4972006j8689995j2502050J042263J0762409J4938974J6446377J2151275
39624I177247p46793j3789705j4879664m011087P953295J2971370J0181724J510224
39616H366611p598365p713005L770232J4784038J1833386k100350j2859359j4092908
39608e609720r582456j417472R667530J5088528O290777p907964r074617K972927
39600D27533P953495l319129j3585414o139449R214970J2472370L612898j330955
39592I306319K459019L699365l729527j0965610r027937j504128K595949P90012
39584f376538k489537k481304J709000O112179M643489l346412r264985m505331
$$ plain form
39639 1590134 -5042932 -7072966 -5436317 -4829480 -4580318 -2347135 -3312349 -14972006
39631 -14972006 -33662001 -46164051 -45121788 -34359379 -19420405 -2974028 9177247
39624 9177247 8430454 -5359251 -20238915 -24250002 -16296707 -3325337 6856387 8366611
39616 8366611 768246 -6944759 -3174527 11609511 23442897 21342547 8483188 -5609720
39608 -5609720 -15192176 -16609648 -6942118 8146410 14437187 6529223 -2545394 427533
39600 427533 8381028 5061899 -8523515 -14662964 -5447994 7024376 10637274 9306319
39592 9306319 11765338 15464703 11735176 769566 -8258371 -9762499 -7166550 -6376538
39584 -6376538 -8866075 -11347379 -9638379 -3526200 1117289 -2229123 -11494108 -15999439
39576a5999439P077211J2494692O220767l239385n544667j090730K166226k99127
39568A785548n844159q916294n784193K662936J0438128J1179395N307600k37531
39560A0591430r97105M9731j135067k916744j831015P40351J044232q12142k737922
39551A995749n848399j0803021j1536463k055134J0883410J2861534K175335o359303
39543h686292l390545J358937k945258q390669j569221J1332435J2006127K98983
39535A4497m024610O327296J2880924Q77548j5946586j5836042j438404O809973
39527a0335404K446569j268607M141175J0025619O446061l100330q379773n157355
39519e182045K976361R314885Q397341J000857m852658l030725K322996L798737
$$ plain form
39576 -15999439 -8922228 3572464 9793231 6553846 1009179 -81551 2084675 1785548
39568 1785548 -4058611 -12974905 -18759098 -16096162 -5658034 5521361 10828961 10591430
39560 10591430 9594325 9644056 8508989 5592245 3761230 4501581 5545813 4733671 1995749
39551 1995749 -3852650 -14655671 -26192134 -28247268 -17363858 -4502324 -2326989 -8686292
39543 -8686292 -12076837 -10717900 -13663158 -22053827 -23623048 -12290613 -284486 14497
39535 14497 -4010113 2317183 15198107 16075655 129069 -15706973 -17145377 -10335404
39527 -10335404 -7888835 -9157442 -5016267 5009352 11455413 8355083 -24690 -5182045
39519 -5182045 -2205684 7109201 15506542 16507399 11654741 8624016 10947012 14745749
39511A4745749K500756L818116N201413K26584p218844o802092P8582R82709o420926
39502G112047r631761k625102L837634P61982m927328m299839r94378r70031j57829
39493a1894605N411319Q638902M039166O77851P188062J3560317N713489q999582
39485B4334919j0898891P56356O472897k263087j0446883m147948R122366J3678524
39477B6608253P134078r92475l988336k563659K18973J686394j52032m820574
39469B3130622r441721j1661520j0210663l929026N217667R999106N237815l709984
39461D632296o566323j477132M131309M882051K020837k100334n755625n263690
39453e496611M19230M234244K37155m321056Q48438R063775M193847j0512131
$$ plain form
39511 14745749 17246505 21064621 26266034 26492618 19273774 12471682 12550264 13532973 7112047
39502 7112047 -2519714 -5144816 -1307182 -545200 -5472528 -9772367 -10766745 -11736776 -11894605
39493 -11894605 -6483286 2155616 6194782 6872633 14060695 27621012 33334501 24334919
39485 24334919 13436028 14192384 20665281 18402194 7955311 3807363 12929729 26608253
39477 26608253 33742331 32749856 28761520 26197861 26416834 28103228 27951196 23130622
39469 23130622 13688901 2027381 -8183282 -12112308 -6894641 3104465 8342280 4632296
39461 4632296 -1934027 -3411159 720150 5602201 7623038 5522704 -232921 -5496611
39453 -5496611 -5077381 -843137 -605982 -4927038 -4078600 4985175 9179022 -1333109
39445a333109j1780425P877205K4266460J5601934m784589r079946L678982R447971
39437C3894483k541033j5947072j4294031l121578K018668l158254j0488769j1305170
39429b4942756k786098J1838715K3574842K2363013P177741j0182494j5323929
39422A1719034n231797R338052J4769234P167194n330074j2169430j1323692q949796
39414a1275r072495q207892k295262N510639Q388481M923649M63370L20440M549690
39405D569345Q651869P567440L81734p597300r547094m854241P82892L416716
39397C371361M427476N041875L460417J59170m27334K495001L244284p32530l156439
39388A7883281J002878O341379N540742J186104L46216K320183J317400k600874
$$ plain form
39445 -1333109 -13113534 -5236329 19030131 34632065 29847476 20767530 24446512 33894483
39437 33894483 31353450 15406378 1112347 -2009231 9437 -3148817 -13637586 -24942756
39429 -24942756 -27728854 -15890139 7684703 30047716 37225457 27042963 11719034
39422 11719034 6487237 15825289 30594523 37761717 32431643 20262213 8938521 -11275
39414 -11275 -9083770 -17291662 -19586924 -14076285 -5687804 -764155 -300785 19655 4569345
39405 4569345 13221214 20788654 21170388 13573088 4025994 -828247 -45355 3371361
39397 3371361 7798837 12840712 16301129 16460299 16032965 18527966 21772250 21039720 17883281
39388 17883281 18886159 25227538 30768280 31954384 32300600 34620783 35938183 33337309
39380C3337309n168946p107946j1115190j2571786n202922N321320O385939k020615
39372A857163n826949J618853R027464M399095p488151j2915885p476992J702808
39364a5102594P641383R783937J0145606Q899527M679337k502538q965301r367193
39356E212164l246073K535287J964045j727157j474581J961888J431215m090706
39348B566082o963571k495571M397110O664259L318562j799015m401758k072584
39340g86486L104461M998515J485231j014759K223179M677364m22849n562343
39332H702313m07317O986295M42304j4004720j2237951Q478515J9889755M628883
39324B2478077j6364897j6033737j5613Q616450O481298O507994R418021N507610
$$ plain form
39380 33337309 28168363 21060417 9945227 -2626559 -7829481 -2508161 3877778 1857163
39372 1857163 -3969786 -2350933 6676531 11075626 3587475 -9328410 -16805402 -15102594
39364 -15102594 -7461211 2322726 12468332 21367859 26047196 23544658 14579357 5212164
39356 5212164 1966091 4501378 6465423 4738266 3263685 5225573 6656788 2566082
39348 2566082 -4397489 -6893060 -2495950 4168309 7486871 5687856 1286098 -786486
39340 -786486 2317975 7316490 8801721 7786962 10010141 14687505 14264656 8702313
39332 8702313 8294996 15281291 15723595 1718875 -10519076 -2040561 17849194 22478077
39324 22478077 6113180 -9920557 -9936170 -1319720 5161578 11669572 21087593 26595203
39316B6595203j625933O65812Q784242O618680n599762j0089856j480744M841259
39308B8708901q94914r172455j0279126p852457o040498r94723O577926O795908
39300F848562k449208q430176k224301Q531751J2969961J0271822L447141o109847
39292B2855705j1802719n173552P220528P449758n461980j0403140J919327J1436476
39284A8040403R70437j4664138j2826604J070938O178139J356421J539142P887659
39276I552397P854096k4747n898386r154139j5262425j6305732q42988J9004546
39268a1077378J8608692P4462q888215L81832N012076p719520j7582591o731257
39260b7921899J0050556J1710635M286341L963675O114660k048682j2230317o738682
$$ plain form
39316 26595203 24969270 25635082 34419324 41038004 35438242 25348386 23867642 28708901
39308 28708901 27813987 18641532 8362406 509949 -5530549 -6525272 52654 6848562
39300 6848562 4399354 -4030822 -6255123 2276628 15246589 25518411 28965552 22855705
39292 22855705 11052986 5879434 13099962 20549720 15087740 4684600 6603927 18040403
39284 18040403 19010840 4346702 -8479902 -7408964 -1230825 125596 1664738 9552397
39276 9552397 17406493 17381746 11483360 2329221 -12933204 -29238936 -30081924 -11077378
39268 -11077378 7531314 7605776 -1282439 -900607 4111469 -3608051 -21190642 -27921899
39260 -27921899 -17871343 -6160708 -1874367 2089308 8203968 6155286 -6075031 -12813713
39252a2813713R095113J3505686L066524m814138k697490j453771o043531o752962
39244h908282J47373M314006J177863O91541P490902J0137881J206553p549559
39236H708278l289686P164318Q809014J173822m856218n892087o886748p378293
39228b447600j910115O499764P133286j783832q726151n389506J821037K560781
39220b242336k355816l891826J001456N633170M008569p22239r57461M796099
39212E269616R493237O313829k295232o839596k070869O481925Q944738K525068
39204B7822716n704716p019567k25112P488460P911433K97596p067955n206477
39196A8296378M552487J0320638L417624r614603j3848964m797458N750941N433727
$$ plain form
39252 -12813713 -3718600 9787086 12853610 8039472 5341982 3888211 -2155320 -8908282
39244 -8908282 -8760909 -4446903 -3269040 -2577499 4913403 15051284 16257837 8708278
39236 8708278 5418592 12582910 21391924 22565746 17709528 11817441 4930693 -2447600
39228 -2447600 -4357715 2142049 9275335 7491503 -1234648 -6624154 -4803117 -2242336
39220 -2242336 -4598152 -8489978 -7488522 -1855352 2153217 1430978 473517 5269616
39212 5269616 14762853 21076682 18781450 11941854 9870985 16352910 25297648 27822716
39204 27822716 22118000 15098433 14873321 22361781 30273214 30570810 23502855 18296378
39196 18296378 22848865 33169503 36587127 26972524 13123560 8326102 14077043 19510770
39188A9510770l096842p977214n192919j521054j492220q04728M240016Q776912
39180A2442721O742065P84096j983769q09779r13305l935312n472285j953269
39172D901163N385959J2903049J5948697R473192o163500k0801559k3300907j4975336
39164a6629242o966157m492218k790363P11970J672214j23760K984512J2380680
39156a3252364J6350121O847261o239060q570945j424267L718316M014857N067754
39148F511673O633587L545790j175788O29732O085301L514207p009674j0969868
39140G764960k337120N632525P19665r638227j0368284k24742R373871J0677752
39132A1600400N229297k139302o542128m165801K590757M934995j019730p531536
$$ plain form
39188 19510770 16413928 8436714 3243795 1722741 230521 -574207 3665809 12442721
39180 12442721 19184786 19968882 17985113 17175334 16262029 12326717 6854432 4901163
39172 4901163 10287122 23190171 39138868 48612060 42448560 21647001 -1653906 -16629242
39164 -16629242 -23595399 -28087617 -30877980 -30166010 -28493796 -28617556 -25633044 -13252364
39156 -13252364 3097757 9945018 3705958 -4864987 -6289254 -2570938 1443919 6511673
39148 6511673 13145260 16691050 15515262 16144994 22230295 25744502 18734828 7764960
39140 7764960 5427840 11060365 11780030 2141803 -8226481 -8451223 922648 11600400
39132 11600400 16829697 14690395 8148267 3982466 6573223 11508218 10488488 2956952
39124B956952o483709j662794j341072l955494j841757M119014N571435J828217
39116h09208J758537P981551J0435769J630100j0196310j1215145p55319Q196216
39108G026191O215843j734624m559436O86538O771753O850656K368274j126385
39100B2498810k212704l534358n393283m806523j379569J036508L02404r82179
39092E529106n87948j83848r76567n88946J917471K400650k122946p208679o395787
39083h217494m43556M120140L970654J509698l76139j220029q88027J464730N752124
39074E672101R914838J0094401K463462j1158185j9688074j2383755M860702J1788604
39066A564094q07740j6405934j3633309M949450J7841126J4268967M021244j742982
$$ plain form
39124 2956952 -3526757 -5189551 -6530623 -10486117 -12327874 -8208860 -2637425 -809208
39116 -809208 949329 8930880 19366649 20996749 10800439 -414706 -1170025 7026191
39108 7026191 13242034 11507410 6947974 7634512 14406265 21256921 23625195 22498810
39100 22498810 20286106 16751748 11358465 6551942 5172373 6208881 6511285 5529106
39092 5529106 4941158 4757310 3780743 3191797 5109268 7509918 5386972 -1821707 -8217494
39083 -8217494 -8661050 -4540910 -570256 939442 563303 -656726 -1544753 -80023 5672101
39074 5672101 15586939 25681340 28144802 16986617 -2701457 -15085212 -10224510 1564094
39066 1564094 756354 -15649580 -29282889 -24333439 -6492313 7776654 11797898 10054916
39058A0054916l680966m503048q19950P341216J0381487K355979p663714p517867
39050E948053K91066K837025m457713j2996659j4150421q749493k410348J883343
39042c1805147M353299O247110R289421J4175078J7911288J5213895M458609r159239
39034C0684314j7917670j8487032j3841969q892159n316056j231483M531603R340976
39026b1129476R219526L926572k037464m121724k480593r98194j630075j193560
39018b0444988M167764J1567189J2420274L800760n224612m569620K349315L754221
39010G820303j707516k959880L843954P045357j117498r530490n391076L934400
39002A937554K708996o646521q346245j462163j294561j0015109q871641J0676172
$$ plain form
39058 10054916 6373950 1870902 1050952 8392168 18773655 21129634 13465920 5948053
39050 5948053 6239119 9076144 4618431 -8378228 -22528649 -31278142 -33688490 -31805147
39042 -31805147 -27451848 -21204738 -11915317 2259761 20171049 35384944 39843553 30684314
39034 30684314 12766644 -5720388 -19562357 -28454516 -33770572 -35002055 -30470452 -21129476
39026 -21129476 -11909950 -7983378 -10020842 -14142566 -16623159 -17621353 -19251428 -20444988
39018 -20444988 -16277224 -4710035 7710239 11510999 6286387 1716767 4066082 7820303
39010 7820303 6112787 3152907 6996861 14042218 12924720 3394230 -1996846 1937554
39002 1937554 4646550 -1999971 -10346216 -11808379 -13102940 -23118049 -31989690 -21313518
38994b1313518K8109358K1315670j566290j4834567j0071847q99986J302395r85262
38986A055953k637845l218741j481608M928715J1632105R778638p49395r210435
38978A0097387q371109l361106k568177o234464q334543n206749J388670O872758
38970a5717333P381229L313506O0603J944251N519940L563617l771487p477111
38962e182785j756348P351305R093892P41174r981241j3138457n122530Q595832
38954i399158J7014320J2520333r18185j0540810q447600j88765L441554L85696
38946C867385k149138L14180L935217M322262K988469K271306K8471m770949o576527
38937D230676j302243M456737K313376k938497l29769O200888Q72886j5262161
$$ plain form
38994 -21313518 6795840 28111510 26545220 11710653 1638806 738820 2041215 1055953
38986 1055953 -1581892 -4800633 -6282241 -1353526 10278579 20057217 19307822 10097387
38978 10097387 1726278 -1634828 -4203005 -10437469 -18772012 -23978761 -22590091 -15717333
38970 -15717333 -8336104 -5022598 -4961995 -3017744 2502196 6065813 2294326 -5182785
38962 -5182785 -6939133 412172 9506064 10247238 265997 -12872460 -17994990 -9399158
38954 -9399158 7615162 20135495 19217310 8676500 228900 40135 3481689 3867385
38946 3867385 1718247 2032427 5967644 10289906 13278375 15549681 15578152 10807203 4230676
38937 4230676 2928433 7385170 9698546 6760049 6430280 12631168 13504054 -1758107
38929a758107j8219485L770998K6520655K0908144m806369j7700070q361749Q69467
38921A223484m100557r363672j696325Q379662O864042j66820j72386L901630
38913D869058K751242k18282L234095Q378125N185640k990069n423619l342498
38905A2443692o171506j2103636r738955J723361R810575P323556J00178m664436
38897a277171n545212j807637O651665J3334838J0568096J821641k228185q2060
38889B1435975k65881n455732q310733n001051p52980Q48601K606747M666650
38881I771596J977771n230586q710434m256438K387933N128932M446872K119414
38873G635060j930796m931721k396563L824205P404622Q015497R436633P755002
$$ plain form
38929 -1758107 -19977592 -16206594 10314061 31222205 26415836 8715766 354017 1223484
38921 1223484 -2877073 -12240745 -13937070 -5557408 1306634 1139814 967428 4869058
38913 4869058 7620300 7402018 10636113 19014238 24199878 21209809 15786190 12443692
38905 12443692 6272186 -5831450 -15570405 -13847044 -4036469 3287087 3387265 -1277171
38897 -1277171 -6822383 -8630020 -1978355 11356483 21924579 23746220 21518035 21435975
38889 21435975 21170094 15714362 7403629 2402578 1649598 2498199 5104946 9771596
38881 9771596 11749367 6518781 -2191653 -6448091 -4060158 1068774 5515646 7635060
38873 7635060 5704264 772543 -1624020 2200185 9604807 17620304 27056937 34811939
38865C4811939m085086j8224018j5803449M473410J8650202R116110j0656875
38858A8282233j6264484n405951M597578M214129L68801Q94455M474936O451058
38850A7612755M702840o45657o191475m976888N756441J7335295J6827404K226306
38842E2647021j3778487j6266285l088711J2171314J3076308j627270j5587610
38835B7546280j5013364o260909m111011p907254m817226M916009N925186m603286
38827d325575p927148O913104K3059780J9695025J139791j3630747j7734676j5820475
38819h630921q346724M552430J2090283N297504n368263l571880O818698Q466764
38811A1307891m56731m581396K177876Q456347N728130j070208n954387q833525
$$ plain form
38865 34811939 30726853 12502835 -3300614 1172796 19822998 28939108 18282233
38858 18282233 2017749 -3388202 1209376 5423505 5792306 6686761 11161697 17612755
38850 17612755 22315595 21669938 15478463 10501575 16258016 33593311 50420715 52647021
38842 52647021 38868534 22602249 19513538 31684852 44761160 43133890 27546280
38835 27546280 12532916 6272007 2160996 -5746258 -10563484 -5647475 277711 -4325575
38827 -4325575 -12252723 -5339619 17720161 37415186 38554977 24924230 7189554 -8630921
38819 -8630921 -16977645 -12425215 -334932 4962572 -405691 -3977571 2841127 11307891
38811 11307891 10851160 6269764 8447640 16903987 22632117 21561909 15607522 6773997
38803F773997p716751L77033Q766162P201756M6147J047444Q291680M673627j1827747
38794A7633348k0366345r504291L629562P55107q999456n933916Q289294J5485585
38786I88888R849194K808122K169782L250086J046874k091527k810659j328176
38778A3882584J374517L944080L014194k278961o035560k754108L437104M056898
38770A8640748j257915n317917m808836k905760j183010K461698O975037P434069
38762B0038114L422924R74281L033925M373877L09758m762886l297392L886383
38754B7978984Q243084N338968M12076J39335L216121L018064k626117q913830
38746C6806685j0908148q475018l898634P53419K542973q55753o026187n539100
$$ plain form
38803 6773997 -942754 -565721 8200441 15402197 15448344 16495788 24787468 29461095 17633348
38794 17633348 -2732997 -12237288 -8607726 -7852619 -16852075 -22785991 -14496697 988888
38786 988888 10838082 13646204 15815986 19066072 20112946 18021419 15210760 13882584
38778 13882584 15257101 19201181 22215375 19936414 13900854 11146746 14583850 18640748
38770 18640748 17382833 12064916 7256080 4350320 3167310 5629008 12604045 20038114
38762 20038114 23461038 24435319 27469244 31843121 32152879 27389993 24092601 27978984
38754 27978984 36222068 41561036 41973112 42112447 45328568 48346632 45720515 36806685
38746 36806685 25898537 17423519 13524885 14278304 16821277 15965524 9939337 4400237
38738D400237J608021O920989M289551j451859l852155n217103q590645o961724
38730h854688O008708J9216973J4781241m407629j4856354m659773J0274751J0130472
38722B7633701k366131j0255833o840474M92467M818358O217326O003892L559891
38714B9263197j000787n915740q747470o554480J169392Q521224Q203820K137655
38706B7076811o69775J168437r62160r457382j3927119p997992o70275r80810
38698f420265k781621K458586P905461K302007q495424q593968K553039R326818
38690a745367M420094k421906k593924l35864j536020l936020m414303n038037
38682a7601347n779041j180793Q902577J4117066P172166m061800o255998K053904
$$ plain form
38738 4400237 6008258 12929247 17218798 15766939 11914784 6697681 -1892964 -8854688
38730 -8854688 -2845980 16370993 31152234 26744605 11888251 7228478 17503229 27633701
38722 27633701 25267570 15011737 8171263 8663730 13482088 19699414 25703306 29263197
38714 29263197 28262410 22346670 13599200 7044720 8214112 16735336 24939156 27076811
38706 27076811 26407036 27575473 26613313 17155931 3228812 -4769180 -5439455 -6420265
38698 -6420265 -9201886 -6743300 1162161 3464168 -5031256 -13625224 -11072185 -1745367
38690 -1745367 2674727 252821 -2341103 -2676967 -4212987 -8149007 -12563310 -17601347
38682 -17601347 -23380388 -24561181 -15658604 -1541538 5630628 1568828 -4687170 -2633266
38674b633266J0598288J1931752Q231093M219531L13828m724209q539853o961419
38666A2435745r64869J919589l466466j1308337j0514714M19980J0636009J1577536
38658A0734473P240491M904329L423163j137358m872539j832052L817954L132215
38650B5410676k498262l724430K81610O79884m736055p214656k142285L787826
38642I844308M750941L533664K287911k562245r894310j0223494p12391P054947
38634D079331L996110j769589J611840J0427507J2641213P524499L556221J295832
38626D3362964n825626j4869271j3758140j235286P863547L195729o789285q467782
38618C476850j641775M103589M856419M595380N451590M935351K396226P57668
$$ plain form
38674 -2633266 7965022 19896774 28127867 32347398 32661226 27937017 19397164 12435745
38666 12435745 11470876 13390465 9923999 -1384338 -11899052 -11479072 -843063 10734473
38658 10734473 17974964 22879293 26302456 25165098 20292559 18460507 22278461 25410676
38650 25410676 22912414 19187984 19469594 20149478 15413423 8198767 6056482 9844308
38642 9844308 14595249 18128913 20416824 17854579 7960269 -2263225 -2975616 4079331
38634 4079331 8075441 6305852 7917692 18345199 30986412 38510911 42067132 43362964
38626 43362964 37537338 22668067 8909927 7674641 15538188 18733917 11944632 3476850
38618 3476850 1835075 5938664 10795083 15390463 20842053 25777404 28173630 28931298
38610B8931298O22345j392148o038866p749813j413546R272105J4338445Q922198
38602D5492018q43535n324542l073136j596168o035369j1253467r030799q57452
38594G477550K610017l675321j0804768p360096M336686J0732325N782855q48442
38586H250806J548414Q715888Q300830m41781m444515L464256J2461528Q377749
38578D6233175n774157j3334106o280789N255574P676071N67049n936006n722385
38570B2684426k600909k437932m410460k673021M610110J0842409P832467l402887
38562C0444203j1863151q587384K837673J0744651Q794916J264641m403853n988624
38554B3243072o062158o344009n177319l76413O489518R727868N197997l321590
$$ plain form
38610 28931298 29553643 28161495 22122629 14372816 12959270 22231375 36569820 45492018
38602 45492018 44648483 39323941 36250805 34654637 28619268 17365801 8335002 7477550
38594 7477550 10087567 6412246 -4392522 -11752618 -7415932 3316393 9099248 8250806
38586 8250806 9799220 18515108 26815938 26374157 21929642 25393898 37855426 46233175
38578 46233175 40459018 27124912 20844123 26099697 33775768 34342817 28406811 22684426
38570 22684426 20083517 17645585 13235125 10562104 15172214 26014623 33847090 30444203
38562 30444203 18581052 9993668 12831341 23575992 32370908 33635549 29231696 23243072
38554 23243072 17180914 10836905 5659586 5283173 11772691 21500559 26698556 23376966
38546B3376966o302548Q56710J1582152J5148272Q094382l706794j1918559j1858662
38538B5271919m643902L058739L858828k239497p294757o057408k472843j246322
38530H234757N78147O163651R505614M200379l250956j730208N854372O650418
38522C6206174n03970l756397J3382K2680o793928p685922K814763R432422k15278
38513B9533926j3477825j1258121K708037R875361N973076K310212L020443J303185
38505B9988294l182196k872464P92536k052483r549380p641901N119856J1502930
38497B2105192K851060n874955m61594R528425P872303j254292k099554N234127
38489C7900712O374608j613425n976423j231770J727997m987231j2968321j1722656
$$ plain form
38546 23376966 17074418 17931128 29513280 44661552 52755934 49049140 37130581 25271919
38538 25271919 20628017 23686756 27545584 25306087 18011330 11953922 9481079 8234757
38530 8234757 8812904 14976555 24482169 28682548 25431592 23701384 29555756 36206174
38522 36206174 35702204 31945807 31959189 31981869 25187941 17502019 20316782 29749204 29533926
38513 29533926 16056101 4797980 7506017 17381378 23354454 25664666 28685109 29988294
38505 29988294 26806098 23933634 24726170 22673687 13124307 5482406 10602262 22105192
38497 22105192 24956252 19081297 18619703 28148128 36020431 34766139 32666585 37900712
38489 37900712 44275320 42661895 36685472 35453702 37181699 32194468 19226147 7503491
38481G503491m231943R88339L784115P943862J0327118O052696j18412K99106
38473C2548372M457026J623827p945900j0808686j241722P862012L094282r820053
38465A9769158j4711194p061436L585986R460262J1221768J0248941N916603J410072
38457C9840160J495382K909733k012626r937816p702133N993491J3917654M760368
38449D9264213q367575p135208M463285Q289276J185164l243146l85152j964318
38441D2106539j2976086j9438023r195338Q203714J4398745O651604k030343k003985
38433B5716827M264102R779475J0216029M528679m294247r220779n451653L358862
38425C8897295R030968P925657K777200k223589m110749j321480M093559O288748
$$ plain form
38481 7503491 3271548 4259887 8044002 15987864 26314982 32367678 32249266 32548372
38473 32548372 37005398 38629225 30683325 19874639 18632917 26494929 29589211 19769158
38465 19769158 5057964 -2003472 1582514 11042776 22264544 32513485 38430088 39840160
38457 39840160 41335542 44245275 42232649 32294833 24592700 30586191 44503845 49264213
38449 49264213 40896638 33761430 38224715 46513991 47699155 44456009 44070857 42106539
38441 42106539 29130453 9692430 497092 8700806 23099551 29751155 27720812 25716827
38433 25716827 29980929 39760404 49976433 54505112 50210865 40990086 35538433 38897295
38425 38897295 47928263 55853920 58631120 56407531 52296782 50975302 55068861 61357609
38417F1357609K220405l419430m457313k205144k681364o628971q576445n303647
38409C0305700O89183N953027Q566970O372158n08092n344811r22334Q558979
38401E3670780J0379903J423579n824608j444959O588562M672822n457239j0130195
38393E3878645n105425l44402k450264n098344j658401L543116L771880J208511
38385D7745316J331326K517725M33190k124181L58583N251007N690475L091776
38377F4295217M474709Q217568N275346l751057o516634J045353O063566j303093
38369G7800975j1231712r449329K64181L098783l093846o577923k046429L229762
38361E1994462M760764P735968J4000638J4697698L398191j1934683j7674622
$$ plain form
38417 61357609 63578014 60158584 55701271 53496127 50814763 44185792 35609347 30305700
38409 30305700 30994883 36947910 45514880 51887038 51378946 46034135 45111801 53670780
38401 53670780 64050683 65474262 59649654 58204695 64793257 69466079 64008840 53878645
38393 53878645 48773220 48428818 45978554 40880210 39221809 42764925 46536805 47745316
38385 47745316 49076642 51594367 52027557 49903376 50261959 55512966 61203441 64295217
38377 64295217 68769926 76987494 82262840 78511783 71995149 73040502 79104068 77800975
38369 77800975 66569263 57119934 57384115 60482898 57389052 50811129 48764700 51994462
38361 51994462 56755226 64491194 78491832 93189530 96587721 84653038 66978416
38354F6978416j0301703J714018P793520L883265m489418o199089L204727J3270601
38346G5854337J0713969m22751k657163Q013142J3734835J607642j5111902j5831492
38338G5900617j952324Q508218Q330901N556077M238409n66743p677861p244584
38330H5092710K031992Q012600L528709l239255l375677J1435J379797L400777
38322I6843088Q347578R136903N68360q291825n377210N852370J1120710N312502
38314A23512476l323929o537517l136425N099927J3741608J3715834Q28137j3075307
38306A30824804j0914243O106892J8128273J2883873j09410o667942o722589p610624
38298A35919034r104904o239347o62181J690037R82858K593375P891394J2971894
$$ plain form
38354 66978416 56676713 58390731 66184251 70067516 65578098 59379009 62583736 75854337
38346 75854337 86568306 86145555 83488392 91501534 105236369 106844011 91732109 75900617
38338 75900617 73948293 82456511 90787412 96343489 100581898 100015155 92337294 85092710
38330 85092710 87124702 95137302 98666011 95426756 92051079 92062514 93442311 96843088
38322 96843088 105190666 114327569 114895929 106604104 101226894 107079264 118199974 123512476
38314 123512476 120188547 113651030 110514605 115614532 129356140 143071974 143900111 130824804
38306 130824804 119910561 126017453 144145726 157029599 156920189 150252247 143529658 135919034
38298 135919034 126814130 120574783 119912602 121602639 122585497 125178872 133070266 146042160
38290A46042160J4364638J0288490K5580j1480785j3178133p88365J3322058J3059408
38282A71655051j49356r027891l522815P540854J0079442J845953p609962q600168
38274A62211108o8878J0056889J2677010P969342N320364R219969J1061064K610982
38266B21057850q589029r073269l91978M224614K112383L374231R696389R209038
38258B31620229j920092j0064552n121114M265041O471284L800045K664244O60133
38250B32375218m084734l916774M065457P757430k06640n618597N365079J9440474
38242B55176913J4337124m667318j1928681j124158Q424609N055549j665370m152117
38234B59456551p992287j2866823o593926J1256613K1518051J3381852O49234
$$ plain form
38290 146042160 160406798 170695288 170720868 159240083 146061950 145273585 158595643 171655051
38282 171655051 171505695 162477804 158954989 166495843 176575285 178421238 170811276 162211108
38274 162211108 162142230 172199119 184876129 192845471 198165835 207385804 218446868 221057850
38266 221057850 212468821 203395552 203003574 207228188 209340571 212714802 222411191 231620229
38258 231620229 229700137 219635585 214514471 218779512 225250796 229050841 231715085 232375218
38250 232375218 228290484 224373710 228439167 236196597 235989957 230371360 235736439 255176913
38242 255176913 269514037 264846719 252918038 251793880 260218489 265274038 263608668 259456551
38234 259456551 251464264 238597441 232003515 243260128 264778179 278160031 278809265
38227B78809265k514365k445216p779094r774028J95436R800565M238248o550422
38219B63980389k105527J4945017K2330745J1438092l907240j0729530r771616
38212B86180330m910541K335441O223447J177909n420161p65025J1188158J2225666
38204C08235224j444140j0888852k665579J1066082J2038256K144467l777299
38197C14708159k175758k281372p413813r644413m182694K668680L956015K000110
38189B97634914K096514J906964m839067j5064344j5535208l45551J6680132J6261760
38181B98796114q93532j3649570q515374K973546K596259q720276j5405124j1112754
38173B46069289l766104O07704M012253N660396O1849r770336j0958374L21478
$$ plain form
38227 278809265 276294900 273849684 266070590 256296562 256491998 266292563 270530811 263980389
38219 263980389 261874862 276819879 299150624 310588716 306681476 295951946 286180330
38212 286180330 281269789 283605230 289828677 291006586 285586425 284821400 296009558 308235224
38204 308235224 306791084 295902232 293236653 304302735 316340991 318485458 314708159
38197 314708159 312532401 310251029 302837216 293192803 289010109 291678789 295634804 297634914
38189 297634914 299731428 301638392 296799325 281734981 266199773 265854222 282534354 298796114
38181 298796114 297902582 284253012 275737638 278711184 281307443 272587167 257182043 246069289
38173 246069289 242303185 242910889 246923142 252583538 252645387 242875051 231916677 232238155
38165B32238155J0253942O426494m445567p903287k641626J614637J246873P98068
38157B37587689O03545m323896j2180264j3438048n886160K5029k839536n928440
38149A93619919K067772J5578070J7194212J978845j4565158j6983735q907777
38142A89982148l860463m135711o70313Q059383J0671842Q90616j0456339j0228962
38134A80252201k026919M58777n193962p838547j756595M273772J381137n534077
38126A64015787n809103Q18776M495668k9972o667442p704725m588855m404399
38118A40125735p796440o466982M642701J7026051J6631172J740502j3603805
38111A52298934j6226422q160970q16793k47165l558392n799754m117884K276677
$$ plain form
38165 232238155 242492097 248918591 244473024 236569737 233928111 235542748 236789621 237587689
38157 237587689 238191234 233867338 221687074 208249026 202362866 202387895 199548359 193619919
38149 193619919 195687691 211265761 228459973 230438818 215873660 198889925 189982148
38142 189982148 186121685 181985974 181315661 189375044 200046886 200937502 190481163 180252201
38134 180252201 178225282 178684059 173490097 165651550 163894955 168168727 169549864 164015787
38126 164015787 158206684 159025460 163521128 163491156 156823714 149118989 144530134 140125735
38118 140125735 132329295 125862313 130505014 147531065 164162237 165902739 152298934
38111 152298934 136072512 127911542 127094749 126847584 123289192 117489438 113371554 115648231
38103A15648231J0067241J1706095L568657p045067r204236k018709M747215L501691
38095A30971118l083754p040730l919557L209576N700586k475859j5330061j8203601
38087H9827718n831423Q425248R288783J68195l544312K332825P541928O073672
38079A14282634L529924L617473J428672m643685o978031j959704J668387l607869
38071A07337801j0809397q484027J976019Q658388N506270k039311o541116o993123
38063H8611504p194292r654169j2338708j0992195m859860J708799N412747Q268115
38055E8961941J1477850J0128986J866258m200507J093554R981074O756283p057215
38047H9008224j3423590o240424p10991p360266j4704133r164548L230017Q845645
$$ plain form
38103 115648231 125715472 137421567 140990224 133945157 124740921 122722212 127469427 130971118
38095 130971118 127887364 120846634 116927077 120136653 125837239 123361380 108031319 89827718
38087 89827718 83996295 92421543 101710326 101878521 98334209 100667034 108208962 114282634
38079 114282634 117812558 121430031 122858703 118215018 111236987 109277283 110945670 107337801
38071 107337801 96528404 88044377 90020396 98678784 104185054 102145743 95604627 88611504
38063 88611504 81417212 71763043 59424335 48432140 43572280 45281079 50693826 58961941
38055 58961941 70439791 80568777 82435035 78234528 79328082 89309156 96065439 89008224
38047 89008224 75584634 69344210 68633219 61272953 46568820 37404272 40634289 49479934
38039D9479934P393113O044817L438229m325472j0084835m785891N345767O762215
38031E9267877l68211m418950k267294j236662k767776j66170O370257P261992
38023F1675063o88376q262546p448580j321741L083638L579259J677652o44177
38015E1650192j228605m6911p84449m829611o515497j528002L741356R03108n488686
38006C5872895l448902P000327J2419732N606272m904676q449525n494902k735357
37998C5865864k480494j699234K664804R775906J3589091P095555p527848j6609964
37990D0673680j0242295L447409Q417223K382023k486921O83954N092146L394145
37982E1361364j529453k735008J298581O227253O038667k138074j2833546j5066983
$$ plain form
38039 49479934 56873047 62917864 66356093 62030621 51945786 47159895 52505662 59267877
38031 59267877 58899666 54480716 52213422 50976760 48208984 48042814 54413071 61675063
38023 61675063 60986687 52724141 45275561 43953820 47037458 50616717 52294369 51650192
38015 51650192 50421587 50374676 49590227 44760616 38245119 36717117 40458473 41361581 35872895
38006 35872895 32423993 39424320 51844052 57450324 52545648 44096123 38601221 35865864
37998 35865864 33385370 31686136 34350940 44126846 57715937 64811492 57283644 40673680
37990 40673680 30431385 33878794 42296017 44678040 42191119 42875073 47967219 51361364
37982 51361364 49831911 47096903 48395484 54622737 60661404 58523330 45689784 30622801
37974C0622801o274547K266883J987448Q44723Q361527J5669541Q162282q026688
37966E3613970j3284074n721716k288155q049881q919513J10328M541702k437282
37958A7565379o261432K278711Q739366L71569r451032k293789J4379209J8454079
37950D3782060N853011p474385r886172l589158M959001R658636M872382o517781
37942D1657594j1375306l999730L250864l83084m929640L127012J4937052J1462110
37934E3746872m873848j3130911o402694L51722l492887j0244677j0317510n332371
37926C03696M91967P212943J2155692R227785K81430m672699k651882j276964
37918B1071968l719467l203270K573170N068836J74753k721995L574664R864602
$$ plain form
37974 30622801 24348254 26615137 28602585 29447308 37808835 53478376 61640658 53613970
37966 53613970 40329896 34608180 32320025 24270144 15350631 15460959 20002661 17565379
37958 17565379 11303947 13582658 22322024 22693593 13242561 10948772 25327981 43782060
37950 43782060 49635071 42160686 32274514 28685356 33644357 43302993 48175375 41657594
37942 41657594 30282288 26282558 29533422 29150338 24220698 27347710 42284762 53746872
37934 53746872 48873024 35742113 29339419 29691141 26198254 15953577 5636067 303696
37926 303696 795663 8008606 20164298 29392083 29673513 25000814 22348932 21071968
37918 21071968 17352501 14149231 16722401 21791237 21965990 19243995 22818659 32683261
37910C2683261L536754j1129945j7408707q071961O726080J3099539P949616q24659
37902B6559978l951161O37651O820209P256837J319595m907043n937312k134195
37894B5664559J881505J913956k051430n092489k239845M141174N644296l81758
37886B9479968n566689k622647K745225M17071p733364j0431446m354012K099253
37878D033359K968072J834433K127508N64012m676775p408931j677349Q443430
37870F207759J3438867J0243029M658524K699277L284664J118351m333314o201909
37862C1115248N8672P088970L625026p674102j1166045j294284P367240J929777
37854C1050502q702824q588335L93227M963782M294893P954636J3799766R245209
$$ plain form
37910 32683261 36220015 25090070 7681363 -390598 6335482 19435021 27384637 26559978
37902 26559978 22608817 23246468 30066677 37323514 38643109 33736066 27798754 25664559
37894 25664559 27546064 29460020 27408590 22316101 20076256 24217430 29861726 29479968
37886 29479968 23913279 21290632 24035857 24452928 16719564 6288118 1934106 4033359
37878 4033359 7001431 8835864 10963372 11527384 6850609 -558322 -2235671 6207759
37870 6207759 19646626 29889655 34548179 37247456 40532120 41650471 37317157 31115248
37862 31115248 31173920 38262890 41887916 34213814 23047769 21753485 29120725 31050502
37854 31050502 22347678 13759343 14152570 19116352 23411245 31365881 45165647 54410856
37846E4410856m555413j0767980l585805K761120j409051o480671l182332M00145
37838B7590869n390358j2946287r380773K254113Q341368N087531L65738r40308
37830A4981893j695900m157829o136789n540714k917561K41250K695087M380654
37822A850091O768302Q955515N031038p526562j8263706j3257707M694044J6986059
37814E237074J3017789J269230o539989q958640p630270r77003P548789Q299566
37806A1266546O69036l540404J30618N83716p636757j1624797k175196P691711
37798d635527L681179m575660J15818J2136790J2087119n85028p560976k017043
37790H646672L142260j203833p964607q338403k989307M389835J1347747J2795614
$$ plain form
37846 54410856 49855443 39087463 35501658 38262778 36853727 30373056 27190724 27590869
37838 27590869 22200511 9254224 -126549 2127564 10468932 15556463 15922201 14981893
37830 14981893 13285993 9128164 2991375 -2549339 -5466900 -5225650 -2530563 1850091
37822 1850091 8618393 17573908 22604946 15078384 -3185322 -16443029 -11748985 5237074
37814 5237074 18254863 19524093 12984104 4025464 -3604806 -4581809 2966980 11266546
37806 11266546 11935582 8395178 8525796 9109512 1472755 -10152042 -12327238 -4635527
37798 -4635527 -954348 -5530008 -5414190 6722600 18809719 18224691 10663715 8646672
37790 8646672 11788932 10585099 2620492 -5717911 -8707218 -4317383 7030364 19825978
37782A9825978N393806l616316m334082j67147k273884r211034q042444L209224
37774G84101J0650865N821571k820453m627962k21723M582033O912034M702962
37766B5783428l024221j0255904q377601R88929P326249O473277L853767K401580
37758B5169504l20408k716983n76772J706289l543429j0225006m486906R861977
37750A4868266J2132659l054762j5007517q186879N338527P524720P62199k631861
37742A1745352k147737l411444l020804L661299R147402M826151k836863k902226
37734A5061130J234664M1277k745106K786218J1535347Q827504m683629j2304732
37726A9752673o770566O29622j26479l952489k268553L445593O185816L505779
$$ plain form
37782 19825978 25219784 21603468 17269386 17102239 14828355 5617321 -2425123 784101
37774 784101 11434966 17256537 14436084 9808122 9586399 14168432 21080466 25783428
37766 25783428 22759207 12503303 4125702 5114631 12440880 18914157 22767924 25169504
37758 25169504 24849096 22132113 21555341 23261630 19718201 9493195 5006289 14868266
37750 14868266 27000925 23946163 8938646 751767 6090294 13615014 14377213 11745352
37742 11745352 9597615 6186171 3165367 6826666 15974068 20800219 17963356 15061130
37734 15061130 16295794 16337071 13591965 16378183 27913530 36741034 32057405 19752673
37726 19752673 12982107 13611729 13485250 9532761 7264208 10709801 16895617 20401396
37718B0401396j849033n821399n138953l85813K795812N78677k848369k173630
37710E558688n05116l246813o144243j208015P395809P310385j223589l478146
37702D458960O291271J3973471O650330p689462j2860221p898130m344466n259642
37694f677889j895503Q264585J4076725P292804l447797m319797L452358N712429
37686B2457915l133802j1691243q625214J219376N541103K564971k87676j670206
37678F375224p162821j4754100j3341912l62490J1311299J1251909N609511M500236
37670C426856M971561j755867j2670256j5424470n749802Q305497J7893315J9841869
37662A8838703J3599148J433879q874999j0232171n165560j608978j136187R93465
$$ plain form
37718 20401396 18552363 12730964 7592011 7206198 10002010 10580687 7732318 5558688
37710 5558688 5053572 1806759 -4337484 -5545499 1850310 9160695 7937106 4458960
37702 4458960 10750231 24723702 31374032 23684570 10824349 2926219 -1418247 -6677889
37694 -6677889 -8573392 -308807 13767918 21060722 17612925 13293128 16745486 22457915
37686 22457915 19324113 7632870 -992344 227032 5768135 8333106 8045430 6375224
37678 6375224 -787597 -15541697 -28883609 -29246099 -17934800 -6682891 -1073380 3426856
37670 3426856 8398417 6642550 -6027706 -21452176 -27201978 -18896481 -1003166 18838703
37662 18838703 32437851 33871730 24996731 14764560 9599000 7990022 6853835 7847300
37654G847300N497404P177315L320016l091744q355361j0383965p766236k483034
37646h238305o26003l786902m064008M005310J1664895P230147m853666r437164
37638h105696l207620K375486R44589n63208L417062P619319O343895K489540
37630A1313367R44564J607395K832560L936868K208662m014765q540818l938598
37622F349235M401672L142044q330227j5704449j1396279l929351r53384J747978
37614b4672761P184249Q485099L003631Q82991Q001537J3218948N712145o242080
37606A5573759q220642k209392j099000p381446j2167947j0880361o379988j65237
37598c2930254O994189R204822K634402m478685j212050R039814J2862545O227231
$$ plain form
37654 7847300 13344704 20522019 23842035 20750291 12394930 2010965 -5755271 -8238305
37646 -8238305 -8864308 -12651210 -16715218 -12709908 -1045013 6185134 1331468 -8105696
37638 -8105696 -11313316 -8937830 -7993241 -8556449 -5139387 2479932 8823827 11313367
37630 11313367 12257931 13865326 16697886 20634754 22843416 18828651 10287833 6349235
37622 6349235 10750907 13892951 5562724 -10141725 -21538004 -25467355 -26420739 -24672761
37614 -24672761 -17488512 -9003413 -5999782 -5116791 2884746 16103694 21815839 15573759
37606 15573759 7353117 5143725 4044725 -3336721 -15504668 -26385029 -32765017 -32930254
37598 -32930254 -25936065 -16731243 -14096841 -18575526 -19787576 -10747762 2114783 8342014
37590H342014k144805n520298n581272m426519j365781J348103o60950n921394
37582a5930902p753478l387128M026745J1135900J5418175J3320449N183408j196036
37574B0817133m18311J067762m780178j2386922j0092093M4843M217418j561191
37566c091539o203640k195309L856941L837065Q5254q34277J982300M903211M682282
37557G022288k39426p657563j0502981m484732M058199N849679K398057K163068
37549a393411M914326K453544m885727o213279K387479J0941260J0627146M576950
37541B3408288q68527n090175q445743q169218l944529K48372K661396M246066
37533D045930K453211m894464j0132812l854949P148693O311374o274097j2349041
$$ plain form
37590 8342014 6197209 676911 -4904361 -9330880 -10696661 -9348558 -10009508 -15930902
37582 -15930902 -23684380 -27071508 -23044763 -11908863 3509312 16829761 22013169 20817133
37574 20817133 20398822 21466584 16686406 4299484 -5792609 -5747766 -1530348 -3091539
37566 -3091539 -9295179 -11490488 -7633547 -3796482 -3711228 -4545505 -2563205 2340006 7022288
37557 7022288 6782862 -874701 -11377682 -15862414 -11804215 -5954536 -3556479 -1393411
37549 -1393411 3520915 5974459 1088732 -5124547 -2737068 8204192 18831338 23408288
37541 23408288 22539761 17449586 9003843 834625 -3109904 -2861532 -200136 4045930
37533 4045930 6499141 1604677 -8528135 -12383084 -5234391 1076983 -5197114 -17546155
37525a7546155m816289K109317p3905O20715J1322619J6054115J678868j6039528
37517f690243j4649134K21889N898995j063426m027312L124413P914420J835730
37509g434668q069882j1736610o051049O632523J7695242J4652048k183581j2609869
37501i105846k305635J2964488R330464p326675j1178441R49742O898660k34542
37493g785j382604J0558570J4094000l773987k1531351j5419861L863623J0100389
37485c499006J030807n288333k437255K68562l11887K370135P628859O307223
37477F069105k216130p122155k619631M393033N211075p56898p722297r071260
37469a3835158k883086L562017L14759r016420p389148J0115976K2812937J1771181
$$ plain form
37525 -17546155 -22362444 -20253127 -20327032 -19706317 -8383698 7670417 9349285 -6690243
37517 -6690243 -21339377 -21117488 -15218493 -16281919 -20309231 -17184818 -9270398 -7434668
37509 -7434668 -15504550 -27241160 -33292209 -26659686 -8964444 5687604 3504023 -9105846
37501 -9105846 -11411481 1553007 10883471 3556796 -7621645 -6671903 226757 -7785
37493 -7785 -1390389 9168181 23262181 19488194 -2043157 -17463018 -13599395 -3499006
37485 -3499006 -2468199 -7756532 -10193787 -9925225 -10237112 -7866977 -238118 6069105
37477 6069105 3852975 -3269180 -5888811 -1495778 3715297 2958399 -4763898 -13835158
37469 -13835158 -16718244 -13156227 -12841468 -21857888 -29247036 -19131060 3681877 15453058
37461A5453058r638650j3157036K443264J1112740J187615q637270k628509O753249
37453B888461J870005j0240057j0223945K549354J1095737P927968K585885K283336
37445A0736744J584300m225013q534385l989269M469868O040279R8596k584741
37437C596379M484634J3113921J0198853m679537j7219223j5321871l103446O010353
37429b919937O458935M383973N557523P236965M480364j586490n991033o531989
37421A1088311m442129j518430J01410j632031n072894m853132P60962N837288
37413B69355M850659J562934L449732R170562R418576J064181p138055o387993
37405A6259951M20950L535587p98743p203893q886097m263092K920718O626653
$$ plain form
37461 15453058 5814408 -7342628 -4899364 6213376 7400991 -1236279 -3864788 2888461
37453 2888461 4758466 -5481591 -15705536 -13156182 -2060445 5867523 8453408 10736744
37445 10736744 12321044 8096031 -438354 -4427623 42245 6082524 6181120 3596379
37437 3596379 8081013 21194934 31393787 26714250 9495027 -5826844 -8930290 -2919937
37429 -2919937 3538998 7922971 13480494 20717459 25197823 23611333 17620300 11088311
37421 11088311 6646182 5127752 5229162 3597131 -1475763 -6328895 -5567933 269355
37413 269355 5120014 6682948 10132680 19303242 28721818 29785999 22647944 16259951
37405 16259951 16680901 20216488 19417745 12213852 3327755 -935337 1985381 8612034
37397H612034K944241n149164r027884m346768K038326M03752p687438j0718118
37389b2931019l953545L009546l8669r048971j1359471k469316R918625J6665155
37381b0207665J5086377O975713l951622j1509406j0242101j653692O880269J0653324
37373g968803J0911793R283259M819626j467096m900124l241445m3425R17107
37365H310892J12971j289980l966581n953098j821827Q174776J3655514O260892
37357B3483559p187665j1790559l671729N704740N154825k804350o894934j644005
37349C49882O073301M843757p292344j7968470j3313221L908566J5147338Q685786
37341D34595n148423q155634J676183R622426N224748o196852j3476394j2101704
$$ plain form
37397 8612034 11556275 6407111 -2620773 -6967541 -4929215 -4525463 -12212901 -22931019
37389 -22931019 -26884564 -23875018 -23913687 -32962658 -44322129 -46791445 -36872820 -20207665
37381 -20207665 -5121288 1854425 -2097197 -13606603 -23848704 -25502396 -18622127 -7968803
37373 -7968803 2942990 12226249 17045875 15578779 10678655 7437210 7393785 8310892
37365 8310892 8423863 7133883 3167302 -2785796 -4607623 3567153 17222667 23483559
37357 23483559 16295894 4505335 833606 6538346 11693171 8888821 1993887 349882
37349 349882 6423183 11266940 3974596 -13993874 -27307095 -23398529 -8251191 434595
37341 434595 -4713828 -12869462 -11193279 -1570853 3653895 -2542957 -16019351 -28121055
37333b8121055m556787M562965J0662749J1324274Q525144N322518R70054n758826
37325B931036j0253466o764950J094870L549700n15706j546721M984197J0787793
37317D266753P882909N67787k709533k073782k753215m499268l167111N16823
37309a968637J907832M38608k13221J169673K387709K654920L121957L342316
37301A2841157J868277l96575j442434j525870j577655k50184L071733M453565
37293A7042014o5945p415450j0410598p152346k250031R12613L223788M490413
37285a625542J438091n797906j0060649n046915N045340Q739493J315068p891711
37277a3884731n664316Q626793K1200327K0062670Q301660k794739q934090j3446664
$$ plain form
37333 -28121055 -32677842 -28114877 -17452128 -6127854 2397290 7719808 8689862 2931036
37325 2931036 -7322430 -14087380 -12992510 -9442810 -9958516 -11505237 -6521040 4266753
37317 4266753 12149662 12717449 10007916 7934134 5180919 681651 -2485460 -1968637
37309 -1968637 -60805 377803 164582 1334255 3721964 6376884 9498841 12841157
37301 12841157 14709434 14312859 12870425 11344555 9766900 9516716 12588449 17042014
37293 17042014 16976069 9560619 -849979 -8002325 -10252356 -9339743 -6115955 -1625542
37285 -1625542 -187451 -5985357 -16046006 -21092921 -16047581 -7308088 -5993020 -13884731
37277 -13884731 -19549047 -10922254 10278073 30340743 38642403 35847664 26913574 13466910
37269A3466910j5862630j0933095l56783N613201K793809n85703J897471M123611
37261A56791q65890p433863o210433N23340L799652K910350L332182M123410M25646
37252G61185m570932l994301j582961o538783j4614136j1163441M383958J4453808
37244b2865603R517426J471557K175222N054867N72190m549248K23395Q364202
37236c5992O061157l926696p005531j945367j885543r640108j1545990j297038
37228c1221108P903689M739259j254435M657337J7724352J9781393N689096j0367231
37220A7652352j4831486r160063k072277K483339N122350O085742N769013N649484
37212A6698454M740272m95347q878650j2135417n128754N698960J0393752Q350557
$$ plain form
37269 13466910 -2395720 -13328815 -13685598 -8072397 -5278588 -5864291 -3966820 156791
37261 156791 -709099 -8142962 -14353395 -13830055 -10030403 -7120053 -3787871 335539 761185
37252 761185 -3809747 -7804048 -9387009 -15925792 -30539928 -41703369 -37319411 -22865603
37244 -22865603 -13348177 -11876620 -9701398 -4646531 -4074341 -8623589 -8400194 -35992
37236 -35992 6025165 2098469 -4907062 -6852429 -8737972 -18378080 -29924070 -31221108
37228 -31221108 -23317419 -18578160 -19832595 -15175258 2549094 22330487 28019583 17652352
37220 17652352 2820866 -6339197 -8411474 -5928135 -805785 5279957 11048970 16698454
37212 16698454 21438726 20943379 12064729 -70688 -5199442 499518 10893270 19243827
37204A9243827N561654K334071n755541j5071488j4343597j976324Q089619M882608
37196B964829m395479o487148j575886L71636k616161k886935K586940P947435
37188d090769Q576462N572139J44196o636648q844673j668044O960897L275859
37180C289419j1000741j7421364o359250Q880845J1455624L143034k892288k042383
37172a2947104O14472K331785L956119L457659q37087l546400J066807Q054837
37164B151088P381763q88492o601007m271482J116767L500879K759756J016031
37156F165303j284638l721152m982682m643142l034726m76119J050750j015309
37148a1941715m052616j278331O856451R737922K182659n398864k648718L230723
$$ plain form
37204 19243827 24805481 27139552 21384011 6312523 -8031074 -10007398 -1917779 2964829
37196 2964829 -1430650 -7917798 -9493684 -9122048 -11738209 -14625144 -12038204 -4090769
37188 -4090769 4485693 10057832 10202028 3565380 -5279293 -6947337 13560 3289419
37180 3289419 -7711322 -25132686 -31491936 -22611091 -11155467 -8012433 -10904721 -12947104
37172 -12947104 -12332632 -10000847 -6044728 -2587069 -3424156 -6970556 -5903749 2151088
37164 2151088 9532851 8644359 2043352 -2228130 -1111363 2389516 5149272 6165303
37156 6165303 4880665 1159513 -3823169 -8466311 -11501037 -11977156 -10926406 -11941715
37148 -11941715 -15994331 -17272662 -10416211 -678289 1504370 -3894494 -6543212 -3312489
37140c312489o52160j0334115j1269881l054696J294543k19364M022468J4275528
37132i250166J4155808q91047j0790680n90350J4342289J0781703p154630j5282588
37124d679661n058971P909960R762820M825913K616917K493776j499157q322332
37116H049265r970515k398777P402845P644159l414685j1883536m249337J2307556
37108C486975J6625379L035779r617698n926814L667016J873817o715957n213659
37100A214838M899568N682167n313908q502649N582355J8332130J0191959r401893
37092B2684567j5547330k826426J0079700Q410418j267169m926907q90884J551214
37084A7267183k385953p119407o225286j663101m9433k815706m883065k733709
$$ plain form
37140 -3312489 -3964649 -14298764 -25568645 -28623341 -27328798 -27548162 -23525694 -9250166
37132 -9250166 4905642 4014595 -6776085 -7366435 6975854 17757557 10602927 -4679661
37124 -4679661 -9738632 -1828672 7934148 12760061 15376978 17870754 16371597 8049265
37116 8049265 -1921250 -4320027 3082818 10726977 7312292 -4571244 -8820581 3486975
37108 3486975 20112354 23148133 13530435 7603621 11270637 13144454 6428497 1214838
37100 1214838 6114406 11796573 6482665 -2019984 3562371 21894501 32086460 22684567
37092 22684567 7137237 4310811 14390511 22800929 21533760 16606853 15715969 17267183
37084 17267183 14881230 7761823 1536537 -126564 -175997 -2991703 -7874768 -10608477
37076a0608477J039277K546442J518689o70860l415265m567835o34191O845737
37068g946483J0040382N019321j332231n27393N468809Q069477M488627q05407
37060B2475102m271962n700215m698583j696574k00303j752158k098994J020679
37052C076992J649355m087786p802610r30773Q646458P098384k000993k502924
37044C146103O877018R420634j948465j3152071j1910841m323701M17796M834280
37036f639247J1408487J1787201J337006q842367q624478n262710q040147q909784
37028b1786039L044922J7605274J5209426k162830j2995136p873400J002782L403546
37020d551455M374693Q414879P926055k898126j5107731j6404337p965564j056603
$$ plain form
37076 -10608477 -9569200 -7022758 -5504069 -6174929 -9590194 -14158029 -14792220 -7946483
37068 -7946483 2093899 7113220 5780989 5253596 10722405 18791882 23280509 22475102
37060 22475102 18203140 12502925 7804342 6107768 5907465 4155307 2056313 3076992
37052 3076992 4726347 638561 -7164049 -8094822 551636 7650020 5649027 3146103
37044 3146103 10023121 19443755 17495290 4343219 -7567622 -11891323 -11473527 -6639247
37036 -6639247 4769240 16556441 17893447 9051080 426602 -4836108 -12876255 -21786039
37028 -21786039 -18741117 -1135843 14073583 11910753 -1084383 -8957783 -7955001 -4551455
37020 -4551455 -176762 8238117 16164172 13266046 -1841685 -18246022 -26211586 -27268189
37012b7268189j509502m714948l757429K516507R185626J0984261Q084799N093647
37004a385228M100983K637165O0657l38153Q75423k332879r207069q337304M033241
36995i893164J2408184L441807j0169636o634608R605441J2705026m183662j7874936
36987a0595548j1360893J790152J882510o723944o429106N151561J4550863J3458598
36979A724193O119731l62027k120735J755720O910648M834671o249869j5861371
36971c249039j3545145k367560O072988N574852r86387o529226l822901Q409439
36963a0442979J9040934J3269051o409220j8593982j0486280M244904N979430
36956c398142l377017p544145j806354M488420O109351O268974N309364M91968
$$ plain form
37012 -27268189 -28777691 -33492639 -37250068 -34733561 -25547935 -14563674 -6478875 -1385228
37004 -1385228 2715755 5352920 5413577 5075424 5950847 3617968 -5589101 -13926405 -9893164
36995 -9893164 2515020 5956827 -4212809 -10847417 -1241976 11463050 7279388 -10595548
36987 -10595548 -21956441 -20166289 -18283779 -25007723 -31436829 -26285268 -11734405 1724193
36979 1724193 7843924 7481897 5361162 7116882 14027530 18862201 12612332 -3249039
36971 -3249039 -16794184 -19161744 -13088756 -7513904 -8500291 -15029517 -18852418 -10442979
36963 -10442979 8597955 21867006 15457786 -3136196 -13622476 -9377572 -3398142
36956 -3398142 -6775159 -14319304 -16125658 -11637238 -5527887 741087 6050451 6542419
36948F542419l697678O23130J0231659J3188624O416735j385968m970647q141801
36940A8806473j2673727j3889214j0086205n792911l222832j30862K588375J378227
36932b3022676j011844J986098Q180436Q147555R04846m092700k611078m19671
36924a1939034O417L243239P416916K581331j0524372j5421111l204939J2754360
36916a5087193J6208199R272955K365008m009392j2173596j3362148K09342J6068785
36908e08040J4061083l967786j5705582j0273611m96525O64212j433347L076192
36900a4583404J0080826R051507J209742k184763K938996Q046521M544466n298428
36892A3805463j2275882j0811661k900797O102502J2243462J3398275Q125645
$$ plain form
36948 6542419 2844741 3467871 13699530 26888154 33304889 31918921 26948274 18806473
36940 18806473 6132746 -7756468 -17842673 -23635584 -26858416 -26989278 -24400903 -23022676
36932 -23022676 -24034520 -22048422 -13867986 -5720431 -4815585 -8908285 -11519363 -11939034
36924 -11939034 -11932617 -8689378 -1272462 1308869 -9215503 -24636614 -27841553 -15087193
36916 -15087193 1121006 10393961 12758969 8749577 -3424019 -16786167 -16576825 -508040
36908 -508040 13553043 9585257 -6120325 -16393936 -16890461 -16226249 -17659596 -14583404
36900 -14583404 -4502578 4548929 5758671 3573908 6512904 14559425 19103891 13805463
36892 13805463 1529581 -9282080 -12182877 -6080375 6163087 19561362 27687007
36885B7687007k758348j3835111j7745183j2196557k809609K656462K001671n22430
36877a7522098o423L565686N574321K889016n93422K374296J1311772J5293075
36869B2886223O725801o234849r457335k587085J798588j272736k455588M185533
36861A3588552R869429N520633l474477o985083n667324n642379n258997O6997
36853B017351N129563P65536r838141j3365171m629667Q034758J5187043J4243977
36845A7545249O302395m423290q961635k471012N836828L188537p123974r980110
36837h7012k566970J470740m364545q092538N61551J3038809J5609038Q755188
36829B4324261J673128k914594o411841m942630M408228J3214738J0470088j286641
$$ plain form
36885 27687007 24928659 11093548 -6651635 -18848192 -21657801 -19001339 -16999668 -17522098
36877 -17522098 -17528521 -13962835 -8388514 -5499498 -6092920 -3718624 7593148 22886223
36869 22886223 29612024 23377175 13919840 11332755 13131343 11858607 9403019 13588552
36861 13588552 23457981 28978614 25504137 18519054 12851730 7209351 1950354 2017351
36853 2017351 7146914 7912450 -1925691 -15290862 -19920529 -11885771 3301272 17545249
36845 17545249 23847644 19424354 10462719 7991707 13828535 17017072 9893098 -87012
36837 -87012 -2653982 -1183242 -5547787 -13640325 -13078774 -39965 15569073 24324261
36829 24324261 25997389 23082795 16670954 11728324 16136552 29351290 39821378 38534737
36821C8534737r882533j0598916q205347n089395j67101J927684n173067j4944417
36813a3598355j1720668N964465J8823575J1701806n388313j1287205j409070
36806f913765R966028J1173412N039581p29038m156531o198193n346047j095439
36798A740008J514128k861407j1201369j3777882n334407Q602399J7686987J6729867
36790A3098324Q729282L84743l370834j854508J810685L572834K170203k35124
36782B4305605j702786l110777n216398n079431N77782Q562002J0475379L203135
36774C2014511n391556n327464K363676N975720k279466j5751537k0777099j3067145
36766b2240360k119213K052777J866231O673994J6583641J9842177R272126n655248
$$ plain form
36821 38534737 28652204 18053288 9847941 4758546 4591445 6519129 1346062 -13598355
36813 -13598355 -25319023 -19354558 -530983 11170823 5782510 -5504695 -6913765
36806 -6913765 3052263 14225675 19265256 18536218 14379687 8181494 2835447 1740008
36798 1740008 3254136 392729 -10808640 -24586522 -29920929 -21318530 -3631543 13098324
36790 13098324 21827606 22212349 18841515 16987007 18797692 22370526 24540729 24305605
36782 24305605 22602819 19492042 14275644 9196213 9773995 18335997 28811376 32014511
36774 32014511 26622955 21295491 23659167 29634887 27355421 11603884 -9173215 -22240360
36766 -22240360 -24359573 -22306796 -20440565 -13766571 2817070 22659247 31931373 26276125
36758B6276125r874762k147562M465047P89243p686096j0183267m165160M287397
36750A760965Q954719P894978K156405n534490j1411785j2633079q716463r27461
36742a8456211P827221J2510211R305690J438364k153773K634021Q831462P055366
36734B8992351j603922o907590l717894J124799p33448o719301p590671k353440
36726D90884n70225o663356j0127596j80819J4621995J4394708l376194j7079767
36718h490370r892813P048576J2140596M103032q04881L054479M306050k803848
36710H660821p925289l180619L222669J429293l993575l095357L356226P510536
36702E984705P222246M882793o51501j0188299j6334354j0278845N025361J6956067
$$ plain form
36758 26276125 16401363 14253801 18718848 19508091 11821995 1638728 -2526432 1760965
36750 1760965 10715684 18610662 20767067 15232577 3820792 -8812287 -17528750 -18456211
36742 -18456211 -10628990 1881221 11186911 12625275 10471502 13105523 21936985 28992351
36734 28992351 27388429 20480839 16762945 17887744 17154296 10434995 2844324 490884
36726 490884 -79341 -6742697 -16870293 -17051112 -2429117 11965591 8589397 -8490370
36718 -8490370 -18383183 -11334607 805989 4909021 4104140 7158619 11464669 8660821
36710 8660821 735532 -2445087 777582 2206875 -1786700 -4882057 -1525831 5984705
36702 5984705 13206951 18089744 17438243 7249944 -9084410 -19363255 -14337894 2618173
36694B618173J7432055Q616924k976684j1271636j2102702o697619j637940k33416
36686f252845J955801P494245R499277K338023o157266m397921M881207Q172204
36678A7532725Q94757q095131j0885237q119376k421170M577011Q071398L874766
36670E429743k588797j587628N732251Q322873K391721l978815m983094l771171
36662D967083k666818O38748L959867Q95282n765029n005756K918884L657680
36654C599941o784076j1561916Q58071J5630492J3023195j248606o332179J143859
36646H328781N315591j135090p404005m457422K437155N276792L857543O0820
36638A2280165o929929j4565836j5519980p578202K150937O743170O841416N895061
$$ plain form
36694 2618173 20050228 28667152 25690468 14418832 2316130 -4381489 -6019429 -6252845
36686 -6252845 -4297044 3197201 12696478 15034501 8877235 4479314 9360521 17532725
36678 17532725 18427482 10332351 -552886 -8672262 -11093432 -6516421 1554977 5429743
36670 5429743 2840946 1253318 6985569 15308442 17700163 13721348 8738254 4967083
36662 4967083 2300265 2939013 6898880 7794162 2029133 -2976623 -57739 3599941
36654 3599941 -3184135 -14746051 -13887980 1742512 14765707 13517101 7184922 8328781
36646 8328781 13644372 12509282 5105277 647855 3085010 8361802 12219345 12280165
36638 12280165 5350236 -9215600 -24735580 -32313782 -30162845 -23419675 -16578259 -10683198
36630a0683198M697226L489262L408265L254584K03259m695612p214993o636369
36622a4177576n301463j756913P036419J5860678J3985088J189299q972248p080405
36614G82879L29001L089479K046750K645838K133433n266610j4926847j5480349
36606b4646426n095258N793099Q646696N438208J871759n05346k811337m831472
36598a6140077n105205j998075N436920J4086062J5767738N706171q232712j1975286
36590b454464k511182Q202266R074206K269263m192863q276269j1213204r378082
36582a8480329R45075J3108868J4781184M193757o727940p779451j684701L060251
36574A416714L466372J747641l32969j535756m9567K740257J636057m406190q541613
$$ plain form
36630 -10683198 -5985972 -2496710 911555 4166139 4369398 -326214 -7541207 -14177576
36622 -14177576 -19479039 -21235952 -14199533 1661145 15646233 16835532 7863284 782879
36614 782879 1111880 4201359 6248109 8893947 11027380 5760770 -9166077 -24646426
36606 -24646426 -29741684 -23948585 -15301889 -9863681 -7991922 -8497268 -11308605 -16140077
36598 -16140077 -21245282 -23243357 -17806437 -3720375 12047363 17753534 9520822 -2454464
36590 -2454464 -4965646 3236620 12310826 14580089 10387226 2110957 -9102247 -18480329
36582 -18480329 -17535254 -4426386 10354798 14548555 7820615 41164 -1643537 1416714
36574 1416714 4883086 6630727 6297758 4762002 4712435 7452692 9088749 4682559 -3859054
36565c859054n867729j467396j403316j725783L431139Q093726K351703q494012
36557h940722q549197L720490J1927914P719723K611201N117643M268742r072097
36549H803697k0055655r693638J3016306K1856959J1831399K886426M752538K994566
36541C6392598j2349160k6678561k3018928p710329J644533K107704L353395P827835
36533a8430913R079058N941956M034891M367469K329220k341576m628379k977981
36525b626255k60909K934115P263276Q592206K967996l457707q61114P274112
36517B1825720O222835p143867j6096098o572687J1721051J7504027N840538p557485
36509B5744034q875078k233295L80334k818038l089035L313914P623386N91674
$$ plain form
36565 -3859054 -9726783 -11194179 -12597495 -14323278 -10892139 -2798413 -446710 -8940722
36557 -8940722 -17489919 -13769429 -1841515 5878208 8489409 13607052 17875794 8803697
36549 8803697 -11251958 -20945596 -7929290 13927669 25759068 28645494 33398032 36392598
36541 36392598 24043438 -2635123 -25654051 -33364380 -31719847 -29612143 -26258748 -18430913
36533 -18430913 -9351855 -3409899 624992 4992461 7321681 4980105 351726 -2626255
36525 -2626255 -2887164 46951 7310227 15902433 18870429 15412722 14551608 21825720
36517 21825720 28048555 20904688 4808590 -1764097 9956954 27460981 33301519 25744034
36509 25744034 16868956 14635661 15015995 12197957 9108922 12422836 20046222 20637896
36501B0637896j2782909j7796779q890150L570029P914245N146751K988354K778058
36493C565495O52390k698802l099714j496575j992216k706013J344687P069882
36485F39134O367191P75315M03013O053781O489762j697066o571668j360165K849386
36476A3948683k975937p926290j95770Q271243j523320k1017316k1720930J623148
36468c1516489K0590745J3661454m724925q723596L044544J2927698J2944725
36461A8204156R144115M082164n913304j6775850j6676677l544648R731257J2226828
36453A0478041P546061M618546M305332J852356k787827m607910j908766R06367
36445B0402200l14972m033894n790742m564606l700381n157647n658465j410665
$$ plain form
36501 20637896 7854987 -9941792 -18831942 -15261913 -7347668 -2200917 787437 3565495
36493 3565495 4217885 1519083 -1580631 -3077206 -5069422 -7775435 -6430748 639134
36485 639134 7006325 7781640 8184653 14238434 20728196 19031130 12459462 11099297 13948683
36476 13948683 10972746 3046456 2850686 11121929 9598609 -11418707 -33139637 -31516489
36468 -31516489 -10925744 2735710 -1989215 -10712811 -7668267 5259431 18204156
36461 18204156 27348271 31430435 25517131 8741281 -7935396 -11480044 -1748787 10478041
36453 10478041 18024102 22642648 26947980 28800336 26012509 21404599 19495833 20402200
36445 20402200 20087228 16053334 10262592 5697986 1997605 -3160042 -8818507 -10229172
36437a0229172N004255P099241L997889K012773M671613O955894L713810j310477
36429B1915826j045885L604789M878738q43236r328085j4950115j5015963q587518
36421a9371449K204359R442119N385335o404810j2028089l048763J2800443K0229633
36413I208778J2882013j626601j0899307r351098j784795K811209Q98989k958565
36405h19377l752275l144407n073230p085515k824930O875940J2442477P512595
36397D131278l027830r917498r951957o395830k741328K59329L307761O993395
36389a7342680J0770763J2953682J2814776J1457870Q491696Q96277j0269133
36382B9773251j5856007r209698J683881K799721n690804r619248k974640L561917
$$ plain form
36437 -10229172 -5224917 1874324 5872213 7884986 12556599 19512493 23226303 21915826
36429 21915826 20869941 24474730 29353468 28510232 19182147 4232032 -10783931 -19371449
36421 -19371449 -17167090 -7724971 -2339636 -8744446 -20772535 -23821298 -11020855 9208778
36413 9208778 22090791 20464190 9564883 213785 -1571010 1240199 2139188 -819377
36405 -819377 -4571652 -7716059 -12789289 -19874804 -22699734 -15823794 -3381317 4131278
36397 4131278 1103448 -8814050 -18766007 -25161837 -27903165 -27643836 -24336075 -17342680
36389 -17342680 -6571917 6381765 19196541 30654411 39146107 40042384 29773251
36382 29773251 13917244 4707546 6391427 9191148 3500344 -6118904 -9093544 -5531627
36374e531627J386550k454254M71910M465436Q59315m914839k064742N995266
36366a786985O371451j786888n781596K43158P422932P519825L967702K871122
36358A9040721K737601q72303o815161r645372o094563J863396P612946M408891
36350A2236156o255996j2956726p396617L381614O262064J228845K93969P620055
36342D413364J3348981R961722K394386l066277q121515j3840130j3853695n366176
36334a4129340K241484K98162m982652k531228N103851O028375j140661m901511
36326a4013520Q86522Q085812P030963r23360p900108r339551m846370M427141
36318a6592471J3644123J4510220M487209o778342p121279K678013R757750O322672
$$ plain form
36374 -5531627 -4145077 -6599331 -6127421 -1661985 -802670 -5717509 -7782251 -1786985
36366 -1786985 4584466 2797578 -2984018 -2740860 4682072 12201897 16169599 19040721
36358 19040721 21778322 20906019 14090858 4445486 -1649077 214319 7827265 12236156
36350 12236156 5980160 -6976566 -14373183 -10991569 -4729505 -3500660 -3206691 4413364
36342 4413364 17762345 27724067 30118453 27052176 18930661 5090531 -8763164 -14129340
36334 -14129340 -11887856 -11589694 -16572346 -19103574 -13999723 -7971348 -9112009 -14013520
36326 -14013520 -13126998 -5041186 1989777 1066417 -6833691 -16173242 -21019612 -16592471
36318 -16592471 -2948348 11561872 16049081 9270739 2149460 4827473 14585223 20907895
36310B0907895j181533l271284p37330k28839j967816j257241M37803k838715
36302I862940q419691o006289M484990R031158Q79344o924206j787978P119919
36294H240187L428085r030553j2156570k745424M353453K055332k56542K760700
36286c351332L064574k846848n236054M47277L753517j097175k547709P411706
36278d02044J5342583O771995q078669q902476K886768P890701r9870p487200
36270G921788n288560q61155j525135k799058O61594M623815K909671k432610
36262C210350m326246N07865Q532931J1822941M179160j0734394j9555005j3071683
36254a9434081K668845J4494022J7017309J3055808N299311l362580o866868l638204
$$ plain form
36310 20907895 19726362 16455078 15717748 15488909 13521093 12263852 12701655 9862940
36302 9862940 1443249 -4563040 -78050 8953108 9832452 2908246 1120268 8240187
36294 8240187 11668272 2637719 -9518851 -12264275 -7910822 -5855490 -6112032 -3351332
36286 -3351332 -286758 -3133606 -8369660 -7922383 -4168866 -5266041 -7813750 -402044
36278 -402044 14940539 21712534 13633865 4731389 7618157 15508858 15408988 7921788
36270 7921788 2633228 1772073 246938 -2552120 -1890526 2733289 5642960 3210350
36262 3210350 -1115896 -608031 7924900 19747841 23927001 13192607 -6362398 -19434081
36254 -19434081 -16765236 -2271214 14746095 27801903 33101214 29738634 22871766 19233562
36246A9233562j834632o422002q302212L70556Q393111J136465j2475557j0865034
36238a0765743M769032J0664315j374730j1543052n426631M559605L558185j637178
36230g196197R47405N687463J369394p112386p134862P80175O282687N601552
36222g74769R65822p821899j7564181j6493303J9927J6458038J5282668J266554
36214h661143p405342n348761j107128J381484M576647N196368j419713p652043
36206b0439631k268832R324982J1641372M240803J013039M939359M612770k180617
36198A0883245l546836K816317L287924n957946q789027L177471J3039048M739492
36190A9649688j0544079j2782965m068710o05794l717609j135086P494050Q377147
$$ plain form
36246 19233562 17398930 10976928 2674716 3045272 11438383 12574848 99291 -10765743
36238 -10765743 -5996711 4667604 3292874 -8250178 -13676809 -9117204 -5559019 -7196197
36230 -7196197 -6248792 -561329 808065 -6304321 -13439183 -12659008 -6376321 -774769
36222 -774769 191053 -7630846 -25195027 -41688330 -41668403 -25210365 -9927697 -8661143
36214 -8661143 -16066485 -21415246 -22522374 -21140890 -16564243 -11367875 -12787588 -20439631
36206 -20439631 -22708463 -13383481 -1742109 2498694 3511733 8451092 13063862 10883245
36198 10883245 7336409 10152726 13440650 7482704 -1306323 1871148 14910196 19649688
36190 19649688 9105609 -3677356 -7746066 -8351860 -12069469 -13204555 -5710505 2666642
36182B666642k414056j1620615r476647k429491J45528n42550J071909M425711
36174a8173569N111734J956753k565871m932670j941458N735831J1031554P583053
36166C805357l98572k569227K422827M612356j906411r666165q604101N25981
36158a1777955Q829056J0240104M930522l546899r333108o458020M478611J4299577
36150A1661888J4521881O624770j361653m503647l302053K13095L545458L073460
36142C0473199k407462q378981q978365l855076K427053N890885M792037j159908
36134A8803382q508065r860491j996233P627997Q724311J364286n110811n439385
36126E604991l293601k436730q95331L482864P896864Q178903L407833m406084
$$ plain form
36182 2666642 252586 -11368029 -20844676 -23274167 -23128639 -23671189 -22599280 -18173569
36174 -18173569 -13061835 -11105082 -13670953 -18603623 -20545081 -14809250 -3777696 3805357
36166 3805357 3406785 837558 3260385 7872741 5966330 -3699835 -12303936 -11777955
36158 -11777955 -2948899 7291205 12221727 8674828 -658280 -7116300 -2637689 11661888
36150 11661888 26183769 32808539 31446886 26943239 23641186 23854281 27399739 30473199
36142 30473199 28065737 19686756 10708391 6853315 9280368 15171253 19963290 18803382
36134 18803382 10295317 434826 -1561407 6066590 14790901 16155187 11044376 5604991
36126 5604991 2311390 -125340 -1020671 2462193 10359057 18537960 21945793 17539709
36118A7539709j1004867j0488685j293363Q456236Q777187J310819l333602k006475
36110G956959k002038n542407m264255M931041J1178315N683139m513891q748319
36102D678544q135371p444084k515280R612396J7320491Q581361p582654j1922379
36094B593024l296617K528407M9362k77145N795159R064186N763253M115933O096053
36085C2431615J551165j1502239j8724476j1522949r70318R27493j653845j166342
36077a0629896j043896m505170m053463L673453P124386n86493o036322K562843
36069a3494558J2202417N615780p450953n166237Q579151R745787n222038j3364623
36061h555274k962408R906962J0300572N392102N301964M398117l908089j0871811
$$ plain form
36118 17539709 6534842 -3953843 -5247206 3209030 11986217 13297036 9963434 7956959
36110 7956959 5954921 412514 -3851741 1079300 12257615 17940754 13426863 4678544
36102 4678544 -3456827 -10900911 -13416191 -3803795 13516696 22098057 14515403 2593024
36094 2593024 -703593 1824814 1874176 1597031 7392190 16456376 22219629 26335562 32431615
36085 32431615 33982780 22480541 3756065 -7766884 -8737202 -7809709 -9463554 -10629896
36077 -10629896 -11673792 -16178962 -20232425 -16558972 -9434586 -10021079 -16057401 -13494558
36069 -13494558 -1292141 4323639 -3127314 -8293551 285600 10031387 4809349 -8555274
36061 -8555274 -11517682 -1610720 8689852 14081954 19383918 23782035 19873946 9002135
36053I002135o774651J105746M11777n731093m970475L759116R873005P998519
36045A4674079L394761J666195K255808K297172P70676j304903j725329K48510
36037B2276969Q36892m298406j1520623j1135465j103039Q084228P070231k08622
36029A0002165l908390k184532o65788j760077j769753K240325P792517R504851
36021A9251318M301393m960399j0839013q904868l532800j996546l775850k056280
36013a2513045M315908Q422020O438497K859596J469263o92621n865351r458712
36005e024445o862311o64196L735365M762093L244875k14850l089037j911322
35997f023828J451909O45314n310390r853559r043941n813631j564428O342438
$$ plain form
36053 9002135 2227484 3333230 3745007 -1986086 -6956561 -3197445 6675560 14674079
36045 14674079 18068840 19735035 21990843 24288015 25058691 23753788 22028459 22276969
36037 22276969 23113861 18815455 7294832 -3840633 -4943672 3140556 10210787 10002165
36029 10002165 6093775 3909243 3243455 1483378 -286375 1953950 9746467 19251318
36021 19251318 23552711 18592312 7753299 -1151569 -4684369 -6680915 -10456765 -12513045
36013 -12513045 -8197137 224883 6663380 9522976 10992239 10299618 4434267 -5024445
36005 -5024445 -11886756 -12550952 -8815587 -4053494 -808619 -1023469 -4112506 -6023828
35997 -6023828 -4571919 -3926605 -9236995 -19090554 -28134495 -33948126 -35512554 -29170116
35989b9170116J4584044J3028625J072356o262161J792278J5076891J6513134
35982B6635051N143965o175118r912624q793073n914572j747126J049937m357
35974B82083j144761K948366R777498J1911202P812301K942465J235574J085200
35966C6849928j250248p589654j4613568j3701191n44890J3752278J1908893m949101
35958A9862447j5031736o230148N470271O00940j3893898j6607191m181566P386516
35950b2624365Q861872O234702M991188L511776K395200M924266P578488L865850
35942A9738977k629242k778984J344850r50133r779613j3586856q600998m017536
35934b1259535m931591m713709J443536Q321931J0531593R704871Q408775O358715
$$ plain form
35989 -29170116 -14586072 -1557447 -485091 -6747252 -4954974 10121917 26635051
35982 26635051 31779016 25603898 15691274 6898201 983629 -763497 286440 282083
35974 282083 -862678 2085688 11863186 23774388 31586689 34529154 35764728 36849928
35966 36849928 35599680 28010026 13396458 -304733 -849623 12902655 24811548 19862447
35958 19862447 4830711 -1399437 4070834 4671774 -9222124 -25829315 -30010881 -22624365
35950 -22624365 -13762493 -7527791 -2536603 975173 3370373 8294639 15873127 19738977
35942 19738977 17109735 14330751 15675601 14725468 4945855 -8641001 -17241999 -21259535
35934 -21259535 -26191126 -30904835 -29461299 -21139368 -10607775 -902904 7505871 13864586
35926A3864586M273519K626224k193677j0469404j2104156n22945J1360922O594639
35918A3429708q310992j2068056k531843K127700l279311l694858M978836O090899
35910c257917n701838j0651416K199863J3324950M530556j0593520j0691774j182006
35902b2023102L10640l542170P29047P589194J037054j3657861j4494629K676709
35894d1375118J8482470J9435519J1561228L470567m024605q619220m988454L275702
35886b781911N092819j333710o003770l243823J972707M792583N454849L195610
35878G145354k782535o765141l360162O99511m372127j2340099p769896P704947
35870b1840148J4506614M572502o425398l720883O060180R159272N686507M134564
$$ plain form
35926 13864586 18138105 20764329 18570652 8101248 -4002908 -4525853 6835069 13429708
35918 13429708 5118716 -6949340 -9481183 -7353483 -10632794 -14327652 -9348816 -3257917
35910 -3257917 -8959755 -19611171 -17411308 -4086358 444198 -10149322 -20841096 -22023102
35902 -22023102 -21712462 -25254632 -24525585 -16936391 -15899337 -29557198 -44051827 -41375118
35894 -41375118 -22892648 -3457129 8104099 11574666 7550061 -1069159 -6057613 -2781911
35886 -2781911 2310908 977198 -5026572 -8270395 -6297688 -1505105 3949744 7145354
35878 7145354 4362819 -2402322 -5762484 -5062973 -9435100 -21775199 -29545095 -21840148
35870 -21840148 -7333534 -2761032 -9186430 -12907313 -6847133 2312139 7998646 12133210
35862A2133210M831668J741101m801599q438966p343792n623454n177454l000159
35854a5679445K836291Q898859R778977M688191o48352n52926K231796q04932
35846A0748459j0686064j6489314r588260L493533J0109330Q296273N375524M129284
35838E388765J418697j836008j041994J901705k23597p450687j0887892n283790
35830a8014801M345901R735578P007311j708534q689702o037591L253763N819721
35822d288354k648447p711069K107341J4393514J1050084j534115k677728P698018
35814A6389244R724944j840675j0381598q056612o836923j1818813j0040748K945411
35806a9915770J0252106J646190q016063l998677N361134P506901P399938J1971980
$$ plain form
35862 12133210 16964878 18705979 13904380 5465414 -1878378 -7501832 -12679286 -15679445
35854 -15679445 -12843154 -3944295 5834682 10522873 9874521 9321595 11553391 10748459
35846 10748459 62395 -16426919 -26015179 -22521646 -12412316 -4116043 1259481 5388765
35838 5388765 6807462 4971454 3929460 5831165 5607568 -1843119 -12731011 -18014801
35830 -18014801 -13668900 -3933322 3073989 1365455 -7324247 -13361838 -10108075 -4288354
35822 -4288354 -6936801 -14647870 -12540529 1852985 12903069 11368954 8691226 16389244
35814 16389244 26114188 24273513 13891915 5835303 -1001620 -12820433 -22861181 -19915770
35806 -19915770 -9663664 -8017474 -16033537 -20032214 -14671080 -7164179 235759 12207739
35798A2207739J1998175K91150r218916k997045O828076K316013r061080q466468
35790C897644R55833K115959l885283k513036L506198j530314j3692788j1970490
$$ plain form
35798 12207739 24205914 24497064 15278148 12281103 19109179 21425192 12364112 3897644
35790 3897644 4853477 6969436 3084153 571117 4077315 2547001 -11145787 -23116277
$$ [...]
##END NTUPLES=NMR SPECTRUM
##END=
