##TITLE=31Pdec_BAU-j-4.1FNO
 CDCl3, 24 sc
 4.7.2019
##JCAMPDX= 6.0         $$ Bruker NMR JCAMP-DX V2.0
##DATA TYPE= NMR SPECTRUM
##DATA CLASS= NTUPLES
##ORIGIN= UXNMR, Bruker Analytische Messtechnik GmbH
##OWNER= root
$$ XWIN-NMR		Version 3.5
$$ Thu Jul  4 16:12:27 2019 Russian Standard Time (UT+4h)  she@DPX200
##.OBSERVE FREQUENCY= 81.013821
##.OBSERVE NUCLEUS= ^31P
##.ACQUISITION MODE= SIMULTANEOUS
##.ACQUISITION SCHEME= undefined
##.AVERAGES= 24
##.DIGITISER RES= 17
##SPECTROMETER/DATA SYSTEM= spect
##.PULSE SEQUENCE= zgpg30
##.SOLVENT NAME= CDCl3
##.SHIFT REFERENCE= (INTERNAL, CDCl3, 0, 182.463)
##AUDIT TRAIL= $$ (NUMBER, WHEN, WHO, WHERE, WHAT)
$$ ##TITLE= Audit trail, XWIN-NMR		Version 3.5
$$ ##JCAMPDX= 5.01
$$ ##ORIGIN= Bruker BioSpin GmbH
$$ ##OWNER= she
$$ F:/spectra/data/she/nmr/P31/1/pdata/1/auditp.txt
$$ ##AUDIT TRAIL=  $$ (NUMBER, WHEN, WHO, WHERE, WHAT)
(   1,<2019-07-04 16:11:26.46 +0400>,<she>,<DPX200>,
      <created by zg, POWCHK disabled, PULCHK disabled
       configuration hash MD5:
       00 E9 B6 7A A2 85 ED C7 34 08 36 98 17 FE 4E 26
       data hash MD5: 32K
       F1 5E 05 89 47 28 4A 7D F4 35 C6 E9 EF A9 49 FE>)
(   2,<2019-07-04 16:11:29.20 +0400>,<she>,<DPX200>,
      <Start of raw data processing
       efp BC_mod = 2 LB = 1 FT_mod = 6 PKNL = 1 PHC0 = -2607.207 PHC1 = 182.7988 SI = 64K 
       data hash MD5: 64K
       3F F5 D2 46 F5 13 D3 FC 86 67 60 C7 40 59 A9 6D>)
(   3,<2019-07-04 16:11:57.85 +0400>,<she>,<DPX200>,
      <pk PHC0 = -54.30089 PHC1 = 165.8 
       data hash MD5: 64K
       B5 13 4D 80 74 DF 16 F7 06 8A 77 BD EC 46 4B 61>)
(   4,<2019-07-04 16:12:01.98 +0400>,<she>,<DPX200>,
      <abs ABSG = 5 
       data hash MD5: 64K
       24 EB DE 70 72 6E D0 0C 7F 47 47 4A 1F 76 9D 41>)
$$ ##END=
$$ 
$$ hash MD5
$$ EC CC 1D BD 96 09 A0 8D BA EF E9 B5 1D F5 DB 1C
##$RELAX= 
##$RELAX= 
##$RELAX= 
##$RELAX= 
##$RELAX= 
##$RELAX= 
##$RELAX= 
##$RELAX= 
$$ Bruker specific parameters
$$ --------------------------
##$DU= <F:/spectra>
##$EXPNO= 1
##$NAME= <P31>
##$PROCNO= 1
##$TYPE= <nmr>
##$USER= <she>
##$AMP= (0..31)
100 100 100 100 100 100 100 100 100 100 100 100 100 100 100 100 100 100 
100 100 100 100 100 100 100 100 100 100 100 100 100 100 
##$AQSEQ= 0
##$AQ_mod= 1
##$AUNM= <au_zg>
##$AUTOPOS= <>
##$BF1= 81.014009
##$BF2= 200.13
##$BF3= 200.13
##$BF4= 200.13
##$BF5= 200.13
##$BF6= 200.13
##$BF7= 200.13
##$BF8= 200.13
##$BYTORDA= 1
##$CFDGTYP= 0
##$CFRGTYP= 5
##$CHEMSTR= <none>
##$CNST= (0..31)
1 1 145 1 1 1 1 1 1 1 1 1 1 1 1 1 1 1 1 1 1 1 1 1 1 1 1 1 1 1 1 1 
##$CPDPRG= <waltz16>
##$CPDPRG1= <>
##$CPDPRG2= <waltz16>
##$CPDPRG3= <>
##$CPDPRG4= <mlev>
##$CPDPRG5= <mlev>
##$CPDPRG6= <mlev>
##$CPDPRG7= <mlev>
##$CPDPRG8= <mlev>
##$CPDPRGB= <>
##$CPDPRGT= <>
##$D= (0..31)
0 1 0 0 0 0 0 0 0 0 0 0.03 2e-05 3e-06 0 0 0 0 0 0 0 0 0 0 0 0 0 0 0 0 
0 0 
##$DATE= 1562242285
##$DBL= (0..7)
120 120 120 11 120 120 24 19 
##$DBP= (0..7)
150 150 150 150 150 150 150 150 
##$DBP07= 0
##$DBPNAM0= <>
##$DBPNAM1= <>
##$DBPNAM2= <>
$$ [...]
##$SUBNAM3= <"">
##$SUBNAM4= <"">
##$SUBNAM5= <"">
##$SUBNAM6= <"">
##$SUBNAM7= <"">
##$SUBNAM8= <"">
##$SUBNAM9= <"">
##$SW= 369.568048894756
##$SWIBOX= (0..15)
0 1 3 0 0 0 0 0 0 0 0 0 0 0 0 0 
##$SW_h= 29940.119760479
##$TD= 32768
##$TD0= 1
##$TE= 0
##$TE2= 300
##$TE3= 300
##$TEG= 300
##$TL= (0..7)
0 120 53 12 22 120 120 120 
##$TP= (0..7)
150 150 150 150 150 150 150 150 
##$TP07= 0
##$TPNAME0= <>
##$TPNAME1= <>
##$TPNAME2= <>
##$TPNAME3= <>
##$TPNAME4= <>
##$TPNAME5= <>
##$TPNAME6= <>
##$TPNAME7= <>
##$TPOAL= (0..7)
0.5 0.5 0.5 0.5 0.5 0.5 0.5 0.5 
##$TPOFFS= (0..7)
0 0 0 0 0 0 0 0 
##$TUNHIN= 0
##$TUNHOUT= 0
##$TUNXOUT= 0
##$USERA1= <user>
##$USERA2= <user>
##$USERA3= <user>
##$USERA4= <user>
##$USERA5= <user>
##$V9= 5
##$VALIST= <valist>
##$VCLIST= <CCCCCCCCCCCCCCC>
##$VD= 0
##$VDLIST= <DDDDDDDDDDDDDDD>
##$VPLIST= <PPPPPPPPPPPPPPP>
##$VTLIST= <TTTTTTTTTTTTTTT>
##$WBST= 1024
##$WBSW= 4
##$XGAIN= (0..3)
0 0 0 0 
##$XL= 0
##$YL= 0
##$YMAX_a= 11239
##$YMIN_a= -11178
##$ZGOPTNS= <>
##$ZL1= 120
##$ZL2= 120
##$ZL3= 120
##$ZL4= 120
##$ABSF1= 182.463
##$ABSF2= -187.1042
##$ABSG= 5
##$ABSL= 3
##$ALPHA= 0
##$AQORDER= 0
##$ASSFAC= 0
##$ASSFACI= 0
##$ASSFACX= 0
##$ASSWID= 0
##$AUNMP= <proc_1d>
##$AZFE= 0.1
##$AZFW= 0.5
##$BCFW= 0
##$BC_mod= 2
##$BYTORDP= 0
##$COROFFS= 0
##$CY= -3
##$DATMOD= 1
##$DC= 0
##$DFILT= <>
##$DTYPP= 0
##$F1P= 0
##$F2P= 0
##$FCOR= 1
##$FTSIZE= 65536
##$FT_mod= 6
##$GAMMA= 0
##$GB= 0
##$INTBC= 1
##$INTSCL= 5.30512e-09
##$ISEN= 30
##$LB= 1
##$LEV0= 0
##$LPBIN= 0
##$MAXI= 10000
##$MC2= 0
##$MEAN= 0
##$ME_mod= 0
##$MI= 50
##$NCOEF= 0
##$NC_proc= -8
##$NLEV= 6
##$NOISF1= 182.463
##$NOISF2= 159.3651
##$NSP= 0
##$NTH_PI= 0
##$NZP= 0
##$OFFSET= 182.463
##$PC= 4
##$PHC0= -2661.508
##$PHC1= 348.5988
##$PH_mod= 1
##$PKNL= yes
##$PPARMOD= 0
##$PSCAL= 0
##$PSIGN= 0
##$REVERSE= no
##$SF= 81.0140089999434
##$SI= 65536
##$SIGF1= 159.3651
##$SIGF2= -187.1042
##$SINO= 113.3802
##$SIOLD= 16384
##$SREGLST= <1H.CDCl3>
##$SSB= 0
##$STSI= 65536
##$STSR= 0
##$SW_p= 29940.119760479
##$SYMM= 0
##$S_DEV= 0
##$TDeff= 32768
##$TDoff= 0
##$TI= <>
##$TILT= no
##$TM1= 0
##$TM2= 0
##$TOPLEV= 0
##$USERP1= <user>
##$USERP2= <user>
##$USERP3= <user>
##$USERP4= <user>
##$USERP5= <user>
##$WDW= 1
##$XDIM= 65536
##$YMAX_p= 306798858
##$YMIN_p= -124181270
$$ End of Bruker specific parameters
$$ ---------------------------------
##NTUPLES= NMR SPECTRUM
##VAR_NAME=  FREQUENCY,     SPECTRUM/REAL,   SPECTRUM/IMAG
##SYMBOL=    X,             R,               I
##VAR_TYPE=  INDEPENDENT,   DEPENDENT,       DEPENDENT
##VAR_FORM=  AFFN,          ASDF,            ASDF
##VAR_DIM=   65536,         65536,           65536
##UNITS=     HZ,            ARBITRARY UNITS, ARBITRARY UNITS
##FACTOR=    0.456856943014862, 1,           1
##FIRST=     14782.0589164792, 0,            0
##LAST=      -15158.0608439998, 0,           0
##MIN=       -15158.0608439998, -124181270,  0
##MAX=       14782.0589164792, 306798858,    0
$$ Real data points
##PAGE= N=1
##DATA TABLE= (X++(R..R)), XYDATA
$$ [...]
39249b799815P20918L727148K914513L399995M023077L90247m884680n552098
$$ -2799815 -2078897 1648251 4562764 7962759 11985836 12376083 7491403 1939305
39241A939305k720310k463809m494162l125846J735158M234613K691554J078021
$$ 1939305 -781005 -3244814 -7738976 -10864822 -9129664 -4895051 -2203497 -1125476
39233a125476P41539o35480k146133n42713K117494O72816l184380k470098K966660
$$ -1125476 -383937 -1019417 -3165550 -3708263 -1590769 -917953 -4102333 -6572431 -3605771
39224c605771N552525K520170n55995p12636j796104m713700m039061J206675
$$ -3605771 1946754 4466924 3910929 3198293 1402189 -3311511 -7350572 -6143897
39216f143897L588623l42889l453637m00424K922897L01674l336253r64337L608934
$$ -6143897 -2555274 -2898163 -6351800 -6752224 -3829327 -3527653 -6863906 -7828243 -4219309
39207d219309K654172j535211j148508K873245L005742q46254j517738J916862
$$ -4219309 -1565137 -3100348 -4248856 -1375611 1630131 783877 -733861 1183001
39199A183001K591152j225437k923107J83273J926125j322534l794995l44283
$$ 1183001 3774153 2548716 -374391 -191118 1735007 412473 -3382522 -3726805
39191c726805M455542L517740k158961o100085n332269j578210K859622N691071
$$ -3726805 728737 4246477 2087516 -4012569 -9344838 -10923048 -8063426 -2372355
39183b372355M356750m55131l767405k441287O58524J884487K346153M202834
$$ -2372355 1984395 1529264 -2238141 -4679428 -4020904 -2136417 209736 4412570
39175D412570N354708K866368j429423l885703m793326n912871n230335n18176
$$ 4412570 9767278 12633646 11204223 7318520 2525194 -3387677 -8618012 -9136188
39167i136188M167245K926896j969004k392847K686149M769244p89644o581461
$$ -9136188 -4968943 -2042047 -4011051 -6403898 -3717749 1051495 261851 -6319610
39159f319610l710389M847017Q274364K828327m062504m755846n41144K658848
$$ -6319610 -10029999 -5182982 3091382 5919709 1857205 -2898641 -3439785 -780937
39151g80937L424152N011773P712713O541725r53993q566858q138348r70245L366830
$$ -780937 2643215 7654988 15367701 21909426 20955433 12388575 4250227 3279982 6646812
39142F646812L07430l953937k760715J277299J964131m19678j629817k095891
$$ 6646812 6954242 3000305 239590 1516889 3481020 3061342 1431525 -664366
39134f64366m889511p420794m247346K369050M234644P80803J025445Q498592
$$ -664366 -5553877 -12974671 -17222017 -14852967 -10618323 -9837520 -8812075 -313483
39126c13483J3647313P442495m833264j0894175p546285j940775K4912q39060
$$ -313483 13333830 20776325 15943061 5048886 -2497399 -4438174 -4413262 -5252322
39118e252322j847375k332445k390632j900510j038038M24314L052174N287493
$$ -5252322 -7099697 -9432142 -11822774 -13723284 -14761322 -14337008 -11284834 -5997341
39110e997341L880481r02716m040456k621564O6420O58446J053912L189170L920705
$$ -5997341 -2116860 -3019576 -7060032 -9681596 -9615176 -8956730 -7902818 -4713648 -792943
39101g92943J243758K66652N099884R468682N085291l893419n842074K77170L759800
$$ -792943 450815 717467 5817351 15286033 20371324 16477905 10635831 10913001 14672801
39092A4672801j36160l698752j409263Q51354k592896o657492m541997P67595
$$ 14672801 14536641 10837889 9428626 10279980 7687084 1029592 -3512405 -2744810
39084b744810K728004K413276M090561M829242q95992r030378r362464j157028
$$ -2744810 -16806 2396470 6487031 11316273 10420281 1389903 -7972561 -9129589
39076i129589M803365K061686k728320j321805L289141K436980m010071o787785
$$ -9129589 -4326224 -2264538 -4992858 -6314663 -3025522 -588542 -4598613 -11386398
39068a1386398m94758Q542868J0315743L401553m367759n983792k214200J773504
$$ -11386398 -11881156 -3338288 6977455 10379008 6011249 27457 -2186743 -413239
39060d13239L074060K307557Q50584l69843q54059j800215n538582j0716356j0591984
$$ -413239 2660821 4968378 5818962 5449119 4595060 2794845 -2743737 -13460093 -24052077
39051b4052077j119195J0780930J3430257N298945k824322k406881K689577M189421
$$ -24052077 -25171272 -14390342 -960085 4338860 1514538 -892343 1797234 5986655
39043E986655J337979p97466p37755j667406m589610o041657k983770L391951
$$ 5986655 7324634 6527168 5789413 4122007 -467603 -6509260 -9493030 -6101079
39035f101079Q781753Q836915K494215n693971q567281m232011J170676J293965
$$ -6101079 2680674 11517589 14011804 8317833 -249448 -4481459 -3310783 -2016818
39027b016818k310035l494348p21218J609682L03968k464762k848238m17169J483667
$$ -2016818 -4326853 -7821201 -8542419 -6932737 -6628769 -9093531 -11941769 -12358938 -10875271
39018a0875271l21014m468599n224245O59859P757451P294551l01242m296769
$$ -10875271 -11196285 -15664884 -20889129 -20229270 -12471819 -5177268 -5478510 -9775279
39010i775279J507189R182071P791483j181219p175365n774994k048904l14420
$$ -9775279 -8268090 913981 8705464 7524245 348880 -5426114 -7475018 -7789438
39002g789438P36654K283880K415697N10020j324756k242414k925031j982410
$$ -7789438 -7052784 -4768904 -2353207 -1843187 -3167943 -5410357 -8335388 -10317798
38994a0317798J902113M601071O94253o410863o722791J739438Q716420N852342
$$ -10317798 -8415685 -3814614 -3120361 -9531224 -16254015 -14514577 -5798157 54185
38986E4185k257361o005961l457142M92364K567612K828569J524965l77149j33517
$$ 54185 -2203176 -8209137 -11666279 -11173915 -8606303 -5777734 -4252769 -4629918 -4763435
38977d763435K984893N430118M444094K048533L53855k870433q929822j2386209
$$ -4763435 -1778542 3651576 8095670 10144203 10498058 7627625 -1302197 -13688406
38969a3688406o989945M442936J2143396J0798362M023025j840811l674281j647988
$$ -13688406 -20678351 -16235415 -4092019 6706343 10729368 8888557 5214276 3566288
38961C566288K128674M395530L283398L39395j961141l567457n351288o165371
$$ 3566288 5694962 10090492 13373890 13713285 11752144 8184687 2833399 -3331972
38953c331972m711264k700824k477742k788215o91742L300173N618147M388728
$$ -3331972 -8043236 -10744060 -13221802 -16010017 -16701759 -13401586 -7783439 -3394711
38945c394711P68935l022740l995234P26890R034380J2582069O103105m040251
$$ -3394711 -2625776 -5648516 -9643750 -8916860 117520 12699589 18802694 14762443
38937A4762443p135752k493404J075912l66564j196671K113269M082696M2825
$$ 14762443 7626691 5133287 6209199 5842635 4645964 6759233 10841929 10884754
38929A0884754m881018l594964J535005K701651j147429l752946j873957Q74833
$$ 10884754 6003736 2408772 3943777 6645428 5497999 1745053 -128904 745929
38921G45929Q45034q98762j944247k001966j462599j72201R50795L64587p25321
$$ 745929 1590963 692201 -1252046 -3254012 -4716611 -4888812 -3938017 -3573430 -4298751
38912d298751J171911O208036R301305O409255j8959m837317o959489q339394
$$ -4298751 -3126840 3081196 12382501 18791756 18772797 13935480 6975991 -1363403
38904a363403q049523l015103M808327P890975K991352l064728k418005K232150
$$ -1363403 -9412926 -12428029 -7619702 271273 3262625 197897 -2220108 12042
38896A2042J679576n166178q475179j661164Q485787J0731651L751274m270207
$$ 12042 1691618 -3474560 -11949739 -13610903 -5125116 5606535 9357809 5087602
38888E087602p281833o146860l243738Q24851M349648M235661P69586j535713
$$ 5087602 -2194231 -8341091 -11584829 -10759978 -6410330 -2174669 -1405083 -2940796
38880b940796J24131L491185N390199N663206N107856K971989j018344m757834
$$ -2940796 -2816665 674520 6064719 11727925 16835781 19807770 18789426 14031592
38872A4031592o110190n074321k301530J716000M591264K781555l235807p791878
$$ 14031592 7921402 2847081 545551 2261551 6852815 9634370 6398563 -1393315
38864a393315o728651k237721J614781M513176P397595Q002742L963778j926397
$$ -1393315 -8121966 -10359687 -8744906 -4231730 3165865 11168607 15132385 13205988
38856A3205988m756139m327375l957837l781282r02561M042651O265629L804687
$$ 13205988 8449849 4122474 164637 -3616645 -4519206 -476555 5789074 9593761
38848I593761K70536p39980K76715J551205K810562L673940L104279J943358K108921
$$ 9593761 9864297 9124317 9401032 10952237 13762799 17436739 20541018 22484376 24593297
38839B4593297J894076l138013j1969169j5805737q596633L330159P540324M36784
$$ 24593297 26487373 23349360 11380191 -4425546 -13022179 -9692020 -2151696 -1714912
38831a714912q722864r283489j168451O362632O333577K021671J836589P095736
$$ -1714912 -10437776 -19721265 -20889716 -14527084 -8193507 -6171836 -4335247 2760489
38823B760489Q971763P04268j0878873j2707078l196126N665597N594954K368563
$$ 2760489 11732252 12436520 1557647 -11149431 -14345557 -8679960 -3085006 -716443
38815g16443M160850Q151492O871428J606676m67888R93780o2121m296673n686515
$$ -716443 3444407 11595899 18467327 20074003 19606115 20599895 20537774 16241101 10554586
38806A0554586k439491K15657l94715j019258p95272l639108q797727q293567
$$ 10554586 8115095 8330752 7936037 6916779 6121507 2482399 -6315328 -14608895
38798a4608895O54232Q797913P320840M10119k212513K70631J300234j049725
$$ -14608895 -13954663 -5156750 2164090 2574209 361696 632327 1932561 882836
38790H82836k563250j560510q71506j579037j730607j116967j166342m99526L154282
$$ 882836 -1680414 -3240924 -4112430 -5691467 -7422074 -8539041 -9705383 -10204909 -7050627
38781g050627O895370N147891j279655n130524k895448J068649K212208J520720
$$ -7050627 -155257 4992634 3712979 -1417545 -4312993 -3244344 -1032136 488584
38773D88584J230162N18340j313563k088125o65695K05320j660660l753960k502414
$$ 488584 1718746 2237086 923523 -1164602 -1830297 -1624977 -3285637 -7039597 -9542011
38764i542011J363614L999377L289258M21424j859276j397381J188777K142471
$$ -9542011 -8178397 -4179020 -889762 -468338 -2327614 -3724995 -2536218 -393747
38756c93747j020485m891329l831007J519349M328683J459008k045453p93634
$$ -393747 -1414232 -6305561 -10136568 -8617219 -4288536 -2829528 -4874981 -5668615
38748e668615L581698O032431M763363J150680k925728m757297k218018J621620
$$ -5668615 -2086917 3945514 8708877 9859557 6933829 2176532 -41486 1580134
38740A580134M50682n391357p208537q91611N242028K524221m341955m673973
$$ 1580134 2030816 -3360541 -10569078 -11460689 -6218661 -3694440 -8036395 -12710368
38732a2710368J650893N370432K953204k52828j146274k207440k975833O93888
$$ -12710368 -11059475 -5689043 -2735839 -2988667 -4134941 -6342381 -9318214 -8624326
38724h624326O256110M342899o134479j2760144o418861M899628P422629N67923
$$ -8624326 -2368216 1974683 -4159796 -16919940 -23338801 -18439173 -11016544 -10448621
38716a0448621m580232j980266L501034N677118M170123J399999p89513k51295
$$ -10448621 -15028853 -17009119 -13508085 -7830967 -3660844 -2260845 -3050358 -3301653
38708c301653M031371Q009834N237035m012229j0537135o614634L971798R954007
$$ -3301653 729718 8739552 13976587 9964358 -572777 -7187411 -3215613 6738394
38700F738394N705556k816428n679393k51899O599877O754831l82501p883695
$$ 6738394 12443950 9627522 3948129 3696230 10296107 17050938 16668437 8784742
38692H784742r106093m315118N13060N89822k656771l629012M60148N593233N429005
$$ 8784742 -321351 -4636469 -4123409 -3533587 -6190358 -9819370 -9359222 -3765989 1663016
38683A663016m93500n610471m494711N77834L530986K477399M26557k16199J81619
$$ 1663016 1169516 -4440955 -8935666 -8357832 -4826846 -2349447 -1922890 -2139089 -1957470
38674a957470R62913J840633J520069n13277j572331M78328K060533j702946p727739
$$ -1957470 -994557 846076 2366145 1852868 280537 758865 2819398 1116452 -6611287
38665f611287p465954j61320M493713P98832l799356m30191O896841P388236k5762
$$ -6611287 -14077241 -14238561 -9744848 -8946016 -12745372 -13175563 -6278722 1109514 1083752
38656A083752n735680l930701Q91293K939146K684064K541741J470169j891431
$$ 1083752 -4651928 -8582629 -7691336 -4752190 -2068126 473615 1943784 52353
38648E2353m934223m231922n73727K620616M147280N062512N110483K638033j688429
$$ 52353 -4881870 -9113792 -9687519 -7066903 -2919623 2142889 7253372 9891405 8202976
38639H202976m085584k230176R98101O25386l818957p243552n546716r14488J652843
$$ 8202976 4117392 1887216 2885317 3510703 -308254 -7551806 -13098522 -14013010 -12360167
38630a2360167J152968M90666Q24692N68605N0355K027297O112744P725681N030566
$$ -12360167 -11207199 -10716533 -9891841 -9323236 -9272881 -7245584 -1132840 6592841 11623407
38621A1623407K086546J940595J504005k418184o519848n759359j248188K108133
$$ 11623407 13709953 15650548 17154553 14736369 8216521 2457162 1208974 3317107
38613C317107K876161K507304N50350l392998n635611k960900J131357J553063
$$ 3317107 6193268 8700572 9250922 5857924 222313 -2738587 -1607230 -54167
38605e4167K88741K017653L951460L6010o420457o163248l28624j85811p615644
$$ -54167 234574 2252227 6203687 6239697 -180760 -6344008 -6672632 -6858443 -14474087
38596a4474087r873453l35946R023052O033906k238891j482850O854574R395293
$$ -14474087 -24347540 -24683486 -15660434 -9626528 -11865419 -13348269 -6493695 2901598
38588B901598K912363k699085k227473j251934k870665j898334L447133N749272
$$ 2901598 5813961 3114876 887403 -364531 -3235196 -5133530 -1686397 4062875
38580D062875M94203n178561k846373M741483Q363093M686287j980373o469824
$$ 4062875 4557078 -621483 -3467856 1273627 9636720 14323007 12342634 5872810
38572E872810o240590j626414K909352J436658n271513q464449l096726L976006
$$ 5872810 -367780 -1994194 915158 2351816 -2919697 -11384146 -14480872 -10504866
38564a0504866L744004j505202k668345J233046K373995j902348m498001o02440
$$ -10504866 -6760862 -8266064 -10934409 -9701363 -7327368 -9229716 -13727717 -14330157
38556a4330157M576799M880823K709662L237079M681053J914719l345583m017283
$$ -14330157 -9753358 -4872535 -2162873 1074206 5755259 7669978 4324395 307112
38548C07112J058223M553813J206210m754177n908194j556371K484242K118801
$$ 307112 1365335 5919148 7125358 2371181 -3537013 -5093384 -2609142 -490341
38540d90341o55087j599871J93955J891534J149577p27877o71598J734156L482227
$$ -490341 -1145428 -2745299 -2551344 -659810 489767 -238110 -909708 824448 4306675
38531D306675K453087N37347N41602J557251M61494k503302l268588Q9299M187528
$$ 4306675 6759762 7297109 7838711 9395962 9857456 7354154 4085566 4174865 8362393
38522H362393M907088K432983n05251l030970n704416p326771n928394k755314
$$ 8362393 13269481 15702464 15197213 12166243 6461827 -864944 -6793338 -9548652
38514i548652j604410l135979l079092J638144P378131P902822L186621r0451
$$ -9548652 -11153062 -14289041 -17368133 -15729989 -8351858 -449036 2737585 2647134
38506B647134J755477L363401j881911j0462455j1471016j587329R124781J0119601
$$ 2647134 4402611 7766012 5884101 -4578354 -16049370 -17636699 -8511918 1607683
38498A607683L664981n87893j62331p96532m506991n822934j776775K441849J662013
$$ 1607683 5272664 4684771 4522440 3725908 -781083 -6604017 -8380792 -5938943 -4276930
38489d276930j809161l271252k802466k669225k203261j13453K046568L183155
$$ -4276930 -6086091 -9357343 -12159809 -14829034 -17032295 -17145748 -15099180 -11916025
38481a1916025N267360Q224180P242521O63729m761772l323052J15745j760692
$$ -11916025 -6648665 1575515 8818036 9481765 4719993 1396941 1512686 -248006
38473b48006n909071m319354J426173K714941o42997k18597N191703O571597N85552
$$ -248006 -6157077 -10476431 -9050258 -6335317 -6978314 -7196911 -2005208 4566389 5151941
38464E151941m035710j144029L190852K201480q50793j171638k077045o945665
$$ 5151941 1116231 -27798 3163054 5364534 4513741 3342103 1265058 -5680607
38456e680607r659703l560221N958361Q380668L504188r5695J029350K642466
$$ -5680607 -15340310 -18900531 -12942170 -4561502 -1057314 -1153009 -123659 2518807
38448B518807K230967J636336J159388o81303k246821j191626m60695l952087
$$ 2518807 4749774 6386110 7545498 6864195 4617374 3425748 2965053 -987034
38440i87034p693418m371445L929609P279077L034885n27351J755116L996453
$$ -987034 -8680452 -13051897 -9122288 -1843211 1191674 664323 2419439 6415892
38432F415892L2235o118715o849163k289741J353025J257069J60496R40262L288338
$$ 6415892 6448127 329412 -6519751 -8809492 -7456467 -6199398 -6038902 -5098640 -1810302
38423a810302M933989L735594k68314l552193j904657M022905Q110300N318434
$$ -1810302 3123687 6859281 6590967 3038774 1134117 5157022 13267322 18585756
38415A8585756k641605r096437q651671j815812M926804M503079k998608r230803
$$ 18585756 15944151 6847714 -1803957 -3619769 1307035 5810114 2811506 -6419297
38407f419297p085310N21760N185431M282122K472457L192875M619214M153403
$$ -6419297 -13504607 -12982847 -7797416 -3515294 -1042837 2150038 6769252 10922655
38399A0922655J609587k218993n559078n212152j163452O08474l516306o802735
$$ 10922655 12532242 10313249 4754171 -457981 -1621433 -1012959 -4529265 -11332000
38391a1332000j699251N645580L080435o151128n399382Q576825J7453287Q293440
$$ -11332000 -13031251 -7385671 -4305236 -10456364 -15855746 -7278921 10174366 18467806
38383A8467806o658295r323061k082931M74623l405459l207741L237143O907411
$$ 18467806 11809511 2486450 403519 878142 -2527317 -5735058 -2497915 4409496
38375D409496M362421K089367K990253J991778k546654m982682k973412j359011
$$ 4409496 8771917 10861284 13851537 15843315 13296661 8313979 5340567 3981556
38367C981556k307489j392091L010719N599756L316533K94090j56045m94073k092302
$$ 3981556 1674067 281976 3292695 8892451 12208984 12503074 12347029 11852956 9760654
38358I760654j513292K009085L227597j18013k566918n72444P16070l231337p283289
$$ 9760654 8247362 10256447 13484044 13366031 10799113 10226669 10942739 7711402 428113
38349D28113m683321J498884L307428K71421j411708O51390L185539M067912L845361
$$ 428113 -4255208 -2756324 551104 822525 -589183 62207 3247746 7315658 11161019
38340A1161019J818302k522323n258247k176331L492939M545955R87388K17984
$$ 11161019 12979321 10456998 5198751 3022420 6515359 11061314 12048702 12266686
38332A2266686M753675P395795K094891o595547r671280n134105J388480M593943
$$ 12266686 17020361 24416156 26511047 19915500 10244220 5110115 6498595 11092538
38324A1092538L415201j185928p364720j1271195q968463j176145O148332P628934
$$ 11092538 14507739 13321811 5957091 -5314104 -14282567 -15458712 -9310380 -1681446
38316a681446L771856o12714k067169r35226J069657L225999M923165M599774
$$ -1681446 2090410 1477696 -589473 -1524699 -455042 2770957 7694122 12293896
38308A2293896J616539j922382l469682l531193m372277n592873m217493J21714
$$ 12293896 13910435 11988053 8518371 4987178 614901 -4977972 -9195465 -9073751
38300i073751L428001K567443m63407j741223n59801J293148L401224O421741
$$ -9073751 -5645750 -3078307 -3541714 -5282937 -5842738 -4549590 -1148366 5273375
38292E273375Q762521P023471L50411p718113j2196446j0316895k986651N437879
$$ 5273375 14035896 21059367 21409778 13691665 1495219 -8821676 -11808327 -6370448
38284f370448R319940O211906k83863l926050k693521o41213k109009n614812
$$ -6370448 2949492 9161398 8877535 4951485 2257964 1616751 -492258 -6107070
38276f107070n368705J090701Q511283R185461K681482k495991M90202O808499
$$ -6107070 -11475775 -10385074 -1873791 7311670 9993152 7497161 7987363 14795862
38268A4795862N546640m804518j2764964q765641K078057P556129M528429K38165
$$ 14795862 20342502 15537984 2773020 -5992621 -3914564 3641565 8169994 8408159
38260H408159m64357p10510l334017m884594j759836L236604N019713L245016
$$ 8408159 7943802 7233292 3899275 -985319 -2745155 491449 5511162 8756178
38252H756178J047729l30258j564719k181322j454684o27641o44980L06430L063805
$$ 8756178 9803907 9473649 7908930 5727608 4272924 3645283 3000303 3306733 6370538
38243F370538L691004j256959p286120o343078J338428O744545M983186J399137
$$ 6370538 10061542 8804583 1518463 -4824615 -3486187 3258358 8241544 9640681
38235I640681J413331J700998k335015o466578l680680L215353M790753q9846
$$ 9640681 11054012 12755010 10419995 3953417 272737 3488090 8278843 8188997
38227H188997k617691J123072L766213n07952n890506m637498L57596J256793
$$ 8188997 5571306 6694378 10460591 9952639 4062133 -575365 -217769 1039024
38219A039024j567954j651003J277106J222749k610353m231225j793937o28960
$$ 1039024 -528930 -2179933 -902827 319922 -2290431 -6521656 -8315593 -8944553
38211h944553k833170k984123J623086M959549K218001j545515K93214M842985
$$ -8944553 -11777723 -14761846 -13138760 -8179211 -5961210 -7506725 -7213511 -2370526
38203b370526M667632l57141l967959l351838o00197L139427P203028P182732
$$ -2370526 2297106 1939965 -2027994 -5379832 -5980029 -2840602 4362426 11545158
38195A1545158j32964q273056o739252L646731R907925M297021n567648q289051
$$ 11545158 11412194 3139138 -3600114 46617 9954542 14251563 8683915 394864
38187C94864l445846R72796Q11244r58820n82096K259886N528435O548637L800414
$$ 394864 -3050982 -2078186 -1266942 -2225762 -2807858 -547972 4980463 11529100 15329514
38178A5329514n72434k041325K08411J245252k565541p528032p672570l369120
$$ 15329514 14757080 12715755 12924166 14169418 11603877 4075845 -3596725 -6965845
38170f965845K920N64756J661348M872900O590469L733875r39763k561353j320745
$$ -6965845 -6962925 -6398169 -4736821 136079 6726548 10460423 9520660 6959307 5638562
38161E638562k195440p054274j0248763n217620N371291J0550568M412282n447821
$$ 5638562 3443122 -3611152 -13859915 -19077535 -13706244 -3155676 1256606 -4191215
38153d191215p623606k152315J087469j566204k379189L817464R634499O079901
$$ -4191215 -11814821 -13967136 -12879667 -14445871 -16825060 -13007596 -3373097 2706804
38145B706804l136738p100179l487445N57233J418830K960007O790551P909310
$$ 2706804 -429934 -7530113 -11017558 -10460325 -9041495 -6081488 709063 8618373
38137H618373L276449k403570l440980n93959J667568J136445j693675n296472
$$ 8618373 11894822 9491252 6050272 5456313 7123881 8260326 6566651 1270179
38129A270179o880511m265215K07289J728901K02148R7280J849816N00313m148301
$$ 1270179 -5610332 -9875547 -9668258 -7939357 -7737209 -7639929 -5790113 -5289800 -9438101
38120i438101m329380K993773Q206251K421248p357776p079546L756168J1626693
$$ -9438101 -13767481 -10773708 -2567457 -146209 -7503985 -14583531 -10827363 799330
38112G99330Q339147j29771n405646o770266o067412k077239M585908Q179946
$$ 799330 9138477 9008706 3603060 -3167206 -9234618 -11311857 -6725949 1453997
38104A453997N304409M19286j037742m376N14643J638802M524626M955358q24551
$$ 1453997 6758406 7177692 6139950 6135574 6650217 8289019 12813645 17769003 16944452
38095A6944452q262221r897310o301004m027889m158064j351054N242533Q701180
$$ 16944452 8682231 -1215079 -7516083 -11543972 -15702036 -17053090 -11810557 -3109377
38087c109377M904550o76862j175018J929423K394770q59009k921268q27418K450370
$$ -3109377 1795173 1118311 -56707 1872716 4267486 3408477 487209 -340209 2110161
38078B110161K710501J50438j417785M3528J836377k2598m742724o397826j352885
$$ 2110161 4820662 4971100 3553315 3596843 5433220 5410622 667898 -5729928 -7082813
38069g082813N902799P648455K801276k131588k250308P77M3773j908742k307396
$$ -7082813 -1180014 6468441 9269717 7138129 4887821 4888598 4932371 3023629 716233
38060G16233j15481K121629J892799r99604m776860o486444l859261J670728N229323
$$ 716233 600752 2722381 4615180 3615576 -1161284 -7647728 -11506989 -9836261 -4606938
38051d606938L941265P42629L37514K617277L185516K0845l664483m072798j791221
$$ -4606938 -665673 76956 414470 3031747 6217263 6238108 2573625 -1499173 -3290394
38042c290394m00182j371859k289923m10588L264031M838233K475866j144206
$$ -3290394 -3690576 -5062435 -7352358 -7762946 -4498915 339318 2815184 1670978
38034A670978k517714j932691k123255l301299k686534R30252N288076P899750
$$ 1670978 -846736 -2779427 -4902682 -8203981 -10890515 -9960263 -4672187 3227563
38026C227563Q159265N649823Q6515n654694o421990j298732L875570L238601
$$ 3227563 11386828 17036651 17123166 11468472 5046482 3747750 7623320 10861921
38018A0861921k317707p352951q162474m737636M56569L419673J745378j080755
$$ 10861921 8544214 1191263 -6971211 -11708847 -11252278 -7832605 -6087227 -7167982
38010g167982J071860O974966P362202j302799r076117n668068M362056Q512591
$$ -7167982 -6096122 878844 8241046 6938247 -2137870 -7805938 -3443882 5068709
38002E068709M205240m63859j097674q09359m54533L070947P361587M951327l501019
$$ 5068709 9273949 8810090 7712416 6903057 6448524 9519471 16881058 21832385 18331366
37993A8331366p388412k148963L165301K66995n817874n920027o39897K817160
$$ 18331366 10942954 8793991 11959292 12226287 6408413 488386 -151511 2665649
37985B665649J652434k013418o340723q854835n682446J973108O309902M011283
$$ 2665649 4318083 2304665 -4036058 -12890893 -18573339 -16600231 -10290329 -6279046
37977f279046J972433N077546O724808R94987m489689o10467N709339J650552
$$ -6279046 -4306613 770933 7495741 8490728 4001039 3390572 9099911 10750463
37969A0750463q571208q734469K622152R267248L767131j897088J165531L608912
$$ 10750463 2179255 -6555214 -3933062 5334186 9101317 7204229 8369760 11978672
37961A1978672l648455j0972682n059170P918600J0578738L69847q267932o183153
$$ 11978672 8330217 -2642465 -7701635 216965 10795703 11165550 2897618 -3285535
37953c285535J64236K175928Q85138R92039J783998m11219n188489p855744m773029
$$ -3285535 -3121299 -945371 -60233 931806 2715804 2304585 -2883904 -10739648 -15512677
37944a5512677K610754Q157091O355639r93697n480464k195304L686189M416817
$$ -15512677 -12901923 -4744832 1610807 617110 -4863354 -7058658 -3372469 1044348
37936A044348N62610j468718l34710o33969l277272l048512K207070P073212O762614
$$ 1044348 1606958 138240 -196470 -830439 -4107711 -7156223 -4949153 2124059 8886673
37927H886673L991436L244922K925199j158317p148560q035548j358256O396795
$$ 8886673 12878109 16123031 19048230 17889913 10741353 2705805 1347549 7744344
37919G744344O842631q51517r058613r762767k675709N067451O918482L190444
$$ 7744344 14586975 13735458 4676845 -5085922 -7761631 -2694180 4224302 7414746
37911G414746j346007l847772m568067l157337J635634P769005R731449N100724
$$ 7414746 6068739 2220967 -2347100 -5504437 -3868803 3900202 13631651 18732375
37903A8732375j663359m801333m332045m328542n796563n310460q69688M379143
$$ 18732375 17069016 12267683 7935638 3607096 -2189467 -7499927 -8369615 -3990472
37895c990472N823327K873094q18131j742363J16191K035849J698559o64472k865505
$$ -3990472 1832855 4705949 3887818 2145455 2261646 4297495 5996054 5331582 2466077
37886B466077l125387j754018o12639j078721k552188k997237j184510J651411
$$ 2466077 -659310 -2413328 -3025967 -4104688 -6656876 -9654113 -10838623 -9187212
37878i187212L015566K274734J629760L043616N031443M177834j66385m402603
$$ -9187212 -6171646 -3896912 -2267152 776464 5807907 9985741 9819356 5416753
37870E416753m685350j347532J660413J349367j092326j819876J152348N335213
$$ 5416753 731403 -616129 1044284 2393651 1301325 -518551 633797 5969010
37862E969010O246977K513130k540220m867410l966737k102292p26888L57615
$$ 5969010 12215987 14729117 12188897 7321487 3354750 1252458 525570 883185
37854H83185J129064Q56865p14078l261764o133769p051011k735641N636040R853528
$$ 883185 2012249 2869114 2155036 -1106728 -7240497 -14291508 -17027149 -11391109 -1537581
37845a537581L621000o425053o549808M876913J2636875N108626q289396r840921
$$ -1537581 2083419 -4341634 -10891442 -6014529 6622346 11730972 3441576 -6399345
37837f399345J169811Q331764K747455n375511m101588K857373M488082J054k449034
$$ -6399345 -5229534 3102230 5849685 474174 -3627414 -770041 3718041 3719095 1270061
37828A270061k81199R57389j353622k911959r86597J048289K98306r72733k75167
$$ 1270061 988862 1946251 592629 -2319330 -3305927 -2257638 -1959332 -2932065 -3207232
37819c207232R37475J175155K007875L826878L279842r55978m182578k338156
$$ -3207232 -2269757 -1094602 913273 4740151 8019993 7064015 2881437 543281
37811E43281J025662P4731l685645l474906K175887P149667O451689J852349k197249
$$ 543281 1568943 1643674 -2041971 -5516877 -3340990 3808677 10260366 12112715 9915466
37802I915466l653031k517469M54321K863001J802186k287922n365005m493404
$$ 9915466 6262435 3744966 4199287 7062288 8864474 6576552 1211547 -3281857
37794c281857n41483L967187O568885M550800k572115r405107q656614j038504
$$ -3281857 -3823340 143847 6712732 11263532 8691417 -713690 -9370304 -10408808
37786a0408808L846607K020o161834m342827N607819J3599605J1693894J756100
$$ -10408808 -6562201 -6560181 -12722015 -17064842 -11457023 2142582 13836476 15592576
37778A5592576q430960j2343065q406267o17816M136731K380647k191816l423174
$$ 15592576 7161616 -5181449 -13587716 -14205532 -10068801 -7688154 -9879970 -13303144
37770a3303144k17186L310070L862570J724691j416202l554470k066672L448077
$$ -13303144 -13520330 -10210260 -6347690 -4622999 -6039201 -9593671 -11660343 -8212266
37762h212266Q379904P543084K329344j184055j268068k083090n164745n743828
$$ -8212266 167638 7710722 10040066 8856011 7587943 5504853 340108 -5403720
37754e403720p42234N060526N457571J520308r14670L72398K797571L897790K734120
$$ -5403720 -6145954 -1085428 4372143 5892451 4977781 5350179 8147750 12045540 14779660
37745A4779660j636679p880455j0036292l557149O322021Q658603R56125o780072
$$ 14779660 13142981 5262526 -4773766 -8330915 -2008894 6649709 7605834 825762
37737H25762n440586J140981K795027k105313n337957j643292M139252M999810
$$ 825762 -4614824 -3473843 -678816 -2784129 -8122086 -9765378 -5626126 -626316
37729f26316J474377o25927R89439L237179L384451K145476P78927r94186k851029
$$ -626316 848061 222134 1211573 4448752 7833203 9978679 10757606 9763420 6912391
37720F912391k880257p98975L15586j946928n259454n331569j891025R96914O37948
$$ 6912391 4032134 3233159 3548745 1601817 -3657637 -8989206 -10880231 -9883317 -9245369
37711i245369r23405l19939K143802K752519m65265m287729l558361J880961N684480
$$ -9245369 -10168774 -10488713 -8344911 -5592392 -6057657 -10345386 -13903747 -12022786 -6338306
37702f338306K789871k878364k824123L819438Q120872L972260k778167l012018
$$ -6338306 -3548435 -6426799 -9250922 -5431484 2689388 6661648 3883481 871463
37694H71463K278311M497939R55957k409965j802788o86459j923713k476860P3232
$$ 871463 3149774 7647713 8603670 6193705 4390917 3704458 1780745 -696115 -622883
37685f22883K275813J175911L65354L464657N979426J198928q079120j1688971
$$ -622883 1652930 2828841 3194195 6658852 12638278 13837206 5758086 -5930885
37677e930885o074306J095925K162827q78900j422591J736612M111928K917462
$$ -5930885 -12005191 -10909266 -8746439 -9625339 -11047930 -9311318 -5199390 -2281928
37669b281928J47163j390315j429253q65116J58168J194954N41405k337256m407857
$$ -2281928 -2134765 -3525080 -4954333 -5819449 -5661281 -4466327 -3924922 -6262178 -10670035
37660a0670035j984190L600805O141483K124687m026872m821681J332606Q479188
$$ -10670035 -12654225 -9053420 -2911937 -787250 -4814122 -9635803 -8303197 175991
37652A75991R789500L877567m602466q606226m431435L604225O132633k39896
$$ 175991 9965491 13843058 9240592 634366 -3797069 -192844 5939789 5699893
37644E699893p336588n726973J930142N027799J097863j603415J180737K781257
$$ 5699893 -1636695 -7363668 -5433526 -405727 692136 -911279 269458 3050715
37636C050715k025210p309794n843717q15709Q57670N02719L199877O294584L437877
$$ 3050715 1025505 -6284289 -12128006 -12943715 -12086045 -11583326 -8383449 -2088865 1349012
37627A349012k662029k983599K904682N806502J846951k255135j545233l01030
$$ 1349012 -1313017 -4296616 -1391934 4414568 6261519 4006384 2461151 2160121
37619B160121k658607m655466j592478L468558M748336K186146p64276l303350
$$ 2160121 -498486 -5153952 -6746430 -3277872 1470464 3656610 2892334 -411016
37611d11016n644449m962490J045012Q642633J1198147O880892j38362m774386
$$ -411016 -6055465 -11017955 -9972943 -1330310 9867837 16748729 16610367 11835981
37603A1835981m692206q81787K796006K470238j295079l942782k986268n30100
$$ 11835981 7143775 6261988 9057994 11528232 10233153 6290371 3304103 2774003
37595B774003J281134K885589L648049R88089l849658m806921M1737M074154J792003
$$ 2774003 4055137 6940726 10588775 11576864 7727206 2920285 2962022 7036176 8828179
37586H828179k463399j779520K181541K806726m11449k581253k640996l483665
$$ 8828179 6364780 4585260 6766801 9573527 9162078 6580825 3939829 456164
37578D56164m294747j228484M494331P038597M819210J722218m80146l339138
$$ 456164 -3838583 -5067067 -572736 6465861 11285071 13007289 12527143 9188005
37570I188005n350650k822166J976346K261480k043551l583342k59377J307870
$$ 9188005 3837355 1015189 2991535 5253015 3209464 -373878 -633255 674615
37562F74615j436717j526886M287369P464029J271580o902175p162837l061034
$$ 674615 -762102 -2288988 1998381 9462410 10733990 3831815 -3331022 -6392056
37554f392056l824929o954197k867395O238731P603679j182654p071527j539567
$$ -6392056 -10216985 -17171182 -20038577 -13799846 -6196167 -7378821 -14450348 -15989915
37546a5989915O950471O929981J13519m219081l336501j277095j82039Q40219
$$ -15989915 -9039444 -2109463 -1995944 -6215025 -9551526 -10828621 -11010660 -10170441
37538a0170441J481838J252200K093933M808882N857058K638866j368407j926000
$$ -10170441 -8688603 -7436403 -5342470 -533588 5323470 7962336 6593929 4667929
37530D667929r26843k143569l573507r22781L843803M832114J536881j453413
$$ 4667929 3741086 1597517 -1975990 -2898771 945032 5777146 7314027 5860614
37522E860614k787000m597976n248244o20675O704662Q626539L881557K74169
$$ 5860614 3073614 -1524362 -6772606 -7393281 -688619 7937920 11819477 12093646
37514A2093646J578167J655181l515761p391961l817432J641405N57085m216765
$$ 12093646 13671813 15326994 11811233 4419272 601840 2243245 2800330 -1416435
37506a416435l609224K411218N566620L498728K320682M547795M879629M09705
$$ -1416435 -5025659 -2614441 2952179 6450907 8771589 13319384 18199013 18608718
37498A8608718m108984m740614m169082m892069l830182J236288O017033O160258
$$ 18608718 14499734 9759120 5590038 697969 -3132213 -1895925 4121108 10281366
37490A0281366M326691M894476N810718K290834m142536p011328m204502k77805
$$ 10281366 14608057 19502533 25313251 27604085 23461549 16450221 12245719 11967914
37482A1967914K40351k750505o743604q622384n523660J897563P583187O019840
$$ 11967914 12208265 9457760 2714156 -5908228 -11431888 -9534325 -1951138 4068702
37474D068702j87296l447456j730974l00150j997102k315980K523952Q163923
$$ 4068702 3881406 433950 -1297024 -1597174 -3594276 -5910256 -3386304 4777619
37466D777619P944719K654230j163243p35319P98646J219292K272096M456150
$$ 4777619 12722338 15376568 14213325 13478006 14276652 15495944 17768040 22224190
37458B2224190M011641j524466q062790r176009m099073J809722L871629K399699
$$ 22224190 26235831 24711365 16648575 7472566 3373493 5183215 9054844 11454543
37450A1454543N59905P02557K815241M212341J189658o063321j0935360p289441
$$ 11454543 12014448 12717005 15532246 19744587 20934245 14870924 3935564 -3353877
37442c353877Q88060K728275m274894q952483j781177J0297504J2682996L423840
$$ -3353877 -2465817 262458 -4012436 -12964919 -14746096 -4448592 8234404 11658244
37434A1658244n179971m866567p73501K17283K90188L639458O580561L154832
$$ 11658244 6478273 1611706 838205 1055488 1345676 4985134 11565695 14720527
37426A4720527m094570p430716n496887l648109l951398k666142J910123O076523
$$ 14720527 10625957 3195241 -2301646 -5949755 -9901153 -12567295 -10657172 -4580649
37418d580649O713161M929190K321395r78095l063161q88686L572424L742210
$$ -4580649 2132512 7061702 9383097 8405002 5341841 4453155 8025579 11767789
37410A1767789j628592m874390o67810M680593K237760n150451o449037N66726
$$ 11767789 10139197 5264807 4596997 9277590 11515350 6364899 -84138 482588
37402D82588N569765J370007n549482n685747o38403J333069o85760l80735L025788
$$ 482588 6052353 7422360 1872878 -3812869 -4451272 -3118203 -3803963 -4184698 -1158910
37393a158910K561872l669652p190587k073988M890733M601493J8284N76624O063853
$$ -1158910 1402962 -2266690 -9457277 -11531265 -6640532 -2039039 -2020755 -1444131 4619722
37384D619722P095353R50222m304772l637032k366109n080867o768443j894764
$$ 4619722 11715075 12665297 8360525 4723493 2357384 -2723483 -9491926 -11386690
37376a1386690N170751O979508M843674N200724P818237O734608J431288j762382
$$ -11386690 -6215939 763569 5607243 10807967 18626204 25360812 26792100 25029718
37368B5029718j1977J814263p93232n611436p883190o652014m396281k963724
$$ 25029718 25017741 26832004 26038772 20427336 12544146 5892132 1495851 -1467873
37360a467873j789344Q88002N341322Q491062O510045M42571l837181l405744
$$ -1467873 -3257217 -2369215 2972107 11463169 17973214 18415785 14578604 11172860
37352A1172860k019052k828762k497599J945713N441860J933408m593245n271370
$$ 11172860 9153808 6325046 3827447 5773160 11215020 13148428 8555183 3283813
37344C283813l93088J768869n56108l80002M341304O035969O99845m349264j993456
$$ 3283813 2890725 4659594 4103486 3723484 8064788 14100757 14800602 10451338 8457882
37335H457882L580727M235177J6326l151671l189186k464271k013197j274883
$$ 8457882 12038609 16273786 16290112 13138441 9949255 7484984 5471787 4196904
37327D196904j331205l401070n831311o181544m168904o3335O291954J2080763
$$ 4196904 2865699 -535371 -6366682 -12548226 -16717130 -16780465 -10488511 1592252
37319A592252J1681507M241817l048417l690361j53216J084990r72997k507073
$$ 1592252 13273759 17515576 14467159 10776798 10623582 11708572 10735575 8228502
37311H228502k098314j859643k891056l909936l455507r37082K689442M032274
$$ 8228502 6130188 4270545 1379489 -2530447 -5985954 -6923036 -4233594 -201320
37303b01320P33675l017550j74551P682167R738421J080279q993167r699925k699816
$$ -201320 532355 -2485195 -2659746 5022421 14760842 15841121 6847954 -2851971 -5551787
37294e551787L691446O994261Q641365O342583j092199o477468l055380L404778
$$ -5551787 -1860341 5133920 13775285 20117868 19025669 12548201 9492821 12897599
37286A2897599K893601k113559j318927M443205L890116m593705q958202l356899
$$ 12897599 15791200 13677641 12358714 16801919 20692035 16098330 7140128 3783229
37278C783229K370956n33222o065477m918734M65248J794741j256270k397208
$$ 3783229 6154185 5620963 -444514 -5363248 -4898000 -3103259 -4359529 -6756737
37270f756737N61727M092115N201155L651869N41849j514345j70789K019456l77222
$$ -6756737 -6195010 -2102895 3098260 6750129 7291978 5777633 5606844 7626300 7249078
37261G249078o452771q139031k187119M194903M529652K425152L423483M843536
$$ 7249078 796307 -7342724 -9529843 -5334940 -805288 1619864 5043347 9886883
37253I886883J861029k546165l012047k065575m778868p029911p74921J0411762
$$ 9886883 11747912 9201747 6189700 4124125 -654743 -7684654 -8459575 1952187
37245A952187J3316500M307920m629012l257017L169056L942456p22617j936204
$$ 1952187 15268687 19576607 14947595 11690578 14859634 18802090 18079473 16143269
37237A6143269K765963N563331O47502o428711o007810K102043P612133K967766
$$ 16143269 18909232 24472563 25120065 18691354 12683544 14785587 22397720 25365486
37229B5365486o918123j1396551p429641j142474K373009M085294N079400K966188
$$ 25365486 18447363 7050812 -378829 -1521303 851706 4937000 10016400 12982588
37221A2982588k208321m880570j982964J238334n30595l338839m06099N583956
$$ 12982588 10774267 5893697 3910733 5149067 4618472 1279633 873534 6457490
37213F457490N608186j337584o182248l471711J218550R86941k055826j165651
$$ 6457490 12065676 10728092 4545844 1074133 2292683 3279624 1223798 58147
37205E8147M543360R141297P720442J483360m386522n724321k784633P1465j214606
$$ 58147 4601507 13742804 21463246 22946606 18560084 12835763 10051130 10122595 8907989
37196H907989n611818p666319l603975M175375R209838P041140n64335o680255
$$ 8907989 3296171 -4370148 -7974123 -3798748 5411090 12452230 11887895 5207640
37188E207640n341561K029230P235471M156381l879880p818133l414929M500268
$$ 5207640 -133921 1895309 9130780 13287161 9407281 1589148 -1825781 2674487
37180B674487Q367690O023174J573675k78881N43622J81329l349423o352475l830772
$$ 2674487 11042177 17065351 18639026 18360145 18903767 19085096 15735673 9383198 5552426
37171E552426K725907N940731K427395k279716j864219J757763K351514p12374
$$ 5552426 8278333 14219064 16646459 14366743 12502524 14260287 16611801 15899427
37163A5899427k344047k40158K374839K616619J413572K84146j089542k954435
$$ 15899427 13555380 13315222 15690061 18306680 19720252 20004398 18914856 15960421
37155A5960421m405216m917887m463394k477092N41578J635880p70323l010449
$$ 15960421 11555205 6637318 2173924 -303168 238410 1874290 1103967 -1906482
37147a906482n81789M717421P009166M753143J467203j105949m052102n622619
$$ -1906482 -2488271 2229150 9238316 13991459 15458662 14352713 10300611 4677992
37139D677992j954203N069049P893172L796748j341907k695245l061420n813054
$$ 4677992 2723789 7792838 15686010 19482758 18140851 15445606 12384186 6571132
37131F571132p879793n192615L5399L104748L781731M117637L200514j71567k708584
$$ 6571132 -1308661 -6501276 -6465877 -3361129 420602 4538239 7738753 7567186 4858602
37122D858602n14435M145356N259813J012414m878328q141802o631635m15144
$$ 4858602 4344167 8489523 13749336 14761750 9883422 1741620 -4890015 -5305159
37114e305159O817145R036343M795422K5680m33257k46791m620783r846514q007787
$$ -5305159 1511986 10548329 15343751 15369431 14936174 14689383 10068600 222086 -7785701
37105g785701j20647M501907K115518j118422l43679J085384n78098k434380q29537
$$ -7785701 -7906348 -3404441 -1288923 -2407345 -2751024 -1665640 -2243738 -4678118 -5507655
37096e507655J688123J099890q14662l9681J889834J37642m522830n235698J354201
$$ -5507655 -3819532 -2719642 -3534304 -3573985 -1684151 -1546509 -6069339 -11305037 -9950836
37087i950836R474138J0561492L286684m690933m856475K836334R419370O733074
$$ -9950836 -476698 10084794 13371478 8680545 3824070 6660404 16079774 22812848
37079B2812848k675222q074078l766363L688268M458221j241673m117705L01013
$$ 22812848 20137626 12063548 8297185 11985453 16443674 15202001 11084296 11385309
37071A1385309M959340J740869o032769p707786o74499N336515J888643o137250
$$ 11385309 16344649 18085518 12052749 4344963 3670464 9006979 10895622 4758372
37063D758372p857463k189141J576453j127760l268220J527956P340727M293824
$$ 4758372 -3099091 -5288232 -3711779 -4839539 -8107759 -6579803 760924 5054748
37055E054748n500619r443783j744088Q982079J1749685O245865J07196j778592
$$ 5054748 -445871 -9889654 -11633742 -2651663 9098022 15343887 15451083 13672491
37047A3672491n43299J001274J329481J14812j485127j443747p5764p93606m900489
$$ 13672491 13129192 14130466 15459947 15574759 14089632 12645885 12570121 11776515 6876026
37038F876026p788342m306856L231711O873260L047193l286691n542431k873262
$$ 6876026 -912316 -5219172 -1987461 4885799 7932992 4646301 -896130 -3769392
37030c769392J204427M314732O369832P050374N442140K036136j218642l111087
$$ -3769392 -2564965 1749767 8119599 15169973 20612113 22648249 21429607 18318520
37022A8318520l785263l165265p79469K176487K645905o81898m759328n314046
$$ 18318520 14533257 11367992 10588523 12765010 15410915 14729017 9969689 4655643
37014D655643k202524O17711O27770l57838J8652P26609j54627r77158J510035
$$ 4655643 2453119 3070830 3698600 3340762 3359414 4086023 3931396 2954238 4464273
37005D464273N975182O433513N2791p953182r711818l384951N532197J0268173
$$ 4464273 10439455 16872968 16925759 8972577 -739241 -4124192 1408005 11676178
36997A1676178Q229889J814571l746950m053102M98154M473262L121366j829948
$$ 11676178 19906067 21720638 17973688 13920586 14418740 18892002 22013368 20183420
36989B0183420m193987j159113L268964L450563j161077n688057n188124M94225
$$ 20183420 15989433 14830320 18099284 21549847 20388770 14700713 9512589 10006814
36981A0006814O629612Q105950M546602M26600p21809n97551k297929m075470
$$ 10006814 16636426 24742376 29288978 29715578 28993769 28396218 26098289 22022819
36973B2022819j605960L690163M577086j365242o757528m550140J666288L642821
$$ 22022819 20416859 24107022 28684108 27318866 20561338 16011198 17677486 21320307
36965B1320307J132476O36638L055628J814873n049375r685380n706704K219550
$$ 21320307 22452783 23089421 26145049 27959922 22910547 13225167 7518463 9738013
36957I738013N715943M239196K807527K365916N4959k985007j985442L050243
$$ 9738013 15453956 19693152 22500679 24866595 24921554 21936547 19951105 23001348
36949B3001348O148888L984659j832j870636k319161l164510l441073k169408
$$ 23001348 29150236 33134895 33133063 31262427 28943266 25778756 22337683 20168275
36941B0168275j214126j923671j906152J230750N089934N062216N45666m368867
$$ 20168275 18954149 17030478 15124326 16355076 21445010 26507226 27052892 22684025
36933B2684025n688108k773950K180156N794564N636949K747798J038735K415594
$$ 22684025 16995917 14221967 16402123 22196687 27833636 30581434 31620169 34035763
36925C4035763M044506K642327m33726j573014q66692j539574l893438m460667
$$ 34035763 38080269 40722596 40288870 38715856 37849164 36309590 32416152 27955485
36917B7955485k164182p78045k818341m865632k708520J616747K687559L32547
$$ 27955485 25791303 25013258 22194917 17329285 14620765 16237512 18925071 19257618
36909A9257618l5439L629341O277702L780570j99797o9737K605012K219742o66473
$$ 19257618 19222179 22851520 29129222 32909792 32709995 32640258 35245270 37465012 36798539
36900C6798539o9936M177845M667806r40836m289522L79094N141261J34555r136169
$$ 36798539 36728603 40906448 45574254 44633418 40343896 40722990 45864251 45998806 36862637
36891C6862637q352381L543372J1737237P001691k392247n123577k270636q62583
$$ 36862637 28510256 32053628 43790865 50792556 48400309 43276732 41006096 40143513
36883D0143513r92600J132775L533446J990552o37640J386491N494770L939135
$$ 40143513 39150913 40283688 43817134 45807686 45170046 46556537 52051307 55990442
36875E5990442k593724m834603P7416L372260j562783q585633q105524j049841
$$ 55990442 53396718 48562115 48639531 52011791 50449008 41863375 33757851 32708010
36867C2708010L623933K168522m63886J64935J952806J714694J769648O399309
$$ 32708010 36331943 38500465 38036579 38201514 40154320 41869014 43638662 50037971
36859E0037971J3356079J4275402N550935n183560p663947j994603K369486K21914
$$ 50037971 63394050 77669452 83220387 78036827 70372880 68378277 70747763 70969677
36851G0969677l303221k161631J660462K991004J890051J525298J643952M16589
$$ 70969677 67666456 65504825 67165287 70156291 72046342 73571640 75215592 75632181
36843G5632181k69425J924962L517226m50802o866217o981823J117801R400572
$$ 75632181 75362756 77287718 80804944 80354142 73487925 66506102 67623903 77024475
36835G7024475J0454775N038314k119960p786910r578067n782454J395345O959783
$$ 77024475 87479250 92517564 90397604 82610694 73032627 67250173 68645518 75605301
36827G5605301R408477J1371288J2862793R868059K060748m095113l676348K57462
$$ 75605301 85013778 96385066 109247859 119115918 121176666 117081553 113405205 113662667
36819A13662667K443190L014120M838913P094981O529911K906081j073967l796135
$$ 113662667 116105857 119119977 123958890 131053871 137583782 140489863 139415896 135619761
36811A35619761n301416n086638k252425K679806P563747R581900O731517P03076
$$ 135619761 130318345 125231707 122979282 125659088 133222835 142804735 149536252 150239328
36803A50239328k490470J192723P210516P371212J660076j452138J935451N455279
$$ 150239328 147748858 148941581 156152097 163523309 165183385 163731247 165666698 171121977
36795A71121977L502907L07261K008082O048737N979236K412970J241426L511268
$$ 171121977 174624884 174932145 176940227 182988964 188968200 191381170 192622596 196133864
36787A96133864M719015L053461J432371J445186J257948J44850K26547K723663
$$ 196133864 200852879 203906340 205338711 206783897 208041845 208186695 208413242 211136905
36779B11136905N928342P422100N963199J771279k831752m348146j910671J540115
$$ 211136905 217065247 224487347 230450546 232221825 229390073 225041927 223131256 224671371
36771B24671371L715609N669462P745652P056455K886572L40806L271771P112377
$$ 224671371 228386980 234056442 241802094 248858549 251745121 252085927 255357698 262470075
36763B62470075M928747k011940o243558m836114j483569R68557L178435M551828
$$ 262470075 267398822 265386882 259143324 254307210 252823641 253792198 256970633 261522461
36755B61522461K444080k666736o356332n804216k309811J804035M851189M853631
$$ 261522461 263966541 261299805 254943473 249139257 246829446 248633481 253484670 258338301
36747B58338301J388085j971156j400263J400885J421893k392840o482922q372263
$$ 258338301 259726386 257755230 256354967 257755852 259177745 256784905 250301983 241929720
36739B41929720q474015p257196n288447m751076o062306m983555J147801O597480
$$ 241929720 233455705 226198509 220910062 216158986 210096680 205113125 206260926 212858406
36731B12858406L731607n296725j1117652j0281586p434285n151887j352604K407037
$$ 212858406 216590013 211293288 200175636 189894050 182459765 177307878 175955274 178362311
36723A78362311M47124o428077r507813n234158o77579j494175l370044j224230
$$ 178362311 178809435 172381358 162873545 157639387 156961808 155467633 152097589 150873359
36715A50873359J472118k25265l369487k834375r06869k855601o907876p085862
$$ 150873359 152345477 152120212 148750725 145916350 145009481 142153880 135246004 128160142
36707A28160142l740985l155468p146194j0130601p573382k011661J150917L93093
$$ 128160142 124419157 121263689 114117495 103986894 96413512 94401851 95552768 95945861
36699I5945861j363766j260896L52346J681040L138255O435945R335347N934473
$$ 95945861 94582095 93321199 93673545 95354585 98492840 104928785 114264132 120198605
36691A20198605m027966j1103102q103486j779814l085615r155943p698552J391727
$$ 120198605 116170639 105067537 96964051 95184237 92098622 82942679 75244127 76635854
36683G6635854M158554m144785r864628l108293N534066K339879p355805q791583
$$ 76635854 80794408 76649623 66784995 63676702 69210768 71550647 64194842 55403259
36675E5403259j268299L420381J169589r41188N63199J032121j833151m607149
$$ 55403259 54134960 57555341 58724930 57783742 58346941 59379062 57545911 52938762
36667E2938762n965125p799566q118663k536260O418430J0553343P477897K639373
$$ 52938762 46973637 39174071 31055408 28519148 34937578 45490921 52968818 55608191
36659E5608191k54298k387964l429808j093407K098517N22798m818155o733524
$$ 55608191 55353893 52965929 49536121 48442714 50541231 51064029 46245874 39512350
36651C9512350l138430N91951J593985K757923M402645K206112l781483p005709
$$ 39512350 36373920 36965871 38559856 41317779 45720424 47926536 44145053 37139344
36643C7139344m610258j559451j460255j539992l8785j37226k711063l415125
$$ 37139344 32529086 30969635 29509380 27969388 27930603 27793377 25082314 21667189
36635B1667189r46427L4661j845404j413549K550542L217013j979428m716875
$$ 21667189 20720762 20755423 18910019 17496470 20047012 23264025 21284597 16567722
36627A6567722R59741P963172P601705L181964K062402J941722k961740q183313
$$ 16567722 17527463 25490635 33092340 36274304 38336706 40278428 37316688 29133375
36619B9133375m993692L300456M832838j899960n997324k412655P06812k854756
$$ 29133375 24139683 27440139 32272977 30373017 24375693 21963038 22669850 19815094
36611A9815094o295642r59304R152147J2076473L640369p686930j0668014k583820
$$ 19815094 13519452 12560148 21712295 33788768 37429137 29742207 19074193 16490373
36603A6490373Q695112J2420385N645198l863398o913266l351657K66855J185516
$$ 16490373 25185485 37605870 43251068 39387670 32474404 29122747 29389602 30575118
36595C0575118K170502L167156n04558q589546j2087069m848260O207387R365778
$$ 30575118 32745620 35912776 35408218 26818672 14731603 9883343 16090730 25456508
36587B5456508L540007j806803p96983K572679L312031K947833M131980L777907
$$ 25456508 28996515 27189712 26392729 28965408 32277439 35225272 39357252 43135159
36579D3135159j953812r001605r225321k712193J024358l484634r493559p946048
$$ 43135159 41181347 32179742 22954421 20242228 21266586 17781952 8288393 342345
36571C42345m42609M113801K741438P91686J950660L420191K471138J059606J109238
$$ 342345 -100264 4013537 6754975 7546661 9497321 12917512 15388650 16448256 17557494
36562A7557494P73317j247074k403577q80375P78920L38566J24193K515761M925945
$$ 17557494 18330811 17083737 14680160 13799785 14578705 14917271 15041464 17557225 22483170
36553B2483170L782145K75031k383496m164769n834036m914184n1283L656062
$$ 22483170 26265315 26540346 24156850 19992081 14158045 9243861 9192578 12848640
36545A2848640Q72609m410307l552108L104087O016356J236320l450983j034628
$$ 12848640 13721249 9310942 5758834 8862921 14879277 16115597 12664614 11629986
36537A1629986L944382L299033j845852l655820k54009K160766j43007k937538
$$ 11629986 15574368 18873401 17027549 13371729 13117720 15278486 15135479 12197941
36529A2197941j634165J148908J75101l364757l099646K404147O376241L305430
$$ 12197941 10563776 11712684 11887785 8523028 5423382 7827529 14203770 17509200
36521A7509200k693722l617974R15185L815644J546450j599760j708829j115049
$$ 17509200 14815478 11197504 12112689 15928333 17474783 15875023 14166194 13051145
36513A3051145k614595l806024k245341j164028l789111o101870k681512L140243
$$ 13051145 10436550 6630526 4385185 3221157 -567954 -6669824 -9351336 -6211093
36505f211093L345446j919542m464860j204446K107616K169671L513706Q233475
$$ -6211093 -2865647 -4785189 -9250049 -10454495 -8346879 -6177208 -2663502 5569973
36497E569973R356288J576923q149841r209288k241211L160685L014604K063631
$$ 5569973 14926261 16503184 8353343 -855945 -3097156 63529 3078133 5141764
36489E141764K854776J166604m997348r569370o278824K544032R484074J0811481
$$ 5141764 7996540 9163144 4165796 -5403574 -11682398 -9138366 345708 11157189
36481A1157189P771492K614248j900514j855662L255359O830024K162174p190837
$$ 11157189 18928681 21542929 19642415 17786753 21042112 27872136 30034310 22843473
36473B2843473j0599437m800452K034080L219264K598739N188443O379338k88022
$$ 22843473 12244036 7443584 9477664 12696928 15295667 20484110 26863448 26575426
36465B6575426r383408r165533j3951M474626k558720j0900972q391096K183398
$$ 26575426 17192018 8026485 8012534 12487160 9928440 -972532 -9363628 -7180230
36457g180230Q488876N081677k739256p674216o747283j626416K524224J320135
$$ -7180230 1308646 6390323 3651067 -4023149 -10770432 -12396848 -9872624 -8552489
36449h552489k316213m75791P379184J1130855M700061l535103l263652J917188
$$ -8552489 -10868702 -11344493 -3965309 7165546 11865607 8330504 5066852 6984040
36441F984040J840828k888020l646183r5586L59593k121428K7483N509473L541204
$$ 6984040 8824868 5936848 2290665 2195079 2554672 433244 460727 5970200 9511404
36432I511404o775622j1524008l025709P668886P903116J277011j570998n1631
$$ 9511404 2735782 -8788226 -11813935 -4145049 3758067 5035078 3464080 3412449
36424C412449k58089k100786j321801Q35734N37144j36468K668316N610894K940167
$$ 3412449 3154360 1053574 -268227 567507 1104651 968183 3636499 9247393 12187560
36415A2187560k836026m525209j961818q28295j991223j643084n32641k979176
$$ 12187560 9351534 4826325 2864507 2036212 44989 -1598095 -2130736 -5109912
36407e109912o965484n213930K708699Q539745P541635M229754L390649L155641
$$ -5109912 -12075396 -17289326 -14580627 -6040882 1500753 5730507 9121156 12276797
36399A2276797M52197l126821m651628m196349k984892j390075o40948k097089
$$ 12276797 12728994 9602173 4950545 754196 -2230696 -3620771 -4261719 -6358808
36391f358808l384195k08887O244875Q866096L944640l548804o411500l069454
$$ -6358808 -9743003 -9951890 -3707015 5159081 9103721 5554917 -856583 -3926037
36383c926037K789521O412829M312361l142248r736666q604214j249492L447590
$$ -3926037 -1136516 5276313 9588674 6446426 -3290240 -11894454 -13143946 -9696356
36375i696356J247652j967636J49397M883299N380417R20958l138701l244278
$$ -9696356 -8448704 -10416340 -10266943 -5383644 -3227 917731 -2220970 -5465248
36367e465248o06652K283438L978254L660273J621913k61550o22640l29250p09708
$$ -5465248 -6071900 -3788462 189792 3850065 5471978 5210428 4587788 4258538 3548830
36358C548830j577113k300496k782541k089344J161927N301497N730919J329410
$$ 3548830 1971717 -328779 -3111320 -5200664 -4038737 1262760 6993679 8323089
36350H323089k227148O58455P154250Q611786J209644r198426j3348395p826177
$$ 8323089 6095941 6754396 13908646 22520432 23730076 14531650 1183255 -6642922
36342f642922K228470Q558414P577304K690956j085461k860512m049493l283107
$$ -6642922 -4414452 4143962 11721266 14412222 13326761 10466249 6416756 3133649
36334C133649J639796P177368O038992k125533q286031o043235m08354M87885
$$ 3133649 4773445 11950813 17989805 15864272 7578241 1535006 1126652 1614537
36326A614537k638068l250899l52190J119495j05306L89929M180458O408929L301061
$$ 1614537 -1023531 -4274430 -4626620 -3507125 -3612431 -3222502 957956 7366885 10667946
36317A0667946j991843m276435l292461k447496l042587l199870j735962l23383
$$ 10667946 8676103 4399668 1107207 -1340289 -4382876 -7582746 -9318708 -9642091
36309i642091j057833l037876k738845J453890O029720N939777J529347j319118
$$ -9642091 -10699924 -13737800 -16476645 -15022755 -8993035 -3053258 -1523911 -2843029
36301b843029N57357K905517Q12015l203685k797830K319790N727755L495479
$$ -2843029 -2285672 619845 1431860 -1771825 -4569655 -2249865 3477890 6973369
36293F973369j003167k531553k22177K864098L219408p80970o913178r283312
$$ 6973369 5970202 3438649 3216472 6080570 9299978 8519008 1605830 -7677482
36285g677482m216364L774582O373192K577104J64813M029003Q647803O258924
$$ -7677482 -11893846 -8119264 -1746072 831032 995845 5024848 13672651 19931575
36277A9931575j838964p419015o295322k013412L91355k12406j894924k421771
$$ 19931575 18092611 10673596 4378274 2364862 2756217 2543811 648887 -1772884
36269a772884q51090J283073P22564l433512p283822o264512q18409M718011P673834
$$ -1772884 -2623974 -1340901 -618337 -4051849 -11335671 -17600183 -18418592 -13700581 -6026747
36260f026747Q157654N826173J81153n678755o416058j327737L963952M768192
$$ -6026747 2130907 7957080 8138233 2459478 -3956580 -5284317 -1320365 3447827
36252C447827K800695J930275J889567n6285l364792m363296j703820J598625
$$ 3447827 6248522 8178797 10068364 10012079 6647287 2283991 580171 2178796
36244B178796J865596j524179n919856p299345l250884L955414Q224186N857447
$$ 2178796 4044392 2520213 -3399643 -10698988 -13949872 -9994458 -1770272 4087175
36236D087175R4176k868423j232012J824893L547315L741364K307004q53317l369168
$$ 4087175 4181351 1312928 80916 1905809 5453124 9194488 11501492 10648175 7279007
36227G279007k433793J82942l0723k784237k966107L50144J568280j694146l713968
$$ 7279007 4845214 5028156 4997433 2213196 -752911 -402767 1165513 -528633 -4242601
36218d242601n98846J957082j702559n889203j705830P328698R062534J218511
$$ -4242601 -4841447 -2884365 -4586924 -10476127 -12181957 -4853259 4209275 5427786
36210E427786n234770k909247K432256K918670k22425j941699k241579l586146
$$ 5427786 193016 -2716231 -283975 2634695 2412270 470571 -1771008 -5357154
36202e357154n144582n344163n341307m904432o9549R424157J5528248J1556447
$$ -5357154 -10501736 -15845899 -21187206 -26091638 -26161187 -16737030 -1208782 10347665
36194A0347665K422007k013350o73562o53469m823527q200902o944117l912798
$$ 10347665 12769672 10756322 10082760 9429291 4605764 -3595138 -10539255 -14452053
36186a4452053l352959m788568m208012R94845Q588307J1861590N704841n632812
$$ -14452053 -17805012 -22593580 -26801592 -25806747 -17218440 -5356850 347991 -5284821
36178e284821j0788846m950487L310460M090965n9372Q584M860256P141382N099002
$$ -5284821 -16073667 -21024154 -17713694 -13622729 -13682101 -13673517 -8813261 -1671879 3427123
36169C427123M245153N391136K474925n068751q539803l273332L448372L441213
$$ 3427123 7672276 13063412 15538337 10469586 1929783 -1343549 2104823 5546036
36161E546036j168949l803411l659323l490464k801106n4271K593019K873641
$$ 5546036 4377087 573676 -3085647 -6576111 -9377217 -9431488 -6838469 -3964828
36153c964828K918070M725413N328875K171627j136808q44737m55048m636192
$$ -3964828 -1046758 3678655 9007530 11179157 10042349 9197612 8742564 4106372
36145D106372r527935p759266p26987L300564K280601K095798M804258N094556
$$ 4106372 -5421563 -13180829 -13907816 -10607252 -8326651 -6230853 -1426595 3667961
36137C667961R94907j324206J856537M575097R80879m118461k428305M230336
$$ 3667961 4662868 3338662 5195199 9770296 10751175 6632714 4204409 8434745
36129H434745O190254M83333n212254m260382N10507K903541J962892L41040j453383
$$ 8434745 14624999 15108332 9896078 5635696 6146203 9049744 11012636 11353676 9900293
36120I900293m012505n042905j946391K928064M856773L756769L084622K374714
$$ 9900293 5887788 844883 -1101508 1826556 6683329 10440098 13524720 15899434
36112A5899434j992705p699728o702694J811173P224445K523373m340544k836400
$$ 15899434 13906729 6207001 -495693 1315480 8539925 11063298 6722754 3886354
36104C886354L184084K285815n274223q333834l497014P11466k99043o31830L180743
$$ 3886354 7070438 9356253 4082030 -4251804 -7748818 -7037352 -7336395 -7968225 -4787482
36095d787482N381290K367627p88241j074909l134201p370253m912937O523303
$$ -4787482 593808 2961435 2173194 1098285 -2035916 -9406169 -14319106 -7795803
36087g795803J4065266Q452765o9498J614106P439098L433207p106888q993472
$$ -7795803 6269463 14722228 14652730 16266836 23705934 27139141 20032253 11038781
36079A1038781j364339J666239l928966o255639K62164N369332J613879l827953
$$ 11038781 9674442 11340681 7411715 1156076 1418240 6787572 8401451 4573498
36071D573498l388441q35921o56074J125381O409564P323234n92090p701130l905712
$$ 4573498 1185057 349136 -306938 818443 7228007 14551241 13959151 6258021 2352309
36062B352309N212168P083726O59515m708259m288594j638469k17850j43847j314018
$$ 2352309 7564477 14648203 15307718 10599459 6310865 4672396 4454546 4310699 2996681
36053B996681k912624k080753J610874L796511K024779j9372M22576L47817j419582
$$ 2996681 84057 -1996696 -385822 3410689 5435468 5416096 5838672 6186489 4766907
36044D766907J46668N772235N890927m746627j4638924j0288454K889962Q398619
$$ 4766907 4913575 10685810 16576737 11830110 -2808814 -13097268 -10207306 -1808687
36036a808687L004980j814979n53685J74535k982485l966852k26987J674868j531849
$$ -1808687 1196293 -618686 -1172371 -997836 -3980321 -7947173 -8174160 -6499292 -8031141
36027h031141l365675P73151N453987M589152N56336j471155r61503O96116L183755
$$ -8031141 -11396816 -10623665 -5169678 -580526 -24190 -1495345 -2456848 -1760732 1423023
36018A423023L893746o36645o592787n113605L354303O871527l51362q413002
$$ 1423023 5316769 4680124 -1912663 -7026268 -3671965 3199562 2848200 -5564802
36010e564802p055487m71806K300613K378244N174659P242618K001525o202407
$$ -5564802 -12620289 -13092095 -10791482 -8413238 -3238579 4004039 6005564 -196843
36002a96843o924497p8744M777871M278685M021051N504358L016070l956928p074587
$$ -196843 -7121340 -7200084 -2422213 1856472 5877523 11381881 14397951 10441023 3366436
35993C366436k607282J566556j425536o104748l302062N539228J0396814O180444
$$ 3366436 759154 2325710 900174 -5204574 -8506636 -2967408 7429406 13609850
35985A3609850k129920o748254m931989o7024K126088r84102n762732o012004
$$ 13609850 11479930 4731676 -200313 -267337 1858751 874649 -4888083 -10900087
35977a0900087p80073M276693M742533K974745K996317L448575J62054o089298
$$ -10900087 -11680160 -7403467 -2660934 313811 3310128 6758703 6920757 831459
35969H31459r268000n658582J787491P322447P970900M639806N7692l300065m689367
$$ 831459 -8436541 -14095123 -12307632 -4985185 2985715 7625521 7683213 4383148 -306219
35960c06219n276274n914303m978209m85207N268291O230020K37307n961978l526521
$$ -306219 -5582493 -11496796 -16475005 -16960212 -11691921 -5461901 -5224594 -11186572 -14713093
35951a4713093O458010J2261685N474064p699655j3454651o950171L404981Q055469
$$ -14713093 -8255083 4006602 9480666 1781011 -11673640 -18623811 -15218830 -7163361
35943g163361O520436L311012j23296m041886n229306l93881O352161O505196
$$ -7163361 -642925 2668087 2544791 -1497095 -6726401 -7120282 -768121 5737075
35935E737075j014678p110029m457146K680293M822332J55534m230312l031932
$$ 5737075 4722397 -2387632 -6844778 -4164485 657847 813381 -3416931 -6448863
35927f448863O43795J071210j472662j598723K665840O209006L569975l079175
$$ -6448863 -5805068 -4733858 -6206520 -7805243 -5139403 1069603 4639578 1560403
35919A560403o071496j975653M327731O334071L395424n76848k901016l412674
$$ 1560403 -4511093 -6486746 -2159015 4175056 7570480 6993632 4092616 679942
35911F79942k115626O18388K539417J737260l86007j604033k932929n937108p340076
$$ 679942 -1435684 -817296 1722121 3459381 3073374 1469341 -1463588 -7400696 -14740772
35902a4740772k407753N908749Q025735O26623p585197p343666r80370K472269
$$ -14740772 -17148525 -11239776 -3214041 -2587418 -10172615 -17516281 -18496651 -16024382
35894a6024382O02356q39237J701304M738989M455207K528485K420848L576882
$$ -16024382 -15422026 -16261263 -14559959 -9820970 -5365763 -2837278 -416430 3160452
35886C160452K719309q36607m101108m257763j664948J089489J913038O88411
$$ 3160452 5879761 5043154 942046 -3315717 -4980665 -3891176 -1978138 -1289727
35878a289727j182823k148506j644064l92574L33785J27930O2949J118257K072562
$$ -1289727 -2472550 -4621056 -6265120 -6657694 -6323909 -6195979 -6133030 -5014773 -2942211
35869b942211O75883k382562l083277L08503L687157K577758r16918j409076R14971
$$ -2942211 -2266328 -4648890 -7732167 -7423664 -3736507 -1158749 -2075667 -3484743 -2569772
35860b569772R92692j565640j233678K883544L429781l226848q847001m672812
$$ -2569772 -1577080 -3142720 -4376398 -1492854 1936927 -1289921 -10136922 -14809734
35852a4809734M845406Q772830N982163M085299M255524m03682r752438j2471247
$$ -14809734 -9964328 -1191498 4790665 8875964 13131488 12727806 2975368 -9495879
35844i495879k902499Q099097P575783j335366n109033M94101O436181M998192
$$ -9495879 -12398378 -4299281 3276502 1941136 -3167897 -2673796 3762385 8760577
35836H760577q74309m537565m613085l494903j889081Q71728L478395L450521
$$ 8760577 7886268 3348703 -1264382 -4759285 -6648366 -5776638 -2298243 1152278
35828A152278R04468j056840l58567J107089l9969l527620m860151j384678L055274
$$ 1152278 2056746 999906 641339 1748428 1708459 -1819161 -6679312 -8063990 -5008716
35819e008716K890516p62084j344140K800865N149453J143829l914553k538776
$$ -5008716 -2118200 -2880284 -4224424 -1423559 3725894 4869723 955170 -1583606
35811a583606L290864M865282o59040p093814q406962n000448k42409L668132
$$ -1583606 1707258 6572540 5913500 -1180314 -9587276 -14587724 -14830133 -11162001
35803a1162001N164228L569724J235231J128164J746535n53134l872061k140490
$$ -11162001 -5997773 -2428049 -1192818 -64654 1681881 1128747 -2743314 -4883804
35795d883804M095901N942228o91331p405117m920610L479409P566349M924068
$$ -4883804 -787903 5154325 4462994 -2942123 -7862733 -4383324 3183025 8107093
35787H107093J806663J810644K324347J549867Q07573p11164n669931j1551841
$$ 8107093 9913756 11724400 14048747 15598614 16406187 15695023 10025092 -1526749
35779a526749j1446582m539886J150711J26317k905054j218787L840039O648347
$$ -1526749 -12973331 -17513217 -16362506 -16236189 -19141243 -20360030 -16519991 -9871644
35771i871644O508204O453323O085255K820276j156202m81760M314370N892282
$$ -9871644 -3363440 3089883 9175138 11995414 10839212 10357452 14671822 20564104
35763B0564104M27697o344615o675046r30203L388281J070405n405326r515218
$$ 20564104 20991801 14647186 7972140 7041937 10430218 11500623 6095297 -3419921
35755c419921p617300j828592K999979M282514L155266J474054n34588k422247
$$ -3419921 -11037221 -12865813 -9865834 -5583320 -2428054 -954000 -1488588 -3910835
35747c910835j657493L278536Q918742R514736L980433k944951o815457p362505
$$ -3910835 -5568328 -2289792 6628950 16143686 20124119 17179168 10363711 3001206
35739C001206n587621j273553M189506O356501L051956j350397j468397P63690
$$ 3001206 -2586415 -3859968 329538 6686039 9737995 8387598 6919201 7682891
35731G682891j323855q005388j0601950l333976O796587P740188j391580q320515
$$ 7682891 6359036 -1646352 -12248302 -15582278 -8785691 -1045503 -2437083 -10757598
35723a0757598l780642N995974Q147905J061063m309571j166440L740261K047641
$$ -10757598 -14538240 -8542266 -394361 666702 -3642869 -4809309 -1069048 978593
35715I78593k454296q02460M756653L102097o598923j0455204k24278J2350371
$$ 978593 -1475703 -2278163 2478490 5580587 -1018336 -11473540 -11697818 652553
35707F52553J1206782j069397p856087k872334L039489O30003m653402l634092
$$ 652553 11859335 10789938 2933851 61517 3101006 3731009 -922393 -4556485
35699d556485K189777N033784L387042J810788J621198j47487l618323n035068
$$ -4556485 -2366708 2667076 6054118 7864906 9486104 9338617 5720294 685226
35691F85226l342330k058915l280221m340676k217659J988975M658875L665148
$$ 685226 -2657104 -4716019 -7996240 -12336916 -14554575 -12565600 -7906725 -4241577
35683d241577p4930l377485l006707J116108N235437O037037M458496K931799
$$ -4241577 -4316507 -7693992 -10700699 -9584591 -4349154 1687883 6146379 9078178
35675I078178Q91166k954729n666955l210769J727184J740537l952272p048712
$$ 9078178 9969344 7014615 1347660 -1863109 -135925 1604612 -2347660 -9396372
35667i396372k423996L724162L338324j410862k598656O17990J956223n03344
$$ -9396372 -11820368 -8096206 -4757882 -6168744 -8767400 -8149410 -6193187 -6696531
35659f696531j375588K147644N161807L240580k34244L75894M159718N547210
$$ -6696531 -8072119 -5924475 -762668 2477912 2243668 2619562 6779280 12326490
35651A2326490K731206q48952k681977m090339o124328o417358k425219M201986
$$ 12326490 15057696 14208744 11526767 7436428 1312100 -5105258 -7530477 -3328491
35643c328491Q843016Q879413N705145K024077j024197l497862n047841n102059
$$ -3328491 5514525 14393938 20099083 22123160 21098963 17601101 12553260 7451201
35635G451201l904873k083661J54073K057692J698509j383327l813209k043743
$$ 7451201 3546328 1462667 1616740 3674432 5372941 3989614 176405 -1867338
35627a867338J798704J977756k089398m148816n96371L633144K889467l64628
$$ -1867338 -68634 1909122 -180276 -4329092 -4925463 -1292319 1597148 1232520
35619A232520n19302J356658K71859k491885p77894M983844O738147J291311m390790
$$ 1232520 713218 2069876 2341735 -150150 -928044 4055800 10793947 12085258 7694468
35610G694468l831972K69830K239561J720778Q65914p96220l175657k675269J620499
$$ 7694468 3862496 4132326 6371887 8092665 8958579 8162359 4986702 2311433 3931932
35601C931932L805065k77887n066012l369051J814956K354570j248637j189083
$$ 3931932 7736997 7459110 2393098 -975953 839003 3193573 1944936 755853
35593G55853L669584N726103J799747j728154k25346J743940p80374m411954l655061
$$ 755853 4425437 10151540 11951287 10223133 9997787 11741727 10961353 6549399 2894338
35584B894338l59779k62893l430169m400497m28262N269112P910440N500393l89122
$$ 2894338 2534559 2271666 -1158503 -5559000 -5987262 -718150 7192290 12692683 12303561
35575A2303561n620008o293143k612241J175489J965389R44905L44861o9583j150982
$$ 12303561 6683553 390410 -2221831 -1046342 919047 1863952 2208813 2139230 988248
35566I88248j719387l61407K103922L983086M447364K528548k504642p974711
$$ 988248 -731139 -1092546 1011376 4994462 9441826 11970374 9465732 1491021
35558A491021q796078m188879N82487J986720K761655M672512K867909n469002
$$ 1491021 -7305057 -11493936 -10911449 -8924729 -6163074 -1490562 1377347 -4091655
35550d091655j1979463o539214O461611J2154873N975793p98906O01267M003903
$$ -4091655 -16071118 -22610332 -16148721 -3993848 1981945 1183039 1784306 5788209
35542E788209J056846l680331j237987M644872K154661q473975j2956868m159988
$$ 5788209 6845055 3164724 1926737 6571609 8726270 252295 -12704573 -16864561
35534a6864561O645779O569879m22686j781491L298635M443035q20712k169821
$$ -16864561 -10218782 -3648903 -4071589 -5853080 -2554445 1888590 1067878 -1101943
35526a101943N756781J2735977P933173l338268q000220m611594k730370n495306
$$ -1101943 4654838 17390815 25323988 21985720 13985500 9373906 6643536 1148230
35518A148230n549651L10023M419371R24258m577659m395428L4860L144635M644031
$$ 1148230 -4401421 -4091398 327973 1252231 -3325428 -7720856 -7685996 -4541361 102670
35509A02670O207766M664703k475459q954874o888978O80973M076405K019643
$$ 102670 6310436 10975139 8499680 -455194 -7344172 -6663199 -2586794 -567151
35501e67151J744422M429975K545195n397418r207322k495801N821288M160633
$$ -567151 1177271 5607246 8152441 2755023 -6452299 -8948100 -3126812 1033821
35493A033821m335623o861877K26658P526212O971885J424976j945377j195406
$$ 1033821 -3301802 -10163679 -9937021 -2410809 4561076 5986052 4040675 2845269
35485B845269O10357Q48123n55422k073646j623623J460060M366794L119870j746331
$$ 2845269 3455626 4303749 3748327 1674681 51058 1511118 5877912 8997782 7251451
35476G251451m614508k051045K086875K145195q83806j198864K199517L729448
$$ 7251451 2636943 585898 2672773 4817968 3934162 2735298 4934815 8664263
35468H664263Q66471p13131L506312P575819L032102o367330p750259J736871
$$ 8664263 9530734 8817603 12323915 19899734 22931836 16564506 8814247 10551118
35460A0551118R015384L455732p504383r442272j613923L865702R58346l213385
$$ 10551118 19566502 23022234 15517851 6075579 4461656 8327358 9285704 6072319
35452F072319j553671K439714J787949k924047n247034k340879J991190K798891
$$ 6072319 4518648 6958362 8746311 5822264 575230 -1765649 225541 3024432
35444C024432l19785l133001j711420K606338M507309J894278j071238p69581
$$ 3024432 2704647 -428354 -2139774 466564 4973873 6868151 5796913 5027332
35436E027332k69543l634835p303728m412187L633344P968795N098300R77309
$$ 5027332 4757789 1122954 -6180774 -10592961 -6959617 1009178 6107478 7084787
35428G084787O79055J773582P97811q71883j212894j429444k185153j693061m29615
$$ 7084787 7763842 9537424 10335235 9463352 8250458 6821014 4635861 2942800 2513185
35419B513185j525652l746633j386706N371383Q125569L023877k598581k434342
$$ 2513185 987533 -2759100 -4145806 1225577 9351146 12375023 9776442 7342100
35411G342100j288121m879024p931981l033962M881702M790668l206444q397936
$$ 7342100 6053979 1174955 -6757026 -9790988 -4909286 -118618 -3325062 -11722998
35403a1722998n504323L52265M005821N672806N798860L369428J51439p13073
$$ -11722998 -17227321 -16875056 -12869235 -7196429 -1397569 1971859 2123298 1410225
35395A410225k72969j253606j674171J290228L487843o58972o693988n224723
$$ 1410225 1137256 -116350 -1790521 -500293 2987550 2328578 -4365410 -9590133
35387i590133K229024M522370j122721m997562j360121L615009M501626M760360
$$ -9590133 -7361109 -2838739 -3961460 -8959022 -10319143 -6704134 -2202508 2557852
35379B557852O479369M205866l349849o794647n14910O380213M003179k394061
$$ 2557852 9037221 13243087 9893238 3098591 2583681 8963894 12967073 10573012
35371A0573012k299711J860756J17026o396659o955901l0254L622813j539661
$$ 10573012 8273301 10134057 10251083 3854424 -3101477 -3131731 491082 -1048579
35363a048579p618182o584729j741549m36377k851229l987571j862098J643705
$$ -1048579 -8666761 -15251490 -16993039 -17429416 -20280645 -24268216 -26130314 -24486609
35355b4486609M942187P308463P361768M620820J417527N65396J853814K831943
$$ -24486609 -19544422 -12235959 -4874191 -253371 1164156 1729552 3583366 6415309
35347F415309K445861K007253K471556K338247n02776n156170p647141n547844
$$ 6415309 8861170 10868423 13339979 15678226 15175450 10019280 2372139 -3175705
35339c175705j236958J390105K046322K951492L919437K853838O97708P12052
$$ -3175705 -4412663 -3022558 -976236 1975256 5894693 8748531 9446239 10158291
35331A0158291K315052J327847k426829m161657k791963l207405o397789n548930
$$ 10158291 12473343 13801190 11374361 7212704 4420741 1213336 -5184453 -10733383
35323a0733383K108431P622109K988766n138915m829270K663819N451835j78114
$$ -10733383 -8624952 -1002843 1985923 -3152992 -7982262 -5318443 133392 -44722
35315d4722n496668m134036K07865K923395M975018O765185M863705o59937l604750
$$ -44722 -5541390 -9675426 -9467561 -6544166 -1569148 5196037 10059742 9399805 5795055
35306E795055j142193J079111j726952n591096m745404p51972J237149O25447
$$ 5795055 4652862 5731973 4005021 -1586075 -6331479 -7083451 -5846302 -5220855
35298e220855j54986j297857l671074m432584q24820L794386L699011n58191k671764
$$ -5220855 -5375841 -6673698 -10344772 -14777356 -15602176 -11807790 -8108779 -8666970 -11338734
35289a1338734N12767N203168O132401K464284k138238l156797Q16709O255831
$$ -11338734 -10825967 -5622799 509602 2973886 835648 -2321149 -1504440 4751391
35281D751391P877793M716499Q97961p46150k249848n331001o806385l345567
$$ 4751391 12629184 17345683 18243644 17497494 15247646 9916645 3110260 -235307
35273b35307K423670N265560M244365J628391k197771o950035q211561k392840
$$ -235307 2188363 7453923 11698288 13326679 11128908 4178873 -4032688 -6425528
35265f425528N053426M427826m323966j0384025p033042j62756K059408P24889
$$ -6425528 -1372102 3055724 -1268242 -11652267 -18685309 -18848065 -16788657 -16063768
35257a6063768J444157L942764L956266J956368K031928L670609K517994p63116
$$ -16063768 -14619611 -10676847 -6720581 -4764213 -2732285 938324 3456318 2693202
35249B693202l31778M412528N943081O5611o280641m577288K433274M495282j644520
$$ 2693202 2361424 6773952 12717033 12782644 6502003 1924715 4357989 8853271 7208751
35240G208751q545839q983977m200122L37487K000717J202893j065974k637270
$$ 7208751 -1337088 -10321065 -14521187 -14183700 -12182983 -10980090 -12046064 -14683334
35232a4683334m81498M925502Q278971N979792J445328p2681M70072j743935o378165
$$ -14683334 -15164832 -10239330 -1960359 4019433 5464761 5392080 5862152 4118217 -2259948
35223b259948p569496l332236Q21886M49351q34367K573497Q652925R792671L470127
$$ -2259948 -9829444 -13161680 -12339794 -11890443 -12724810 -10151313 -1498388 8294283 11764410
35214A1764410m210842o518103l600599j43040J314275J654534J372282p82704
$$ 11764410 7553568 1035465 -2565134 -2708174 -1393899 260635 1632917 850213
35206H50213m567877o408427l159822L104968O461631L928131p95156j811292
$$ 850213 -3717664 -10126091 -13285913 -10180945 -3719314 208817 -586339 -2397631
35198b397631J543067L659942k79837p469825r615223k605602P484068J0451056
$$ -2397631 -854564 2805378 2525541 -4944284 -14559507 -17165109 -9681041 770015
35190G70015L971262l617597m216310j59154N54335l299848m860972m49662M760363
$$ 770015 4741277 1123680 -3092630 -3251784 -2697449 -5997297 -10858269 -11307931 -6547568
35181f547568N118452K458698J165998L34783l127257o957064n838913J66352
$$ -6547568 -1429116 1029582 2195580 2530363 -596894 -7553958 -13392871 -13226519
35173a3226519N577844P247565O585769M559668L93747m343943n924856l678249
$$ -13226519 -7648675 -401110 6184659 10744327 11138074 6794131 869275 -2808974
35165b808974k93407L210085P260430Q467804J914323r269088j4112774p687133
$$ -2808974 -3102381 107704 7368134 15835938 17750261 8481173 -5631601 -13318734
35157a3318734J600307L625215j67490j317823K274639N041171L724251J274046
$$ -13318734 -11718427 -8093212 -8260702 -9578525 -7303886 -2262715 1461536 2735582
35149B735582N77551L64133j089657k520762j933282L34245K324179K751469J849971
$$ 2735582 3313133 3677266 2587609 66847 -1866435 -1532190 791989 3543458 5393429
35140E393429Q81434Q15691Q93936n94986l335467m526572k951970j468355k829168
$$ 5393429 6274863 7090554 7984490 7389504 4054037 -472535 -3424505 -4892860 -7722028
35131g722028m662598k256592L908054P254716L347739l619641n409811j36820
$$ -7722028 -12384626 -14641218 -10733164 -3478448 -130709 -3750350 -9160161 -9296981
35123i296981N041328L236661k570026l273002L174787P785616K935330o169061
$$ -9296981 -4255653 -1018992 -3589018 -6862020 -3687233 4098383 7033713 864652
35115H64652q472454k537548K676797J781232p92772k65170J074809N2071q11315
$$ 864652 -7607802 -10145350 -7468553 -5687321 -6480093 -6745263 -5670454 -5618383 -6429698
35106f429698J440902L593936J160454l592271m500301l08195M479326O103413
$$ -6429698 -4988796 -1394860 -234406 -3826677 -8326978 -8635173 -4155847 1947566
35098A947566M677039K023247j17411p33794p26795j925268l724953l636702k076899
$$ 1947566 6624605 8647852 8530441 7796647 7069852 5144584 1419631 -2217071 -4293970
35089d293970k116421l243620j420639K614761K730379j380948j353801N556715
$$ -4293970 -6410391 -9654011 -11074650 -8459889 -5729510 -7110458 -8464259 -2907544
35081b907544Q959558J099645q721914p274785K101475N830987J952613L32943
$$ -2907544 6052014 7151659 -1570255 -8845040 -6743565 -912578 1040035 1372978
35073A372978L365140K709096l711126p089189l593152n09960j704537o35248
$$ 1372978 4738118 7447214 3736088 -3353101 -6946253 -7456213 -9160750 -9795998
35065i795998N648842Q556584K542399l747643j001736N487810N199256k65774
$$ -9795998 -4147156 4409428 6951827 3204184 2202448 7690258 12889514 12623740
35057A2623740j181121L443964M882272q13648p503867q843476n727419k432483
$$ 12623740 11442619 14886583 19768855 18955207 11451340 2607864 -3119555 -5552038
35049e552038q96291l51422Q36724L722630P170132Q184294N240957k7273n091752
$$ -5552038 -6448329 -6799751 -5963027 -2240397 4929735 13114029 18354986 18327713 13235961
35040A3235961p986294o493709k83135N408788L842937l631657q021672n128657
$$ 13235961 5249667 -1244042 -1527177 3881611 7724548 4092891 -3928781 -9057438
35032i057438q88157r71704k390104m23072L000232L919612L265026K857836L45005
$$ -9057438 -9945595 -10917299 -13307403 -13730475 -10730243 -6810631 -3545605 -687769 -342764
35023c42764n155619q066628m297346J196704K296317J533938L760332N919758
$$ -342764 -5498383 -13565011 -17862357 -16665653 -14369336 -12835398 -9075066 -3155308
35015c155308L087872m14575K697280Q895183Q276784N81585n225456n999691
$$ -3155308 -67436 -482011 2215269 11110452 19387236 19968821 14743365 8743674
35007H743674o571489p301510k910243M678955N815950q61508m562217L65071
$$ 8743674 2172185 -5129325 -8039568 -3360613 2455337 1593829 -2968388 -2603317
34999b603317N270415K045189l904104l877561L08042K137056K330963M723887
$$ -2603317 2667098 4712287 808183 -3069378 -2761336 -624280 1706683 6430570
34991F430570O018739O58220p261866p674531M14355O865060M610139j754708
$$ 6430570 12449309 13107529 5845663 -1828868 -1414513 5450547 10060686 8305978
34983H305978m154258j909133n17953k660938m586926j832165L811455N754101
$$ 8305978 4151720 2242587 1724634 -936304 -5523230 -7355395 -3543940 2210161
34975B210161J683359k152088O25742O478012O574261N10862k776366N00899K635424
$$ 2210161 3893520 1741432 2367174 8845186 15419447 15930309 13153943 13654842 16290266
34966A6290266k538134q640780o620483P21709L763234J682739K096139O006135
$$ 16290266 13752132 5111352 -1509131 -787422 2975812 4658551 6754690 12760825
34958A2760825M632696n552149j4368759j0949787R11486P852327M559394j001666
$$ 12760825 17393521 11841372 -2527387 -13477174 -12565688 -4713361 -153967 -1155633
34950a155633k07533M676409M903574k150400r261839q256004M84486Q758411
$$ -1155633 -1363166 3313243 8216817 6066417 -3195422 -11451426 -10966940 -2208529
34942b208529R138424J660632o718909q347315k090439M799142M275659k133896
$$ -2208529 6929895 8590527 1871618 -6475697 -8566136 -3766994 508665 -1625231
34934a625231m526929J366004O867910K838620n580760o024813J832487N662402
$$ -1625231 -6152160 -4786156 2081754 4920374 -660386 -6685199 -4852712 809690
34926H09690J08704n312567k648507J857919k19976m549087k011724M945821N980200
$$ 809690 918394 -4394173 -7042680 -5184761 -5404737 -9953824 -11965548 -7019727 -1039527
34917a039527m29135n510021m431478j384085r9815P69016J306658j324435n555405
$$ -1039527 -1468662 -6978683 -11410161 -12794246 -12894061 -12125045 -10818387 -12142822 -17698227
34908a7698227m825783K161327P957746P051734L356656K633127L539168J575629
$$ -17698227 -22524010 -20362683 -12404937 -5353203 -1996547 636580 4175748 5751377
34900E751377k734049n173533m288380j873840N47299J979985J209976q73702
$$ 5751377 3017328 -2156205 -6444585 -8318425 -7771126 -5791141 -4581165 -5454867
34892e454867r61898J589052K726673K37397j657547J040367M588686K720997
$$ -5454867 -6416765 -4827713 -2101040 -1863643 -3521190 -2480823 2107863 4828860
34884D828860l230348o267124m481224k636973k891088j449096L395885O710813
$$ 4828860 1598512 -4668612 -9149836 -11786809 -14677897 -16126993 -12731108 -6020295
34876f020295M358689j24062p76008K142356L571924J631911n21895j96623J283713
$$ -6020295 -1661606 -1785668 -2561676 -419320 3152604 4784515 4262620 4065997 5349710
34867E349710Q63924k638149p148703q369146l658933L513311N529111k2595n660022
$$ 5349710 6213634 3575485 -3573218 -11942364 -15601297 -12087986 -6558875 -6581470 -12241492
34858a2241492l218037M422603P066566K036445k303566J91558M315432K429336
$$ -12241492 -15459529 -11036926 -3970360 -1933915 -4237481 -4045923 269509 2698845
34850B698845l643345o307697l823961r93638l22951K43701J352931R40110n00410
$$ 2698845 -944500 -7252197 -11076158 -12069796 -12392747 -12149046 -10796115 -9856005 -10356415
34841a0356415L57689L474065M833872L441651K863810L867469K177598l062989
$$ -10356415 -9998726 -6524661 -1690789 1750862 4614672 8482141 10659739 7596750
34833G596750n288683k92191N494161L261896n184679r820754o047356P76603
$$ 7596750 2308067 2015876 7510037 10771933 5587254 -4233500 -10280856 -9504253
34825i504253M038174L003854N58614j078440r91914M23792J177202K20858k2013
$$ -9504253 -5466079 -2462225 -1903611 -2982051 -3973965 -3550173 -2372971 -2152113 -2174126
34816b174126K783196N441157K298037n591302r672944m677742M127222P805142
$$ -2174126 609070 6050227 8348264 2756962 -6915982 -11593724 -7466502 338640
34808C38640M699331O16384o9427R02239K15452j359599k54623L989360O788248
$$ 338640 5037971 5654355 5584928 6487167 6702619 5343020 5088397 9077757 15866005
34799A5866005L926630k477970o034595m082949n13002N53325L02418J672652
$$ 15866005 19792635 17314665 11280070 7197121 6684119 7237444 7539862 9212514
34791I212514L496696K479616r57324l522943m627299o216184p643144o106705
$$ 9212514 12709210 15188826 14231502 10708559 6081260 -134924 -7778068 -13884773
34783a3884773k501071j148192k339202q68332N383033J0691991R158239K946562
$$ -13884773 -16385844 -17534036 -19873238 -20741570 -15358537 -4666546 4491693 7438255
34775G438255j485210k188035k045238k507262k036612j95153J004486K78155
$$ 7438255 5953045 3765010 1719772 -787490 -2824102 -3019255 -2014769 -1736614
34767a736614j264807j890025o55416K414457N365074M436840j779181q474220
$$ -1736614 -3001421 -4891446 -5546862 -3132405 2232669 6669509 4890328 -3583892
34759c583892q283446K8606R015122J0360104L810816l275215m453284n37010
$$ -3583892 -11867338 -11838732 -2823610 7536494 11347310 8072095 3618811 3081801
34751C081801K675921J506488k128137m051929k866118m68509J202993J787226
$$ 3081801 5757722 7264210 5136073 1084144 -1781974 -2250483 -1047490 739736
34743G39736J172823q75951k975044k335178J589923N216641M574170K30211l243597
$$ 739736 1912559 1036608 -1938436 -4273614 -2683691 2532950 7107120 7337331 4093734
34734D093734k523756J072211L508423K428655o67111k410469j595831p19707
$$ 4093734 1569978 2642189 6150612 8579267 7912156 5501687 3905856 3186149
34726C186149k753622o806517q428036m535575L007498Q914247Q751216K302503
$$ 3186149 432527 -6373990 -14802026 -19337601 -16330103 -7415856 1335360 3637863
34718C637863n583535p994031k431001N423555P263849K174527k337552r16969
$$ 3637863 -1945672 -9939703 -12370704 -6947149 316700 2491227 153675 -763294
34710g63294K187559J26018n284021n414754K204230R024951O573024j997450
$$ -763294 1424265 1550283 -3733738 -9148492 -6944262 2080689 8653713 6656263
34702F656263o227503k269493L002526K420765k154555m113594j885895N40544
$$ 6656263 428760 -1840733 1161793 3582558 1428003 -2685591 -4571486 -4030942
34694d030942J100020J770259K939247J750024j712492k405157J568513M083710
$$ -4030942 -2930922 -1160663 1778584 3528608 1816116 -589041 979472 5063182
34686E063182j88094o303774n425751J921208O699146M449398l48999l202282
$$ 5063182 4875088 -1428686 -6854437 -4933229 1765917 6215315 5866316 2664034
34678B664034m749576n366819k689210K222516L423013j015541m847302k922018
$$ 2664034 -2085542 -7452361 -10141571 -7919055 -4496042 -5511583 -10358885 -13280903
34670a3280903J100356J303264j431671k498518j290297n8532J307077L658740
$$ -13280903 -12180547 -10877283 -12308954 -14807472 -16097769 -16156301 -14849224 -11190484
34662a1190484M863479L126380J090365J439306J729707q23521l028763p55917
$$ -11190484 -6327005 -3200625 -2110260 -670954 1058753 235232 -2793531 -3549448
34654c549448K957733K373190p59465K47267N341876P130087K439992l450487
$$ -3549448 -591715 1781475 1022010 1269277 6611153 13741240 16181232 12730745
34646A2730745n704790n876491o615401o629288l922161N07575M539478O828375
$$ 12730745 7025955 1149464 -5465937 -12095225 -16017386 -15509811 -10970333 -4141958
34638d141958N752403O46586m955039n692844j199521L288679L726623Q56119
$$ -4141958 1610445 2257031 -2698008 -8390852 -9590373 -6301694 -2575071 -1718952
34630a718952k771805m907285l315731J462127L967909N55511l003356J363434
$$ -1718952 -4490757 -9398042 -12713773 -11251646 -7283737 -6728226 -9731582 -8368148
34622h368148R886194J0097469r2137p584614l175540N118019N329330q39796
$$ -8368148 1518046 11615515 11523378 3938764 763224 5881243 11210573 10370777
34614A0370777l417389q00464L168l171139m424683k34328N099075O217176L406381
$$ 10370777 6953388 6152924 6156092 2984953 -1439730 -1674058 3425017 9642193 13048574
34605A3048574O69380L36924Q35179j196617n886319p582426j196069Q335901
$$ 13048574 13717954 14054878 14890057 13693440 7807121 224695 -971374 7364527
34597G364527R283356j064701j0761583q824637N9075L825958L63223k679923
$$ 7364527 16647883 15583182 4821599 -4003038 -3943963 -118005 245218 -2434705
34589b434705j614862j11982l30737k04397M65139k95774p48933K405294N810262
$$ -2434705 -4049567 -4161549 -4492286 -4696683 -4231544 -4527318 -5276251 -2870957 2939305
34580B939305K374479o344256r915302l961597L366594L773136k21455j626622
$$ 2939305 5313784 -1030472 -10945774 -14907371 -11540777 -7767641 -7989096 -9615718
34572i615718N79092L140470N235130P361941P297250K913728l261306o814983
$$ -9615718 -9036626 -5896156 -661026 6700915 13998165 16911893 13650587 6835604
34564F835604o861587n208852k437593J580137N028097N282871J842952l433565
$$ 6835604 -25983 -5234835 -7672428 -6092291 -1064194 4218677 6061629 2628064
34556B628064p423077o619986k47038O542538O744528N15228m330816k936743
$$ 2628064 -4795013 -11414999 -11662037 -5119499 1625029 2140257 -2190559 -5127302
34548e127302N74316P79270p89061K17623L104215M022200K549594J010151k12984
$$ -5127302 -4552986 -3773716 -4562777 -4345154 -1240939 2781261 5330855 6341006 6128022
34539F128022j580675j112592K466082N467622L687440o55732k107366n83149
$$ 6128022 4547347 3434755 5900837 11368459 15055899 14400167 12292801 11709652
34531A1709652n82648k608443k109448K281941N668687M015130n04654l436455
$$ 11709652 11127004 8518561 6409113 8691054 14359741 18374871 17870217 14433762
34523A4433762l475336k017957n18312j02806j293955k778166k541152r14854
$$ 14433762 10958426 8940469 8422157 8319351 7025396 4247230 1706078 791224
34515G91224l90541k044284m079897l818103L83655P645441J2777430Q995386
$$ 791224 400683 -1643601 -5723498 -9541601 -9157946 -1512505 11264925 20260311
34507B0260311l152337j2446447r033671J917881O350168N66480m964184k747956
$$ 20260311 17107974 4661527 -4372144 -2454263 3895905 4462385 -501799 -3249755
34499c249755J208020o37938m246874j571655N033817O153641L18938m078878
$$ -3249755 -2041735 -2679673 -6926547 -8498202 -3464385 2689256 3008194 -1070684
34491a070684j908403K081456J728108j977865l836791j724637J863382L136134
$$ -1070684 -2979087 -897631 830477 -1147388 -4984179 -6708816 -4845434 -1709300
34483a709300L63843m171307n258314k24910O680076Q424163L987367m73094k38486
$$ -1709300 -1345457 -5516764 -10775078 -10999988 -4319912 4104251 8091618 7618524 7380038
34474G380038J888116N02964m105591o082464j976329M282232N776447R15468
$$ 7380038 9268154 9771118 5665527 -416937 -2393266 1888966 7665413 8580881
34466H580881m712670n575011l061259k096740k324322J681945R917985J3234001
$$ 8580881 3868211 -1706800 -4768059 -6864799 -9189121 -7507176 2410809 15644810
34458A5644810N337257o394922r481525l028780K446491J038636j906748q70835
$$ 15644810 20982067 14587145 5105620 2076840 4523331 5561967 3655219 2784384
34450B784384J256570J26966k075538j565190j76904j285959l053950k387509
$$ 2784384 4040954 4167920 2092382 527192 350288 -935671 -3989621 -6377130
34442f377130j746714m627102p235861k987979O097643J1055315Q937000N386264
$$ -6377130 -8123844 -12750946 -19986807 -22974786 -16877143 -5821828 3115172 8501436
34434H501436L275370j469540r156617j1285859l184672O107020N685724q67303
$$ 8501436 11776806 10307266 1150649 -10135210 -13319882 -7212862 -1527138 -2394441
34426b394441j514998M761129O523752j182885q426442n955651P88572J301255
$$ -2394441 -3909439 851690 7375442 6192557 -2233885 -8189536 -7400964 -6099709
34418f099709l400226l810818J992135N847496L057412j093070q36915J975938
$$ -6099709 -9499935 -13310753 -11318618 -5471122 -2413710 -3506780 -4343695 -2367757
34410b367757L136022K891847K752856Q75045l799875o952406m440105N62377
$$ -2367757 768265 3660112 6412968 7288013 3488138 -3464268 -7904373 -7341996
34402g341996K048840M22346P75377L648788M688044L014068K405623L324814
$$ -7341996 -5293156 -4870810 -4095433 -446645 4241399 7255467 9661090 12985904
34394A2985904J384962l984845o642336l058042J986195L336759K992420M418713
$$ 12985904 14370866 10386021 3743685 685643 2671838 6008597 9001017 13419730
34386A3419730N030564J119202l953023m040953k13829R76262k032580m306317
$$ 13419730 18450294 19569496 15616473 11575520 11361691 12337953 10305373 5999056
34378E999056l217968j823059k409352k774361q13292J943678L117653K095809
$$ 5999056 2781088 958029 -1451323 -4225684 -5038976 -3095298 22355 2118164
34370B118164q45735m227904m358174M83334N004795K178809n749004q629232
$$ 2118164 1272429 -2955475 -7313649 -6830315 -1825520 353289 -5395715 -14024947
34362a4024947k886930L093057K120452j053093J147215N738429M162331k854357
$$ -14024947 -16911877 -13818820 -11698368 -12751461 -11604246 -5865817 -1703486 -4557843
34354d557843n681498r84580L160935L97429l764386o74281P678269J0729703
$$ -4557843 -10239341 -11223921 -8062986 -7665557 -11429943 -12104224 -4425955 6303748
34346F303748L843697n625908q252671l840530M22275K71882j706087j994389
$$ 6303748 10147445 4521537 -3731134 -7571664 -7149389 -6877507 -8583594 -10577983
34338a0577983j105268o26402O20169L767115O125941M854847K463668L206496
$$ -10577983 -11683251 -12309653 -11689484 -7922369 -1796428 3058419 5522087 8728583
34330H728583N111976K236038m786020p913303l835366N19468r86548m061595
$$ 8728583 13840559 16076597 11290577 3377274 -458092 61376 -925172 -4986767
34322d986767j752493L717434M801322P97920k212739j899594j887982l683266
$$ -4986767 -6739260 -3021826 1779496 2577416 364677 -1534917 -3422899 -7106165
34314g106165m269609k734813k005499k220081P12078P278541J1483161R364106
$$ -7106165 -11375774 -14110587 -16116086 -18336167 -17624089 -10345548 1137613 10501719
34306A0501719M868363L136676K834891O9340l952387m850516k563335j478441
$$ 10501719 15370082 18506758 21341649 21410989 17458602 12608086 10044751 8566310
34298H566310l538289n625278m370545m52970K839690L523166K508233J785607
$$ 8566310 5028021 -597257 -4967802 -5420772 -2581082 942084 3450317 5235924
34290E235924J355489j073424n809878p819519j547118J0177176J6526311J0746927
$$ 5235924 6591413 5517989 -291889 -8111408 -9658526 518650 17044961 27791888
34282B7791888j565813r524489r233166n130320j942703o96361j518996m485732
$$ 27791888 26226075 16701586 7468420 2338100 395397 -300964 -1819960 -6305692
$$ [...]
##END NTUPLES=NMR SPECTRUM
##END=
